##TITLE=abcd
##JCAMPDX= 6.0         $$ Bruker NMR JCAMP-DX V2.0
##DATA TYPE= NMR FID
##DATA CLASS= NTUPLES
##ORIGIN= UXNMR, Bruker Analytische Messtechnik GmbH
##OWNER= root
$$ XWIN-NMR		Version 3.5
$$ Wed Jul 23 12:05:25 2025 Russian Standard Time (UT+4h)  servis@DPX200
##.OBSERVE FREQUENCY= 200.131235884673
##.OBSERVE NUCLEUS= ^1H
##.DELAY= (6, 6)
##.ACQUISITION MODE= SIMULTANEOUS
##.ACQUISITION SCHEME= undefined
##.AVERAGES= 32
##.DIGITISER RES= 18
##SPECTROMETER/DATA SYSTEM= spect
##.PULSE SEQUENCE= zg
##.SOLVENT NAME= CDCl3
##.SHIFT REFERENCE= (INTERNAL, CDCl3, 0, 16.5164)
##AUDIT TRAIL= $$ (NUMBER, WHEN, WHO, WHERE, WHAT)
$$ ##TITLE= Audit trail, XWIN-NMR		Version 3.5
$$ ##JCAMPDX= 5.01
$$ ##ORIGIN= Bruker BioSpin GmbH
$$ ##OWNER= servis
$$ F:\spectra/data/av/nmr/H1/1/audita.txt
$$ ##AUDIT TRAIL=  $$ (NUMBER, WHEN, WHO, WHERE, WHAT)
(   1,<2025-07-23 12:05:08.35 +0400>,<servis>,<DPX200>,
      <created by zg, POWCHK disabled, PULCHK disabled
       configuration hash MD5:
       00 E9 B6 7A A2 85 ED C7 34 08 36 98 17 FE 4E 26
       data hash MD5: 32K
       AD 30 C3 71 58 56 2C B9 A6 3C 8A 63 1A 63 AF 4A>)
$$ ##END=
$$ 
$$ hash MD5
$$ B4 ED 4D 86 DC D3 8B FF 26 DD 18 1B 87 B0 F3 2C
##$RELAX= 
##$RELAX= 
##$RELAX= 
##$RELAX= 
##$RELAX= 
##$RELAX= 
##$RELAX= 
##$RELAX= 
$$ Bruker specific parameters
$$ --------------------------
##$DU= <F:\spectra>
##$EXPNO= 1
##$NAME= <H1>
##$PROCNO= 1
##$TYPE= <nmr>
##$USER= <av>
##$AMP= (0..31)
100 100 100 100 100 100 100 100 100 100 100 100 100 100 100 100 100 100 
100 100 100 100 100 100 100 100 100 100 100 100 100 100 
##$AQSEQ= 0
##$AQ_mod= 1
##$AUNM= <au_zg>
##$AUTOPOS= <>
##$BF1= 200.13
##$BF2= 200.13
##$BF3= 200.13
##$BF4= 200.13
##$BF5= 500.13
##$BF6= 500.13
##$BF7= 500.13
##$BF8= 500.13
##$BYTORDA= 1
##$CFDGTYP= 0
##$CFRGTYP= 5
##$CHEMSTR= <none>
##$CNST= (0..31)
1 1 145 1 1 1 1 1 1 1 1 1 1 1 1 1 1 1 1 1 1 1 1 1 1 1 1 1 1 1 1 1 
##$CPDPRG= <>
##$CPDPRG1= <>
##$CPDPRG2= <>
##$CPDPRG3= <>
##$CPDPRG4= <mlev>
##$CPDPRG5= <mlev>
##$CPDPRG6= <mlev>
##$CPDPRG7= <mlev>
##$CPDPRG8= <mlev>
##$CPDPRGB= <>
##$CPDPRGT= <>
##$D= (0..31)
0 2 0 0 0 0 0 0 0 0.06 0 0 0 0 0 0 0.0002 0 0 0 0 0 0 0 0 0 0 0 0 0 0 
0 
##$DATE= 1753257907
##$DBL= (0..7)
120 120 120 120 120 120 120 120 
##$DBP= (0..7)
150 150 150 150 150 150 150 150 
##$DBP07= 0
##$DBPNAM0= <>
##$DBPNAM1= <>
##$DBPNAM2= <>
##$DBPNAM3= <>
##$DBPNAM4= <>
##$DBPNAM5= <>
##$DBPNAM6= <>
##$DBPNAM7= <>
##$DBPOAL= (0..7)
0.5 0.5 0.5 0.5 0.5 0.5 0.5 0.5 
##$DBPOFFS= (0..7)
0 0 0 0 0 0 0 0 
##$DE= 6
##$DECBNUC= <off>
##$DECIM= 32
##$DECNUC= <off>
##$DECSTAT= 4
##$DIGMOD= 1
##$DIGTYP= 9
##$DL= (0..7)
0 120 120 120 120 120 120 120 
##$DP= (0..7)
150 150 150 150 150 150 150 150 
##$DP07= 0
##$DPNAME0= <>
##$DPNAME1= <>
##$DPNAME2= <>
##$DPNAME3= <>
##$DPNAME4= <>
##$DPNAME5= <>
##$DPNAME6= <>
##$DPNAME7= <>
##$DPOAL= (0..7)
0.5 0.5 0.5 0.5 0.5 0.5 0.5 0.5 
##$DPOFFS= (0..7)
0 0 0 0 0 0 0 0 
##$DQDMODE= 0
##$DR= 18
##$DS= 0
##$DSLIST= <SSSSSSSSSSSSSSS>
##$DSPFIRM= 0
$$ [...]
##$SUBNAM0= <"">
##$SUBNAM1= <"">
##$SUBNAM2= <"">
##$SUBNAM3= <"">
##$SUBNAM4= <"">
##$SUBNAM5= <"">
##$SUBNAM6= <"">
##$SUBNAM7= <"">
##$SUBNAM8= <"">
##$SUBNAM9= <"">
##$SW= 20.6817932712277
##$SWIBOX= (0..15)
0 0 3 0 0 0 0 0 0 0 0 0 0 0 0 0 
##$SW_h= 4139.07284768212
##$TD= 32768
##$TD0= 1
##$TE= 0
##$TE2= 300
##$TE3= 300
##$TEG= 300
##$TL= (0..7)
0 120 120 120 120 120 120 120 
##$TP= (0..7)
150 150 150 150 150 150 150 150 
##$TP07= 0
##$TPNAME0= <>
##$TPNAME1= <>
##$TPNAME2= <>
##$TPNAME3= <>
##$TPNAME4= <>
##$TPNAME5= <>
##$TPNAME6= <>
##$TPNAME7= <>
##$TPOAL= (0..7)
0.5 0.5 0.5 0.5 0.5 0.5 0.5 0.5 
##$TPOFFS= (0..7)
0 0 0 0 0 0 0 0 
##$TUNHIN= 0
##$TUNHOUT= 0
##$TUNXOUT= 0
##$USERA1= <user>
##$USERA2= <user>
##$USERA3= <user>
##$USERA4= <user>
##$USERA5= <user>
##$V9= 5
##$VALIST= <valist>
##$VCLIST= <CCCCCCCCCCCCCCC>
##$VD= 0
##$VDLIST= <DDDDDDDDDDDDDDD>
##$VPLIST= <PPPPPPPPPPPPPPP>
##$VTLIST= <TTTTTTTTTTTTTTT>
##$WBST= 1024
##$WBSW= 30
##$XGAIN= (0..3)
0 0 0 0 
##$XL= 0
##$YL= 0
##$YMAX_a= 945172
##$YMIN_a= -745798
##$ZGOPTNS= <>
##$ZL1= 120
##$ZL2= 120
##$ZL3= 120
##$ZL4= 120
##$ABSF1= 10
##$ABSF2= 0
##$ABSG= 5
##$ABSL= 3
##$ALPHA= 0
##$AQORDER= 0
##$ASSFAC= 0
##$ASSFACI= 0
##$ASSFACX= 0
##$ASSWID= 0
##$AUNMP= <proc_1d>
##$AZFE= 0.1
##$AZFW= 0.1
##$BCFW= 1
##$BC_mod= 2
##$BYTORDP= 0
##$COROFFS= 0
##$CY= 19
##$DATMOD= 1
##$DC= 2
##$DFILT= <>
##$DTYPP= 0
##$F1P= 11.0000007629395
##$F2P= -0.999999237060547
##$FCOR= 0.5
##$FTSIZE= 0
##$FT_mod= 4
##$GAMMA= 1
##$GB= 1
##$INTBC= 1
##$INTSCL= 1
##$ISEN= 128
##$LB= 0.05
##$LEV0= 0
##$LPBIN= 0
##$MAXI= 10000
##$MC2= 0
##$MEAN= 0
##$ME_mod= 0
##$MI= 0
##$NCOEF= 0
##$NC_proc= 0
##$NLEV= 6
##$NOISF1= 0
##$NOISF2= 0
##$NSP= 1
##$NTH_PI= 0
##$NZP= 0
##$OFFSET= 16.51637
##$PC= 1
##$PHC0= -275.1915
##$PHC1= 4.101552
##$PH_mod= 0
##$PKNL= yes
##$PPARMOD= 0
##$PSCAL= 4
##$PSIGN= 0
##$REVERSE= no
##$SF= 200.13
##$SI= 16384
##$SIGF1= 0
##$SIGF2= 0
##$SINO= 400
##$SIOLD= 16384
##$SREGLST= <1H.CDCl3>
##$SSB= 0
##$STSI= 0
##$STSR= 0
##$SW_p= 4139.07284768211
##$SYMM= 0
##$S_DEV= 0
##$TDeff= 0
##$TDoff= 0
##$TI= <>
##$TILT= no
##$TM1= 0
##$TM2= 0
##$TOPLEV= 0
##$USERP1= <user>
##$USERP2= <user>
##$USERP3= <user>
##$USERP4= <user>
##$USERP5= <user>
##$WDW= 1
##$XDIM= 8192
##$YMAX_p= 0
##$YMIN_p= 0
$$ End of Bruker specific parameters
$$ ---------------------------------
##NTUPLES= NMR FID
##VAR_NAME=  TIME,          FID/REAL,        FID/IMAG
##SYMBOL=    X,             R,               I
##VAR_TYPE=  INDEPENDENT,   DEPENDENT,       DEPENDENT
##VAR_FORM=  AFFN,          ASDF,            ASDF
##VAR_DIM=   16384,         16384,           16384
##UNITS=     SECONDS,       ARBITRARY UNITS, ARBITRARY UNITS
##FACTOR=    0.0002416,     1,               1
##FIRST=     0,             0,               0
##LAST=      3.9581328,     0,               0
##MIN=       0,             -745798,         0
##MAX=       3.9581328,     945172,          0
$$ Real data points
##PAGE= N=1
##DATA TABLE= (X++(R..R)), XYDATA
0@%%%%%%%%%%%%%%%%%%%%%k8O0o4O4o4O4p2J02j26J28j42J73j96K18k50K77l08
38a64L45l85M32m78N28n83O41p05P73q46R27j014J107j210J323j448J587j738
56i08J904k090K296k525K786l075L398l753M104m370M270k723n912J12198Q39572
71I45172j52694r42428n10310K07614M38005K51677j08996r3911R4830l7867k36317
82a45225j44732K38439L39045J6251k16928k88192q6824K54062J72409j17635
92B0670j21353J01679J39066j28461j53280M6597J38034J28438p8713k13856K7778
103i3401K22813L1686k80692j44000K67789K37940q7483k82715j63033K20085
113g1011L21992l7140l26153j55917K31547K33946k9408j63730j68456K8447K12016
$$ plain form
0 0 0 0 0 0 0 0 0 0 0 0 0 0 0 0 0 0 0 0 0 0 0 -28 32 -32 32 -32 32 -40 62 -64 64 -78 95 -101 117 -133 144 -164
38 -164 181 -204 228 -250 278 -305 336 -369 404 -442 485 -529 578 -632 691 -757 830 -908
56 -908 996 -1094 1202 -1323 1463 -1612 1786 -1967 2137 -2233 2037 -686 -6598 105600 945172
71 945172 792478 -149950 -660260 -452646 -14641 237036 128040 34129 128959 91092 -145225
82 -145225 -289957 -51518 287527 303778 86850 -201342 -288166 -34104 138305 20670
92 20670 -100683 996 140062 11601 -141679 -95082 42952 171390 92677 -121179 -93401
103 -93401 129412 161098 -119594 -263594 4195 242135 154652 -128063 -291096 -71011
113 -71011 250981 213841 -112312 -268229 -36682 197264 167856 4126 -164330 -135883 76133
124G6133O7309j39894q3269J15545N6896j78807j07954J27453K22725Q2731k24343
135A4525k68457O4449K96564J21732j83835j42760N9157O5048J0279m7213n2354
146f2865M9875P0092m4019j01696L4817J47943j5071j46020o2533P4508J79824
157A24855R7214j51034k49408l5231K29719J59504q0725j24543n1210L8005M2490
168c64m9956l0580J15962J39094p1282k15882l8377J39324R9253J0090o4398o8588
180c5704M025M2848j6625p5229J4780J06905L9476l1767o6706o7292J8858Q1465
192A5034L9615j4718K2156K5968j14507j38272M9192J72692J17511n8824j89935
203g4088j20361Q9041J86915L6316j06585m2376K3521Q769r61p237K308L2327
$$ plain form
124 76133 143442 3548 -79721 35824 92720 -86087 -194041 -66588 156137 238868 14525
135 14525 -253932 -189483 107081 228813 44978 -97782 -38625 26423 36702 -10511 -62865
146 -62865 -12990 57102 13083 -88613 -53796 94147 79076 -66944 -129477 -54969 124855
157 124855 222069 71035 -178373 -213604 16115 175619 94894 -29649 -80859 -42854 -364
168 -364 -50320 -80900 35062 174156 102874 -113008 -151385 -12061 87192 97282 32884 -35704
180 -35704 -31679 11169 -5456 -80685 -65905 41000 80476 48709 -17997 -85289 -66431 15034
192 15034 54649 39931 62087 88055 -26452 -164724 -115532 57160 174671 115847 -74088
203 -74088 -194449 -105408 81507 117823 11238 -31138 -7617 1152 191 -7046 -4738 27589
215B7589L6090m2042r2220L989Q0865L0002k4735n1392k7859M6922O8893k0133
227C5969q4203J1341R0173K99o4103j4841K6089K2370q126l2916k1446L2702M0925
240C4233m1635m8888M1883N0975n497k9408k8669p745M6988O7604k8974r6745
252d5878j3528N8062L2855n429l2115l0498J2573L7204j4320l9844M1204N9114
264E9400l7855n7677J3910M4485J8693j6752m1739k7555M5653N2646m2639o2430
276e1860Q788L2577K2107K0515j2745m7554n56N1290j977l2309K6872L1957l0088
289A7017m7293j8330K0657N5052L4797n8863p4453L1213O0691p964j5207J8458
301A5775K703j6812k618n386p816L6379K4168m8471l9369K1027K1659J988M369
$$ plain form
215 27589 63679 21637 -70583 -66594 14271 44273 19538 -31854 -59713 -12791 56102 35969
227 35969 -48234 -36893 53280 53579 -10524 -25365 724 23094 14968 -17948 -39394 -6692 34233
240 34233 -7402 -56290 -14407 36568 31071 1663 -27006 -34751 12237 79841 50867 -45878
252 -45878 -59406 -1344 31511 26082 -6033 -36531 -23958 13246 -1074 -40918 286 59400
264 59400 21545 -36132 -22222 22263 40956 24204 -17535 -45090 563 53209 10570 -51860
276 -51860 -43072 -10495 11612 32127 19382 -28172 -28728 22562 20585 -11724 15148 47105 17017
289 17017 -30276 -48606 -27949 27103 61900 3037 -71416 -40203 20488 12524 -2683 15775
301 15775 18478 1666 -952 -6338 -14154 22225 46393 -2078 -41447 -20420 1239 3227 7596
314G596j5557k7371K9988M7389l2465m7141K9330M3311m857k1304j8463j1149
326b0693K1455K4999l1865k6994L8276J5178m5421j3016L8890J9021k576o93k4580
339h019k0564L8087L1123k9632k3078J0846j265n183J0923j2135k1081L1499K8938
352C0459m0683k6706L8531K5180j8102r363L313M75J6202K049m1745j0757M5864
365A4717R179l8356p169J5793o670L373K3376p805j6425K0600N879k5259L312
378e455K5110k629j2331l494k1332j0113M1181J8529m3457j9548L0821J0506j2420
391d632P303P240o234Q819J70k5807N370L2777j0705l2277Q276J4830j5391k106
405a2367J4240j2762n502K9090P227k4471k721J2936k423N374J1983j7177j4859
$$ plain form
314 7596 -7961 -35332 -5344 42045 9580 -37561 -8231 35080 30223 8919 -9544 -20693
326 -20693 762 25761 -6104 -33098 5178 20356 -25065 -38081 809 19830 17254 16561 -8019
339 -8019 -28583 9504 40627 10995 -12083 -1237 -2502 -7685 3238 -8897 -29978 1521 30459
352 30459 -10224 -36930 1601 26781 8679 -684 2629 3104 19306 21355 -20390 -31147 14717
365 14717 23896 -14460 -21629 -5836 -12506 -9133 14243 6438 -9987 10613 16492 -8767 -5455
378 -5455 19655 17026 4695 1201 -20131 -30244 10937 29466 -13991 -33539 -2718 7788 -4632
391 -4632 2671 9911 3677 12496 12666 -13141 -7771 25006 14301 -17976 -9700 5130 -10261 -12367
405 -12367 1873 -10889 -16391 12699 19926 -4545 -7266 5670 3247 8621 20604 3427 -11432
418a1432J8956k989l2324Q316L4703l837k2841K302K878m102J5257J1039j1607
431D319M183J2253k0780j8431J8411J1752j4716K443Q353k0911j0795J9649O666
444B396r399J0122J1419j0904m432M654q054M233K3797p727l1248K745J9884r902
458b416j3543J0094K892n966J1574P044j2410j005P873o038M096K2259l733k7604
472f883l712P109j0823K980K4160J60k0176m621N43o584J3540K4071O05q228l953
487H188j8744j3438K6015K6542j4916k0554K516m942r163R501Q735m458P687J1237
501A4206j1343j1497O560J342J047K0884M981k9897j5348J6755L945j1890K602
514g653O110l225Q153P347j7064j2226J2923J2984O540J1757p112l1342p326K1280
$$ plain form
418 -11432 7524 4535 -27789 -19473 15230 11393 -11448 -9146 -6268 -10370 4887 15926 4319
431 4319 8502 20755 -25 -18456 -45 11707 -3009 -566 7787 -13124 -23919 -4270 2396
444 2396 -7003 3119 14538 3634 -798 3856 -4198 35 23832 16105 -15143 -12398 7486 -2416
458 -2416 -15959 -5865 -2973 -8939 2635 9679 -2731 -3736 4137 -1901 2195 24454 20721 -6883
472 -6883 -10595 -3486 -14309 -11329 12831 12991 -7185 -11806 -11263 -17847 -4307 19764 20369 12141 8188
487 8188 -10556 -23994 2021 28563 13647 -6907 -4391 -9333 -18496 -8995 -260 -4718 2969 14206
501 14206 2863 -8634 -2074 -732 315 21199 26180 -3717 -19065 -2310 1635 -10255 -7653
514 -7653 -1543 -4768 3385 10732 -6332 -18558 -5635 7349 13889 25646 18534 -12808 -20134 1146
528A146J991j0527J2015J0180j2507j4610j0148q979J9802M3933J0521k9824k6558
541a3565j4058R75L6121L7960j5494m1776j2947M891J334J2806J3074m400j027
554C894M007j7257j6479J9165K5247J096j239o137k7555r920K9992J7132k0613
567A333j6059J971M889J2926Q361k0287j7371J8471K0639j652L96k081k0949n104
581a4517K2679L722j9104K441J4704n142j1250q935j3132J0386M0685J5572k7063
594A1046k3333o559k502K1973L5974k337l2861j5290k834o793J1163K2499L620
607A3766l220j469k3107k5043K1338L9578J0085o579j2177l1515j7644K9438L2138
620B5589m749j7226j3735j2671Q645K3542m897j8430J0127J5857o651k941M634
$$ plain form
528 1146 3137 -7390 4625 14805 2298 -12312 -22460 -31439 -11637 32296 42817 12993 -13565
541 -13565 -27623 -26648 9473 47433 31939 -9837 -22784 -17893 -16559 -3753 9321 4921 3894
554 3894 7901 -9356 -25835 -6670 18577 19673 18434 12297 -15258 -25178 4814 21946 1333
567 1333 -14726 -12755 -7866 5060 13421 -6866 -24237 -5766 14873 13221 13617 11536 -9413 -14517
581 -14517 8162 11884 -7220 -4779 9925 4783 -6467 -15402 -28534 -18148 22537 38109 11046
594 11046 -12287 -18846 -21348 625 36599 34262 1401 -13889 -16723 -23516 -12353 10146 13766
607 13766 10546 9077 -14030 -39073 -17735 21843 31928 25349 13172 -18343 -35987 -6549 25589
620 25589 20840 3614 -10121 -22792 -14147 9395 4498 -13932 -3805 12052 5401 2460 7094
633G094j1420m533K0578N902k0508n584J0790k154n594j928j0463K956L0272J1319
647B6727k6760j6965P131N233J1094J9113n381k5359n550O043m833K379J2107
660D979j514k626O968j2517k4862R558L3855J2412n576j0154k3771j4099K3201
673d146K6413l897j3984r638j1866K336J7032j145j1189J2862J3228j6216j4083
686a4293J0316R854L975P111q966k1148L389J8815j345j1375m271o851R81K2277
700H469J0080k1313j2836J0867P150L087J1129k237j7524l684N799m685K199J1180
714G681l952j0762M644m19j3239M705K2005M404r333l156o075n858J2043J1849
728A4537p331q215J215n980n484R012J933q516O664J2950r389j2753P969R273
$$ plain form
633 7094 -4326 -8859 11719 17621 -2887 -8471 2319 165 -5429 -7357 -17820 -14864 15408 26727
647 26727 -33 -16998 -9867 -4634 6460 25573 20192 -5167 -10717 -4674 -9507 -7128 4979
660 4979 3465 839 7807 -4710 -29572 -20014 13841 26253 20677 10523 -13248 -27347 -4146
673 -4146 22267 18370 4386 -5252 -17118 -14782 2250 1105 -10084 2778 16006 -210 -14293
686 -14293 -3977 5877 9852 16963 7997 -13151 -9762 9053 7708 -3667 -7938 -14789 -13808 8469
700 8469 18549 -2764 -15600 -4733 2417 5504 16633 14396 -3128 -6812 -1013 -5698 -3499 7681
714 7681 3729 -7033 -2389 -2808 -16047 -11342 10663 15067 5734 2578 -3497 -9355 2688 14537
728 14537 7206 -1009 206 -5774 -11258 -2246 -313 -8829 -2165 10785 1396 -11357 -3388 5885
742E885J75L651j45j1750k001P946l596o923O212J553r519K863R167n410n132
757g024Q022J970m232Q017O090j0826o516M806m57K45P574m123j5264J463R821
772d34l757k408J0934L392q765j026L461j073N453P177r346r850N774K096p637
787f009K275N241o853k729R405m75p541P117Q550n997l724N032p22j686L907m765
803A026r358O516P939j0478o943R404L200n234L861K968n089L382Q377n726o218
818b373P602P97r594J487N581o603k501O062n257p112J0969R214q882l309O990
833C071j27p7N757m973q613P848N581j3511n244J1172P46q686L923L470n416M090
849i89P500o455l600J0796J463r445J463L529p018Q62P574q691r294J0437N653
$$ plain form
742 5885 6060 9711 9566 -2184 -4185 3761 165 -6758 -546 1007 -8512 -5649 3518 -1892 -7024
757 -7024 998 2968 -1264 6753 12843 2017 -4499 307 -150 95 7669 3546 -11718 -10255 -434
772 -434 -4191 -6599 4335 7727 -1038 -2064 1397 324 5777 12954 3608 -6242 -468 1628 -6009
787 -6009 -3734 1507 -5346 -8075 1330 855 -6686 431 8981 2984 -740 4292 3570 1884 5791 1026
803 1026 -8332 -1816 6123 -4355 -11298 -1894 1306 -3928 -67 2901 -2188 1194 9571 3845 -2373
818 -2373 5229 6026 -3568 -2081 3500 -3103 -5604 458 -4799 -11911 -942 8272 -610 -3919 3071
833 3071 2944 2867 8624 3651 -4962 2886 8467 -5044 -10288 884 1630 -7056 -3133 337 -5079 -989
849 -989 6511 56 -3544 7252 8715 -730 733 4262 -2756 -1894 5680 -3011 -12305 -1868 3785
864C785j0209M30R637j780k387N465l001m048J0599K867j4685l531J0546k341
878A347p268M740L89p733N163O633p198l57J0999j471p909N774L957p059J960
893A967M722j0344m758J2184N6j3270J753Q838k633p68N434m403k565J0933J013
908H159j1126L275Q809p553o105O618j844p053N930K702r995J165J1064k789n219
923c962P197J184n953O106M236r969j331R851n135j0792M996N580o317K23M356
938B70n087K31J0490k214q740P663P765q262l193N850m491n035P509L86r889J338
954e409O646n844k273Q774K18l916O277N75q906M037J0176n906q286N909M87q110
970e551J507L741n279J845P515m601o340P826M707n799K608N889o035l382N983
$$ plain form
864 3785 -6424 -5994 3643 1863 -524 4941 1940 -2108 8491 11358 -3327 -6858 3688 1347
878 1347 -5921 -1181 -792 -8525 -3362 3271 -3927 -4284 6715 5244 -2665 3109 7066 7 1967
893 1967 6689 -3655 -8413 3771 3827 -9443 -7690 1148 -1485 -2253 3181 -1222 -3787 7146 8159
908 8159 -2967 308 9117 1564 -4541 2077 233 -6820 -890 1812 -8183 -7018 4046 1257 -3962
923 -3962 3235 4419 -1534 4572 8808 -1161 -2492 7359 2224 -8568 -3572 2008 -4309 -4086 270
938 270 -4817 -4586 5904 3690 -5050 2613 10378 2116 -1077 4773 282 -4753 2756 3142 -6747 -5409
954 -5409 1237 -4607 -6880 1894 2112 -1804 4473 5048 -3858 179 10355 4449 -3837 2072 2559 -5551
970 -5551 -4044 -303 -5582 -3737 3778 -823 -7163 663 5370 -429 2179 8068 2033 -1349 4634
985D634k836q233M916N255o649k764M569l121j699P715J108n457N181O151p742
1000A028m357P319R99n420J728P31n999J54L076n295j634J0015K338o595R60K567
1016A615l529K859Q119l477p284L584J714p425j375M768j338j31L758m909n955
1031i006P443P185l875j246N176k248m484L860M69n582J665L849n536k610M699
1046b41k510m975N182N693k897J005L956n208l146P632K604o986n23M240k694
1061A132m222n53m282Q25J1283L495j0885m585O536K616O44N037r01o345J691
1076A486K279p441k625P414K552l877q71l312n904N435J0561j267m334L469j166
1091B399o262M661P229l885m489P73k552k141N376j142q953K963J0814j487o354
$$ plain form
985 4634 1798 -6435 -1519 3736 -2913 -5677 -1108 -4229 -5928 1787 2895 -2562 2619 8770 1028
1000 1028 -3329 3990 4989 -431 1297 2028 -3971 -3817 -741 -6036 -7670 2345 4683 -1912 -952 1615
1016 1615 -1914 945 9064 5587 -1697 1887 3601 -3824 -5199 -431 -1769 -1900 1858 -3051 -9006
1031 -9006 -1563 5622 1747 501 5677 3429 -1055 2805 3274 -2308 -643 3206 -2330 -4940 -241
1046 -241 -2751 -7726 -2544 3149 252 1257 5213 5 -3141 4491 7095 109 -414 3826 1132
1061 1132 -3090 -3643 -7925 -7100 4183 7678 -3207 -7792 -1256 1360 2004 7041 6140 -205 1486
1076 1486 3765 -3676 -6301 1113 3665 -212 -1083 -4395 -10299 -4864 5697 4430 96 3565 2399
1091 2399 -3863 798 8027 4142 -347 426 -2126 -4267 1109 -33 -8986 -6023 4791 3304 -3050
1106c050J880J828P7N796N56r739p05J0207o23j0009l028Q96J507Q461L086j2714
1122e574o249J1143N993m392J942L234m376n44K862n856l512P701K622p394n88
1137b988J615o883l63J1175L790n012Q05j680o003N575J0759m385r551K676J847
1152A377l695J322p90o422M600J1616n761j2582M686J0336P50k67j775p148J805
1167a948J1731k476j3592J60O438j529L40K955o609m340R003L631o623L181P336
1182G658m588m492L990q96l460N578R70q456j10N608p560n061J1453O273o391
1197E16k057J019k787N317Q695o468r124O264N002p753l653K975j914K568P099
1212E699o470j0958O775J1282k615l552K661k600k47O412k306q860M168O587p769
$$ plain form
1106 -3050 -1170 658 735 6531 7087 -2652 -3357 6850 6227 -3782 -6810 -5914 -4407 4054 7140 -5574
1122 -5574 -11823 -680 5313 921 2863 6097 1721 1177 4039 -1817 -5329 2372 4994 -2400 -2988
1137 -2988 -1373 -8256 -8619 2556 6346 1334 2139 459 -5544 31 10790 6405 -3146 -470 1377
1152 1377 -2318 -996 -1786 -8208 -3608 8008 2247 -10335 -5649 4687 5437 5170 3395 -3753 -1948
1167 -1948 9783 7307 -6285 -6125 313 -1216 -876 2079 -4530 -8870 133 3764 -2859 322 7658
1182 7658 3070 -1422 2568 1672 -1788 3790 4760 -3696 -3806 1802 -5758 -10819 634 6907 516
1197 516 -1541 -522 -3309 2008 10703 4235 -4889 1375 6377 -1376 -5029 -2054 -3968 -1400 5699
1212 5699 -771 -11729 -4954 6328 3713 161 2822 222 -25 6387 4081 -4779 -611 5976 -1793
1227a793n129N921R23m542L245K107m370M181O499n947m697P569K073o340K14
1242h6K643m025L62L179p462m773J0875N988q334l913M308J546K731M290n716
1257A613n867P789M667r345m468N516P80k488J699l105m011O460N912o387k863
1272d098P495J626m148J267O1l641L120L752p506n184P120K147o456n06M012L12
1288f27J102K548m424j273Q498J426q065j211N632p10l589k68l285j578O731K665
1304C572p704k048P142K580l261O60P06r49L810L90p315k175Q149P71p279k250
1320e201K280N59K312J239m762m14P818J706o623m1N307k17k395r4k950j481M275
1337A318M37o942o57O074P69l017N20J121Q95M479k00o308l29P062l38p190p47
$$ plain form
1227 -1793 -6922 -1001 -78 -4620 -1375 732 -3638 543 7042 1095 -3602 3967 6040 -300 -86
1242 -86 2557 -1468 -1106 2073 -5389 -10162 713 6701 -1633 -5546 -1238 308 3039 7329 1613
1257 1613 -4254 3535 8202 -1143 -5611 -95 685 -1803 -104 -3209 -7220 -760 5152 -1235 -4098
1272 -4098 3397 5023 875 2142 2203 -1438 1682 5434 -2072 -7256 -136 2011 -4445 -4951 -939 -627
1288 -627 475 3023 -1401 -2674 5824 7250 -815 -2026 3606 2896 -693 -961 -4246 -5824 907 3572
1304 3572 -4132 -6180 962 3542 281 941 1647 698 4508 4898 -2417 -4592 3557 4328 -2951 -5201
1320 -5201 -2921 -2362 -50 1189 -3573 -3987 3831 5537 -1086 -1127 4180 3963 1568 1474 -1476 -2957 1318
1337 1318 1755 -5187 -5844 230 999 -2018 -1498 -377 518 4997 4797 -1511 -1840 5222 4884 -2306 -3053
1354c053K994r48K76o32l556O72O845L74o275J264N712M22j667k22k178o42M417
1371C803r32p214o32O117n75m164P56M99Q80L897N58n241J325P320j348o297N64
1388f84L037j166q40r43l831N29N564j507n604K750N407j263q63J429j553K14
1404F76M318j110p101J260N859k900m847P02R57n6L234o35n087L162O832k138
1420C126n056L147K727j897J2m97m764R96N161l216o031L164M147k305q3K320
1436I51j782P81N395j952o109L586M490l951l556J813j086q84K737j979m582M501
1452a627N465m531k913N626J592k671J728j38l877J912M397n232n028M393J774
1467H70l919O18J993k925K298N150l470l752N305L789n041j149K380k472m78K754
$$ plain form
1354 -3053 -59 -1007 -731 -1363 -4919 -4247 2598 2972 -3303 -2039 3673 4095 2428 2206 28 -614 3803
1371 3803 2871 -4343 -4975 1142 567 -3597 -2841 -2342 -1462 2435 2993 -2248 -923 6397 5049 -1248 -684
1388 -684 2353 1187 347 -596 -4427 -3898 1666 159 -5445 -2695 2712 1449 586 2015 462 676
1404 676 4994 3884 -3217 -1957 3902 1002 -3845 -3143 -2186 -2242 992 357 -4730 -1568 5264 3126
1420 3126 -1930 1217 3944 2047 2059 1562 -3202 -2206 2955 -261 -6292 -3128 1019 -1286 -1369 951
1436 951 -831 -50 5345 3393 -2716 870 5360 1409 -2147 -334 -1420 -2304 433 -1546 -6128 -1627
1452 -1627 3838 -693 -3606 2020 3612 941 2669 2531 -1346 566 4963 -269 -5297 -904 870
1467 870 -3049 -2431 -438 -3363 -1065 4085 615 -3137 2168 5957 916 -233 2147 -325 -803 1951
1483A951l004m959M768L575n184j451N447j36k031L746k70l264L088L077n421
1498f8k221M229o73m308J910N26l710K432M089l937k415O617J781m816J055K891
1514C382k471M3K797l870l727M569Q77n724K37M217j703r15L773j209k671M990
1530B595K619m948m27M181k324l358K136n53l477K753K146m952q84N542K2l387
1546b316K696K442k081J282J921l908j193M273p26n076P67K049k844k08L201j840
1562a561j830M887J221l766O98L783j423j350J970j313l097J955O99m532L54M139
1578H34j690k443K604J318j397J636J899k410J69L643j460m100J386J458k371
1593i24m11J428k780j148L601P39k887J633L262r92q91K031j365j826L190N5m040
$$ plain form
1483 1951 -1053 -6012 -1244 2331 -2853 -4304 1143 1007 -1024 2722 2452 -812 2276 5353 -68
1498 -68 -2289 1940 1267 -3041 -1131 -605 -4315 -1883 2206 -1731 -4146 2471 4252 -564 491 3382
1514 3382 911 954 3751 -119 -3846 723 1600 -4124 -3887 330 -1373 -2288 1485 276 -2395 2595
1530 2595 5214 266 -161 4020 1696 -1662 474 -79 -3556 -803 1343 -3609 -4493 1049 1071 -2316
1546 -2316 380 2822 741 2023 3944 36 -1157 3116 2390 -2686 -1919 130 -2714 -2922 279 -1561
1562 -1561 -3391 1496 2717 -1049 -351 3432 2009 659 2629 1316 -1781 174 873 -3659 -3305 834
1578 834 -856 -3299 -695 623 -774 862 2761 351 520 4163 2703 -1397 -11 1447 -924
1593 -924 -1335 93 -2687 -3835 -234 505 -2382 -749 2513 1521 630 2661 1296 -530 2660 2715 -1325
1610a325n07K126j781j867K345P99k170J339J925j343M89L377j524j960J980Q47
1626B750k680r54J227j787m88K561j324l596J707L708q78j069J683R5k86K447
1642C116l99l674K11L474j692k546R77p62j618J381J623k209J93L192K05j625
1658a53J594J000k299J026J919k038k267J433j026k551K205K012k476j573K842
1673c52P44q19J833M60k259J996K603l146k760K056O96j691L62p28l065J296L818
1690A044o79k579J979J641q06J176J292k941l69L110r21l847R94J237k857L51
1706b175K136j370j006K636N34j474J847J639k669j77L504j016l144N57Ok194
1722b366J725J900l174k331L826J417j800J127P25j283J924K506l483k825L482
$$ plain form
1610 -1325 -1832 294 -1487 -3354 -1009 -210 -2380 -1041 884 -459 30 3407 1883 -77 1903 2750
1626 2750 70 -884 343 -1444 -1932 629 -695 -4291 -2584 1124 246 -823 860 955 669 3116
1642 3116 2717 -957 -746 2728 1036 -1510 -533 -1295 -2913 -1532 91 -2118 -1925 1267 1472 -153
1658 -153 1441 2441 142 1168 3087 1049 -1218 215 -811 -3362 -1157 855 -1621 -3194 -352
1673 -352 392 -427 1406 1866 -393 1603 4206 1060 -1700 356 1052 -639 -277 -1005 -4070 -2774 1044
1690 1044 365 -2214 -235 1406 600 1776 3068 127 -242 2868 1947 -1900 -906 331 -2526 -2175
1706 -2175 -39 -1409 -2415 221 755 -719 1128 2767 98 -79 3425 2409 -735 -178 -172 -2366
1722 -2366 -641 1259 -1915 -4246 -420 997 -803 324 1049 -234 1690 4196 713 -2112 1370
1737A370J316l377n15O32k086L48K942j429k546L373K199k522M39K477j483q18
1753C20K559j014l255J286J239l193n28K700j072j925K071J031j792K316K024
1768B767k940m80M185n72l775L53J210j891O60J041l011j172L816M74l020J241
1784a114K408o78L59J986k196j603L290N33l897q53K267j439j355J732j065j065
1800b690K686J513l110R60L601j177j887J739L54j945Q76M53l189l80L081j311
1816d26k828J891J668j257R12J465j806L01L582q52l637J075K012j839j211J028
1832G8k129j97K487l23l526J919L569j446o93J937n50p10J925J40l341K89K647
1849B076k091k693J444K34j038J338J069k185Q89L680j246k184J944J672j968
$$ plain form
1737 1370 2686 -691 -1206 -574 -2660 -2312 630 -799 -3345 28 2227 -295 144 2621 1138 320
1753 320 2879 1865 -1390 -104 1135 -2058 -2586 114 -958 -2883 -812 219 -1573 743 2767
1768 2767 -173 -653 3532 2960 -815 -462 748 -1143 -483 558 -2453 -3625 191 665 -2355 -1114
1784 -1114 1294 616 975 2961 765 -838 2452 2985 -912 -1765 502 -937 -2292 -560 -1625 -2690
1800 -2690 -4 1509 -1601 -641 2960 1783 -104 1635 1989 44 920 1373 -1816 -2196 885 -426
1816 -426 -3254 -1363 305 -952 -40 1425 -381 -80 3502 2650 -987 88 2100 261 -950 78
1832 78 -2051 -2248 239 -84 -3610 -1691 1878 432 -261 1676 1126 416 2341 2481 -860 -571 2076
1849 2076 -15 -2708 -1264 -1030 -2068 -730 339 -1846 -957 2723 1477 -707 1237 2909 941
1864I41o16N75j703k0J863j778l047J957K747j687r60J815N67k97J930n19k430
1881f62J779J906k004k384J133j54r49O06m54j932J591K952j244j967K132K067
1897B416j058k55N27j399j74J483j455k404J541J131j769p89J660k31J15J623
1913I62J7j727K043J931j951j590J141M65j395l5p01j816J099K510k161j729K537
1930d00J784j186J72P74l53L77J641j969k266J376J477k385j099J062k64j92J228
1947b23o5j392K094J947j700j222K216K96j268J59o07j739R91J522k453j654K721
1964c77Q86j636Q3J467l20O69J774j558j657K207J025k951j007J322l75p78J062
1981a64j280j202K392J919k109j365L053O23q36M14k62j685J380J430l506j736
$$ plain form
1864 941 325 900 -803 -823 1040 -738 -3785 -1828 919 -768 -1728 87 654 357 2287 1768 -662
1881 -662 1117 3023 1019 -1365 -232 -386 -1335 -729 -1183 -3115 -1524 1428 184 -1783 349 2416
1897 2416 1358 1103 1630 231 57 1540 85 -2319 -778 353 -1416 -2205 -545 -776 -661 962
1913 962 979 -748 1295 3226 1275 -315 826 1291 -104 -139 -840 -2656 -1557 953 -1208 -2937 -400
1930 -400 1384 198 370 1144 791 1168 2809 840 -1426 -50 1427 -958 -2057 -995 -1259 -1451 -223
1947 -223 -288 -1680 414 2361 661 -561 1655 1951 683 842 235 -1504 -513 1009 -1444 -3098 -377
1964 -377 509 -1127 -1044 423 103 772 2546 988 -669 1538 2563 -388 -1395 -73 -448 -1226 -164
1981 -164 -1444 -2646 -254 1665 -444 -1809 1244 1867 1031 1445 1183 -502 878 2308 -1198 -2934
1997b934K865K73k030L74R67o14Q94J978j362j345K603R86k652J60J466j401p14
2014d86J059j621j616K012J381k850j83L097k9j090J651k20j087K157L25k984
2030d84r27K874q31k472N59M08j045J639J119k256j72L330L67k259Q58J267j227
2047G48J38J056k454j453K836k02l091M43J885o50o71J897m57k80K127M03k838
2064e63Q58K296j692j982J505m03j962J478M26k279M56K842q00j649J643J321
2080A495q70P86O64k436K86K130j204k959R38J272j219k06R78j130J71K691k31
2097A156k256J633J824j440p67J356j118j129J438m21k582P15J919j432q02J995
2113H9o3n60J606Jj312Q81K092j552k251J443M22j558J86K2j197L10J763n18j447
$$ plain form
1997 -2934 -69 204 -1826 -1452 -485 -1099 -205 1773 411 -934 1669 2655 3 163 1629 228 -486
2014 -486 573 -1048 -2664 -652 729 -2121 -2304 793 764 -326 1325 1105 18 2175 2500 -484
2030 -484 -1411 1463 632 -1840 -1281 -873 -1918 -279 840 -1416 -1588 1742 2109 -150 708 1975 748
2047 748 886 1942 -512 -1965 871 669 -2422 -1979 -94 -744 -1415 482 25 -255 1872 2275 -563
2064 -563 295 2591 899 -1083 422 19 -1943 -465 -39 -2318 -1862 980 180 -1469 174 1495
2080 1495 625 1411 2075 -361 -75 2055 851 -2108 -1170 102 -1117 -1323 -345 -1475 -1304 1387 1156
2097 1156 -1100 533 2357 917 150 1506 388 -741 697 276 -2306 -1591 328 -1104 -1906 89
2113 89 26 -534 1072 1073 -239 642 2734 1182 -1069 374 796 -762 -576 -554 -1751 -1441 322 -196 -1643
2132a643J805J354j199K94R53j057l13J362j155j890R99J029j673o26J224k33
2148g69k71J262k02r37J756J413j624n93J257K72j393M3k26j294N65R32j464r07
2166b180J804N82o66O99M64l91P67J213j182j634J188O85j790m31M30p28j87J067
2184b90m12o55J288J051r94j38J486j30p03M42j49j003K86K44j493n92J324P1
2202c67r19L93P28l43Q63R63q10q42J940L87j635p59P92n59m50N61r62r08J268
2221f59P96q50l96J920p2m74J225O0j400K43Q05j294q27J118r6j703Q08K66o36
2240a166R9J194l04l4J304P66j713J10J325j019o52N16o53j088J098J23j745j09
2258a948K195m8p38Q55N14o77J087J037j739j116J619l56j559N36J33j292K85
$$ plain form
2132 -1643 162 1516 317 611 1564 507 194 1556 401 -1489 -490 539 -1134 -1760 -536 -769
2148 -769 -1040 222 20 -917 839 2252 628 35 1292 1564 171 214 -12 -1306 -741 191 -1273 -2180
2166 -2180 -376 206 -460 239 703 312 1079 2292 1110 -524 664 1349 -441 -872 -442 -1170 -1357 -290
2184 -290 -702 -1357 -69 982 -12 -150 1336 1206 503 945 796 -207 79 323 -1170 -1762 -438 -367
2202 -367 -1286 -893 -165 -508 355 1318 508 -334 1606 1993 358 -401 391 -168 -618 -57 -1019 -1927 -659
2221 -659 137 -713 -1109 811 739 265 1490 1550 150 393 1198 -96 -923 195 99 -1604 -796 -530 -1166
2240 -1166 -1067 127 -177 -211 1093 1859 146 256 1581 562 -90 426 -227 -1315 -217 -94 -1839 -1948
2258 -1948 247 199 -539 316 830 153 1240 2277 538 -578 1041 685 -874 -338 -205 -1497 -1212
2275a212J579j360n44J913N35j467Q36J642j262m57J305q55j459J372j00j958
2291a492K73J393j009p51J357K58p19J437O44j386N5J921q07j590J023L8j692
2308a047N48P58j867l18K208k9j668J121J392j141L45J522j183r75J864n32k074
2325a076N87J029j687n76J730o50r60J433P97j504O93K066j024r48J616k24j681
2342c79Q01L48k062m7J986j176j419J422P29j143Q00J324j087l07K085o12j833
2359e70J325N97j932M1Q73j100j082K004k83j629J401J622j636P8J522k46j017
2376c2J300%j805N23R18j735r13J676l30j341J188N62q60Q24J576j210o78J926
2394A589R7j509J48L55j247k32R24n86j522J572P01j291L40J251m47J15J032l49
$$ plain form
2275 -1212 367 -993 -1537 376 911 -556 280 1922 660 203 1508 653 -806 566 466 -1492
2291 -1492 -1219 174 -835 -1586 -229 29 -690 747 1391 5 60 1981 1174 -416 607 645 -1047
2308 -1047 -499 259 -1608 -1926 282 253 -1415 -294 1098 -43 302 1824 641 -334 1530 998 -1076
2325 -1076 -489 540 -1147 -1723 7 -643 -1603 -170 627 -877 -184 1882 858 -90 1526 1302 -379
2342 -379 422 770 -1292 -1339 647 -529 -1948 -526 203 -940 -140 1184 97 -210 1875 1263 -570
2359 -570 755 1352 -580 -539 334 -766 -1848 156 -127 -1756 -355 1267 -369 -291 1231 985 -32
2376 -32 1268 1268 -537 -14 904 -831 -1744 -68 -398 -1739 -551 11 -849 -25 1551 341 -337 1589
2394 1589 1686 177 325 680 -567 -799 125 -461 -1983 -411 290 -1001 -661 590 143 258 1290 941
2412I41j315J358O46j771m84Q50m62r61P69j71r27Q49J152r60lJ613k26p20N98
2431G76K47q74J9O99j512p26J126J83j557L77J078n22R5J009m06O1J019K70j213
2450A49q9P18l46q90L55l15q23P44N75j221J50J308k26k7O88M4m87O56L46j022
2470B87n80P73k88j153J37L05m37P9O71k59k12J307K07q57O68O19j46r61K32l31
2490F1n39K70J89j196k18J071q4q9L92M02n2L24N40n71k70J038k87j065q0L27
2510A63p25j12M08o80j07Q10K99l81K71N30L12l50M55l60l62L11Oj163m13R30
2530a58l52p02L71P64p28Q26M88o41L07J300l86j137M68K69m09o75K16p46n9Q73
2550a11j49q36L33J313m51r8P14k55j46Q67p0j269J9O04o91p58L62M5o62Q45P43
$$ plain form
2412 941 -374 984 1630 -141 -625 225 -237 -1198 -429 -600 -1527 -678 474 -486 -489 1124 898 178 776
2431 776 1023 149 168 867 -645 -1371 -245 -62 -1619 -1242 -164 -686 -591 418 12 73 1092 1362 149
2450 149 60 778 432 -458 -103 -418 -1241 -497 78 -1143 -993 315 89 62 750 794 307 963 1309 287
2470 287 -293 480 192 -961 -824 -519 -956 -877 -206 -465 -677 630 837 -20 648 1267 1121 160 392 61
2490 61 -478 -208 -19 -1215 -1433 -362 -446 -535 -143 259 207 531 1071 500 230 1268 981 -84 -164 163
2510 163 -562 -674 -266 -946 -1053 -243 56 -325 -54 476 788 438 893 533 171 482 488 -675 -1088 -158
2530 -158 -510 -1212 -841 -77 -805 21 509 -132 175 1475 1089 -48 420 689 280 -395 -179 -925 -984 -111
2550 -111 -260 -1096 -763 550 99 1 715 460 314 1181 1111 -158 -139 465 -226 -984 -622 -577 -1239 -394 349
2571C49j044L44J391l79o74P67K56r36J99M95j017n85J178r23r60R50L68p00K50
2590f71J144l81q2J258j32j398P26J080j225r67R25n90o80P69j8j262O64J424
2608E84q67o56J477K91q06P91O06j664K80J273j286j081R26K25j017J65Q22r50
2626h87L34J275m46q12J305O65j347P8J203r81q61P88o04q48O94Q48j455k57J613
2645C05M1o58J065j49q73J005R03j493p32J051K6j260L94j27o50M61J100j052
2663f43k13J417J03o80M12O36q03J7Q06j105n95Q09Q0j400J46P48n50q2R45J44
2683A92p97J367N41q98j90P63m80o55J92j34o41L86M63j022m12J572j97m80N86
2702A56L60n41L04Q07r25k06P85j92r14j8L95o15k27N01j84m41J346K3p09N17
$$ plain form
2571 349 -695 -351 1040 661 -13 754 1010 74 273 768 -249 -834 344 -579 -1539 -589 -221 -921 -671
2590 -671 473 92 10 1268 1136 -262 464 1544 319 -648 277 -313 -993 -224 -242 -1504 -840 584
2608 584 -283 -939 538 829 23 814 1420 -244 36 1309 23 -1058 -132 93 -924 -759 63 -887
2626 -887 -553 722 276 -536 769 1434 87 165 1368 387 -474 314 -290 -1138 -444 404 -1051 -1308 305
2645 305 346 -312 753 604 -269 736 1639 146 -586 465 491 -769 -375 -502 -1152 -691 409 -643
2663 -643 -856 561 664 -16 396 1032 229 246 1052 -53 -648 161 241 -1159 -1013 -265 -815 -897 48 192
2683 192 -605 762 1303 405 215 978 498 -157 35 -99 -740 -354 109 -913 -1325 247 50 -430 156
2702 156 516 -25 279 1086 161 -45 740 548 -366 -384 11 -604 -831 -330 -514 -955 391 414 -295 222
2722B22J061p35j2K44l84n51M28j10j231K38J044m70p20O51j19J92K30O80m18
2741B40J83N17r9r79K61M55p36l87O3l69k24R14o4l08L68P06k96J65K24n5m38
2762A41L45k9m32j05K71o38m80N62j30j24L71M43l37J82O40P0n89L73M59o26k94
2783G3N3o65q0L43j30l99J71L47J45j40N61L9J5J75J87k77k60L42m26n02O1l5
2805d02j41J94j6k37L66K29P8j93O10L21l05K0o4j66k02j05j19q21L03N79m38
2826e09j02M75J17r1M56k4j61K71M69n36m18L72L5r18L73P9p05R7O63j04l80O60
2848A19K86l58J59Q98o76m1M21l19j154M59L64o85k56L34j18Q9M95O7l45N07O40
2869H86o22j51P34l86o45N82j28p16p9N14p63k65Q85J38n40N01O35l80J42N96
$$ plain form
2722 222 1283 548 536 780 396 -155 273 163 -1068 -830 214 -256 -976 -325 -444 -252 -22 658 240
2741 240 423 940 841 -138 123 578 -158 -545 -482 -851 -1075 -161 -225 -533 -165 541 245 410 634 579 141
2762 141 486 457 25 -80 191 -447 -927 -365 -495 -619 -248 195 -142 40 680 750 161 534 993 367 73
2783 73 126 -539 -619 -276 -406 -805 -634 -287 -142 -282 279 318 333 508 695 418 158 500 74 -428 -367 -402
2805 -402 -543 -349 -365 -602 -236 -7 71 -122 488 809 504 524 460 294 92 -13 -132 -953 -650 -71 -509
2826 -509 -611 -136 -19 -110 346 322 161 432 901 365 -53 319 354 -564 -191 -112 -817 -720 -57 -161 -541 119
2848 119 405 47 206 1104 428 387 808 489 -665 -206 158 -527 -783 -449 -567 -478 17 84 -261 246 886
2869 886 264 113 847 461 -184 398 270 -446 -525 -11 -774 -1039 -154 -16 -556 -55 580 200 342 938
2889I38l49o53N95Rr54J37J31o65M0O28l14k55O08N02p16M62J024r50m28Q75k84
2910C81m90M29m0r15j45P50j66p63O40N4j44N60O14p62K40P29m16n23M43n9r20
2931e03L63J52p60K9Q41j05o15M24N73l55R1P21k86m24Q77m94o31j93O32o47m90
2952h00O00j44q00J069M04q92L27Q03r8l05O53j72p11N28nq21l53Q37o07m98P57
2973b28K96n19L88M38n07K12O89j78n60L62P7l94j71J18m25o16O43R6m64O41M29
2994C27m51R2O34j4k58L67j46n36q1P55r53m90M23k30Q8J96j3l58N96N35k35k27
3016B1N82J67n77N3K42n96j77M46l80n67K70K32k09MN76R4j41N12ql06L93Rn11
3039A29k12L08j10o83L93k82j69N1L83M4k01L67M23l11L32J65j09k84J31k27q60
$$ plain form
2889 938 589 -64 531 540 -414 -277 -146 -811 -771 -143 -457 -712 -104 398 -318 144 1168 218 -210 665 381
2910 381 -109 320 280 -635 -780 -30 -196 -959 -319 -265 -409 151 765 3 243 972 556 33 476 417 -503
2931 -503 -140 12 -748 -719 122 17 -598 -174 399 44 135 856 570 146 1023 529 -102 -295 337 -310 -800
2952 -800 -200 -344 -1144 -75 329 -563 -236 567 469 164 817 645 -66 462 457 -364 -717 120 -487 -985 -228
2973 -228 68 -451 -63 375 -132 80 769 591 31 393 470 76 -95 23 -402 -1018 -375 -279 -743 -102 327
2994 327 -124 -32 602 588 330 697 551 15 -66 689 -264 -754 -331 -561 -473 -277 -290 -648 -52 483 248 21
3016 21 603 770 193 246 488 -108 -285 161 -219 -786 -516 -284 -493 -489 87 181 40 552 544 238 631 640 129
3039 129 -83 225 115 -568 -175 -457 -626 -575 -192 -148 -349 18 441 130 462 627 518 234 365 138 -722
3060g22M67K18m14k74L95O5k55P21J85n32M05J69j05j43J72j39j19k73K2k16j3
3081c86J58j75j98N54K67l09K89K87M4j43K62k75k90Q0J79n36l27K64m25M2M19
3102b19P2k17K67P72l48l47L93K46n74L62k88q2j45K55m40n43O30j09j41J73N83
3123C00l97J09N14j66k87L20L66o26k12L30l68m72N07m16j17L56M90m52k60Q71
3143C90M9j81L17j70m21K67j5l76m44M51K33q46J46L90k46J58M08pPN56K07p13
3165A60K68J70l60k93M15o45l72M38L42q34N6P93k1n69O35L28n33N54L21p18j16
3186A9M45m07m35K88J2l78K00K84m51K47N97j80k89M66J82l67J16R9n51j88N71
3207B80l34p35L11L76j53l64M70n8J89N15P5o31L45N32m43m29K22k61k56J24J43
$$ plain form
3060 -722 -255 -37 -451 -725 -330 -265 -520 201 386 -146 259 428 323 180 352 213 94 -179 -157 -373 -386
3081 -386 -228 -403 -601 -47 220 -89 200 487 531 388 650 375 85 165 344 -192 -519 -255 -680 -638 -219
3102 -219 -147 -364 -97 675 327 -20 373 619 45 407 119 37 -108 147 -293 -836 -206 -315 -456 -283 300
3123 300 -97 12 526 360 73 393 759 133 -79 251 -117 -589 -82 -498 -615 -259 231 -221 -481 390
3143 390 439 258 575 405 -16 251 236 -140 -584 -133 100 -746 -600 -210 -456 -298 110 103 110 666 873 160
3165 160 428 598 238 -55 360 -285 -657 -219 123 -711 -655 138 117 -452 183 511 -22 532 853 135 19
3186 19 464 57 -378 -90 -78 -456 -256 28 -423 -176 421 241 -48 418 600 233 349 448 -103 -291 280
3207 280 -54 -789 -478 -102 -255 -619 -149 -207 -18 497 572 -59 286 818 375 -54 168 -93 -349 -225 -82
3228h2n61J53P34m96N3K86K98l63N75l9l41p5O53p68n76M73j12l62K07J28j92
3249d07J90L24j4m34O71J79k89j62N74n87j12J52j71n22J32L27m05Q7M57j17P3
3270e4L80j02q3M7Q62p15m05K10j46q1m4o6k79n6L04j72R6L45L72n90N83Q1k58
3293B29j1M80n27o35N88l4o57K66K86k90j19K58K7j88O95K94n02Q6L26k10m03
3314d1K38k81l37J92K89m91j66L88j46j46N12P3o2L37K71k76j9K0K73p26M1R1
3336C4m97j8L46l85J86L87m8k70L17L60p3j70nJ5M6j18l2q7m21N4J3j59j65O61
3360b9k67K20N36Rk96J68J56m83J15L36n62M0k84L00o23P02n23O1J18N26J8k03
3382C5K35K50l56M0K00m95j12L16kl93K8P1k12M0L75M5k99N66k2j65q8N90n62
$$ plain form
3228 -82 -643 -490 244 -252 -199 87 385 22 597 558 217 142 795 27 -549 -76 -188 -550 -343 -215 -407
3249 -407 -217 107 93 -341 330 509 220 58 632 45 -67 85 -86 -608 -476 -149 -554 -467 -10 -127 -54
3270 -54 326 224 141 188 1050 335 -70 140 -6 -87 -131 -197 -476 -532 -228 -400 -304 41 413 -177 406 487 229
3293 229 218 698 171 -464 124 90 -567 -301 -15 -305 -424 -166 -139 -327 368 662 160 246 572 362 -41
3314 -41 197 -84 -421 -229 60 -431 -597 -209 -355 -501 11 84 22 359 630 354 335 355 628 -98 -57 34
3336 34 -463 -481 -135 -520 -334 53 5 -265 52 412 339 169 164 179 225 107 75 -12 -433 -379 -366 -525 -690 -29
3360 -29 -296 -76 460 469 173 341 497 14 129 465 -97 -57 -341 -41 -664 38 -485 -424 -306 220 238 35
3382 35 270 520 164 204 404 -91 -203 113 111 -282 -254 -183 -395 -355 20 65 -234 332 310 145 57 647 85
3405H5l5P9O1o19J60J43k85K2J37J72j05J0M90k20K68K66m82J33J35j99m94L27
3427D9Q6p07K49K31k70J36L85R5l20J75N44m74M2L09l39m00L52r4n23J38M77p40
3449e99%N40j60j04M10K36k83O3N15l62l91M06m7m88L40k43m69J99L88k7l68N03
3471E9K44m81N59K27k97j46M92o0o15l6L11m08l52L00j18l25P34l95L0L40N35
3492E98l98j12L42K5m80Q0K97p21J85L41n04J68j05J22l68N28K76k98K1O77l88
3513B86j84L59j67k56j36L52m94k15L55N9k16J72M48n66K57M35n07J86L07k63
3533B12m15N45k02k63j42M10l93l49K61J50j82K47J92j84J28K87P4k91K00j44
3553A41k65J25ol01j48L11k6k76K30L77k01k6M28j92L5J37K11p44L10R9k46k19
$$ plain form
3405 85 50 129 190 -429 -269 -126 -411 -389 -252 -80 -185 -175 315 95 363 629 147 280 415 216 -278 49
3427 49 135 -572 -323 -92 -362 -226 159 254 -66 109 653 179 221 530 191 -209 143 49 -474 -336 141 -599
3449 -599 -599 -59 -219 -323 87 323 40 103 618 256 -135 271 224 -264 76 -167 -636 -437 -49 -76 -444 59
3471 59 303 -178 381 608 311 165 657 597 -18 -54 257 -151 -503 -203 -321 -646 88 -307 -277 63 598
3492 598 200 88 430 455 -25 55 352 -369 -184 157 -347 -179 -284 -162 -530 -2 274 -24 -3 674 286
3513 286 102 461 294 38 -98 254 -240 -455 -100 -41 -257 -85 363 -203 54 489 -18 168 475 212
3533 212 -203 342 140 -123 -265 145 -248 -597 -336 -186 -368 -121 71 -113 15 302 376 85 285 141
3553 141 -124 1 -5 -306 -454 -143 -169 -445 -215 162 -39 -65 363 171 206 343 554 -190 120 219 -27 -246
3575b46J18j94j21K39P7r2J00M12l04J79K71n2l62J11j35m1j02L7ql30P7K60N1
3598e5o3K46j75J9K57k0M7J67j18q4j20j07J9m32L68Kj64JK5k5J28L50k33K59
3622B92j58J08K0j67K6q9k65j82K03o0J66k45L7L62n0l4r3K14J80j92J29k85L3
3645e0j25K88n46J17rL27k32K2J17K13p0J97J7j31Q3J73k29rj13K64m11j01p8
3668b86J73K3J1J68k61L28o7N4J37J02j76k08L75o6k76k83M36l64J74j74j42j54
3690d76L04K05p6K01J60r1j58M13l14l01L04o1k16o0J51k25J29J21j4j33j4L96
3712B45j08J43K4k10l40L97L31o26j61K66j98%Q2Mj2J5L42K4q4Q5lm32M57M7l56
3737f8n8K04J3m84M27k27j78M25on3N7K7mK9J00J91m39L2R8j69l31L05R1l20J62
$$ plain form
3575 -246 -128 -322 -443 -204 -127 -219 -119 293 -11 168 439 387 25 136 1 -40 -142 -105 -113 -443 -366 -106 -55
3598 -55 -118 128 -47 -28 229 209 256 423 305 221 101 -6 13 -419 -51 -49 -213 -212 -187 -212 -84 266 33 292
3622 292 134 242 262 95 121 32 -233 -415 -212 -272 -106 -351 -314 48 -2 -36 -129 85 265 73 202 -83 -50
3645 -50 -175 113 -433 -316 -325 2 -230 -208 -91 122 52 249 266 135 218 391 162 153 40 304 -107 -208 -286
3668 -286 -113 -90 -79 89 -172 156 89 143 280 382 206 -2 373 307 31 -252 184 -180 -6 -180 -322 -476
3690 -476 -172 33 -43 158 318 227 69 482 168 -133 171 110 -106 -166 -15 -240 -111 10 -4 -137 -151 245
3712 245 137 280 304 94 -246 151 482 -144 -305 -39 -237 -237 -155 -151 -163 -148 194 218 134 219 216 -216 241 288 -68
3737 -68 -126 78 91 -393 34 -193 -371 54 48 -5 52 79 75 104 204 395 -44 -12 86 -83 -414 -109 -18 -338 -176
3762a76m7o0J62M28k79K70j40O9l8K3M35o15l85N10l02k52L67j57q6J29K21n0
3784B7j24K89j01j19J54J16p0j23J62p8l09O0K21o35L01K83j57N9J57qn6J07K87
3807D43k78Q0q7j04j82K68k49k78N53k73k33K6L15M2k51L30M6J8j06K13l26n9
3829i2J22m2l33K60J21n54K79J51J97j93J73J42k91K40M36m13j0P6q7k51J37j73
3851a05l99K42K59jM0L11k99q9L11q9j64p8L41k41r2J81j59k78K64k24J40n1K06
3874B6N0k53J40K96j05J44k00J03p4j54J46m69K21kj20n3J72l3p7K5L31M1J30
3897B85K3j37R4n4j5j75l6r0J8k06L6L07k58k4K06K55m7p8J07j30J4J65l79p4
3921a93L57j47l06K70j20k2pL23k04j14M8L56Q6l56L16j99J2l9O9ol44j00L72
$$ plain form
3762 -176 -223 -283 -121 307 28 298 158 227 189 212 647 32 -353 157 -145 -397 -30 -187 -273 -144 77 27
3784 27 -97 192 91 -28 126 242 172 49 211 133 -176 -116 105 -530 -229 54 -103 -44 113 105 49 156 443
3807 443 165 245 158 54 -128 140 -109 -387 166 -107 -340 -314 1 43 -208 122 168 186 80 293 -33 -92
3829 -92 30 -12 -345 -85 36 -518 -239 -88 109 -84 89 231 -60 180 616 203 193 269 182 -69 68 -105
3851 -105 -504 -262 -3 -4 36 347 48 -41 270 181 17 -61 280 39 -53 128 -31 -309 -45 -269 -129 -180 26
3874 26 76 -177 -37 259 154 298 98 201 127 -27 119 -350 -129 -131 -251 -304 -132 -165 -242 -217 114 155 285
3897 285 308 171 265 211 196 21 -15 -105 -87 -293 -257 50 -208 -232 -26 229 182 104 211 81 95 260 -119 -193
3921 -193 164 17 -289 -19 -139 -161 -168 155 -49 -163 -115 241 327 -29 287 88 100 61 130 124 -220 -320 52
3944E2k73J00j1Q3k6J44P3j8O5k2l2J22j60J8l03J66l50J91n1n3O1L30K8r6J44
3969A82k47L91j51P2j64L5J4p7j76m2p5N8J99l33J60J08o1N2R3J45N8Ol29R7J05
3994A20p2j24o2k09L11k35K54j97J01JK2L35K3j65r5K69k62J02k23K9J13n6pp4
4018a01p8J12j54K02j46M61m93K45K5J64k4J05j50m21K44j67N8j69K26k0q7J60
4040hJ22r1N3L27j45j53L88n15N3J42K5l43K55k45j98K80K28j69o9J36j5p7J01
4063H2O7M8j94K1J9k15L4K16k67j43L33q0Lm9K02k13j1L44j95K71pjk19j6L2l08
4089b46k9L12k39j37N41m02J86J11K32j84rj05L96l53l8J31l28q7J83m3k54K87
4111g5K78l15K35J37l15J39J27kl12M09r2k04j11R2j26j26j32j08M01j70J54j75
$$ plain form
3944 52 -221 -121 -132 -49 -75 69 142 124 189 167 135 257 97 115 -188 -22 -372 -181 -232 -285 -224 106 134 38 182
3969 182 -65 326 175 247 83 118 132 55 -121 -163 -238 -180 19 -314 -154 -46 -107 -55 38 183 241 247 -82 15 120
3994 120 48 -76 -138 -347 -36 -271 -17 -214 -113 -112 -90 245 268 103 8 277 15 117 -106 -77 36 -20 -27 -101
4018 -101 -179 -67 -221 -19 -165 296 -197 48 73 237 213 318 168 -253 -9 -176 -118 -287 -61 -81 -168 -8
4040 -8 114 23 76 403 258 105 493 -22 31 173 198 -145 110 -135 -333 -53 175 6 -63 73 58 -19 82
4063 82 149 197 3 24 43 -172 -138 78 -189 -332 1 -79 -76 -125 77 -136 -147 197 2 273 266 265 46 30 62 -246
4089 -246 -275 37 -202 -339 202 -200 -14 97 329 145 136 31 427 74 36 167 -161 -248 -65 -108 -362 -75
4111 -75 203 -112 123 260 -55 84 211 209 -103 306 214 10 -101 -9 -135 -261 -393 -501 -100 -270 -116 -291
4133b91K65J92j85l2L31k23j51J57Kj96J12R8j70M2j16L37m46J69K94l45J14L34
4155B92P3k90J54J73l70rj51p2M2r5M10m46K69nj07J69K28o7n8K43l38PJ26m3
4179A35j81l80N11j60j3k28J03L2oR6J33p2J92k8J20j29J11j61n5k54J37p7P5
4202i9J6n3%J12O6P1n4K13j72K05k40J50p6j34k77L04k28kJ92m46L99K89j68n9
4226Ij26J57J23M7J06l15O0L1j66Ln4j71K36K7k9Q0m9K61j00K05j53p8j2j7J90
4251B65l29l8jL0O6j58o5K61j30Nj32K79j0K01j7k48K79J2k98P0l41L1J74j6n6
4276a66j84K83j75J60K71K0j12n9Q5r6L5N8J0l00J84Q3p7l0q5O5j50M20j33Q5
4300A92Lp7j16K26J56l79o0N8l8j10j82M79o41K12J23J08Mj24J67J08L5r7N7j
$$ plain form
4133 -291 -26 166 -19 -51 280 57 -94 63 65 -131 -19 79 -91 -49 -165 172 -274 -105 189 -156 -42 292
4155 292 365 75 229 402 32 23 -128 -200 -158 -253 157 -289 -20 -25 -132 37 265 198 140 383 45 52 178 135
4179 135 -46 -426 85 -75 -88 -316 -213 -181 -187 -91 42 -30 162 134 254 125 236 75 20 -234 -97 -174 -99
4202 -99 -83 -136 -136 -24 42 113 59 272 100 305 65 215 139 5 -272 32 -196 -198 -6 -452 -53 236 68 9
4226 9 -117 40 163 210 316 1 61 92 -74 -71 -125 -296 -60 -33 -62 18 -31 230 130 335 182 104 92 75 265
4251 265 -64 -102 -103 -73 -7 -165 -230 31 -99 -94 -226 53 43 244 227 -21 258 270 -28 42 -299 -268 -94 -110 -166
4276 -166 -350 -67 -242 -82 189 209 97 38 123 27 62 120 130 -170 14 97 20 -10 -95 -30 -180 240 107 192
4300 192 195 118 2 228 384 5 -55 3 -35 -145 -327 152 -489 -277 -154 -46 -42 -166 1 109 144 47 104 103
4324A03n0j16k09K69l03jJ80J6k05L51Q8k97K50k4J86l06K37r1j7K1J78k38l79
4347c57J77L2J91m37M21l28L95j43K2Q4J37j20k01M20k19j47j78J94J88l59J06
4368a22J11p2j10L11j03j26K77p9p0J61k29J45k43L9R9l55M48j90O6K08j96j86
4390b16J25J43J17r8O8M30l53k01J07k33R5q8n3J08j36M9j2J00k1K77k60J24L9
4413A11r1K16m10K05j1R3m2n49N50j22j85M49k84PJ45J05r8O7p7j30L9O2j1m5
4437fM4j42q8J94K6q3l32K56N7K47j54K98j85j05J53k34J36l27K60l0p6J62j36
4460f5r8m5K50M7j05p0k0R1J33oj64O3R0r0K4k81J52J7o5Q2j16J43M4M8OJ13P2
4487B50j00j63Mn9O1j19NJ41j54O1k1j70J74J44JP0k4J55j43p1J12k7j73N3j39
$$ plain form
4324 103 53 -63 -272 -3 -306 -307 -127 -111 -316 35 123 -174 76 52 238 -68 169 78 61 82 260 22 -357
4347 -357 -180 -148 43 -394 27 -301 94 -49 -27 57 194 74 -127 293 74 -73 -251 -57 131 -228 -122
4368 -122 -11 -83 -193 118 15 -111 166 87 17 178 -51 94 -149 -110 -11 -366 82 -108 -42 166 -30 -216
4390 -216 -91 52 169 71 139 569 216 15 122 -111 -16 -104 -157 -49 -185 -136 -148 -48 -69 208 -52 72 111
4413 111 20 236 -174 31 20 113 71 -478 72 -50 -235 214 -70 -63 82 187 89 156 79 -51 -12 50 39 -6
4437 -6 38 -104 -192 2 28 -55 -387 -131 -74 173 19 317 132 27 180 -54 82 -245 15 -15 -91 71 -65
4460 -65 -163 -208 42 89 -16 -86 -106 -15 118 112 -52 11 101 11 35 -246 -94 -77 -142 -60 -176 -33 11 59 65 178 250
4487 250 150 -13 -9 -68 -7 -126 -121 20 -134 -73 -94 -264 -90 54 55 125 101 256 113 42 154 127 -46 7 -132
4512a32J09j7Ln6m4R5p9j8L34q5j63K8J57j99j30N0J08J88j82Q0k95L29l45K28
4536c6p2J59N5j71J21K33q1k13K79q8k80J00k45O6o6J23j73M2K69p7N9O4L31n81
4560a82L02k35o4O7l1R2j23Q8J74nj09L25n00J88J27j50K01o8o7K9j14K66k30
4583a9n2J37j40K16k61K44k38m3K50k23J57K92j28k7J03j90k46R0J51j78j35Q9
4605a51L2M4K1K28l48J35K0J93j63J23j86q8M86j85j9j95P9j09k43R8O5J77j32
4628a18R7k6K83J51n8m28J05L28l75J58p3j4j33J16k28o9J93P8J43n06L75j5K13
4651A97k36J55j15M4R9q4l8l8l9K96m35J3j73R9L71j39K2M8K99j10j95P8q6Pk88
4676b48K60J2j50P1l7j6J09O7K6o3J23j95j9J96Qo1q8M1j72J03q9O6J06R7l88
$$ plain form
4512 -132 -23 -40 -37 -93 -137 -42 -121 -139 195 110 -53 -25 132 -67 -197 -147 -39 149 -33 47 -248 81 -264 -36
4536 -36 -108 51 106 -65 56 289 208 -5 274 186 -94 6 -239 -173 -239 -116 -289 -247 22 -55 4 68 399 -182
4560 -182 120 -115 -179 -112 -143 -51 -174 -86 88 83 -26 299 -201 -13 114 -36 165 97 30 59 -55 211 -19
4583 -19 -71 66 -74 142 -119 125 -113 -156 94 -129 28 320 192 165 268 78 -168 -78 73 -105 -240 -151
4605 -151 -119 -75 -54 174 -174 -39 -19 174 11 134 -52 -140 346 161 142 -53 26 -83 -326 -228 -163 14 -118
4628 -118 -21 -47 236 387 329 -99 6 334 -41 117 44 30 -103 13 -215 -284 -91 -13 130 -376 -1 -16 197
4651 197 -39 116 1 45 144 60 22 -16 -55 241 -194 -181 -354 -255 116 -23 -1 47 346 236 41 119 33 40 -248
4676 -248 12 24 -126 -55 -92 -108 1 68 94 31 154 -41 -60 136 144 83 -5 36 -136 -33 -122 -56 50 147 -241
4701b41K69j79L05n0O2q4j79J00L7L6r8pJ71j08j21l4m3n4n6J93Rn1K79P8j10
4726A24j18n6J40j34q2K80j6M9k56J1J83k07J85l9J7P8m5L6K00l4K1n39J29R9
4750B6j06k6n7K46m05L17o8J31k4p7p5K9L16l50L26k66R6j89R8J39m8j46ON18
4774D11k58l22N23k68J44j18j35jj4l9k0j56K11Nk11J86J43j6l19L87l97L7K13
4797a4O3K2k31K53j13J46j34M4N5j59l4MP0m9p5J09J62m5n0R2p6M4j56J36M4j73
4823f5J18j41L5j59K48j42Q0j83J88K14j56K66k79K92r1l22llJ93j86J00k17K92
4846G9k76NJ87P0j67J25J5j27l6L07j16j72N4J94k05j05O1K50j85k8J1r0K07M0
4870I8j35K86k25q3K15j6L7j62P9j48KJ6k50L18m13M21p1m8J61j24Q5J10j0k9
$$ plain form
4701 -241 28 -151 154 104 166 82 -97 3 40 76 -22 -29 142 34 -87 -121 -164 -218 -274 -81 -72 -123 156 234 124
4726 124 6 -50 90 -44 -126 154 138 187 -69 -58 125 -82 103 64 81 159 114 150 350 316 337 -202 -73 26
4750 26 -80 -106 -163 83 -322 -5 -73 58 34 -43 -118 -89 227 -123 203 -63 33 -156 -58 81 33 -113 -107 411
4774 411 153 -169 354 86 230 112 -23 -24 -38 -77 -97 -253 -42 -37 -248 -62 81 65 -254 133 -264 -227 -14
4797 -14 49 71 -160 93 -20 126 -8 36 91 -68 -102 -98 -28 -77 -152 -43 119 74 24 116 40 84 -72 64 108 -65
4823 -65 53 -88 -53 -212 36 -106 -26 -209 -21 193 37 303 24 316 225 -97 -100 -103 90 -96 4 -213 79
4846 79 -197 -192 -5 65 -102 23 38 -89 -125 182 66 -106 -52 142 -63 -168 -107 143 -42 -70 -59 -149 58 98
4870 98 -37 249 24 -59 156 140 177 15 94 -54 -52 -36 -286 32 -381 40 -31 -79 82 -42 43 153 143 114
4894A14k61K57r1L8k77L5J65kk0Q1j97k5j83M65r7K43k0j95k6N5j00k13L90j76
4918d0O2j53p0Q2nM8J38m6J90k26J4q1L36o16L37KN2j95K96k6k25L0n2N7J13N2
4944G4k6L55l27O6j05N2n2j06K2K7k10M5K6k2J12k72L94P5j91l%L21l19J18k39
4969a85L4J89l6j77J93K7P6p7K3pl03K94J71k21K59qk12j29o2M9J36j6k01M8Q7
4994d8j09J39Nk21L14n7N8M1j27J99j06q0r9K19k22j39J54J7P2j09Q4j29Q2R6
5018C4J27L2j96J7M7J74k21Q7r5J37m46K08l0L2L41m49L58J34l98K85J6k20R2
5041F6N6j18J47k78J86k80J58j59k3L03j1L1J9L19l97n3n2J84l30J63K42j01L4
5064A06Oj90O0k43J25P9N8j06l8J74k09J89J7k26P3L99n43L21k13J43j80j99J45
$$ plain form
4894 114 -147 110 19 57 -220 -185 -20 -22 -42 39 -158 -183 -366 99 2 245 225 30 4 59 -41 -254 136 -40
4918 -40 22 -131 -201 -119 -124 -76 62 16 206 -20 -6 -87 249 -367 -30 -28 24 -171 125 99 -126 -96 -148 -91 22 74
4944 74 48 403 76 142 37 89 37 -69 -47 -20 -230 -185 -159 -181 -69 -341 53 128 -63 -66 -66 255 -64 54 -185
4969 -185 -151 38 2 -175 18 45 121 44 67 60 -243 51 222 1 260 252 40 -89 -151 -102 34 18 -183 -135 -48
4994 -48 -157 -18 -13 -234 80 23 81 122 -5 194 88 8 -91 128 -94 -233 -79 -62 10 -99 -15 -144 -62 34
5018 34 161 193 -3 14 61 235 14 101 6 143 -303 -95 -125 -93 248 -201 157 291 -107 178 194 -26 66
5041 66 122 4 151 -127 59 -221 -63 -222 -245 58 47 78 97 416 19 -34 -86 98 -232 -69 173 72 106
5064 106 112 -78 -18 -261 -136 -57 1 -105 -143 31 -178 11 28 -198 -125 274 -269 52 -161 -18 -198 -397 -252
5087b52M4K12j28J91ojQ1m4J15n0k59K89j63l00o1J09l9J36J37l05K66N1K64j68
5111A19J87j54m3lJ78j32k13k00L84l48J51K24o3j48q3K38j15J64j58j84L78P4
5133B53k42Q3m31M91l1j32o9j52L86j57k47J69J39J65O8k14J40j75J07Q0j82r6
5155d7K43k27j19%j7J03n0M5M3K71l73o9N93j26k27J1l85J21J46N3J76j57J49
5178A57r2M7k04J89j4J81N1k09J04j80k60RoK08qk03J42j23J33J13N5p7J08o8
5202E3k0J65mK5j40k40J96L0j93J11j64K39k83K44%K11k36j22L18Oj98Rj2P5l
5227F7N7l9l19J96j05Q0O0J16J7q4o1J68j10L2J08k52j84J52o9K6L79m24J54R9
5251F4l8k3Q0P8k7l14J96PK14m7j27L8j19J61k58R6p9K54j90K5L0j74j9J49mN0
$$ plain form
5087 -252 -208 4 -124 67 61 60 141 97 212 162 -97 192 29 -271 -332 -223 -262 -126 11 -294 -28 23 287 119
5111 119 306 152 109 106 284 152 -61 -261 123 -225 -74 150 87 -61 -144 94 -21 143 -15 -199 179 253
5133 253 11 94 -337 154 123 -9 -78 -230 156 -1 -248 -79 60 225 293 79 219 44 151 231 49 -47
5155 -47 196 -31 -150 -150 -167 -64 -114 -69 -26 245 -128 -197 396 270 43 54 -331 -210 -64 -11 165 8 157
5178 157 65 112 -92 97 83 264 315 106 210 30 -230 -221 -227 -19 -27 -230 -88 -211 -78 35 90 13 121 53
5202 53 33 198 194 219 79 -161 35 65 -128 -17 -181 58 -225 19 19 230 -6 -128 190 196 -2 7 -5 70 67
5227 67 124 85 -234 -38 -143 -63 -3 113 130 46 -15 153 43 75 183 -69 -253 -101 -170 -144 235 -189 -35 64
5251 64 26 3 83 161 134 -180 16 23 237 190 63 101 -18 143 -115 -19 -98 156 -34 -9 21 -153 -172 -23 -27 23
5277B3n9J35K8j49J62k17J12j58L4q0K06j08J63k25q7M07j6j46l7K64l96J78k3
5300A1k26L51k27J7j4J2K6K03m9qj66J08J28M5j51j41L0k8J12k6N6R5m11K33r9
5325a19O4N3q9J99j80P1O2J00q2j67J13q3J11j55k04J10J50J04o3j72K69j33j18
5348a59K50J0k42O3m2M61m08j30J79Q9j49L54l10j6n8k35J90J25J84m04K54K17
5370B23l82L42j48Q4m12L16L1k45K05k54L26j61l21N71m07L31j40J6K6K0l3Q7
5392G5P0o9K6j15K1q2M7o7K64j95J25k3k13J86N9k86O4J09Po4P0r7M0j65RK60
5418E6j85K7o5L46k82J13K62l71K34k78K22k13P6j62j25J99L3J7nJ44RK0j64L3
5442e9Q1nK3q8P0R6j65P8j05RK4p2k5L27r0k8rn9j0J35k55J64L8P7o4j97O7k8
$$ plain form
5277 23 -36 99 127 -22 140 -77 35 -123 -89 -169 37 -71 92 -133 -220 187 171 25 -12 252 -144 34 11
5300 11 -215 136 -91 -74 -88 -76 -50 153 104 96 -70 38 166 211 60 -81 -51 -79 33 7 63 158 -253 -20 -119
5325 -119 -55 -2 -91 108 -72 -1 61 161 79 -88 25 -58 53 -102 -306 -196 -46 58 -5 -177 92 -41 -159
5348 -159 91 101 -141 -78 -120 341 -67 -197 -18 71 -78 276 -34 -50 -108 -343 -153 -28 156 -248 6 223
5370 223 -159 183 35 119 -293 23 54 -191 14 -240 86 -75 -396 175 -232 99 -41 -25 1 21 -12 75
5392 75 145 76 102 -13 8 -74 -27 -94 170 -25 100 77 -136 50 109 -177 -113 -4 3 -61 9 -88 -48 -213 -204 56
5418 56 -129 -102 -167 179 -103 10 272 -99 135 -143 79 -134 -58 -220 -345 -146 -113 -96 -101 43 52 72 -92 -59
5442 -59 22 17 40 -48 22 118 -47 31 -74 -65 -41 -113 -138 189 99 71 62 3 -7 128 -127 37 75 152 88 -109 -42 -70
5470g0j81R2K48j68KJ49r6l3j0oJ07N6j17J03k46L75l51oK06j63L08p3j58j17
5494a49J77O0j19J01J31j66j2L4P9l09L93j32j26q7lQ9j3j29L05j35O1Jnj36J19
5519B9O0j8N7j60j11j76J51L23j14k49L78n6j56L8o1%K82l42Q1N4j26j17L23k97
5543b07J28o6J67L6k90J01L37m28P6K06J2J19k87L29m47J89j23R0j18J49o0P4
5565a3n7P0J45qk19p7QK29j19nk8P1k58K58l1j67J00j7P5j97L34pK8qJ5o4j90
5592a32L58k1l01J42J36l05l0J57r1n8m9J96j48J12L67k29m03L01L0J59j90l8
5614c7l9J44k14J48o3J00L1l2l5r5J13r1K03j6M3j57Q6j07r8P9r7j33KJ06J14
5639d5J43J30m49L52M9j45n2n8K90o1ko4m8p7O0m8J55k78K89L8m25O7L1L38j35
$$ plain form
5470 -70 -251 -159 89 -79 -77 72 -24 -57 -67 -73 34 90 -27 76 -170 205 -146 -152 54 -109 199 126 -32 -149
5494 -149 28 88 -31 70 201 35 23 57 136 -173 220 88 -38 -125 -128 -39 -52 -181 124 -11 50 51 46 -90 29
5519 29 89 71 128 -32 -143 -319 -168 155 41 -208 170 114 -42 -4 -65 -65 217 -125 -44 10 -116 -233 90 -207
5543 -207 -79 -145 22 58 -232 -131 206 -222 -146 60 72 191 -96 233 -214 -25 -148 -58 -176 -27 -87 -13
5565 -13 -70 0 145 137 -82 -159 -151 78 -41 -46 -74 -3 -261 -3 -34 -201 -101 -118 -43 -240 94 87 115 107 122 58 -132
5592 -132 226 205 -96 46 182 -123 -153 4 -87 -145 -194 2 -146 -34 333 104 -299 2 32 191 1 -37
5614 -37 -76 68 -146 2 -61 39 70 38 3 -92 21 -70 133 117 160 3 89 -18 -116 -37 -134 -267 -265 -159 -45
5639 -45 98 228 -221 131 180 35 -17 -75 215 154 152 88 40 -37 23 -25 130 -148 141 179 -246 -179 -148 190 55
5664E5j49J1J95O3m0n1k12L59l25J26P0j88r2J29k01K77j43K50l38N2J85J00l24
5687a91M5R0L6l7r9K08q6N4J74j08j96R0K43k70K17j47R9j35j33J18J72m64Q8
5710b32K00j00J27P5K25k06k3j41M4o6l8J16J13p5l28J42J16J14k01p9K64j81
5732a34Q6J6j52K89J41l34K41k34R2j22M4j85M47l80L20j38J71p9l78M64k33K79
5754B21l60J74Q6K55k07m46L33J5k80q1R3K96k07K5%m5N8jJ32K2j80K94o2r1K26
5779B70l70K23o2j36L5L6k95K03J08j84J17j73J50n9K62m9O8j04j05nJ10j53Q4
5802b9p8L11k80J07J02j01q8p5J17o0m2L14l52J4J15K94l13n0J70k91K34k7M7
5825C9j53J77J20Q9o6k84L66j87j83j9L2J59j20k33K41q0n5K17N4r6j73K11J01
$$ plain form
5664 55 -94 -83 112 175 135 84 -128 231 -94 32 102 -86 -178 -49 -250 27 -116 134 -204 -152 33 133 -191
5687 -191 -146 -56 -20 -57 -156 52 -34 20 194 86 -110 -20 223 -47 170 23 122 -13 -146 -28 144 -320 -232
5710 -232 -32 -132 -5 70 295 89 66 -75 -31 -97 -135 -19 94 19 -309 -167 -51 63 -138 -217 47 -134
5732 -134 -48 -32 -184 105 246 -88 153 -81 11 -111 -67 -252 195 -185 135 -3 168 89 -289 175 -58 221
5754 221 -139 35 121 376 169 -277 56 71 -209 -290 -197 99 -108 -83 -83 -128 -70 -71 61 83 -97 197 135 44 270
5779 270 -100 123 61 -75 -40 -4 -299 -96 12 -172 -55 -228 -78 -137 125 76 144 40 -65 -70 40 -113 -29
5802 -29 -107 204 -76 31 133 32 -56 -131 -14 -74 -116 198 -154 -140 -25 269 -44 -94 76 -215 19 -8 39
5825 39 -114 63 183 272 206 -78 288 101 -82 -101 -69 90 -30 -263 -22 -102 -157 60 114 18 -155 56 157
5848A57mj17M5l00K41L28k43l03K53p5p6J14OK5k04J80M6ll6J33k68J18L4j26
5872g5K8q8O8j35L64m24J73J77L1q6m9K29p0O1r8j56k07L20J56j80j04j52M44
5895B27k56O8j29K52J7j70k8J24j3J31k61J71k05k88K40j10O9J90J21j59p1N8
5917b2K36J91k30o2k01J16k94K19j37K95j48r3J3j59K16k48M46l01K41r0j26K58
5939A20k6p5k3J1J14k33J63O3j90J20j58K58j05o3J12o0Q4o0j17J35Q7r4J36p7
5963A22k40M5R1j36J32R6km44M58j15J85k25K14k8K3k5l69K68K23j49j57J11j83
5986a05OR5j35L53k95m9J55n8Q3n2J37j14j32j29L9o7J34O5j89J17J53J09j00
6009B1M7J56K0j85p8r1j19K50j55Q8j68m2K65N0N6k40K77k94J94j81J75J05j45
$$ plain form
5848 157 153 36 81 -219 22 350 107 -196 57 -18 -94 20 26 51 -153 27 73 70 34 167 -101 17 51 -75
5872 -75 -47 -135 -67 -202 162 -262 -89 88 119 33 -16 213 143 204 106 -50 -257 63 219 39 -65 -217 227
5895 227 -29 39 -90 162 179 9 -19 105 92 223 -38 133 -72 -360 -120 -230 -161 29 150 -9 -80 -22
5917 -22 214 405 175 113 -88 28 -266 -47 -184 111 -37 -130 -117 -276 -60 -308 138 -163 78 -12 -138 120
5939 120 94 19 -4 7 121 -112 51 114 -76 44 -114 144 39 -24 88 28 112 52 -65 70 157 63 199 122
5963 122 -118 -73 18 -118 14 110 108 -336 122 7 192 -33 181 153 176 151 -218 50 273 124 -33 78 -105
5986 -105 -99 -4 -139 214 -81 -130 25 -33 50 -2 135 21 -111 -240 -201 -268 -134 -69 -258 -141 12 121 21
6009 21 68 224 244 59 -19 -110 -229 21 -134 -46 -214 -256 9 59 115 -125 152 -142 52 -129 46 151 6
6032Fj03K78l4n0q0r6L9j06lJ25R8J1j3l5Nj46J40K85m33R0P2N4nk91K23O1q0
6059A2k90L42q9MM0K73l08K20l15N2J88k02J91o5J9j03k95J78jp3j18L66j02K21
6083A45j95K96n38K93k4K30l3k46M53m55J19j91K22l33K07k20J87o0J77m6P1K4
6105H3j98J64j78R4l9J60k2k41m3J74M8J03p8l1Q3k8o8l7J74o0k06J76K3J73m13
6130a87K22j66J31k94K79P9o6Q8L6N9j58J47l0K5j87J35l15L76k11j61K21m8N3
6153B8l03J27J27Ql8J47J14k48R0p5J63k08L47j94p2j62q1K65j7Rk81M06j41J00
6177A11n9J0k22J02O9K71l53K4K4j45J03k58L73k62K55l8J53r4J69j5J53j88o
6200A77j93M0j3j58k8K57p1m8k01Q5J81k32J87r0K92l94l7N7K74k65J46L8J20
$$ plain form
6032 6 -97 181 147 97 17 -79 -40 -146 -149 -24 74 85 72 37 42 -104 36 321 -112 -22 50 104 99 -192 31 92 12
6059 12 -278 64 -25 -21 19 292 -16 204 -111 -59 129 -73 118 53 72 -31 -326 -148 -149 -222 -340 26 -76 145
6083 145 -50 246 -292 1 -23 207 174 -72 381 -74 45 -146 76 -257 -50 -270 -83 -143 34 -12 59 83
6105 83 -115 49 -129 -35 -74 86 64 -177 -220 -46 2 105 27 -4 79 51 -17 -54 120 60 -146 30 53 226 -187
6130 -187 35 -131 0 -294 -15 64 -2 86 122 181 23 170 140 165 -22 113 -202 174 -37 -198 23 -25 28
6153 28 -275 -148 -21 -13 -51 96 210 -38 52 -23 140 -68 279 85 13 -149 -230 35 18 27 -254 152 11 111
6177 111 52 62 -160 -58 11 282 -71 -47 -23 -168 -65 -323 50 -212 43 5 158 64 233 218 371 183 177
6200 177 -16 24 11 -147 -175 82 11 -37 -238 -153 28 -204 -17 -107 185 -209 -246 -189 85 -180 -34 4 124
6223A24N2j77j09P4N9L9Kk0k42K04P3j3J31k56m1K69k35K7k12Q2j23J18J38J60
6247A24r1r1q3J99R2l2j46O9k16j15L71j8k93K34j98L2P5j65L85j46P7k16J3L65
6271B26k13l0J22j73j17k0L94m30lJ16m5J21jP4j56J73r9K27l03K00j9J05p7k5
6295D7K2k98K46j70M1K10j42J15k62K81j4K22m17L26n3k28j66J71j66K94k31J45
6317b7r8J41J3l38L52K12p6k93K19j18J36j24r8J76r9J30k19J27Nj02j31J97R0
6340G5j49K09j61J12P0k02m4R5k18K33j07j39K14J06k49L92k59l8J90n6l48L07
6362C3l6j04K16N8k1k97K0M1j47L31j06j23O3q0L56l61J85r5J70j5J48k75J8J59
6386A38k17L58n27K10m5J4j00J83R6P1j29k29N0M5J47J53n2p0j40J80l27NQ8P0
$$ plain form
6223 124 176 -1 -110 -36 23 62 64 44 -198 6 79 66 197 -59 -100 169 -66 -39 -251 -169 -292 -174 -36 124
6247 124 33 -58 -141 58 150 118 -28 41 -175 -290 81 63 -230 4 -194 -162 -87 -252 133 -13 64 -152 -139 226
6271 226 13 -17 105 -68 -185 -205 189 -241 -244 -128 -173 -52 -53 21 -135 38 -61 166 -137 63 44 149 72 47
6295 47 69 -229 17 -153 -112 98 -44 71 -191 90 76 298 -119 207 154 -74 -240 -69 -235 59 -172 -27
6317 -27 -125 16 29 -309 43 255 179 -114 105 -13 123 -1 -99 77 -22 108 -111 16 21 -81 -212 -15 75
6340 75 -74 135 -26 86 156 -46 -90 5 -213 20 -87 -226 -12 94 -155 237 -22 -60 130 74 -274 33
6362 33 -3 -107 109 167 146 -151 -131 -90 -237 94 -12 -135 -72 -152 204 -157 28 -67 103 88 236 -39 -21 138
6386 138 -79 279 -248 -38 -83 -69 -169 14 110 181 52 -177 -127 -82 65 218 166 96 -44 136 -191 -186 -98 -28
6410b8nk0m1l1L42j75j0J75l88K73j46pM6j7N4J16j21k21J20R1L1l15M64L2q1
6435A38j32P3r1O6j27R3p5P6l5l36K70oN1j60M4M46k28J86j45q7p9J34j88j0o3
6460a85O8J20P2l22K05j33J57R8N1J9J35k27j42J40n8J02L3j18M7K6k42N2J04
6483BN1l09L95j33p5J76K27j02m7j80j19K57l77J06M28n45L26k26K82j58p1J96
6505A04j18L5q2Q1j08L05p7j10m9j89o9M12k88R0ql6J01k08P9K12j05k68N52K42
6529D98n96J2j82Q3K04k5m6j9K57l17jJ58j77K97k79R2q1K17j92K8j37K32j44
6552a18q9L3K71j52m8j40L71l25R0R6M4o0K8j14J70M1k69Q1R7r1O5j73M18l52
6576a26J28LJ04M7l41K70j66J78J7J0k23R9r6J29r0J1J89q9L5j77J02L2j25J44
$$ plain form
6410 -28 -33 -53 -94 -125 217 42 32 207 -181 92 -54 -61 -15 -32 22 138 17 -204 -84 7 38 -277 187 219 138
6435 138 6 79 -12 54 -73 20 -55 21 -14 -350 -80 -86 -35 -195 -151 295 67 253 108 21 -58 76 -112 -122 -185
6460 -185 -117 3 75 -247 -42 -175 -18 80 131 150 285 58 -84 56 -2 100 133 15 62 88 -154 -102 2
6483 2 53 -256 139 6 -69 107 334 232 185 5 -114 143 -234 -128 300 -245 81 -145 137 -21 -92 104
6505 104 -14 21 -61 20 -88 217 140 30 -19 -208 -277 135 -153 -63 -71 -107 -6 -214 -135 77 -28 -296 256 498
6529 498 -98 -86 -268 -185 19 -6 -52 -71 186 -131 -132 26 -151 146 -133 -41 -122 95 -97 -69 -206 26 -118
6552 -118 -207 -174 97 -55 -103 -243 128 -197 -107 -11 33 -27 1 -113 57 98 -171 -90 7 -84 -19 -192 226 -126
6576 -126 2 5 109 156 -185 85 -81 97 114 124 -99 0 -96 33 -57 -46 143 54 89 -88 14 46 -79 65
6600F5m25M04j2j76j5r2J82r0K71k70J83Rj8M9l7p7o3j10J64J89qo6R8m1Qk21
6626i9k4j77L32J30l22k6L46R2l70k8J42J61j88J17j02p2J13m4j16rJ64j57k5
6649a62Q9J61k64K55J9r0K19J02k30j32J07k6J20j83J54j48j53K53l8p3R2J79
6671B51m0j72J03j06j73K61j33j68M83j89n9k21K4J42j38pK40n1j08pj68K62j03
6694g7J66j85J60p4j20J56L7j31n1j6K36L3l0j77J63r5p8K72joj26p9o1K67k37
6719e4P0j30m7J06n6J29M1j9J28j59l7j3J27k82K46j78J00m1m0%j40J34K09J13
6743B07k28K9R5j17K45q5l63J24K49j52k80J26N6M0q1K43J53j43q6L7j27J81j23
6766@P6j41L64p7k75q7j8J24r3j3j9K86kj72j39M40l59P3K23k12J46Nj53j2o3
$$ plain form
6600 65 -360 44 32 -144 -159 -251 -69 -159 112 -158 25 34 16 65 28 -49 -112 -222 -58 131 123 57 155 114 122 -99
6626 -99 -123 -300 32 162 -160 -186 160 252 -118 -146 -4 157 -31 86 -16 -88 25 -19 -135 -144 20 -137 -162
6649 -162 -73 88 -176 79 98 8 227 329 99 -33 74 48 168 -15 139 -9 -162 91 53 -20 72 251
6671 251 211 39 142 36 -137 124 -9 -177 306 117 58 -163 -139 3 -135 -142 98 47 -61 -68 -236 26 -77
6694 -77 89 -96 64 -10 -130 26 63 -68 -119 -135 101 134 104 -73 90 -5 -83 189 188 182 56 -23 -84 183 -54
6719 -54 16 -114 -161 -55 -111 18 59 40 168 9 -28 -41 86 -196 50 -128 -28 -69 -109 -109 -249 -115 94 207
6743 207 -21 8 103 -14 231 146 -217 -93 156 4 -276 -150 -94 -54 -135 108 261 118 32 69 -58 123 0
6766 0 76 -65 299 222 -53 -140 -158 -34 -127 -140 -159 127 125 -47 -186 254 -105 -32 191 -21 125 130 -23 -35 -98
6791i8K4q6R2l2K12k30j7k0K54m2j4j52J72m4J13l23K55l9J22j94j36P9L4J24
6815E4k69L32p3l0J31j02L8j22J02j19J06j23j49J69j46J85L4J2Kn4L4m2NO9k5
6840A9p4K52k31r9R1nj39J84o0J13j20J7k2J59l3j72J25L08l69j31K14q8J68l
6864A04k21J81k25k7O3O6K2q8R1K61k68MJ04J81q4k09K5o0K9K04k45o6J05L2m0
6889f1q4j24L84J41k58J41j69Q1l9J36j53j0M1k33J56pN7j22Q3J44P3m2q3n7q9
6914i4j23M06j20o3K5J02j74pJ1J03P0m80L29n1J06k16L64m7j79K54l61J22R5
6937G2j37P9k78k4K83l6J58k23J10j02K14j85J04j11J66L1J4O1pl04K08r6l3J86
6961A50k23L5K97o1j69k39M03Mk28J09k97L57r5M3k86K29l3m1N1j97K1Q1J1L52
$$ plain form
6791 -98 -74 -160 -68 -100 112 -118 -135 -155 99 57 43 -109 63 19 132 -191 64 25 147 -47 -183 -104 -70 54
6815 54 -215 117 44 14 145 43 81 -41 61 -58 48 -75 -224 -55 -201 -16 18 30 32 -22 12 -30 -25 44 19
6840 19 -55 197 -34 -133 -42 -47 -186 -2 -62 51 -69 -52 -74 85 52 -120 5 313 -56 -187 27 -61 107 104
6864 104 -117 64 -161 -188 -125 -59 -37 -125 -34 227 -41 -37 67 248 164 -45 -20 -80 -51 153 -92 -158 -53 -21 -61
6889 -61 -145 -269 115 256 -2 139 -30 51 12 148 -5 -15 26 -207 -51 -58 -1 -123 -40 104 177 135 52 -5 -94
6914 -94 -217 189 69 6 31 133 -41 -48 -37 66 136 -344 -15 -66 40 -176 188 141 -38 216 -145 -23 72
6937 72 -65 14 -264 -288 -5 -41 117 -106 4 -98 116 -69 35 -76 90 121 135 196 189 -115 93 -3 -36 150
6961 150 -73 -38 259 198 29 -210 193 197 -31 78 -219 138 43 86 -200 29 -4 -45 6 -191 -170 -89 -78 274
6985B74l47lJ12j86K02J1J0l87J74K42j45J42k8j07J4N6J75k19j22L65k13J68
7007A88j01j56J2J18J02j82M6J13l22J89q4O5L3K9Q2P1o4J7M3k36m5L07l41J13
7031cm4Q2j12R1m5J6qN1j39n0L30j49q3p5O9J36p1o6J27j70m8K29L7j50j09J13
7057d1L1k04K62rN9k02R3J08j12j74K24j15k91K99N4p9J46r9J37j10j49J93j42
7080a21L33m98L24j22jK70q7l52L18N8r3j0j5%R6n3n0J00m0J82j76k05K09m5O6
7105H8k47K24k5j46K47k01J45Mj86L97l01N7J66n2k80Q6j51O8k91K97K3j39M57
7128B40k18m2J0j27M2K30J47m42J57P4M2o0j72k2J65r5r7J50o6q5K83k70M14k06
7152E2p3j57J37l02L49j15K42k28L07j80j25K00j24r0Q7j25K36l6j05J10J46j53
$$ plain form
6985 274 -73 -76 36 -150 52 63 73 -314 -140 102 -43 99 71 -36 -22 34 209 -10 -132 233 20 188
7007 188 87 -69 -57 61 163 -19 27 140 -182 7 -77 -12 21 50 132 203 139 156 199 -37 -82 225 -116 -3
7031 -3 -47 35 -77 14 -31 -15 -23 28 -111 -161 169 20 -63 -138 -69 67 -4 -70 57 -113 -161 68 105 -45 -154 -41
7057 -41 -10 -214 48 39 98 -104 -11 97 -15 -189 35 -80 -371 -72 -18 -97 49 -50 87 -23 -172 21 -121
7080 -121 212 -286 38 -84 -85 185 98 -254 64 122 29 19 4 4 100 47 -3 97 57 239 63 -142 67 22 88
7105 88 -159 65 40 -106 141 -60 85 89 -97 300 -1 56 222 170 -110 -24 -175 -107 -398 -101 -78 -217 240
7128 240 22 -20 -10 -137 -95 135 282 -160 -3 71 113 53 -119 -141 24 -71 -168 -18 -84 -169 114 -156 258 52
7152 52 -21 -178 -41 -343 6 -109 133 -95 212 32 -93 107 -17 -107 -20 -145 91 55 -50 60 206 53
7174E3K79l77Q6j49K15J09l42j6M5K31o2n3J69j04R3j43k25K36J12k18PJ53o1
7197C8L6j91p6K88l18M66k83k5J07J14j1p0n4o8J84K1q0k43J17k7j20Q6M7K41
7221A79k65J04j08R3R1l35L14K8J5j92j7j46L71l4L6l39J78K49j29J6k80M77j29
7244A77k19K93k90J22p0j01O8P7N8j36j63K5q3O6M07k29j59K03k59K08J14mJ21
7267B26l07K43k34j90j69M85M5k43L47l74J24R0J6L3j41O7q0q2K63j16k09J83
7289b3j0Rn9K40k90M4M28ol15q6K54j29J16m0L2k6j97R6mM0j42P1J00J4k9k69
7315a81L50j79j5j8M5L00m77K62p5l5R1P6j95p2J62j14m1K49k70L54q9N6j04j43
7339f3kK35k53q5J55k89K44j20L56m07M53pj68p7J47J58j56o4j59o0L46j65j52
$$ plain form
7174 53 332 -45 41 -108 107 216 -126 -142 -97 134 72 19 188 84 177 34 -191 45 157 -61 -54 99 38
7197 38 74 -117 -193 95 -223 243 -40 -65 42 156 145 75 21 -47 137 158 78 -165 -48 -75 -195 -109 -62 179
7221 179 -86 18 -90 3 94 -241 73 101 116 -76 -93 -239 132 98 134 -205 -27 222 93 109 -171 306 177
7244 177 -42 251 -39 83 13 -88 -20 57 115 -21 -184 -159 -242 -176 231 2 -157 46 -213 -5 109 105 226
7267 226 -81 162 -72 -262 -431 54 99 -144 203 -171 -47 43 59 92 -49 18 -62 -144 119 3 -206 -23
7289 -23 -33 -24 -83 157 -133 -89 339 333 18 -68 186 57 173 133 165 139 -58 38 34 74 -68 3 103 117 88 -181
7315 -181 169 -10 -25 -43 2 302 -175 87 12 -23 68 144 -51 -123 39 -75 -116 133 -137 217 128 184 80 -63
7339 -63 -65 170 -83 -168 -13 -302 -58 -178 178 -229 224 217 49 -28 119 277 121 57 -102 -162 184 19 -133
7362a33n3R7J03O5l69L12k51K88l9R6j74Q2r7pJ31Q8o4k83N0Q3K49j03L8k98L80
7387A91l12M09k63k4K03r5Rk87p9L14R0k13k69K37J1L29o50L71QN2j0M0p5K20
7411B07k01n1m7M2o1J03j71K68k55J75Q2j32J6r4J78J9lQ2j42J0j32P5L8j85J58
7436b1j42nL1K09P4q3J45J14j59j42J72n0j24l9K7k18K00l6r8n1P1O7k6K02l77
7461b59K28J31r9q3K84k12K17m49K16nn3J46j21L8J33j49J88k51L78l23P7L2J8
7484H2J3j57J8K04k49R2K44l54J12o4J78j92L2K55j86J78j82m6q1J56r7L4K36
7507B26j05J8j89J17k01K31J4r1k62L92M8l49L43l94K09K0K62k66J5j41j05J14
7529i4j15L36q5j35J41J61l67L07j93K43j17j54K49k42L1P3Q1p8j98J55J44r9
$$ plain form
7362 -133 -186 -89 14 79 -290 22 -229 59 20 116 -58 24 -73 -80 51 139 75 -208 -158 -75 174 71 109 -189 191
7387 191 -121 288 25 1 204 109 118 -169 -248 66 156 -57 -326 -89 -78 251 -399 -28 -20 32 22 62 -13 207
7411 207 6 -45 -92 -50 -111 -8 -179 89 -166 9 91 -41 -25 -119 59 78 75 157 15 25 -107 -32 6 -179 -21
7436 -21 -163 -168 -137 72 146 63 208 322 163 21 193 143 19 -20 7 -211 -11 -47 -145 -196 -125 -58 -84 118 -259
7461 -259 -31 100 1 -82 202 -10 207 -242 -26 -31 -84 62 -59 -21 112 -37 151 -100 278 -45 32 64 82
7484 82 95 -62 -44 160 -89 3 247 -107 5 -59 119 -73 -41 214 28 206 24 -22 -103 53 -44 -10 226
7507 226 121 139 -50 67 -134 97 111 20 -242 150 198 -151 192 -202 7 27 289 23 38 -103 -208 -94
7529 -94 -209 127 42 -93 48 209 -158 149 -44 199 82 -72 177 -65 -34 39 120 42 -156 -1 143 44
7551D4J11k83P6k0k8K50J65k40L4n2j03qO0l4J64k21J7j63K08R5L5K7L49k17M7
7576C13m65J21L2J00k09J39l5m2L6N3ok32J61r6L64j99M5K7N7R7k75K62k03k06
7600a61J27m8kj37J67k2r5r4P32l75O7j7r8q9J95j27j59M9j81Q0K14j18R3J23
7624A24n9l9l7O1j05L0J84pj13Q7k76J71J05j96P4l0k52L07R7j87J81k8r1R1J28
7649B20k15J26k50J23J90k07n1n5K68m13J69K57k41k6l6K35p6K6l32K10M0m0J6
7672f2J03j23M8L37k55p7J64j80J31mO7j56J94J43l22k92K28K95k59k43K50K1
7694Ho1Q9K4J08j59r4J4K52j38O9p2j53L09j48j70K8N8p1p7J56J26j84J63N2M
7719A33j88L54j40k59K11k36J64j8O0j74q2K7p0J97l2r9P0M1o7k8J90j67J75k76
$$ plain form
7551 44 155 -128 -52 -72 -100 150 315 75 109 57 -46 -54 6 -28 136 -85 -68 -231 -23 72 107 134 483 266 313
7576 313 -152 -31 1 101 -108 31 -4 -46 -10 43 37 -195 -34 -130 234 35 80 107 164 261 -14 248 45 -161
7600 -161 -34 -82 -84 -221 -54 -76 -171 -265 467 92 159 142 44 -45 150 23 -136 -87 -268 -188 26 -92 1 124
7624 124 65 26 -11 50 -55 -25 159 152 39 126 -150 21 126 -70 4 -26 -278 29 126 -61 120 92 1 92 220
7649 220 5 131 -119 4 194 -13 -64 -119 149 -264 -95 162 -79 -105 -141 94 18 44 -288 -78 -38 -78 -62
7672 -62 41 -82 -34 303 48 -29 135 -45 86 82 149 -7 187 330 8 -284 -56 239 -20 -263 -13 8
7694 8 -53 36 60 168 9 -85 -71 181 43 112 40 -113 196 48 -122 -94 -36 -107 -184 -28 98 -86 77 129 133
7719 133 -55 299 159 -100 111 -125 39 21 81 -93 -175 -148 -218 -21 -53 -152 -82 -41 -108 -136 54 -113 62 -214
7743b14R9L09l49J97k7k1j17J67q9k02J46J97Q2l50K67J54j64k23K31l09J69o1
7765a08J24j31O6n9K40M5r5Nj59K5K93k25K51k99j20K39J3l31L27j07J64j92m5
7788g9P5p2K73j28j45J53j14L10l17J84j03om4Mj29j93J82J03M3k5p6O7J19k7
7812E5n8j50L04j50O7n4l7j26j10L86k85J03N1k51L51j8N9k25J81j21Q3r6J27
7835H6n9j26Q0L5L3j62K09k07j12M33%l20J79J9n1J01J30j37k03J79k71pK32M7
7859A08l65O8K61k05J73L25l02L0N1L8j61k7J10k19L17j09k24J8K55o6q6L7J7
7882D4J32j07j46O3j13J70J8j9L1k61p4R9K66nj54j15j6L10n4k57K55K39j55j32
7906A9O3J60j65K4j42R6j35M9M9K04j96K34j83j76K22J5m58K43N6K41j14K6j29
$$ plain form
7743 -214 -115 194 -155 42 15 -6 -123 44 -45 -247 -101 96 178 -172 95 249 85 -138 93 -216 -47 -108
7765 -108 16 -115 -49 -108 132 177 82 87 -72 -47 246 21 272 -27 -147 92 105 -226 101 -6 158 -34 -79
7788 -79 -4 -76 197 69 -76 77 -37 273 -44 140 37 31 -13 -9 -138 -331 -149 -46 -3 -28 -104 -37 82 55
7812 55 -3 -153 151 1 68 14 -23 -149 -259 127 -158 -55 -4 -255 96 78 137 -88 93 -28 55 -41 86
7835 86 27 -99 -19 16 49 -113 96 -111 -223 210 210 -110 69 88 37 138 268 131 -72 107 -164 -171 61 108
7859 108 -257 -189 72 -133 40 365 63 93 144 182 21 -6 104 -115 202 93 -131 -113 142 76 -10 27 44
7882 44 176 69 -77 -14 -127 43 61 42 73 -188 -262 -163 103 98 -56 -171 -187 123 69 -188 67 306 151 19
7906 19 82 242 77 101 -41 55 -80 -31 18 222 26 260 77 -99 123 138 -320 -77 -21 220 106 132 3
7929Cj05p5O9K50N4m04K43K19j37k3k2l5O6l2m7k44J82j8K54j48j57K13k90K30
7953D6r3L22k50Q5m6K10n7k08J82o7k78L33k55o5J14o1K2N4J11r2l9P4J87j24
7977A05o7M7P4k02oL13k37pj93J65J16r0N8k1j78O6O3Q6J72O2l47J03j4k45Q0
8002i7M63l02r0q9o4L15j88j58M02j57J78k14k1K20k15K1r9L34l19K18k01J83
8024A20j60j49p2K69P6k35L95j9j77Q7k95K35p5L8J00k19k7J18k1M8j36k2rL54
8048B24k39J34n2J28q5j54n2O2j7k60L47P0m9P9m7j79n6L6L75j88rj06J17k88
8072b09J85J22m1L8r4R8l01K09j17M5K63j03k35O6K22q4o0K48j64j32J5J17j19
8095c1m9j11l4L34k0p5q2J50j30J2O7J25j67j5L80n39J83J27J30l94J2Q8q8J79
$$ plain form
7929 3 -102 -177 -108 142 196 -208 35 254 117 94 72 37 103 71 24 -220 -38 -56 198 50 -107 106 -184 46
7953 46 -47 275 25 110 64 274 217 9 191 124 -154 179 -76 -141 -27 -88 -66 -12 99 7 -32 42 229 105
7977 105 38 85 159 -43 -49 264 27 20 -173 -8 108 18 76 55 -123 -57 6 92 264 326 -21 82 68 -177 -97
8002 -97 366 64 -26 -115 -179 136 -52 -210 192 35 213 -1 -22 198 -17 4 -95 239 -80 138 -63 120
8024 120 -40 -189 -261 8 84 -151 244 225 48 135 -160 75 0 38 138 -81 -108 10 -11 37 -99 -121 -130 224
8048 224 -15 119 67 195 110 -44 -96 -34 -51 -311 36 106 57 136 89 -90 -146 -110 265 77 68 -38 79 -209
8072 -209 -24 98 57 95 1 99 -202 7 -110 -65 198 95 -140 -74 148 64 4 252 88 -44 -29 88 -31
8095 -31 -80 -191 -225 109 89 14 -68 82 -48 -36 31 156 -11 -26 354 -185 -2 125 255 -139 -127 -39 -127 52
8119E2J04K1k17K53p0R6k70J2J41j40l9J62q2j42K6L17k35J08pn2k8lN9J47j2
8144B01j75j18J02P8j58J43k36p6J67K14j75p8J80j6j45L35j61J37j92p9j48J1
8166a89L36k77R6J5J35j2m2L4k16j32Q6K97j15K40l68K26j39K2L1j92J85K5r3
8189d7k31J09J21LQ4O0j35Q4O7j32K14p8l50L34j60n5j9J52M0j75j22J53K16j02
8213C1M9j3j66K13k12J97j14K15j33j87Q0j8jR5j36K89j94J01r3J28k72L56k20
8236en9rL18l81K1j53L47J4k00K10j36Q5j08O2o0L26j49P8k40K4o4j55K5K68L1
8261I0j76K51j8q4j20K1L1J70j39O4O3nq2m1j00k3K17k17j4Q2K4J05k94Q8p7K13
8287B9L01n75M35q3m0j31n0P9J69p3r8p7J36k64J19j25J84O9n6J74k29J83J8j0
$$ plain form
8119 52 156 177 -40 213 143 239 -31 -19 122 -18 -57 105 23 -119 -93 224 -11 97 90 38 10 7 66 213 201
8144 201 26 -92 10 88 -70 73 -163 -239 -72 142 -33 -111 69 53 -92 243 82 219 27 -52 -200 -189
8166 -189 147 -130 -34 -19 116 104 62 96 -120 -252 -166 131 16 256 -112 114 -25 -3 28 -164 21 46 -47
8189 -47 -278 -169 -48 -45 39 99 -36 48 115 -17 197 119 -231 103 -57 -112 -131 21 61 -114 -236 -83 133 31
8213 31 80 67 -99 114 -98 99 -15 200 67 -120 -40 -58 -59 36 -100 189 -5 96 3 131 -141 215 -5
8236 -5 -64 -73 245 -136 -115 -268 79 93 -107 103 -33 52 -56 6 -54 272 123 201 -39 -15 -79 -234 -209 59 90
8261 90 -86 165 147 63 -57 -36 -5 165 26 90 153 148 66 25 -75 -98 119 -98 -112 -30 -6 99 -195 -107 -184 29
8287 29 330 -245 190 107 67 -64 -114 -35 134 61 -37 -114 22 -242 -123 -248 -64 5 -51 123 -106 77 95 85
8311H5k8o5q4J82j88p5M6L4J84j38k13J72L9l7L39j51k32K00L8L0o0q5K56m03
8335a54J93k19J47J49r5L5K48k54l4K02r1nj60j11K46l73K68m8K58j74n7K99j73
8358I7L1p6j17K26m5k41K09o8p0J18MR9j18q2j21J9K8J49q8J64Oj97K66k64K13
8383A42K2j76l33M82j90k11J51L6n8J76K51m81p7L27K76m09K86l1n7k72L28J3
8405A95j25j91N1J23k2nj33J23n2R7l1J24j64j31J82J20j1n4Q5j21j99L13l52
8428a78j15M01k83J29k18L35P8j29L32k20J1j56J27k88J93N5j80p7J08j36K04
8449gJ03pl1J71k34M0J11j43Q2NJ06j14j9l49K55J02n0q8N6J31j4J24k77%J05
8474E8N0P5j33k4k34J72J16k80J35p0jM32l83m3J20R4lq1j86K09J02o6k53J1J67
$$ plain form
8311 85 57 -8 -92 90 -98 -173 -127 -93 91 -47 -260 -88 -49 -86 253 102 -130 70 108 138 78 -7 249 -154
8335 -154 39 -180 -33 116 21 56 304 50 16 218 127 122 -38 -149 97 -276 -8 -56 202 28 -29 270 97
8358 97 128 52 -65 161 116 -125 84 16 -54 64 68 167 49 -33 -154 -135 -107 42 -46 118 124 -73 193 -71 142
8383 142 164 -12 -345 137 -53 -264 -113 -77 -135 41 292 -189 -266 61 337 -72 214 183 126 -146 182 195
8405 195 70 -121 -70 53 31 26 -107 16 -36 61 30 154 -10 -141 41 161 150 96 181 60 -139 174 -178
8428 -178 -293 108 -175 -46 -264 71 149 20 352 132 143 -13 114 -174 19 74 -106 -183 -75 -211 -7
8449 -7 96 89 58 229 -5 35 146 3 85 90 196 82 63 -286 -31 71 21 -67 -11 120 106 230 -47 -47 58
8474 58 108 183 50 26 -208 -36 80 -200 -65 -135 -136 296 -87 -130 -10 84 81 0 -186 23 125 59 -194 -183 -16
8499a6m0k87K57LL12j36j19j60K61j08Q1J7j35J51j95L06k17k81M23l61J89k13
8521b68K50k7L7K53j47rj61K4m3K07j46k03M3J69k1L5q4K21j98Nj35L46k22J50
8545G6o3Q3m1J5q1J82r8k02P9J27j60K33j92K96l4j14L4n3j7P4j08Q5j67P9Rj72
8571a30L7l4J01j73jO9L08j04k89J41P5O2oj50K18j91L86j77j55j63oQ5O6kQ3
8596E0P7j16q1r3J93J69k19J2J0J9p0P6O3k34J24m6L3J0l6K33Lj99J37k9m0l1
8622A5j32J77p5j14L8l1Q1L3NM0l35K12Q6J10R8p9k6n4m2N6j9J49j91J03r1jQ5
8649I8j19L0KjJ4j9N9O9j46K83k74m2L0l4J1k2k02J48l7L26j28Jn5J2J0m4J25
8676I5j10J49j92jq1J94j06j75j0L3K75j4P0j55R3p2k4J08j08N5Q5k17J93J94
$$ plain form
8499 -16 -56 -343 -86 -83 229 93 -26 -186 75 -33 48 65 -70 81 -114 192 -25 -306 117 -244 -55 -268
8521 -268 -18 -45 -8 245 98 89 -72 -48 -91 116 -30 -233 -190 -21 -42 -7 -91 130 -68 -63 -198 148 -74 76
8545 76 13 96 55 70 -11 171 73 -129 -50 77 -83 150 -42 254 220 106 140 87 70 144 36 121 -46 33 42 -130
8571 -130 -93 -127 -26 -199 -200 -131 177 73 -216 -75 0 62 56 -94 124 -67 319 142 -13 -176 -182 -97 -31 -33 50
8596 50 127 11 -70 -163 30 199 -20 -8 2 21 -49 27 90 -144 -20 -66 -33 -23 -59 174 177 -22 115 86 46 15
8622 15 -117 60 -15 -129 -91 -122 -41 -8 -3 37 -298 -86 0 110 208 129 103 49 7 63 44 193 2 105 14 13 98
8649 98 -21 9 11 10 24 5 64 133 -13 270 -4 -46 -16 -50 -39 -61 -263 -115 -152 174 46 47 -8 4 14 -30 95
8676 95 -15 134 -58 -59 -140 54 -52 -227 -237 -204 71 57 127 -28 65 -7 -31 77 -31 24 109 -108 85 279
8700B79k78j08J96k72J97P6o9j59K10P8j76P3K52l46Q1j72J95p9K00j24l69J48
8722a67L8Q6J72J2m7%j37L0n2L4J79l04J74k55K62k82R9Q5j53L56R2j34j5J03
8746A76j67K63j7j85J24j16j61J07p7J5J10k05J30j99J36K08j99L21k63o8M87
8767D20k09L1j20j49J32k88R7k7LK50l94Q9j02N74j74k07J39r4N5j96K29J3m6
8790B6l74O02o08J43L73k04k49K24p5K26k27J13J89j63J76J47k94n8K4j36N5r2
8812a82K30j83O7n2M9o2j3L8J30Q4n4k13K80k26R1j95J21J36j54J71j32L60m89
8835a98j30M15N3k12%j1j0J55m4k72J50J27k38J17J17o1J22n9N1K58m51nL13l97
8859b10K76k4J69j64n8J47j89p3R4J64o3m02M16J08k71j06L21l14NL12m06K94
$$ plain form
8700 279 1 -107 89 -183 14 90 21 -138 72 150 -26 47 299 -47 34 -138 57 -22 178 54 -315 -167
8722 -167 -129 -43 129 141 94 94 -43 -13 -65 -31 148 -156 18 -237 25 -257 -158 -73 -226 130 222 88 73 176
8746 176 9 272 255 70 194 78 -83 24 -53 -38 72 -133 -3 -202 -66 142 -57 264 1 -67 420
8767 420 211 242 122 -27 105 -183 -86 -113 -110 140 -254 -165 -267 307 133 -74 65 -29 26 -170 59 72 26
8790 26 -348 254 -354 -211 162 -42 -291 -67 -142 84 -143 -30 159 -4 172 319 25 -33 -9 -145 -90 -182
8812 -182 48 -135 -68 -120 -71 -133 -146 -108 22 106 52 -161 119 -107 -16 -211 -90 46 -108 63 -69 291 -198
8835 -198 -328 87 140 -72 -72 -83 -93 62 18 -254 -104 23 -215 -98 19 -42 80 21 72 330 -121 -126 187 -210
8859 -210 66 42 211 47 -11 136 -53 -126 -32 132 69 -333 83 191 -80 -186 135 -179 -174 138 -268 26
8881B6j52J95j8l87L73q4j70K05L7j05Q2J19J71l89l6J81j94L31j52J1N8Jj05
8904bj40q1L92k72J92K22m98N03k64r9Q0j91J69K89m09J50j28J31j11j90Q3K86
8926A12k01m8J30L75n39J81N0k90K29J02k65K77p0j13%JJ20j44RoN22m45k0K17
8950A84k27K52l26J45J73l39J08O1MP9j09lJ19N1j98K3K2l5o7K48r9J95j04j64
8974gj3l9J53j68j4m0J90j56J41J15l9N1j09M7q9j18Q2N0k74L94n55M12K5m5K60
8999B54J68l42j22J34M9j2m51N02k24J68r3l9K68o2p0j10l17K84J37j28m4k08
9021b58Q8J3Q8j08R3l9Q3J20r9j21K55l86J72Q5j37K29m3j07O7J71q9O0j9k19
9045a01J09K44j82P7j73K18k82L64k88N3k25K70J21j78k2l5M3Q8k16Oj14J88j86
$$ plain form
8881 26 -126 69 51 -336 37 -47 -217 -12 25 -80 2 121 292 -97 -133 48 -146 185 33 44 102 103 -2
8904 -2 -142 -223 169 -103 89 311 -187 316 52 -47 33 -158 11 300 -109 41 -87 44 -67 -257 -174 112
8926 112 -89 -137 -7 368 -171 10 60 -230 -1 101 -164 113 43 -70 -70 -69 51 -93 -84 -90 432 -13 -33 184
8950 184 -43 209 -117 28 201 -138 -30 31 35 114 5 2 121 172 -26 -3 19 -16 -83 165 66 261 157 -7
8974 -7 -20 -59 94 -74 -88 -128 62 -94 47 162 123 174 65 112 23 -95 -13 37 -237 157 -398 14 39 -6 254
8999 254 422 80 -42 92 141 129 -322 180 -44 124 31 -8 260 198 128 18 -299 -15 122 -6 -50 -258
9021 -258 -170 -157 -69 -177 -84 -123 -40 80 -19 -140 115 -271 -99 -14 -151 78 35 -72 -5 166 77 137 118 -101
9045 -101 8 252 70 147 -26 192 -90 274 -14 39 -186 84 205 27 5 -30 13 101 -115 -109 -223 -35 -221
9068b21r2J39J89q1L3J9J82lk89L15l78J28l0P9k36K23r9J62Q2k00J18k64J66
9091e8J56l50L56LP9k04L2NJ43k14J76j75K3j34nQ9J02j09j5M5LO6q5L47j10l
9117A63q6k23R0Q6l19L82l5k91j85O07k25j49L94j84J97j78j26K99r8k7j74M4
9139c8p5J14j6j9j57J68l9Q3L3k14M22j06j9j11L9J84j51j2p9j56K35k5j21j79
9163b39K91k7j24P7m1J13j4k6O8j54L25q9k48K25k07j51M34l96L07k01J9J94q3
9186E3O9J8o6K51m17P2n5J33k96j20L2L96j7r8K68k48J13pjk41J94k09J64p8m7
9211a37K26o2k18Q6l1J76R8j18Q0k9j00p4K14k02J2P8j7K44L6k64j21R8j63J52
9235c6j93K07K66K2o3k38J30N2j72L21m69L05K0k67J46j16m8o8K34J91l07R1K20
$$ plain form
9068 -221 -313 -174 15 -66 -33 -14 168 165 -124 191 -187 -59 -89 -10 -246 -23 -122 40 122 -78 40 -224 -58
9091 -58 98 -252 104 107 186 -18 14 19 162 -52 124 -51 -28 -162 -167 -78 24 -85 -100 -55 -52 14 -71 276 166 163
9117 163 77 -146 -56 30 -289 93 58 -233 -418 189 -36 -185 209 25 222 44 -82 217 119 92 -82 -38
9139 -38 -113 1 -15 -34 -191 -23 -62 21 54 -160 262 156 137 26 65 249 98 86 7 -149 86 61 -60 -239
9163 -239 52 25 -99 -22 -63 50 36 10 78 -76 249 160 -88 137 -70 -221 213 -183 124 -77 -58 136 53
9186 53 122 140 74 325 -92 -20 -75 58 -238 -358 -326 70 53 -45 223 -25 88 81 80 -161 33 -176 -12 -90 -137
9211 -137 89 27 -191 -105 -136 40 138 20 100 71 -29 -103 111 -91 -79 -1 -18 226 262 -2 -123 -25 -188 -36
9235 -36 -229 -22 244 266 203 -35 95 147 -25 296 -173 132 152 -115 31 -85 -133 -201 33 224 -83 8 228
9258B28k22Q6r4L15m16L7J13k83L10m20L43N9j39J55k41J06K08m36K14R7J2j3
9280A9J53j19N7n1q9R9j13P0J9k29K76q6k24K71q8l1M0l4J08j76L24m29K70j6
9304B1k22K56q4J5j05J25p6J20k40J73P4Q6j59J3r4J21k14P5r8J90j33J87l6O
9328AK16j43lR0p5m8M26m45m7k00L08j36J38Qk91J69l7R6n0l2J2J50j38J35J7
9353A21j87J14j74oQ1j14O8M7k12K9J37n8k8J36O2k5k05L07k2J11j57M3P3l54
9377b13K24J8r8J37R1J3j01j82M0j98M05k21K40o2l2j39nJ07rk27J33Pk6J36J0
9402D8K3P5j30O6j34Q0J49k77j25L22r7j27N6J09J45l29K45j30K96m7j41N6k44
9425a11L7J65O4j86L11l31j65K19k07j06J11K36k15J75K5J25j58O1k33M22j55
$$ plain form
9258 228 6 92 -2 313 -103 -66 47 -236 74 -346 -3 56 -83 72 -169 -63 145 -291 -77 20 32 19
9280 19 172 53 110 59 -30 69 -44 26 45 -184 92 6 -218 53 -35 -66 -26 -60 48 -128 196 -233 37 21
9304 21 -201 55 -29 -14 -119 6 -70 50 -190 -17 57 143 -16 -3 -97 24 -190 -115 -213 -23 -156 31 -5 1
9328 1 217 74 71 161 86 38 464 19 -28 -228 80 -56 82 90 -201 -32 -69 27 -23 -55 -43 107 -31 104 121
9353 121 -66 48 -126 -132 -51 -165 -97 -50 -262 -233 -96 -154 -182 -46 16 -9 -214 93 71 182 25 68 141 -213
9377 -213 11 29 -69 68 159 172 71 -111 -71 -269 136 -85 155 93 61 -78 -83 24 15 -212 -79 -72 -98 38 48
9402 48 71 146 16 82 -52 28 177 -100 -225 97 0 -127 -71 38 183 -146 99 -31 265 218 77 133 -111
9425 -111 -74 91 155 -31 280 -51 -216 3 -204 -310 -199 37 -178 -3 22 147 -11 50 -183 239 84
9446H4L3J42l72J26M9J19k33M8J4O2m9j83J52oK50k27J5m8J1l4k2J78j75Q3L11
9471C28l87j9N3k1J79k66J71o0J89k0j20j58J60r8o9J1jR7j0P8N2r5j2J73o5k94
9497b04J49N1l37K05K22k22J22O2j19j98L12k16J26N8q6j59L22j51M9J59j53J56
9519A48j43J09j36N7Pl6k97R3K30j25J93n4j14K17rj90J35p1j35K81l85L01j87
9542a11J88k32M4j79P4K07n0J10j68p6M5M3M5lK26k48K77l29J03P6J56j15k31
9565a48K94l79L08j80K23o9N7n0k6k10K92k09J00l8L28j33k53P0m8J45J72k68
9587b2K50j50j80L5%K1J09j08J34O5m03L41m0j74m5J35J49k12M8O5J12L2q4Oj24
9612d0Q3Kk57J01J57k08q2L51k10k1J35k2Q6P4j85l3L00k22L06j77j23j83j7J45
$$ plain form
9446 84 117 259 -113 13 62 181 -52 -4 10 72 23 -160 -8 -14 236 9 24 -24 -13 -47 -69 109 -66 17 328
9471 328 -59 -78 -25 -46 133 -133 38 -22 167 147 27 -131 29 -69 -138 -127 -128 -31 -41 37 89 -6 -18 155 90 -204
9497 -204 -55 -4 -341 -136 86 -136 -14 48 -71 -269 43 -173 -47 11 -75 -234 88 -63 -14 145 -8 148
9519 148 5 114 -22 35 42 6 -291 -198 32 -93 100 46 -68 149 140 -50 85 14 -121 160 -225 76 -111
9542 -111 77 -155 -111 -290 -216 -9 -59 51 -117 -193 -148 -105 -60 -63 163 -85 192 -137 -34 42 198 83 -148
9565 -148 146 -233 75 -105 118 49 106 56 30 -180 112 -97 3 -35 293 160 -93 -23 -71 74 246 -22
9587 -22 228 78 -102 -67 -67 -46 63 -45 89 154 -249 92 52 -122 -167 -32 117 -95 -47 18 130 162 78 84 -40
9612 -40 43 45 -212 -111 46 -162 -244 107 -103 -124 11 -11 75 149 -36 -69 231 9 315 138 15 -168 -185 -40
9636d0R7j24j1K2J73r7l4P8J68k99Or2J72lo2O0j28J50j2j7l46R6K95k61O9K81
9662A41j79L51j28k27K03n0l67L19l8k12J39O1JL8l28O3L1L86j10k09P6J20R1
9685A72k34L8j86P8J60j75L3q7J15J02J6P4m02M75m12K54o3j4L57m66J72o1o0
9708a14K28j01l64K92O2n3j43J87O2j61K42n7j23K28l40K07j05M9j39j37K67N6
9730D3Q2k57J23j5k37M55j42L7j41P5q5J83r4j11j9K16k44L14l09J01j43J98j54
9753a24N8rJ42J26k01K82k15j47J53J94m90L64j24Q8r0K85k67j24O9K15l5N0k13
9776a3J20N9k43RK26j66r1N3k7J03R3l5l04K64N9j57J59l75K77k11K65J8K9j67
9800e5J17k72M88l40k63L07m7Q0m7MR4n8R4j30o7J75m6K15l02L5J04j69p2K9J25
$$ plain form
9636 -40 57 -67 -78 -56 117 20 -14 64 232 -67 -61 -153 19 16 -46 14 -114 36 24 7 -339 -243 52 -209 -140 141
9662 141 -38 313 185 -42 161 111 -256 63 25 -187 -48 13 14 52 -276 -213 -182 204 94 -115 -39 81 172
9685 172 -62 -24 -210 -132 28 -147 -114 -201 -86 16 32 106 -296 179 -233 21 -42 -56 301 -165 7 -54 -114
9708 -114 114 13 -351 -59 3 -50 -193 -6 56 -105 137 80 -43 185 -155 52 -53 -4 -143 -280 -13 43
9730 43 125 -132 -9 -24 -261 194 52 89 -52 23 -62 121 27 -84 -103 113 -131 183 -126 -25 -168 30 -124
9753 -124 -66 -75 67 193 -8 274 59 -88 65 259 -231 133 9 97 7 292 25 -99 -30 185 150 200 -13
9776 -13 107 166 -77 -68 158 -8 -99 -46 -73 30 123 88 -216 48 107 -50 109 -266 11 -200 65 83 112 -55
9800 -55 62 -210 278 -62 -325 -18 -65 15 -32 -28 66 8 102 -28 -95 80 34 249 -53 -18 86 -83 -155 -126 -1
9825aJ4M1j0j89J52l1q7Q8N2Q1n2j60l1M4J69j51Km7o8J98m2OL8m3L5l5R8k54
9853a83J75J3k45L68k7k04J14j43J41q8M86j04l33L8J02k09Q4n6j2J50j46n0K19
9876I0J79m41N4J62qk7l3j84L38O5p7j59K5n8m7K25j20l5n0q2L2j33J74J59J41
9901A90q4k4K7J90k02J9L8j43J83m4%j74K34l44J37k8J0J79%j08m2O8j51p6k5
9926a70Q5J62Kj62J48o6j45J79R0k44K83k04Q8j37ML53m31L50j49r6M9j12m0l7
9950b00O7J26K74m36P1Q9J82j75J58n2m9J1l9j63nL27l15J11j78j1L18j5k07J58
9974D7l9k25J31J39m0j28J31l7n8K37m2j11k04J97j64K13l4j67K0J16M5o8NL78
9998C42Rl53L4nO3k17J33j21l0j16K73K3j29K02l00M69l37M1m2j34L09R7n4l72
$$ plain form
9825 -1 13 54 44 -145 7 -24 -111 -23 29 110 58 -102 -133 -89 80 -71 -69 -116 -184 14 -28 -22 16 -27 8 -27 71 -183
9853 -183 -8 5 -240 128 101 -103 11 -132 9 -79 407 303 -30 8 110 -99 -15 -71 -83 67 -79 -129 90
9876 90 269 -172 -118 44 36 9 -24 -208 130 195 118 -41 -16 -74 -121 104 -16 -51 -101 -183 -151 -284 -110 49 190
9901 190 106 82 109 299 97 116 154 11 194 150 150 -24 210 -134 3 -25 -15 164 164 56 14 82 -69 -145 -170
9926 -170 -85 77 79 -83 65 -1 -146 33 123 -121 162 -42 46 -91 -87 266 -165 185 36 -60 -11 -123 -163 -200
9950 -200 -133 -7 267 -169 -98 -9 173 -2 156 104 55 66 27 -136 -141 186 -129 -18 -196 -207 111 96 -111 47
9974 47 8 -217 -86 53 13 -115 16 -21 -79 158 116 5 -199 -2 -166 47 13 -154 -134 -18 27 -41 -36 342
9998 342 351 -2 32 27 90 -127 6 -115 -145 -261 12 35 -94 108 -192 277 -60 -19 -61 -195 114 211 157 -215
10022b15N8N0P2o7J59m3mK85k90k4r8K13Q4P4k28m2j24O4L0J60k70RN8J0K45l3
10048A33Pj94K28N6l33p4L80k73n1Q8K02k24J39j91j0p4L26r4K25k32p7l4j36
10071b13K13o4K1p7R6j18l0K5J47kj29J03k14J58J63j96M7J08J00J2j91j65Q5
10094a21J48J77j54j20J92j9j67o0O5R7K8j36K16j34J33l21K75k70%O5K74l17
10116a49M03L1l75J07j5O8j02J11P7k59lj02J06K93p7L6j49j24j49O83l33P2J0
10139A60j81P6p4Q0N1k28P3j14p5M09l10J4kP8L1J33j27R3j01l2l7k5R8k3L21
10164B88k38j99J56L5J03k16NK28m8j49J82j33j73K7k7L71k00k3K15j87j12J60
10186F5j14J24p6k96M00l9l0L2O1J1m2m0R0j34r7J57j45J07n8J1n9p9M67k2l35
$$ plain form
10022 -215 -157 -107 -35 -102 57 14 10 295 5 -19 -117 96 180 254 26 -16 -140 -76 -46 114 -156 -147 -89 -79 166 133
10048 133 140 -54 174 230 -103 -177 203 -70 -121 -33 169 -55 84 -107 -117 -191 135 41 266 34 -43 -77 -213
10071 -213 0 -64 -43 -120 -24 -142 -172 -147 0 -2 -131 -28 -242 -84 79 -117 -70 38 138 150 -41 -206 -121
10094 -121 27 204 50 -70 122 103 -64 -124 -59 38 66 -70 146 12 145 -176 99 -171 -171 -106 168 -149
10116 -149 254 285 -90 17 2 70 -32 79 156 -103 -106 -208 -102 191 114 150 1 -123 -272 411 78 150 160
10139 160 -21 55 -19 61 112 -116 -43 -157 -232 177 -133 -119 -121 -43 -12 121 -6 87 -14 -46 -83 -108 -10 -33 288
10164 288 50 -149 7 42 145 -71 -66 162 114 -35 147 14 -159 -132 -159 212 12 -11 204 17 -95 65
10186 65 -49 75 -1 -297 103 64 34 66 127 138 96 56 146 12 -85 72 -73 34 -24 -13 -72 -151 316 294 -41
10211d1K62r2r8Rrj07m3l5J33j26O4K73k50k91K91l38L69K42l03Q6j40J1M6L32
10235B45n09K15l9M8q3J87n5K18l94J33L5l2K31j89l5M5K85m11K91l20J44P7K5
10258A12j16k6N6N1m14J21k0L91N4j45j39R4JJ54l14Q8j46J36K11j57M7j32K10
10281A17j46j34K06j81J43j24J25P3j20K10k04p6Q7J36j52J6J39k78K66j28q0
10302a05j00L60M1k4l35jK34J9K58k23j26K5qk1P0P3J53k95R3k28K80l4k1j51
10326f6O5j04P6m8K69j53l5K02k45P7q5J7L51m21J03j11J77J04j89N6l17L42%
10349F5J83j75n2N4j31L2K8j8l7K54q2p4k2k2K01l71kp2K17j25J60k42J43J83
10373I5J60n03J90j2K01l9l3Q8j85m4LR5m1K05m44L20j09J22L4lk27K05lJ0pj43
$$ plain form
10211 -41 221 129 31 40 31 -76 -119 -154 -21 -147 -83 190 -60 -351 -60 -398 -29 213 -90 -4 -144 -133 -87 245
10235 245 -264 -49 -88 -40 -123 64 9 227 -167 -34 1 -31 200 11 -24 21 306 -105 186 -134 10 87 112
10258 112 -4 -30 26 77 -337 -216 -236 155 209 64 -75 19 20 174 -140 -52 -198 -62 149 -8 39 -93 117
10281 117 -29 -163 43 -138 5 -119 6 79 -41 169 -35 -111 -24 112 -40 -24 115 -163 103 -25 -105
10302 -105 -205 155 196 172 -163 -164 70 89 347 124 -2 23 15 -6 64 137 290 -5 88 -140 140 106 85 -66
10326 -66 -1 -105 -29 -77 192 39 4 206 -39 38 -47 -30 321 -100 3 -108 69 173 -16 40 -277 65 65
10349 65 248 73 21 75 -56 -24 4 -14 -51 203 121 47 25 3 204 -167 -169 -241 -24 -149 11 -231 -88 95
10373 95 255 -248 -58 -70 131 92 59 147 -38 -82 -79 16 -25 180 -264 56 -53 69 103 100 -127 78 75 85 78 -65
10399f5K5p9MM21j87j68J60n8l5N1J7j64K61r1l7l40J81K14J8P0j10j50M4k91
10423c09K58p3nn9K44j33oK7K03j43l3K6p1J64k12J24P9K45j86l3j42J40K0k25
10447a00J96j12J30m9j31J03k31L06j74K48m36K28n6K55l83K01J93k85J63l18
10467b52K06J53kr5k28m9J29lJ85j26L4N0j55m4J39P8Q5K0k33J78n%mk21L52k28
10493c6M9j6P1J74l66K41r3j16P5L7j21M7M0k1J51j45nJ26j42q4pL12q8r1J33
10518A25q8j59J36j12MK78j07j23L2j11J50j31j40K33Q3k0j3J0j21J12J2J11l36
10541a75k9L21n6j3J34N9k48J9N2j73M7J41J00p1j52J5K94m78N89k90k21J30n0
10564e5J87l62K10J54j14J31j60o6O9j8q3J55j49J38j65K48k24K79j60M5O9o0
$$ plain form
10399 -65 -40 -119 -115 306 119 -49 111 53 18 69 86 -78 183 92 55 -285 -104 110 128 198 88 -62 -18 -309
10423 -309 -51 -124 -129 -188 56 -77 -83 -56 147 4 -29 -3 -74 90 -122 2 81 326 140 107 -35 105 125 -100
10447 -100 96 -16 114 65 -66 37 -194 112 -62 186 -250 -22 -78 177 -206 -5 188 -97 66 -252
10467 -252 -46 107 105 10 -218 -267 -138 -141 44 -82 -48 2 -153 -197 -58 20 105 125 -108 70 65 65 61 -160 192 -36
10493 -36 13 -3 68 242 -124 117 24 -92 -17 20 -101 -54 -14 -35 116 -29 -34 92 -50 -134 -141 171 83 -8 125
10518 125 37 -122 14 -98 -94 184 77 -46 -14 -125 25 -106 -246 -13 70 50 37 47 -74 38 50 161 -175
10541 -175 -204 117 61 48 182 241 -7 12 64 -109 -62 79 179 108 -44 -29 265 -213 376 86 -135 -5 -55
10564 -55 132 -230 -20 134 20 151 -9 -75 -6 -24 -107 48 -101 37 -128 120 -104 175 15 60 129 69
10586F9k94K23J24j05j34K22l00J73L9m1J54k02j78J04p9%K75j97L6J44j34J41
10608D0k4j37K52j80k9J9K9M0j6J76o5k07J23j04K58m22J35j06R9j50K43J45l52
10631b33J58J05l8N1l9j5K4k66K59R4j34j32K16j73R5j28J78Q7k30L00p4j24l2
10654e1J01r8j66J29J95j86J65J13k67R8n6J72m25L86R8q7l66O3K10j13n6j2J83
10677C0%m0K2l3K05l34K04j91K15N5j58J79j28Q1J6j32J55j31k17K79k89J30N5
10700b7K41m27K29m8q0l17O17m4l16p1K45p0l3J67k8N8q4j76K6lN2M9L3J25j82
10725f4R8J34n3k23k2k8M8J08j15Q8j1J54p2l80M01J5r6K30j82O4m1n9J02l09
10749b13M79l56lK7Q3k21R1K3K32j39r7o9L40j95r9K68j95q5J68Mr3J71q2J15
$$ plain form
10586 69 -225 -2 122 17 -117 105 -195 -22 17 -24 130 -72 -250 -146 -225 -225 50 -147 -111 33 -101 40
10608 40 16 -121 131 -49 -78 -59 -30 10 -6 170 105 -102 21 -83 175 -247 -112 -218 -119 -269 -26 119 -233
10631 -233 -75 30 -8 43 4 -11 13 -253 6 100 -34 -166 50 -123 -28 -156 22 109 -121 179 105 -19 -51
10654 -51 50 -48 -214 -85 110 -76 89 202 -65 33 -23 149 -276 110 208 121 -245 -182 28 -85 -141 -153 30
10677 30 30 -10 12 -21 184 -150 54 -137 78 133 -25 154 26 107 123 -9 146 15 -202 77 -212 -82 -27
10700 -27 214 -213 16 -32 -112 -429 188 144 -172 -243 2 -68 -101 66 38 96 12 -164 -138 -141 -89 -40 -7 118 -64
10725 -64 34 168 115 -108 -130 -158 -110 -2 -117 -29 -40 114 42 -338 63 78 -18 212 30 94 53 -6 96 -213
10749 -213 266 -90 -93 -66 17 -204 -113 -90 142 3 -94 -163 177 -18 -117 151 -44 -129 39 43 -50 121 39 154
10773A54j41M5k90R2M37m09mK00j13L6k81L43JM7l00K48j42j27p3K79k4j37K5
10796a34K12k43J9L5N9K24j99j35J49L0k57K57j91m1K73j65M9j94L91l05R5O6
10818el0L4n1J79j65K13m58K47j47J55M5Jj1j83L35j65J07Rj08n1J12P2rj06k59
10843b39K39j74J88m0Pn1J24K3j33R0J9k96L74k08K89n5r0j30P5m8q2K21j58j07
10867a62J99J77j44j83K0m0K07j36k1K33j21j2R1m8K0M2n6q1J40j78Q3k84L48
10890I4j85K44l46J26M62n78j3K66j78l6J66p9K77j66j44J23m7M4K00k68O1k7
10912dP9P5k49J4K76k42J64k29K6J68j51J67%Qk13K16j03k6P6J30k06K0J40R1
10936B27r4l4k42N5J70r6J39j27p5M8O0j13J31lp4J63j16l9o9o6M0k0J22P7j71
$$ plain form
10773 154 13 58 -232 -140 297 -112 -116 84 -29 7 -274 69 70 117 -183 65 -77 -204 -277 2 -22 -159 -134
10796 -134 78 -165 -146 -111 -52 172 -27 -162 -13 17 -240 17 -174 -215 58 -107 -58 -252 139 -166 -71 -5
10818 -5 -35 -1 -52 127 -38 175 -283 -36 -183 -28 17 18 7 -176 159 -6 101 110 2 -49 63 135 126 20 -239
10843 -239 0 -174 14 -26 -19 -70 54 77 -56 34 53 -243 131 -77 212 157 67 -63 12 -36 -118 103 -55 -162
10867 -162 37 214 70 -113 -93 -133 74 -62 -83 150 29 17 108 60 80 122 66 -15 125 -53 30 -254 94
10890 94 -91 153 -193 -67 395 -183 -196 70 -108 -144 22 -57 220 54 -90 33 -14 30 230 -38 23 -4
10912 -4 75 150 -99 -85 191 -51 113 -116 -90 78 -73 94 94 102 -111 105 2 -24 52 182 -24 -4 136 227
10936 227 133 99 -143 -88 82 -14 125 -2 -77 -29 31 -82 49 46 -28 135 19 -20 -89 -155 -115 -135 -13 64 -107
10961a07J37j84j0K05R8j62q3K07k62K01k01L30m0j42n7J62k21O0N0p1j02J88
10983dP4j34N2n4j63K20J08j62J68k20L64j76j57omo7J98j3j74K3J80j29K0j98
11007b54K21M4J76j25j35J42j18Rj9K29k23j01L16r9n4J2j08L38m29K63l4j6k6
11030Il3J25jk70J00p4L01j20l8J18k09n3J79k4n3K18k51J01Q5Mj12JL02l59K20
11055A66l17j2L23N8j44J81j34l0j1m9O1j3L8j7Ro9J07n4j35J35k29R5J91l23
11079a73L94Kk20N0p5N3m5lj21O4MJ92k12K6J08j24p3p5R1R3L8r7L0Q7r2N4J9
11106ej9J97nj3n6r0l3J44N7m22K76q1J77k10N9j3K45j70j33L10R7k11J45l81
11130a35K73j97J20j34Q1l5j60J28q5K95j71J63j29J6l6j6j07O6R8n2k15K79R8
$$ plain form
10961 -107 30 -154 -164 41 139 -23 -106 101 -161 40 -161 169 129 -13 -70 92 -129 -69 -19 -90 -192 -4
10983 -4 70 -64 -12 -66 -229 -9 99 -63 105 -115 249 73 -84 -90 -94 -161 37 24 -150 -127 53 -76 -56 -254
11007 -254 -33 11 187 62 -73 69 -49 -40 -59 170 -53 -154 162 63 9 21 -87 251 -178 85 51 35 9
11030 9 -24 101 100 -170 -70 -144 157 37 -1 117 -92 -145 34 10 -43 175 -76 25 110 114 2 3 305 -54 166
11055 166 -151 -163 160 218 74 255 121 91 80 31 92 79 117 100 109 40 147 93 -42 93 -136 -41 150 -173
11079 -173 221 223 3 53 -22 31 -14 -17 -138 -74 -70 122 -90 -64 44 -80 -153 -228 -137 -44 -6 -103 -73 14 -78 -24 -5
11106 -5 -24 173 168 155 99 9 -24 120 177 -245 31 -50 127 -83 -24 -37 208 38 -95 215 312 101 246 -135
11130 -135 138 -59 61 -73 8 -27 -187 -59 -144 151 -20 143 14 30 -6 -22 -129 -63 35 -17 -232 47 145
11153A45j86j31J16J29j54o1J27J82k46j03J97o7Q6L0R2O3P5m11M2j8Q8j03K69
11176A61k63j8K05l0O1k91L02o3l39k4j37L30J34L1j2p9K1n5k2j84K78O2p4k96
11200c02L19r6j15J02J96k51MJ49K52k90o3O0k4N0r8J6j4J33N5n8n7k7m9K43j31
11225Dj47q7J88K89k85K00k30J10qP7ok14O4j1k5M6J43j07j46K6j7J06k27L19
11249F2j48o6K37L4r3k23J74K9p1M6j7k7J53k90K40j90J55j99J86L0J90k94J31
11272D9o2j22R0J65j08k0O0o1J90j48l34K58J55M2r4J31k31p1J17j1R0j83O2j55
11296a91J74k6p9K13J74l28J4K72k50oj33R9P5J01P0k03J80K5p8j21k0%J16j36
11320e8Q6j64K09j67K47j69NJ95j52j79J29j5J87q1Pmq3j50K22J56l75L56j47
$$ plain form
11153 145 -41 -172 -56 73 -81 -142 -15 167 -79 -182 15 -52 34 64 156 219 294 -117 -75 -93 -5 -108 161
11176 161 -102 -120 85 55 116 -175 127 64 -275 -299 -436 -106 28 59 47 -32 -11 -66 -88 -272 6 68 -6 -302
11200 -302 17 -79 -194 -92 104 -147 -143 6 258 -32 -95 -35 -59 -9 -107 -91 -105 28 83 25 -32 -59 -108 135 4
11225 4 -143 -230 -42 247 -38 162 -68 42 34 111 105 -109 -45 -56 -81 -35 108 1 -145 -119 -136 -30 -257 62
11249 62 -86 -152 85 119 26 -197 -23 6 -65 -19 -36 -63 90 -200 40 -150 5 -194 -8 22 212 -82 49
11272 49 -13 -135 -45 120 12 -8 52 -9 181 33 -301 -43 112 154 60 191 -40 -111 6 -5 85 -98 -36 -191
11296 -191 -17 -43 -122 91 265 -63 -49 223 -27 -33 -166 -67 8 109 179 -24 156 181 103 -18 -38 -38 78 -58
11320 -58 28 -136 73 -94 153 -16 -11 184 32 -147 -18 -33 154 73 80 76 -7 -157 65 221 -154 202 55
11343E5m8M7k04L12j63lJ86l46n5J50j03L41p0o7N2m2J04l05L4l4J06j73K45Q2
11367A01l53K85M0Q4j13j53l2m8L86k73L9J34n8O4j7k68K8J19M3P3l28K70j44
11390a21K26J0k30J24K3j81L12j38K50j04l89J88J53K34n17L18j46K60m79L17
11410A10j02J34l41J40l9K40k39j15K80P7j72m8L4Q1J40j62L6O7L2n6k09K58k11
11433f5M5j95Q6J97j23l1J30O6n8Lj08J14nj1p7J91p5o5l8L14l33J41m6j33M2
11458c4qJ09r1J08j47j02K26J21k86j98KL05J14j95j01J90jj15J93k5k59J42Q9
11481C7j86K26J1k35Q6O5j41K01k56Q4K80j52Q0k10J31j51J86j55J20o6K24j79
11503@q8p5j8R8p4L81k77j73K11p0L40j56m04K36K2L12j45j67l8j26M38k68N8
$$ plain form
11343 55 7 54 -150 162 -1 -4 182 -164 -219 -69 -172 169 99 32 84 42 146 -159 -125 -159 -53 -226 19 101
11367 101 -252 33 73 157 44 -109 -141 -189 197 -76 -37 97 39 103 86 -182 -154 -35 8 81 -247 23 -121
11390 -121 105 115 -115 9 32 -149 163 25 275 171 -218 -30 123 357 -160 158 12 272 -207 110
11410 110 8 142 -199 -59 -98 142 -97 -212 68 145 -27 -75 -41 40 180 18 54 121 153 97 -112 146 -65
11433 -65 -20 -215 -129 68 -55 -86 44 110 52 55 -53 61 56 45 -32 159 84 19 -19 295 -38 103 57 -76 -34
11458 -34 -42 67 -24 84 -63 -165 61 182 -104 -302 -300 5 119 -76 -177 13 12 -103 90 65 -194 -52 37
11481 37 -149 77 88 -147 -61 4 -137 64 -192 -108 172 20 100 -110 21 -130 56 -99 21 -45 179 0
11503 0 -88 -163 -181 -83 -157 224 -53 -226 -15 -85 255 99 -305 -69 -47 265 120 -47 -85 -211 227 -41 17
11526A7N3j81K19q0J5k02R2j78K71m6j67l8J42P6r2M08k71m4J19k9R3k24m8J24
11550B9j41J73qK00k49P1J3l0Q3J4k70O9R7J24p5m8L0k80K30o7J16l35K28n7J68
11575H5K6o6j36K50j74j00J01j5%L7Q9l3l8k52N85l96k48J38J13l8J12m0J25K5
11599A50l05n9J60N5m8J10j45J90j47J82k09j63J48l9K22j80M6j23J80j20Q9p
11621a3OJ00n5K2j50Mk71J75K38Q2k72J90j36J99r6j92K84j04j67M80k58j99K24
11644I1m23L24j9M7k5j84O6J18j62j4K21j65K11m9m50K17K34k3j17J83k39l5P7
11667a16j23L46M7m6Jj27M6q2J06k91L04r9K94k22k38L92k19j20n4J64j55L38
11689A46L1k70K8J5J96p4p0l50K61L98l12k2j02j34L72k61K31J16k28KR2n0N9
$$ plain form
11526 17 70 -111 108 28 43 -159 -67 -245 26 -20 -187 -225 -83 -7 -99 309 38 -6 113 84 177 -47 -95 29
11550 29 -112 61 53 253 4 75 88 58 141 155 -115 -46 51 175 100 52 82 -198 32 -35 81 -254 -26 -83 85
11575 85 111 45 -91 159 -15 -115 -14 -29 -29 8 97 64 26 -226 359 -37 -285 -147 -34 -72 40 0 125 150
11599 150 -155 -214 -54 1 -47 63 -82 108 -39 143 -66 -229 -81 -120 102 -78 -32 -155 25 -95 -6 -13
11621 -13 -7 93 38 60 -90 -86 -357 -182 56 138 -134 56 -80 119 23 -169 115 11 -156 324 66 -133 91
11644 91 -332 -8 -27 20 -5 -189 -123 -5 -167 -181 40 -125 86 37 -413 -196 38 15 -102 81 -158 -193 -116
11667 -116 -239 107 154 108 109 -18 28 -54 52 -239 65 -34 260 38 -200 192 -27 -147 -201 -37 -192 146
11689 146 177 -93 -65 -50 146 72 2 -348 -87 311 -1 -23 -125 -259 113 -148 83 199 -29 -27 65 15 74
11712G4n6j33K54k24J56p3K0o0K0J1J81m50R5J38n3J63k30L18l11K93j63j55K57
11735G2J7j79m1M17j81R6k14n9K47q1k3l5r0k43O8K89J5k53M25j30k12l3K09j00
11759a9J81n1r2q8K57J60m52K06q9P0R0l84J55j72L59j30j22K13j0K8kl2k35J43
11783a6k0J60j47oJ07K27j40m2o6j73q5J94j11J67J21j61J60j97L0J00k12P5R8
11806F3J17L4k19j62J68L3P4j53J66o7k39R5J76j92J42J52j03j44nK36k64l1K60
$$ plain form
11712 74 18 -115 139 -85 71 -2 18 -42 -22 -11 170 -280 -185 -47 -100 63 -167 151 -160 133 -30 -185 72
11735 72 89 -90 -131 286 105 201 -13 -72 175 94 71 36 -54 -297 -229 60 75 -178 247 117 -95 -128 81 -19
11759 -19 162 111 19 -69 188 348 -104 102 13 83 173 -211 -56 -228 131 1 -121 92 82 110 108 76 -159 -16
11783 -16 -36 124 -23 -29 78 305 165 123 57 -116 -201 -7 -118 49 170 9 169 -28 2 102 -110 -35 63
11806 63 180 214 -5 -167 1 34 108 -45 121 54 -185 -90 86 -106 36 188 85 -59 -64 172 -92 -123 137
$$ [...]
16383a7
##END NTUPLES=NMR FID
##END=
