##TITLE=abcd
##JCAMPDX= 6.0         $$ Bruker NMR JCAMP-DX V2.0
##DATA TYPE= NMR FID
##DATA CLASS= NTUPLES
##ORIGIN= UXNMR, Bruker Analytische Messtechnik GmbH
##OWNER= root
$$ XWIN-NMR		Version 3.5
$$ Mon Jun  9 18:20:17 2025 Russian Standard Time (UT+4h)  servis@DPX200
##.OBSERVE FREQUENCY= 200.131235884673
##.OBSERVE NUCLEUS= ^1H
##.DELAY= (6, 6)
##.ACQUISITION MODE= SIMULTANEOUS
##.ACQUISITION SCHEME= undefined
##.AVERAGES= 32
##.DIGITISER RES= 18
##SPECTROMETER/DATA SYSTEM= spect
##.PULSE SEQUENCE= zg
##.SOLVENT NAME= CDCl3
##.SHIFT REFERENCE= (INTERNAL, CDCl3, 0, 16.5164)
##AUDIT TRAIL= $$ (NUMBER, WHEN, WHO, WHERE, WHAT)
$$ ##TITLE= Audit trail, XWIN-NMR		Version 3.5
$$ ##JCAMPDX= 5.01
$$ ##ORIGIN= Bruker BioSpin GmbH
$$ ##OWNER= servis
$$ F:\spectra/data/av/nmr/H1/1/audita.txt
$$ ##AUDIT TRAIL=  $$ (NUMBER, WHEN, WHO, WHERE, WHAT)
(   1,<2025-06-09 18:19:24.07 +0400>,<servis>,<DPX200>,
      <created by zg, POWCHK disabled, PULCHK disabled
       configuration hash MD5:
       00 E9 B6 7A A2 85 ED C7 34 08 36 98 17 FE 4E 26
       data hash MD5: 32K
       75 B3 B1 82 4B F1 8D 83 A8 E4 25 9A 60 FC 3E 34>)
$$ ##END=
$$ 
$$ hash MD5
$$ ED CC 22 71 65 15 A0 D4 79 81 33 02 98 7C B1 BE
##$RELAX= 
##$RELAX= 
##$RELAX= 
##$RELAX= 
##$RELAX= 
##$RELAX= 
##$RELAX= 
##$RELAX= 
$$ Bruker specific parameters
$$ --------------------------
##$DU= <F:\spectra>
##$EXPNO= 1
##$NAME= <H1>
##$PROCNO= 1
##$TYPE= <nmr>
##$USER= <av>
##$AMP= (0..31)
100 100 100 100 100 100 100 100 100 100 100 100 100 100 100 100 100 100 
100 100 100 100 100 100 100 100 100 100 100 100 100 100 
##$AQSEQ= 0
##$AQ_mod= 1
##$AUNM= <au_zg>
##$AUTOPOS= <>
##$BF1= 200.13
##$BF2= 200.13
##$BF3= 200.13
##$BF4= 200.13
##$BF5= 500.13
##$BF6= 500.13
##$BF7= 500.13
##$BF8= 500.13
##$BYTORDA= 1
##$CFDGTYP= 0
##$CFRGTYP= 5
##$CHEMSTR= <none>
##$CNST= (0..31)
1 1 145 1 1 1 1 1 1 1 1 1 1 1 1 1 1 1 1 1 1 1 1 1 1 1 1 1 1 1 1 1 
##$CPDPRG= <>
##$CPDPRG1= <>
##$CPDPRG2= <>
##$CPDPRG3= <>
##$CPDPRG4= <mlev>
##$CPDPRG5= <mlev>
##$CPDPRG6= <mlev>
##$CPDPRG7= <mlev>
##$CPDPRG8= <mlev>
##$CPDPRGB= <>
##$CPDPRGT= <>
##$D= (0..31)
0 2 0 0 0 0 0 0 0 0.06 0 0 0 0 0 0 0.0002 0 0 0 0 0 0 0 0 0 0 0 0 0 0 
0 
##$DATE= 1749478763
##$DBL= (0..7)
120 120 120 120 120 120 120 120 
##$DBP= (0..7)
150 150 150 150 150 150 150 150 
##$DBP07= 0
##$DBPNAM0= <>
##$DBPNAM1= <>
##$DBPNAM2= <>
##$DBPNAM3= <>
##$DBPNAM4= <>
##$DBPNAM5= <>
##$DBPNAM6= <>
##$DBPNAM7= <>
##$DBPOAL= (0..7)
0.5 0.5 0.5 0.5 0.5 0.5 0.5 0.5 
##$DBPOFFS= (0..7)
0 0 0 0 0 0 0 0 
##$DE= 6
##$DECBNUC= <off>
##$DECIM= 32
##$DECNUC= <off>
##$DECSTAT= 4
##$DIGMOD= 1
##$DIGTYP= 9
##$DL= (0..7)
0 120 120 120 120 120 120 120 
##$DP= (0..7)
150 150 150 150 150 150 150 150 
##$DP07= 0
##$DPNAME0= <>
##$DPNAME1= <>
##$DPNAME2= <>
##$DPNAME3= <>
##$DPNAME4= <>
##$DPNAME5= <>
##$DPNAME6= <>
##$DPNAME7= <>
##$DPOAL= (0..7)
0.5 0.5 0.5 0.5 0.5 0.5 0.5 0.5 
##$DPOFFS= (0..7)
0 0 0 0 0 0 0 0 
##$DQDMODE= 0
##$DR= 18
##$DS= 0
##$DSLIST= <SSSSSSSSSSSSSSS>
##$DSPFIRM= 0
$$ [...]
##$SUBNAM0= <"">
##$SUBNAM1= <"">
##$SUBNAM2= <"">
##$SUBNAM3= <"">
##$SUBNAM4= <"">
##$SUBNAM5= <"">
##$SUBNAM6= <"">
##$SUBNAM7= <"">
##$SUBNAM8= <"">
##$SUBNAM9= <"">
##$SW= 20.6817932712277
##$SWIBOX= (0..15)
0 0 3 0 0 0 0 0 0 0 0 0 0 0 0 0 
##$SW_h= 4139.07284768212
##$TD= 32768
##$TD0= 1
##$TE= 0
##$TE2= 300
##$TE3= 300
##$TEG= 300
##$TL= (0..7)
0 120 120 120 120 120 120 120 
##$TP= (0..7)
150 150 150 150 150 150 150 150 
##$TP07= 0
##$TPNAME0= <>
##$TPNAME1= <>
##$TPNAME2= <>
##$TPNAME3= <>
##$TPNAME4= <>
##$TPNAME5= <>
##$TPNAME6= <>
##$TPNAME7= <>
##$TPOAL= (0..7)
0.5 0.5 0.5 0.5 0.5 0.5 0.5 0.5 
##$TPOFFS= (0..7)
0 0 0 0 0 0 0 0 
##$TUNHIN= 0
##$TUNHOUT= 0
##$TUNXOUT= 0
##$USERA1= <user>
##$USERA2= <user>
##$USERA3= <user>
##$USERA4= <user>
##$USERA5= <user>
##$V9= 5
##$VALIST= <valist>
##$VCLIST= <CCCCCCCCCCCCCCC>
##$VD= 0
##$VDLIST= <DDDDDDDDDDDDDDD>
##$VPLIST= <PPPPPPPPPPPPPPP>
##$VTLIST= <TTTTTTTTTTTTTTT>
##$WBST= 1024
##$WBSW= 30
##$XGAIN= (0..3)
0 0 0 0 
##$XL= 0
##$YL= 0
##$YMAX_a= 545011
##$YMIN_a= -504331
##$ZGOPTNS= <>
##$ZL1= 120
##$ZL2= 120
##$ZL3= 120
##$ZL4= 120
##$ABSF1= 10
##$ABSF2= 0
##$ABSG= 5
##$ABSL= 3
##$ALPHA= 0
##$AQORDER= 0
##$ASSFAC= 0
##$ASSFACI= 0
##$ASSFACX= 0
##$ASSWID= 0
##$AUNMP= <proc_1d>
##$AZFE= 0.1
##$AZFW= 0.1
##$BCFW= 1
##$BC_mod= 2
##$BYTORDP= 0
##$COROFFS= 0
##$CY= 19
##$DATMOD= 1
##$DC= 2
##$DFILT= <>
##$DTYPP= 0
##$F1P= 11.0000007629395
##$F2P= -0.999999237060547
##$FCOR= 0.5
##$FTSIZE= 0
##$FT_mod= 4
##$GAMMA= 1
##$GB= 1
##$INTBC= 1
##$INTSCL= 1
##$ISEN= 128
##$LB= 0.05
##$LEV0= 0
##$LPBIN= 0
##$MAXI= 10000
##$MC2= 0
##$MEAN= 0
##$ME_mod= 0
##$MI= 0
##$NCOEF= 0
##$NC_proc= 0
##$NLEV= 6
##$NOISF1= 0
##$NOISF2= 0
##$NSP= 1
##$NTH_PI= 0
##$NZP= 0
##$OFFSET= 16.51637
##$PC= 1
##$PHC0= -269.0715
##$PHC1= 1.101538
##$PH_mod= 0
##$PKNL= yes
##$PPARMOD= 0
##$PSCAL= 4
##$PSIGN= 0
##$REVERSE= no
##$SF= 200.13
##$SI= 16384
##$SIGF1= 0
##$SIGF2= 0
##$SINO= 400
##$SIOLD= 16384
##$SREGLST= <1H.CDCl3>
##$SSB= 0
##$STSI= 0
##$STSR= 0
##$SW_p= 4139.07284768211
##$SYMM= 0
##$S_DEV= 0
##$TDeff= 0
##$TDoff= 0
##$TI= <>
##$TILT= no
##$TM1= 0
##$TM2= 0
##$TOPLEV= 0
##$USERP1= <user>
##$USERP2= <user>
##$USERP3= <user>
##$USERP4= <user>
##$USERP5= <user>
##$WDW= 1
##$XDIM= 8192
##$YMAX_p= 0
##$YMIN_p= 0
$$ End of Bruker specific parameters
$$ ---------------------------------
##NTUPLES= NMR FID
##VAR_NAME=  TIME,          FID/REAL,        FID/IMAG
##SYMBOL=    X,             R,               I
##VAR_TYPE=  INDEPENDENT,   DEPENDENT,       DEPENDENT
##VAR_FORM=  AFFN,          ASDF,            ASDF
##VAR_DIM=   16384,         16384,           16384
##UNITS=     SECONDS,       ARBITRARY UNITS, ARBITRARY UNITS
##FACTOR=    0.0002416,     1,               1
##FIRST=     0,             0,               0
##LAST=      3.9581328,     0,               0
##MIN=       0,             -504331,         0
##MAX=       3.9581328,     545011,          0
$$ Real data points
##PAGE= N=1
##DATA TABLE= (X++(R..R)), XYDATA
0@%%%%%%%%%%%%%%%%%%%%%%%%%%%mJ6l4N4o4O4o4O4o5P7j01J21j28J36j57J78
43I3j97K21k46K70k97L28l62M03m42M82n33N90o45P08p84Q60r42J039j152J270
63F64j390J508j588J506q43k608L9961L52608j94866n34925K1513K86825r1378
76a23013k66202J53955M89168J06020m04394j30354L79721K42020k98832k77083
86a28994K73954K47273l11238l18994J88355L04538k03339m43332L1047L64525
96C795N7058k87038n5700L82654J65271l40431j92955K88387K43835k10497j97489
107a43110K83531K61035k61376m04022J6084L23812K8701k73517J0893L04638
117A46669K6262l76292j50248L80819K60216k28592j90938J99118K13077j80075
$$ plain form
0 0 0 0 0 0 0 0 0 0 0 0 0 0 0 0 0 0 0 0 0 0 0 0 0 0 0 0 0 -4 12 -22 32 -32 32 -32 32 -33 44 -57 64 -64 72 -85 93
43 93 -104 117 -129 141 -156 172 -190 213 -229 253 -280 310 -335 373 -411 449 -493 546 -606 664
63 664 -726 782 -806 700 -143 -2751 37210 389818 194952 -339973 -318460 -31635 -123013
76 -123013 -389215 -235260 253908 359928 -44466 -174820 204901 446921 148089 -128994
86 -128994 144960 392233 80995 -237999 -49644 254894 51555 -391777 -360730 3795
96 3795 60853 -226185 -281885 100769 266040 -74391 -267346 21041 264876 54379 -143110
107 -143110 140421 401456 140080 -263942 -247858 75954 104655 -168862 -157969 146669
117 146669 172931 -203361 -353609 27210 287426 58834 -132104 67014 280091 100016
127A00016k50983J39195K38035j33944l36101J1055L63973O9647l25750j04083
137b28940K59768J05088k62555j22086L04543K20914j90449k32770R3004K10517
147A57034j10829k62386Q2139L01632J9065k73066n4690K51804K4337k76175o3366
158b04501K78434J78706k02388k23194J08046J68366r7495j88972Q9963K58796
168A65761m2023k51660K5000K57474M0784k37025p8595K00155O8156j88252j08317
179a48542J58842J52478j68707k40357P8315K22725j0242j65619O1917K29855
189A70665k9597k31211k7910J94040Q2154j47625p5454J45326P2858j76600j74805
200a98159J10699K03979p0887j81487O2246J76864l2519j80272J0333J85481K6922
$$ plain form
127 100016 -150967 -11772 226263 92319 -243782 -232727 131246 200893 -124857 -228940
137 -228940 30828 135916 -126639 -248725 55818 276732 86283 -146487 -53483 157034
147 157034 46205 -216181 -134042 167590 186655 -86411 -141101 110703 135040 -141135 -204501
158 -204501 73933 252639 50251 -172943 -64897 103469 5974 -182998 -93035 165761
168 165761 123738 -127922 -102922 154552 195336 -41689 -120284 79871 148027 -40225 -148542
179 -148542 10300 162778 -5929 -246286 -167971 54754 44512 -121107 -59190 170665
189 170665 141068 -90143 -118053 75987 158141 10516 -64938 80388 153246 -23354 -198159
200 -198159 -87460 116519 45632 -135855 -73609 103255 70736 -109536 -99203 86278 113200
211A13200j52334o0684J29177R6908j15423j04976J05785J00046j16167j45241
221a49709R9497J84308m9290j57789O891J12797n271j28759r729J54006O6780
232A23732j19240j05154P9656R5215q7804q3407J01525J05482p5461j26073M1766
243d9763J21324j8865j04616m558J09874M0364j12632n7461J04685O5338r5845
254b155r1751O9978Q0992o6959o8537N7971P6772l5004r5182J2903J07008K4177
266G0213p9058k7102R1526L9361j08539o1693P9828N8117n8662o5610L7711N3441
278B9533l5842n6001J7602P2206J2826o8686m198Q1268J5171p6706k8690P3689
290C2172L3052p1047m1798L9788L9128k3226n1959R078N0862r49m6604j823O1763
$$ plain form
211 113200 -39134 -99818 29359 126267 10844 -94132 11653 111699 -4468 -149709
221 -149709 -50212 134096 84806 -72983 -66092 46705 41434 -87325 -97054 56952 123732
232 123732 4492 -100662 -21006 74209 -13595 -97002 4523 110005 34544 -91529 -49763
243 -49763 71561 52696 -51920 -56478 53396 93760 -18872 -76333 28352 93690 -2155
254 -2155 -93906 -23928 57064 -9895 -78432 -20461 56311 21307 -73875 -60972 46036 70213
266 70213 -8845 -35947 55579 94940 -13599 -75292 4536 62653 3991 -61619 -23908 29533
278 29533 -6309 -62310 -44708 27498 40324 -28362 -32560 48708 63879 -12827 -41517 32172
290 32172 65224 -5823 -47621 -7833 31295 8069 -43890 -34812 16050 15101 -31503 -33326 28437
303B8437J2322o0647n070N4697O056m7383j7893M0948K4688l1555l3609P960L8675
316A7626R21m6231J783M7507J528m0874n595L7385K558l1199L604K2079L139j6481
330b250j7650J5806K8383q448l1651J244L7767k01l8496J033K3767k527j3450
343f673m006M934k17k422KN37J3765K286j7388J0083K2651p733j9188L799J5951
358A6381o271j2606J96o626K52P501j1410r840J0340J2166k539l126J1318J623
372G359l131J2023M93p737M362k37j0319k979N415j1704k1120J0080J5674j1989
386a3810j0289M527J2307J2339J224n145M360K1155O586k0614Q62J6255j5151
399A4606k3957K102R759j3809k0889L165J1306J913q424r503K2671L6137l991
$$ plain form
303 28437 40759 -19888 -24958 29739 35795 -11588 -29481 11467 36155 4600 -29009 -21049 17626
316 17626 18547 -27684 -25901 21606 23134 -17740 -23335 14050 16608 -14591 -10987 11092 14231 -2250
330 -2250 -19900 -4094 24289 15841 -15810 -14566 23201 23000 -15496 -14463 9304 6777 -6673
343 -6673 -10679 -5745 -5962 -8384 -8382 -7845 5920 8206 -9182 901 23552 15819 -3369 430 16381
358 16381 10110 -2496 -2300 -8926 -8674 -1173 -12583 -22423 -12083 83 -2456 -5582 5736 7359
372 7359 4228 16251 16744 9007 13369 13132 2813 -166 5249 -6455 -27575 -17495 -1821 -13810
386 -13810 -24099 -19572 -7265 5074 6298 1153 5513 26668 33254 12640 13502 29757 14606
399 14606 -9351 -7249 2510 -11299 -32188 -29023 -17717 -15804 -24228 -33731 -11060 25077 21086
412B1086k1582J3568L1266r039l1010P104J8463j2223k3125j0325L844j455j8497
425c1925q053K2260K3652j6966k4721K9830L8020j7924k6708J8245L1619o689
437C0640k8319j737J7465L100k3784k0784J9112J8013k7117j9938K9074K4192
449A9917l2536l2164K7913L3304j1774k0787J2774L3976K273l7440j5119L2762
461A3099K4846k7239k3358K8946J1958m4402k8375K7320K6317j9757k3380K0523
473a3502L1410p152l5345r33M9156J8922m0489j6346L9353J9150l9068k5001K7468
486G623J2567l2727k4400K0072L2218r988l6862K452L4764l320m2873N970O6820
499C2316K3184m3078k0040K7789J2594k9424j5035L2968K8320k6357n2165r300
$$ plain form
412 21086 -496 13072 44338 35299 4289 11393 29856 17633 -5492 -15817 -11973 -13428 -31925
425 -31925 -39978 -17718 5934 -11032 -35753 -5923 32097 14173 -12535 5710 37329 30640
437 30640 2321 584 18049 21149 -2635 -23419 -4307 13706 -13411 -33349 -4275 19917
449 19917 -12619 -44783 -16870 16434 4660 -16127 -3353 30623 32896 -4544 -19663 13099
461 13099 37945 10706 -12652 16294 28252 -16150 -44525 -17205 9112 -10645 -34025 -13502
473 -13502 17908 10756 -24589 -25522 23634 42556 2067 -14279 25074 44224 5156 -19845 7623
486 7623 20190 -12537 -36937 -16865 15353 5365 -31497 -29045 5719 2399 -40474 -34504 32316
499 32316 55500 12422 -7618 20171 32765 3341 -11694 21274 49594 23237 -28928 -38228
511c8228K7300j1608l7989J7842N3407k489m8975K687O0750K5977k8008j5067
523E599K8219K6053k3541l2817J6659K5436l7873o7140k667M2843l939k9992K0827
536c2333M4958p178m7319l336N7491M3670j3003k1804K2608K2117m5870n6284
548c6283J8930M5861j3540m3011M764K6171k0177l8271J0360M8862J7883l5462
560a3913j8430M2531L6310k8469l2868K9433L0675l8960m1359L1319N0710q116
572C8863m6521j6946J3902p523k7067J1411N8625K2549n4663m0466L4945L3119
584B0228k5280j6998M3923L7952l1099m6815M168L1749o011m0627k636M5553J2458
597B6565m3733j8628L9972J6449m1812j3790M7986K9623l2444l1553K5478L7562
$$ plain form
511 -38228 -10928 -22536 -60525 -42683 10724 8235 -40740 -38053 22697 48674 20666 5599
523 5599 33818 59871 36330 3513 20172 45608 7735 -59405 -62072 -19229 -23168 -53160 -32333
536 -32333 12625 5447 -41872 -45208 12283 55953 42950 21146 43754 65871 20001 -36283
548 -36283 -17353 28508 14968 -28043 -23279 2892 -17285 -55556 -45196 3666 21549 -13913
560 -13913 -32343 10188 46498 18029 -14839 14594 45269 6309 -35050 -3731 46979 38863
572 38863 -7658 -24604 -10702 -18225 -45292 -33881 24744 47293 -7370 -47836 -12891 20228
584 20228 -5052 -22050 21873 59825 28726 -18089 -13921 17828 11817 -28810 -31446 14107 26565
597 26565 -17168 -35796 4176 20625 -21187 -34977 13009 42632 10188 -21365 4113 41675
609D1675j9285n2475p755M1388J2825l0460M910M3995p168o4285k2157M9942L8179
622B9329j5230j3299K0160Q821l8937m1225K5480N8988L72m7702m079M1574k359
635B1893m8242m948M2773J0690l3607j1786L3854K0567l2068l2983K1831L7424
647B5398j9800m3385K0879N5248m958m6739k196L3159q440m2625J692N3695L2138
660E4066l1639m3149L471J5699k2118j4272M8672M9781l3952o6861N60M4605O546
673A1409k4873N687L4269J296m1599j7085M0070L1739l3709m0899K1713L4609
685B2627j7566k3851K7079K9402l1137n0100O392M6261J4871k7831j0102L1901
697A7946Q408m8173l0750L9980M4253j4558k2233K3080J7043l5234l6872K0011
$$ plain form
609 41675 22390 -30085 -37840 3548 16373 -14087 -9177 34818 27650 -36635 -58792 -8850 29329
622 29329 14099 800 20960 29781 -9156 -50381 -24901 34087 34459 -13243 -17322 24252 21893
635 21893 -26349 -31297 11476 22166 -11441 -23227 10627 31194 -874 -33857 -12026 25398
647 25398 5598 -37787 -16908 38340 33382 -13357 -15553 17606 9166 -33459 -31767 21928 54066
660 54066 22427 -20722 -17251 -1552 -23670 -37942 10730 60511 26559 -40302 -39742 4863 11409
673 11409 -13464 -7777 26492 27788 -13811 -30896 9174 40913 7204 -33695 -11982 22627
685 22627 5061 -18790 8289 37691 6554 -43546 -37154 9107 23978 -3853 -13955 17946
697 17946 26354 -21819 -52569 -12589 31664 17106 -5127 17953 34996 -238 -37110 -17099
709a7099M6102K847l7627j2010K6199J612m1436j1319M7076K3578l9866k6800
721c8743L6034L7564j5474k7284J0457K0245j5329k8979J3699M4555k01n1340
733a4796k1582L0347J0379l2169l981M6402K3312l3948l2012J6406K8957q730
745H585k4480J3868L5594o138m3253p608L3339K869l3459j079L8285J0778l4782
758g481j9906K5454K4392j7880k9584J1604L2821n981l1263P688L4668n812l9858
771b1138l429L4801J1031k1953o463K2159P135l2289k7208K2419L5893q534l0653
784a8229Q708K9395j1822l3813O573L6185P196k3668p076J9052N485k4481j5916
797b2411K2378K2323k1479k8725J6205K9466j1984k7674R528K7314m925k4672
$$ plain form
709 -17099 29003 31850 -5777 -17787 8412 10024 -31412 -42731 4345 27923 -11943 -38743
721 -38743 -2709 34855 19381 -7903 2554 22799 7470 -21509 -7810 36745 36544 -14796
733 -14796 -36378 -6031 4348 -27821 -31802 14600 37912 3964 -28048 -11642 17315 8585
745 8585 -15895 -2027 33567 27429 -15824 -23432 9907 12776 -20683 -21762 16523 27301 -7481
758 -7481 -27387 -1933 22459 4579 -25005 -13401 19420 13439 -17824 -10136 24532 18720 -21138
771 -21138 -24567 10234 21265 -688 -7151 15008 22143 -10146 -37354 -14935 20958 12424 -18229
784 -18229 -9521 19874 8052 -25761 -19188 16997 24193 525 -6551 12501 17986 -6495 -22411
797 -22411 -33 22290 811 -27914 -11709 17757 5773 -21901 -12373 14941 10016 -14656
809a4656R65K8142J2537k0762j7991J3028J2441j8609j4504K3709K2384k1484
821E200k8802Q382K0742n828j7409P516K4208L070k3730j1966K1128J7591j5625
834D477j3920J7465J3305j9363j6920J4548J5203j3601j9258L799J7509P45j7525
847a3536k029K2340Q980k1624j1748K2297J7087j3709j1080J1755P367j4335j4575
860a2810O026J3692k851j5984k519J5971K115j9240k370K3868J0362j6189q186
873h115J4696R797r185r332L916Q553m100j3739j050J2728o22j6242j730J6317
887A892K168j4736n66J5612O298q679o679N679Q855j985j0063M8J1355m90j3702
902d993j255J0854k009j1293J414R975p11q509k094O101O325k708p866L226J1988
$$ plain form
809 -14656 -13691 14451 26988 6226 -11765 1263 13704 -4905 -19409 4300 26684 5200
821 5200 -23602 -15220 5522 -306 -17715 -10199 14009 17079 -6651 -18617 2511 20102 4477
834 4477 -9443 8022 21327 1964 -14956 -408 14795 1194 -18064 -14265 3244 3989 -13536
847 -13536 -15565 6775 15755 -5869 -17617 4680 21767 8058 -3022 8733 16100 1765 -12810
860 -12810 -6784 6908 4057 -11927 -14446 1525 3640 -15600 -17970 5898 16260 71 -8115
873 -8115 6581 16378 7193 -2139 1777 10330 6230 -7509 -8559 4169 3547 -12695 -14425 1892
887 1892 4060 -10676 -11242 4370 10668 1989 -4690 989 9844 7859 -2204 -2156 9199 8709 -4993
902 -4993 -6248 4606 2597 -8696 -7282 2693 1982 -6527 -8621 -2520 3805 1097 -6769 -3543 8445
917H445J80j0389P94R974j311p967J058L797l440m832m75J896P25l301m716L129
933f433Q367j674o713M827R409j503n370K199L239j128r70j122k677m12o61l778
949d400r35K360k001l176M107M689l390j449N288K722k62J592J11j637K300K053
965G972m275m430P27j039k673J82j378l597J420L439j821m75N352K753q25L972
981E304M135k490k555K261J048k682l216l721j886K088j655p254l17P010M77m483
997g936L373P106P51j328K368J967l48j218j242K186K852n344r118J444O762m165
1013a890p976L838P769k306n766o2M332L101o70j521L935M879m176o113N716P167
1029A0257o977q587N322O951n074p843J123N337K9o855m032P035Q385l854n794
$$ plain form
917 8445 8625 -1764 -970 9004 7693 -274 784 4581 1141 -3691 -4166 -2270 -1545 -4846 -9562 -6433
933 -6433 1934 260 -6453 -1626 7783 6280 910 3109 6348 5220 4250 3128 451 39 -622 -4400
949 -4400 -5335 -2975 -4976 -8152 -4045 644 -2746 -4195 1093 3815 3553 5145 5256 3619 5919 7972
965 7972 3697 -733 -6 -1045 -3718 -3536 -4914 -8511 -7091 -3652 -5473 -5948 -596 2157 1332 5304
981 5304 9439 6949 4394 6655 7703 5021 1805 -1916 -3802 -1714 -3369 -10623 -10940 -3930 -3453 -7936
997 -7936 -4563 2543 3294 1966 4334 6301 5953 4735 3493 5679 8531 3187 -5931 -4487 2275 -1890
1013 -1890 -9866 -6028 1741 -565 -6331 -6393 -2061 1040 370 -1151 2784 7663 3487 -2626 3090 10257
1029 10257 3280 -5307 15 6966 1892 -5951 -4828 509 538 -6317 -10349 -3314 5071 1217 -4577
1044d577O316N723q017o225Q856P961n504o897K621M908l222r453j578J1049O996
1059H957r253p816P973O202q892n986Q960O874n770n900M404O048k757q084K43
1074d797J0012K074j1513l508J3102N342j3189q286Q480O014o229m029P220Q218
1088H911k941j0226j463Q820J576q984J540J3401k34j7207o320J0666N457o840
1102c844l068Q771P427n504j0589J760J2134J152j0969p7J0687k151j3655J14
1116g812J2557K58j2630m653J0074R747k855o863M396Q238p306j5134L785J7005
1130H807J590j1897k057N474m985j0693K611J4654Q489o996q984M663Q090o745
1144B021j0580P901J4092n635j5598L38J0083j261q740n39P489K128p367k330
$$ plain form
1044 -4577 1739 7462 -555 -6780 2076 10037 4533 -2364 257 5165 1943 -7510 -9088 1961 8957
1059 8957 -296 -8112 -139 6063 -2829 -8815 145 7019 1249 -4651 -247 5801 3044 -5040 -4797
1074 -4797 5215 7289 -4224 -7732 5370 10712 -2477 -10763 -2283 3731 -2498 -6527 693 8911
1088 8911 5970 -4256 -5719 3101 4677 -4307 -2767 10634 10400 -6807 -13127 -2461 2996 -3844
1102 -3844 -6912 1859 9286 3782 -6807 -5047 7087 8239 -2730 -2807 7880 5729 -7926 -7812
1116 -7812 4745 5003 -7627 -12280 -2206 7541 4686 -2177 2219 10457 3151 -11983 -8198 8807
1130 8807 10397 -1500 -3557 1917 -3068 -13761 -11150 3504 11993 4997 -3987 676 8766 2021
1144 2021 -8559 -658 13434 7799 -7799 -7461 2622 1361 -7379 -7918 -429 1699 -5668 -7998
1158g998J1968J0093q684j2674N064R315o453o924J1015J1955p891j7121m757
1171a3092P966N728k767p07Q321K036j3920r439J1330J2168o007o289R172P484
1185A1984p979r754M357R767j126j1364l622J0133N525j0183o848Q326M012j1481
1199h253n089J2068R740m848n023M929M793o501j0732K078J5056N636j1165p056
1213d367O187o21j2723j799J4582Q568p002p048K409L872l492m789N004J0479
1227I260j686j2537l10J2642O77j3387l450J0066L137p282k073P919M835o478
1241A333q585J847P636j887p411N924J3173l362j4863k355R029J187n683L389
1255f28J0995K047j1478j1786K374R577M07m960M490O341q327j1424N804J2824
$$ plain form
1158 -7998 3970 14063 5379 -7295 -2231 7084 631 -6293 4722 16677 8786 -8335 -13092
1171 -13092 -5126 602 -2165 -2872 5449 7485 -6435 -15874 -4544 7624 1617 -4672 4500 11984
1185 11984 4005 -5749 -1392 8375 7249 -4115 -7737 2396 7921 -2262 -9110 -784 3228 -8253
1199 -8253 -13342 -1274 8466 3618 -1405 3524 8317 1816 -8916 -6838 8218 13854 2689 -4367
1213 -4367 1820 1199 -11524 -13323 1259 9827 2825 -4223 -1814 2058 -1434 -6223 -1219 9260
1227 9260 7574 -4963 -5273 7369 8046 -5341 -8791 1275 4412 -2870 -4943 2976 7811 1333
1241 1333 -7252 -5405 2231 344 -7067 -1143 12030 8668 -6195 -8550 479 1666 -4017 -628
1255 -628 10367 12414 936 -10850 -8476 1101 1508 -3452 1038 7379 -948 -12372 -6568 6256
1269F256m28q591J35P604K128n766k473O343L304j0663j0632O328J1410k044p443
1284d532K988L630p338o871O721J2466L406n831k874L914o5j0026m781J1229R382
1299A1418p870j0339K626L695n560l741O956Q148j564p493O0Q185L433o864l331
1314b241P174J572j0548l017J1634O214r247j0000J079M806l22j621M731P526
1328G740k430j1336k542R606M114n977M89R154L44j0999n196O389N367l787n671
1343d735K462O464k200q795k0Q661M91q065P38R039J342o854k72P061J744p374
1359c13n290N098P888k142q107O92N816m368r720K465J0326J048o201l62M858
1374A688m6n087r12P624O301m525p238L408O412n383q812L212P626k590p525M83
$$ plain form
1269 6256 5828 -2763 -2628 4976 7104 1338 -1135 5208 8512 -2151 -12783 -6455 4955 2911 -4532
1284 -4532 -1544 2086 -5252 -12123 -5402 7064 10470 4639 1765 5679 5614 -4412 -9193 2036 11418
1299 11418 3548 -6791 -4165 -470 -6030 -9771 -2815 5333 3769 -3724 -3664 4521 7954 1090 -2241
1314 -2241 4933 6505 -4043 -7060 4574 10788 1541 -8459 -7380 -2574 -2896 -4517 214 7740
1328 7740 5310 -6026 -8568 1038 5152 -825 -336 8818 9162 -1837 -7033 -644 4723 936 -4735
1343 -4735 -2273 4191 1991 -6804 -6824 1837 2328 -5737 -4999 4040 5382 -1472 -1744 5317 7061 -313
1359 -313 -5603 -505 7383 5241 -2866 -2174 3642 -726 -10446 -7981 2345 3393 -2808 -3170 1688
1374 1688 1642 -3445 -4357 3267 9568 5043 -2195 1213 7625 2242 -6570 -3358 4268 1678 -5847 -5364
1390e364N360M70m976j098N767L964m312l534P050O442n893p408M088N580m696
1405A440o227L101O227j375p588l335M367L678l390j684O731M335o744m644O051
1420I43N568l945m021M092M098l459o661q07N421J521o844l396N689L656n151
1435c296k481O678L531m591k530N030M248j919m056O18L880j774p558j870P043
1450I53K166o909k988N514K079m401j047N199L874j898k751J215L654j060n430
1465a830L57N837n29p196r39N964Q88n257j590L744K189j986k434J475L699q64
1481A528m303L91N013n05m741J504N370q10m896j25L505J186k695k491J339K873
1497B143j435m409M31M188o45l722J652L774j119k869J264L022mk052j163J957
$$ plain form
1390 -5364 -4 466 -4510 -5608 159 4123 -189 -3723 3327 9769 3876 -3532 556 6136 1440
1405 1440 -4787 -1686 4541 3166 -4422 -7757 -3390 288 -3102 -4786 1945 6280 -464 -5108 943
1420 943 6511 2566 -1455 2637 6735 3276 -3385 -4192 1229 2750 -4094 -7490 -1801 1855 -3296
1435 -3296 -5777 901 4432 -159 -2689 2341 6589 4670 614 1232 5112 3338 -4220 -6090 953
1450 953 3119 -3790 -6778 -1264 815 -3586 -4633 566 4440 2542 -209 1006 4660 3600 -1830
1465 -1830 -1473 4364 3835 -3361 -4300 1664 2552 -2705 -4295 -551 1638 -348 -2782 -1307 2392 1528
1481 1528 -2775 -2384 2629 2124 -2617 -1113 4257 3447 -1449 -1574 1931 3117 422 -2069 -730 2143
1497 2143 708 -3701 -3270 918 273 -3449 -1797 1977 858 -2011 -747 2275 2271 219 -944 1013
1513A013K347j989l612J127L921j575l538J056K733j247k176Q42J100m34q24m02
1529a658J251J429j193j741K140K773j847k718K116K307j352j656J70K47j23k10
1545f5r44k40J080l15j146J171J023j475p57K215R17j458m17N64L22J69M53j296
1563a99j99J659K45j470n2P18r65m96N72q65p63J184L46j032L08J086l36R4J761
1582A596O81j354j21Q03Q3n15j138j598L28J435j495k312J209K642q85j302J592
1599c51J662j92K40Q13P41l8j962j590J121J530k804k625K094K017k873k533K111
1616b639K933k76j231O25K379J143j561r60K575J630l651k569L088J856m093l009
1632c760K231J897k674l071J177M329J586k943j400M231K134l268j391M993K374
$$ plain form
1513 1013 3360 1371 -2241 -1114 2807 1232 -2306 -1250 1483 236 -1940 -1098 2 -432 -1256 -1658
1529 -1658 -407 1022 -171 -1912 228 3001 1154 -1564 552 2859 1507 -149 21 268 145 -65
1545 -65 -1009 -1249 -169 -484 -1630 -459 564 -911 -1668 547 1464 6 -411 153 475 644 1097 -199
1563 -199 -398 1261 1506 36 -16 702 -263 -759 -187 -1052 -1815 -631 -285 -1317 -1009 77 -259 -165 1596
1582 1596 2277 923 802 1605 1688 1173 35 -1563 -1235 200 -1295 -3607 -2398 244 -641 -1943 -351
1599 -351 1311 1119 1359 2172 2913 2875 913 -677 444 1974 -830 -3455 -1361 656 -2217 -4750 -2639
1616 -2639 294 18 -1213 -588 1791 2934 1373 413 2988 4618 967 -1602 1486 3342 -751 -3760
1632 -3760 -1529 368 -2306 -5377 -4200 129 1715 -1228 -2628 1603 3737 469 -922 4071 6445
1647F445m666l110K421J716l572l701J889L876q00n270o35N892K113n003j703
1662d108O044K744m312k176M381K691l697l921J507L990j445n156Q33O150n00
1677C025p764j492O938K376n454j763N538L085m419m383L054N501r85n028J478
1692b93O004j788q058q9P403M62p441j420O041K347n450l969M947N792k850o052
1708d414K869P730j102p357J119O535j845q043n16P387K378o439l937M425M154
1723B944n156n349N735R187k381q539J432O962j503o851J167P402P17p645l714
1738e592N504M215n740n456N664O897n055p586M716Q896k239q311N00P062Q42
1753D317o058q55P107K639q348o681N761O697m697n688N791O382o246q934L034
$$ plain form
1647 6445 1779 -1331 1090 2806 -766 -4467 -2578 1298 498 -4772 -5407 485 2598 -2405 -4108
1662 -4108 1936 4680 368 -1808 2573 5264 1567 -2354 -847 3143 1698 -3458 -2625 3525 3025
1677 3025 -4739 -6231 707 3083 -2371 -4134 1404 4489 70 -4313 -1259 4242 3257 -1771 -293
1692 -293 5711 3923 -4135 -4224 3179 3641 -3800 -5220 821 3168 -2282 -6251 -1304 4488 1638 -4414
1708 -4414 -1545 6185 5083 -2274 -1155 5380 3535 -4508 -5024 2363 4741 -1698 -5635 -1210 2944
1723 2944 -2212 -7561 -1826 7361 4980 -3559 -2127 4835 3332 -3519 -2352 5050 5767 -1878 -5592
1738 -5592 -88 4127 -1613 -7069 -1405 5492 437 -7149 -2433 6463 4224 -4087 -3587 3475 4317
1753 4317 -1741 -2596 4511 7150 -1198 -7879 -2118 4579 -118 -5806 -15 6367 121 -8813 -5779
1768e779R794J296o875j236O896K003p902l817P884N439p667o662N881O487n690
1783E2o961L998P247l174p805J341J0028K597q331l711P431L567q418m434Q474
1798A901O589o542p489L151N575l643o544L500R495k0r925k558Q736L084q324
1813c014l010R007M724p608o198N526O622l782p286K153P816j188q289N88R088
1828E149j29j0749k779R339M277p109l657P071N441n987p223M111Q817j295p842
1843b565J286Q221k144j0771j554R155K376p634k389P263L786p082n928O499Q819
1858G338k878q393K382Q476j896q957L45Q253m53r292j850Q316L943o371n329
1873f366N320N621n271o503O023R850k719r850L77P485p71p439K24Q282K055p796
$$ plain form
1768 -5779 4015 5311 -1564 -2800 4096 6099 -1803 -5620 2264 7703 36 -6626 -745 5742 52
1783 52 -6909 -2911 4336 1162 -6643 -5302 4726 7323 -1008 -4719 2712 6279 -2139 -6573 1901
1798 1901 8490 1948 -5541 -2390 3185 -458 -7002 -3502 5993 5973 -3952 -6510 2226 5310 -3014
1813 -3014 -6024 2983 7707 99 -6099 -573 6049 2267 -5019 -2866 4950 3762 -4527 -3939 5149
1828 5149 5020 -5729 -8508 831 5108 -2001 -5658 1413 6854 867 -6356 -2245 6572 5277 -2565
1843 -2565 -1279 6942 4798 -5973 -7527 1628 4004 -3630 -6019 1244 5030 -2052 -7980 -1481 7338
1858 7338 4460 -3933 -1551 6925 5029 -3928 -3583 4670 4217 -5075 -6925 1391 5334 -1037 -6366
1873 -6366 -1046 4575 -696 -7199 -1176 8674 5955 -3895 -3518 3967 3196 -4243 -4019 4263 6318 -1478
1889a478n040N529M866n444n173O342P576n042q602L408Q512j469p614L18P373
1904D062J067p237k674O974M020p283o441N407O301m192n115N105O287m762q152
1919f633K055Q709J624o542k025O052J874p634m217P017N814n401n721M278N167
1934D417l974n717K865O661j167o853l05P343J742p178l164O680L722o216m077
1949e221N875N429m085n759K205M731j767n459J426O957K85p581k584O589K353
1964C394o093k221O526L815n270m944L364N153j649n007J221O039n10o216n89
1979b987O137O83o466j647N562K595n320l343L771M160l010m964K019O045k21
1994C014n143N36N625j23n577q84N140J376m351k197L315K149l863m250K673N332
$$ plain form
1889 -1478 -6518 -989 3877 -1567 -6740 -398 7178 2136 -6466 -3058 5454 3985 -3629 -3311 4062
1904 4062 5129 -2108 -4782 2192 6212 -1071 -7512 -2105 4196 4 -5111 -6 6281 1519 -6633
1919 -6633 -4578 4131 5755 -787 -2812 3240 5114 -2520 -6737 280 6094 693 -5028 -750 4417
1934 4417 443 -5274 -2409 4252 3085 -3768 -4073 3270 5012 -2166 -5330 1350 5072 -1144 -5221
1949 -5221 654 6083 1998 -3761 -1556 3175 1408 -4051 -2625 4332 4617 -2964 -5548 1041 3394
1964 3394 -2699 -4920 1606 5421 151 -4793 -1429 3724 2075 -2932 -1711 4328 3818 -2398 -2987
1979 -2987 3150 3833 -2633 -4280 1282 3877 -1443 -4786 -1015 3145 135 -4829 -2810 3235 3014
1994 3014 -2129 -1593 4032 3909 -1668 -2552 2588 3964 -387 -2584 731 2880 -983 -5233 -2560 2772
2010B772j380n145R24N364o93m746M41M947R81l624j202L181J763k978k856K427
2026A76L343k833m542J712M614j737m877P44M167J96l093j79L624K021k177k298
2042a139K336K526k133l169K038K841k748m289J166L175q58k918J72L282J290
2057A572k084j575K928K816j900k338J900K130k323k722J333J869j907k453M88
2072b266K184L11k175p90K852J886j995j782K634K235j572j850J365J115j262
2087H90j547K67J234n42j921o37J744P87k118r92K540J697j751r72J952J330q66
2104A095p07L15J053pj289q55J107J0k119n57J689M07j881m29J691O41o75l14
2122h25O29J063N05q32l57R82N25j384l63R76k27j187N2P93m40p79k77K72M54
$$ plain form
2010 2772 1392 -3753 -2829 2535 1842 -2904 -2463 2484 3465 -159 -1361 1820 3583 605 -2251 176
2026 176 3519 686 -3856 -2144 2470 733 -4144 -3400 767 963 -2130 -2309 1315 3336 1159 -1139
2042 -1139 1197 3723 1590 -1579 459 3300 552 -3737 -2571 604 -254 -3172 -3000 282 1572
2057 1572 -512 -2087 841 3657 1757 -581 1319 3449 1126 -1596 -263 1606 -301 -2754 -2266
2072 -2266 -82 229 -1946 -2736 116 2002 7 -1775 859 3094 1522 -328 1037 2152 890
2087 890 -657 -390 844 302 -1619 -2256 -512 275 -1843 -2835 -295 1402 -349 -1321 631 1961 1095
2104 1095 388 703 1756 1749 460 -395 712 722 -1397 -1954 -265 142 -1739 -2168 -477 164 -511 -825
2122 -825 -196 867 1372 540 183 1165 1690 306 -57 919 692 -495 -443 350 -90 -869 -1146 -874 -420
2141d20Q6n21k06J150N71q28n8R55M39m14K10K22o06q5o9m10k61j72l75l46M67
2162f71M5o54J88J097J19q1L37K58j07Q24qj000k86O14j88q46j59p0l28R4K21
2183f01k19K14N04j10J31R59k9o92K84J129o39j161K9N28l4n39n88nN05q0n33
2204i47L4J304o8q68Q14J049n60q61M69P25k02j078o42N56R40o89j371K68J311
2223A84k44j262P77J578m17j072N27N80k33o72L5R75O20j386j658J065J554r23
2241B8j436J046J641q07j508M16J270L2r51l44R12O32j275p59J421J217j775j601
2259a841J680J815j174j264Q85J101n15j754k90J642Q27j307j057J493O96j950
2275a013q98K249J498j490j248J303J279j084j665J92J950L13k183j017K147R15
$$ plain form
2141 -420 -334 -855 -1061 89 660 -168 -226 729 1168 754 964 1186 580 495 426 16 -245 -417 -792 -1138 -671
2162 -671 -626 -1280 -1092 5 124 43 380 638 531 1355 1347 347 61 675 487 -359 -518 -588 -916 -822 -601
2183 -601 -820 -606 -102 -212 -81 878 849 157 441 1570 931 -230 -201 327 293 -246 -834 -839 -334 -414 -947
2204 -947 -913 391 323 -545 269 1318 758 -103 366 1091 889 -189 -831 -275 665 -24 -1395 -1127 184
2223 184 -60 -1322 -545 1033 616 -456 71 651 418 -254 -219 756 1376 -10 -1668 -603 951 28
2241 28 -1408 -362 1279 472 -1036 -620 650 682 -269 -613 299 931 -344 -1103 318 1535 -240 -1841
2259 -1841 -161 1654 480 -784 101 1202 687 -1067 -1357 285 1112 -195 -1252 241 937 -1013
2275 -1013 -1911 338 1836 346 -902 401 1680 596 -1069 -877 1073 1386 -797 -1814 333 1248
2291A248k260r21K040J143j811p91J872J272j146j593M88J927m17k404k8K937
2307A556O28l173j132K054P64j932k73K193J146j466j724O81J811l93j936P87
2323d09K809m69l628l81L129L28k501o98K046J060j461j570J223K281j146k322
2339a709Q77K735n75k537Q69K576q64l450k91K726J406j737j307J475J347j951
2355d10k413J802L549q47k642O15K099j356k712Q84L049J59k601j363K256J721
2371A790j969k019K059K584k003k658J826L226j332k968J27J872j67k113K83K948
2387A486R95l032k358K538K504j964j796K476K459k268l399P59K394n5k071r2
2403a424K442M10k883j031L164J866k705j716K626J912k187k178J633K134j512
$$ plain form
2291 1248 -1012 -1933 107 1250 -561 -1352 520 1792 646 -947 -459 1468 1051 -1353 -1381 1556
2307 1556 2184 -989 -2121 -67 697 -1235 -1508 685 1831 365 -1359 -678 1133 740 -1196 -409
2323 -409 2400 1931 -1697 -2078 1051 1379 -1122 -1820 226 1286 -175 -1745 -522 1759 613 -1709
2339 -1709 -832 1903 1328 -1209 -340 2236 1372 -2078 -2369 357 1763 26 -1281 194 1541 -410
2355 -410 -2823 -1021 2528 1681 -961 -346 1753 397 -2315 -1431 1618 1777 -824 -2187 69 1790
2371 1790 -179 -2198 -139 2445 442 -2216 -390 2836 1504 -1464 -1337 535 368 -1745 -1462 1486
2387 1486 2481 -551 -2909 -371 2133 169 -1627 849 3308 1040 -2359 -1600 794 739 -1332 -1424
2403 -1424 1018 1428 -1455 -2486 678 2544 -161 -1877 749 2661 474 -1704 -71 2063 551
2418E51k939M1L229R08k732q17K615O76l065j057L576J931k441j747J555J592
2434A876j910k482J244L240m1l199m48K939M16l223p22L134J293k462j505J885
2450C5J666j987k013J556K720q22l035O54L552K2l468p52K931P55k741q25K436
2467F84J447k324k357J175K443r28k153J268L393r38l661J85L292L74k591k98
2483i89K439R39k360k263J654K192j362k584J416K546j289k810J177K918l66k841
2499a583M0L017Q92k143j275K049J412k304k604J701K917j280k703Q17J976j227
2515b98k243J043K997M89k264r84K136J345k257j609K170K134k129k649J161K260
2531A302j150k059M19K124K09j957l02K431J151k418j412K432J408j970j740K029
$$ plain form
2418 551 -2388 -2347 882 1790 -942 -1759 856 1532 -1533 -2590 986 2917 476 -1271 284 1876
2434 1876 -34 -2516 -1272 1968 1927 -1272 -1720 1219 1635 -1588 -2310 824 2117 -345 -1850 35
2450 35 1701 -286 -2299 -743 1977 1155 -1880 -1226 2326 2348 -1120 -1872 1059 1814 -927 -1752 684
2467 684 2131 -193 -2550 -1375 1068 140 -2013 -745 2648 1710 -1951 -1766 1526 1900 -691 -989
2483 -989 1450 2389 29 -2234 -580 1612 250 -2334 -918 1628 339 -2471 -1294 1624 1258 -1583
2499 -1583 -1543 1474 2366 223 -1052 997 2409 105 -2499 -798 2119 839 -1864 -1047 929 -298
2515 -298 -2541 -1498 1499 1988 -276 -1260 876 2221 -36 -1645 525 2659 530 -2119 -958 1302
2531 1302 152 -1907 -1488 636 845 -1112 -1414 1017 2168 -250 -1662 770 2178 208 -1532 497
2547D97J648j750k463N74K100J08j923j69K157N83k361q38K352J424j884j192
2563a137J974J013j689j840J289J763m84k177l1K141L80k129q19K322P17k036
2579g43p39K058R38j546j095R41J332q00j684O61K139j07k219k15K099K86k189
2596h83m04J805O14j438r81J024Q89q14j102O54J836l97j813K86K183j33j815
2613d89j86J712K83j612p94Q70R34q51j076M33J361l70j503P96J712l43j656L75
2631d04J593m3j468k41J066L73r98j034O61J098n03j178M48J431o06j133O76J136
2649H74l32q78M4R00J49q66p66Q87J008q35j421O78J124n97r61N46R59l01o42
2668d30K44O93J67n80m15N82M66p55p74O90Q53r32p77N69O34j8o25Q6N73L35n41
$$ plain form
2547 497 2145 395 -2068 -1494 606 714 -1209 -1378 779 1362 -999 -1837 515 1939 55 -1137
2563 -1137 837 1850 161 -1679 -390 1373 889 -1288 -1319 822 1202 -927 -1746 576 1293 -743
2579 -743 -1482 576 1514 -32 -1127 -186 1146 346 -1338 -677 1462 1355 -864 -1079 1020 1306 -883
2596 -883 -1287 518 1132 -306 -1287 -263 626 -188 -1290 -636 1200 803 -1010 -724 1459 1326 -489
2613 -489 -675 1037 1320 -292 -1086 -216 718 -133 -1209 -776 585 215 -1288 -492 1220 877 -779 -404
2631 -404 1189 1146 -322 -563 503 876 -122 -1156 -495 603 100 -1078 -630 801 195 -938 -262 874
2649 874 542 -336 -292 608 757 -109 -875 12 1020 185 -1236 -558 566 -31 -992 -446 513 212 -430
2668 -430 -186 507 674 94 -321 261 727 -28 -802 -112 741 -191 -968 -399 235 217 -408 -322 251 586 45
2689D5l69N86M21n69m87P32K09p80m67N78M92n17l80K98L98J95n24k38N39L90
2709E52n00l09L51K74o38k28O29N1m11R9M9L43k0k87k01N45L01n32m21M52J85
2730B84m08n4O8Jk3O6K5J05J03p0M2K35J01n89j44N94o4l52k05J74q7lK18j83
2754a66k16M36k5q5K53n9r5JL31k49j67J09j9k71J90ok43n7N40j51m46L26J75
2777A06O1O6j25m4R1K14k51m15L35J23k26j12K31k6l01K1L55l4p3r9J46K95n1
2800B87m47k15N91N6o33Q4K51J59k90K7J63q7k2lJ55K51N3o81n8O89j07n66O0
2823b83M78M6n16q0K43K72P6k82n0L93q4m21J51N24j30p59J87N31r2n61l6M55
2845F2J19k21k42J10N68k8n72J67M21j64o98L27N72k11m65M8K28K2l34j16L83
$$ plain form
2689 45 -324 262 683 114 -373 359 568 -212 -679 -101 391 -126 -506 -208 190 385 -139 -377 162 552
2709 552 52 -257 94 368 -270 -498 131 182 -229 -130 -81 262 242 -45 -246 299 600 68 -353 99 284
2730 284 -124 -178 -110 -109 -132 -66 -41 64 167 97 139 374 475 -114 -258 336 272 -80 -285 -111 -198 -201 17 -166
2754 -166 -382 54 29 -56 197 138 43 44 375 126 -41 68 49 -222 -32 -38 -281 -338 202 51 -395 -69 106
2777 106 167 233 108 64 155 369 118 -297 38 161 -65 -177 54 28 -273 -252 103 69 -4 -103 43 338 287
2800 287 -160 -375 216 272 -361 -277 -26 133 -157 -130 33 -54 -76 -79 76 327 380 -301 -359 330 223 -343 -283
2823 -283 195 241 -275 -355 -112 160 236 -46 -96 297 213 -208 -57 467 337 -422 -235 296 204 -357 -393 62
2845 62 181 -40 -282 -172 396 368 -204 -37 384 220 -478 -151 421 210 -255 -207 21 43 -291 -407 -24
2866b4N80j92p97L30O40l91l29J56N86l68k64j23L37n4l31j76M34M98p13l16O08
2887I1P34o63o72L39P10k95l74J24K44r4m33k29L67L69k47l16M48M60p94m44N59
2908a16N84k68n05L51K65K5n84j70M58K71l65k39M36L31m62m24M84L62n22l69
2928d57M60L60j33o01o7M67J90n45k28P46L93o15j77L61J34m19r6M76K66k76m47
2949b08l8K61m8m82o1P61J52n84j98N51K05j38j66K29J97k05l52k0N82l24n87
2970d73p5N47J21o56K21P20J3o40j22L65M08j64j74rL96l51o67N3P17m9n76J80
2992b15N02j95o62K51N54K32k64l79J43M08k82l57J24N41m14m32K29N35j72l92
3012b45J05K12r5k35L7M53K94l76m42J32M21j66m14L33L57j93m30K06L6Q9k46
$$ plain form
2866 -24 556 364 -433 -103 537 146 -183 -27 559 191 -73 -196 141 87 -244 -420 14 512 -201 -517 91
2887 91 825 162 -510 -171 539 244 -130 -6 238 144 -289 -518 -151 218 -29 -345 103 563 -231 -675 -116
2908 -116 468 200 -305 46 311 336 -248 -418 40 311 -54 -293 143 474 12 -412 72 434 -88 -457
2928 -457 3 363 230 -371 -438 29 219 -326 -554 192 585 -30 -207 154 288 -131 -227 249 515 239 -208
2949 -208 -246 15 -33 -515 -576 185 337 -247 -445 106 311 173 7 236 433 228 -124 -144 438 114 -473
2970 -473 -548 -1 120 -536 -315 405 418 -222 -344 21 429 265 91 82 478 127 -540 -487 230 181 -395 -215
2992 -215 287 92 -570 -319 235 467 203 -176 -33 375 93 -264 -140 401 -13 -445 -216 319 147 -245
3012 -245 -140 72 -23 -258 -221 232 526 150 -292 -160 261 95 -319 14 371 178 -252 -46 -10 79 -167
3033a67J47L98j94l21k02M62K63m40k31K60M25l54k22K16K76l57q1J9K11J98m44
3054a38j0L86Kn47j46N37K25m95o4K72J94j20k99J28K55J12k43j16L13m3n00P2
3076b25M19%l85j40M34rj32k84J59L72K0m57J64L77N8l34j98M15j3l23r1L16J8
3099A61k03k23K16L36n35j09K58M42J0n03o7N21o3l75J28J31j7j90k70K46K86
3120A80k24k75L48K03j15n07L50L89k00l84N7L45p4j50k04M14K6k60m15M30L06
3141B40k82j47L90J49l67k75J61L77n0k49j29L42j3l45j31M34J60l38p9J49J79
3162A76k09j91K88J18o0l91J16J60P7k06j77K98L01m16K2K82J10j88k54P8K22
3183A56j41k18K59L3J56m09L6K46J44m74n4M04J75l22j18K97N9k33p3pK58Q9k83
$$ plain form
3033 -167 -20 378 184 -137 -339 123 386 -54 -285 -25 400 46 -176 40 316 -41 -122 -103 108 306 -138
3054 -138 -148 238 240 -307 -453 84 309 -186 -250 22 216 96 -203 -75 180 292 49 -67 246 203 -297 -225
3076 -225 194 194 -191 -331 103 94 -38 -322 -163 209 229 -228 -64 313 371 37 -161 254 241 -82 -173 143 161
3099 161 -42 -265 -49 287 -248 -357 -99 343 353 -150 -217 304 241 -134 -6 125 108 -82 -352 -106 180
3120 180 -44 -319 29 232 117 -390 -40 349 149 -235 -178 167 93 -57 -261 153 179 -81 -496 -66 240
3141 240 -42 -189 201 350 -17 -292 -131 246 196 -53 -182 160 147 -198 -329 105 265 -73 -152 -3 176
3162 176 -33 -224 64 182 122 -269 -153 7 84 -122 -299 -1 300 -116 -94 188 298 110 -144 -66 156
3183 156 15 -203 56 89 245 -164 -128 118 262 -212 -266 138 313 -9 -127 170 229 -4 -77 -84 174 263 -20
3206b0k19K89J37m04J7L15q1k72K3L91n8k9j30p3K89o1k04J6K25p5j56q6K53P2
3230A59l47qL23J5k02k26K97K49j66l44J32L47o5k67q1K45L8k35K7K29o9j70R7
3253b2J28N0n4k48N3L39j16k68J12R6jr0j9J44k6k9j03K00O7k11j41J95J47k49
3277d6k22L78p3n5o6L9O1J0j08j6J70J47k47J7P8R0p9j71R7J61j63j63O7J4O9
3302a1k06J26R0L8R8k39J97p3J6MQ6K0J4j86j21K14r4j32j23K19J27j12j2P1P9
3327I0k9o3J11p1O3j52M8N3p4J1P%jJ1o7Q1O1j36m3J87k9j07Q0K8k3p7PRn8K24
3357A41k3q6M7j04j5J17p6l4r4J03P7j51O4J21q2n6K49j48j01l9K26j50j2R9r7
3382b4L4j42M2P1q4K39j06m7J27r9M6j93K02j6m0J35j41k0J77q6p1o1M5k1j34
$$ plain form
3206 -20 -239 50 187 -217 -200 115 34 -238 -215 176 118 89 -41 -114 175 114 -90 -74 151 76 -80 -166 87 159
3230 159 -188 -196 127 142 -60 -286 11 260 94 -250 -118 229 164 -103 -184 61 99 -136 -109 120 51 -119 -22
3253 -22 106 156 102 -146 -93 246 130 -138 -26 70 69 -21 -40 104 78 49 -54 146 213 2 -139 56 203 -46
3277 -46 -268 110 37 -18 -84 -45 16 26 -82 -98 72 219 -28 -11 67 157 78 -93 4 165 2 -161 -94 -80 -11
3302 -11 -217 -91 -1 37 135 -104 93 20 36 40 126 146 160 -26 -147 67 -27 -159 -282 -63 64 -48 -60 11 90
3327 90 61 -2 109 38 101 -51 -3 50 -24 -13 -6 -6 -7 4 -63 18 79 -57 -100 87 58 -49 31 59 36 -41 -34 -25 -83 141
3357 141 118 32 79 -25 -40 77 1 -33 -127 -24 53 -98 -34 87 5 -51 198 50 -51 -90 136 -14 -26 73 -24
3382 -24 10 -132 -90 -19 -103 136 30 -17 110 11 57 -136 66 50 10 145 4 -16 161 75 4 -57 -12 -33 -167
3407a67M7J54r0k7L9n1K2J70p1J00K1k44P5J08J63k63j28J47l0M5n6m3K6L5no5
3433h8R0Q9k48O6J15K6n3m7O0L4k9j16N9R1M0n8n5JJ57k09m8L61l7k89L0N6L7
3460C5j2K8j29K02j6j68j40M08n9j94k1P2K4l5q3J02N8q0ok7R1K4j12j08M32k12
3486G4j13j49K68O1n6k29L23j5j21j87j4L06p6k15P7K44k8m11J35L92q5k66J4
3509g1J26K19k68m8Q8J34k08k51J19L02l4l49J37K52J4l19K2J04oj0J4P5J32j32
3533D2k36J52K44j19k81N3K46p2j25N5J82L3k46j25J87J72q1k87J70L77k27m28
3555c14K07M10k24k36l7K75Q0l38L4K37J53k41l02J76L93k78k34J05N01k45l77
3576b55L6L37N9k27J1J84R4k69k09L51L10l87k78R3M28l18j58J26K36N7m11L0
$$ plain form
3407 -167 -120 34 -56 -83 -44 -95 -73 97 26 126 147 -97 -22 86 249 -14 -142 5 -25 20 -36 -79 -53 -18 -23 -88
3433 -88 2 91 -157 -91 24 50 -3 -50 10 44 15 -101 -42 49 89 31 -24 -23 134 -75 -123 238 201 -88 -58 -2 35
3460 35 23 51 -78 124 108 -60 -200 208 149 -45 -66 6 30 -5 -88 14 72 -8 -14 -41 50 74 -38 -146 286 74
3486 74 -39 -188 80 141 85 -144 179 164 43 -144 -158 148 72 -143 -66 178 150 -261 -126 266 181 -85 -71
3509 -71 55 274 6 -42 46 180 -28 -279 -160 142 108 -241 -104 148 162 -157 -135 -31 -37 -47 -33 42 174 42
3533 42 -194 -42 202 83 -198 -145 101 29 -96 -41 141 174 -72 -197 -10 162 81 -206 -36 341 114 -314
3555 -314 -107 303 79 -157 -194 81 161 -177 -143 94 247 6 -296 -120 273 -5 -239 -134 367 122 -255
3576 -255 -219 118 177 -50 -39 145 239 -30 -239 112 422 35 -243 -150 278 -40 -198 -72 164 221 -190 -160
3598a60L40J70m47k25K91L10k82k78K53K12j91k99K15L16j84k11Q0K08J54l18
3618d6j02K84J58l55j60K47K87l54k51K04K21j44k43J35L98n0l03j36N92k9n24
3639a71o9K41L16k59k61J56M92k96n46K25K96J39m47j7N15j33l78j2K56K48l06
3660a1l21L26K27j61l32J60K87J6m54PM85N0m37l7L78J22l94j11K61K18k63l52
3682c36K59M53j98m27k9N22Pm30M9L14n0l10n5L65J03k87k74J92M31l05l04K71
3704c9M03j58m66O5L25N7l66P3K44J96m11q7J46K89k34l57K49M27k13l82l5O41
3726C67k67l38K0L46J83l70k21K37L48l09l67K63K52q2l43K10L67k83k70J32L49
3747B24N1m20mK91R0l53j49K56K23j96l37J44K76k8l95K81L23n3l55NL43J27m28
$$ plain form
3598 -160 180 350 -97 -322 -31 279 -3 -281 -28 184 -7 -306 -91 225 41 -170 -90 118 272 -46
3618 -46 -148 136 294 -61 -221 26 313 -41 -292 -88 133 -11 -254 -119 279 229 -74 -210 382 353 -171
3639 -171 -240 1 317 58 -203 -47 445 149 -397 -172 124 263 -184 -201 314 181 -197 -209 47 295 -11
3660 -11 -332 -6 221 60 -272 -112 175 191 -263 -256 229 279 -158 -195 183 305 -89 -200 61 279 16 -336
3682 -336 -77 376 178 -249 -278 244 251 -179 -130 184 134 -176 -231 134 237 -50 -324 -132 299 -6 -310 -39
3704 -39 364 206 -260 -195 130 187 -179 -106 138 334 -77 -164 -18 271 37 -320 -71 356 143 -239 -274 367
3726 367 100 -238 -218 128 311 -59 -280 -43 305 -4 -371 -108 144 62 -281 -71 296 13 -257 -125 224
3747 224 275 -145 -149 142 232 -121 -270 -14 209 13 -324 -180 96 68 -327 -46 277 224 -131 -126 217 344 -84
3770h4k20L42L53m78k54L71J17j81k29J72J71q7p4j10K89Q4j53j22J96K79m74
3791i2j80K88K09l67o9J80K98j42k77K9K32L9k36j25M13l0l37n2M10J3l05p0K60
3814H9J07j49k19J06K48M5l05q9K94P9l99k8M83k45m4l2K22rq2j60J41L24j55
3837B22m35J42L16mm47J56K99ll04j69J82N7L1j61Q1K40j75k51J35L13k03m2N4
3860C4J79j60j16p6J07J49j58n3R4J12r7o4R9J76j49p5n1K73k00o9K5J42n2j85
3884a15mJ34P6j61r7L8K44q0n9K4J72j47m6R6P3j99Q0j04J03J02k74j1J96K2j04
3909d1j05J88J36j20j14J49j08j7jn8P5r4P8k3J52M1j24kR1Mk05R7R2j49J75J5
3935A32k33r7J92j89P9J01o0j12K02J05r9j9M2O2q0K6p5L1p8J24j84KJ58O9l01
$$ plain form
3770 -84 -304 38 391 -87 -341 30 147 -34 -263 -91 80 -7 -81 -191 98 182 29 -93 103 382 -92
3791 -92 -272 16 225 -142 -211 -31 267 125 -152 -123 109 148 -88 -213 200 170 -167 -219 191 204 -101 -171 89
3814 89 196 47 -172 -66 182 227 -78 -167 127 206 -193 -221 262 17 -27 -59 163 154 72 -88 53 377 222
3837 222 -213 -71 245 241 -206 -50 249 246 -58 -227 -45 12 43 -118 -37 203 28 -223 -88 225 22 -20 34
3860 34 213 53 -63 -139 -32 117 -41 -94 0 112 15 -49 50 226 77 2 -49 224 24 -45 -20 122 70 -115
3884 -115 -119 15 91 -70 -167 -129 115 35 -24 0 172 25 -21 75 148 -51 29 -75 28 130 -144 -155 41 63 -41
3909 -41 -146 42 178 58 -56 93 -15 -32 -33 -91 -16 -110 -32 -55 97 138 14 12 103 107 -98 -1 91 -58 117 132
3935 132 -101 -198 -6 -195 -116 -15 -75 -187 15 120 21 2 44 106 26 52 -23 8 -70 54 -130 -128 30 99 -202
3960b02J56J20j58J12m6K88k46L2N0j30J10Qj64m3R0o7N0Mj4q0J22Q4q8n3J22
3985E7pKn6J21n5q2J07j19Jl5r2K4J27J70l68J63J91M3j80l4J18j3m7j46q9K49
4011E0J7p0p7J00J25l69Q7L03j66k5J16L0qj18j48J04R9p5o8r8K34M9j99J66Q7
4036A46o2r8N7J26p5m1j91J58Q9p5k62J70J67r5j89O6K59j56j48K3J86J09k14
4059e0J04N6j01j9j96J61J55k24j49L12J90l58n3J23J82M3j71p1J43J28j06j59
4081f0R5J90l43j76K54K79k03m05K05L70k38r1n9K10J53k92j28L45R3j38k37K55
4103G9J87n00L5K20Q1j03k00j7M84j62m16P2M16J20m29p1K06J78l49k45N41R6
4125B23l30j25J65L23j45l62J39L33j9m98J10L77J45n08k24M79J11j83k30J8L69
$$ plain form
3960 -202 -46 74 -84 28 -18 270 24 56 106 -24 86 94 -70 -113 -23 -90 -40 -36 -50 -130 -8 76 -12 -65 57
3985 57 50 52 -4 117 62 -20 87 -32 -31 -66 -158 -134 -7 163 -205 -42 149 192 12 -22 96 83 36 -110 -199 50
4011 50 67 -3 -80 20 145 -224 -137 166 0 -25 91 121 113 -5 -153 -49 50 -25 -93 -191 43 92 -107 59 146
4036 146 84 -14 43 169 94 53 -138 20 109 34 -228 -58 109 14 -175 -109 150 -6 -154 -131 55 164 -50
4059 -50 54 110 9 -10 -206 -45 110 -114 -263 49 239 -119 -172 -49 133 176 5 -66 77 205 99 -60
4081 -60 35 225 -118 -294 -40 239 36 -369 -164 206 -32 -123 -182 28 181 -111 -239 106 199 61 -176 79
4103 79 266 -234 -199 21 102 -1 -201 -218 266 104 -312 -240 176 296 -133 -204 2 180 -169 -414 127 223
4125 223 -107 -232 -67 256 111 -251 -112 221 202 -296 -186 191 336 -172 -396 83 194 11 -219 -201 168
4146A68K4m08J36L20J2n08o2N33K3m49p4M30l8k27k45J91N01j42m18M7M65n9n33
4169c13L91J79rn49P7M24Q2m01j74K01L76l13j89J98L22n1m81K32L02q0l64j49
4191b89M38j1l30m5K55L00l42l33L22M36l47l79K33N07k92k91J8L46j17k35j11
4212b67L61K6l72q7K46M97l63l99L45L09k08m24L51L34j16m42o9L44K33m14p0
4233a85J84O9j55l27M59L47m05k50K85K49j77l53M6M95N9n26k37N22J05k48l85
4254d28N66J21l91k28M18J90p2m01N3M71j11l65j42N48J09m75j89N14J74m70k2
4275a30J40K77k85k91K05L89k40m80K41L78J0l79j85N21J84l59k38L75J04k27
4295A0k08J39L23k12l11J73L69j34n33J72L89J25n96m0M72J74l54k32L14L44l63
$$ plain form
4146 168 192 -216 -80 240 252 -256 -318 215 238 -211 -285 145 107 -120 -365 -174 327 185 -233 -186 279 220 -313
4169 -313 78 257 248 -301 -224 200 282 -119 -293 -92 284 -29 -218 -20 302 251 -230 2 304 224 -140 -289
4191 -289 149 138 -192 -237 18 318 -24 -357 -35 401 54 -325 -92 415 123 -168 -150 196 79 -156 -267
4212 -267 94 120 -252 -339 -93 404 41 -358 -13 296 88 -336 15 349 233 -209 -278 66 299 -115 -185
4233 -185 -1 68 -87 -414 45 392 -13 -263 22 271 94 -259 -213 282 341 -185 -422 100 205 -43 -428
4254 -428 138 259 -132 -360 58 248 176 -225 -172 299 188 -177 -319 229 338 -137 -326 188 362 -108 -130
4275 -130 10 287 2 -289 -84 305 65 -415 -174 204 214 -165 -350 171 355 -4 -242 133 237 10
4295 10 -198 -59 264 52 -259 -86 283 149 -384 -212 177 302 -294 -334 138 312 -42 -274 40 384 21
4316B1k79O5N57k61n36K47M56j15l28J4K82m1j67j53K82J95k46l15L37L22j50
4337A87l86J87L19j05m04%M40om01JJ37L12l01k83L25L08l68j73K07M10k73l25
4359a92K5K83L3l97K1K45J41k57q1J35L58l51j93L42R9j38l69J76K37p0j78q2
4381b13L43N9l49q2K11K88k01k89K77J82k59j68K02K20j84l36N6L25J04l90j31
4402c35N74L6k98q0K97J6k03j43J60P8j05j85j2L78q1k56k00M16J50l81o3L07
4424G0O7j88n5P9R2o3j35o4L91k20j84Q0L39l45po7J47J96j66j16J86J79j22k14
4448a20J96R8j99j19M8K38j54j85l5L45n1j27R5J54L5j67k75K12J87j1k73k7J86
4471E1Nk78J89L9n5M0o1Q0J70j48j03J47M6k9k10lJ81Nl03J75J02J22k09P6O5
$$ plain form
4316 21 -258 -193 364 103 -433 -186 270 155 -173 -159 123 82 -85 -238 44 239 -7 -322 15 337 187
4337 187 -199 -12 307 202 -202 -202 238 232 -169 -168 -31 281 -20 -303 22 330 -38 -211 -4 406 133 -192
4359 -192 -167 116 149 -248 -227 18 159 -98 -179 -44 314 -37 -230 112 211 73 -296 -120 117 47 -131 -213
4381 -213 130 189 -160 -242 -31 257 56 -233 44 226 -33 -201 1 221 37 -299 -243 82 186 -204 -335
4402 -335 239 275 -23 -103 194 210 7 -136 24 102 -3 -188 -200 178 97 -159 -359 57 207 -174 -237 70
4424 70 137 -51 -106 -27 65 2 -133 -197 194 -26 -210 -130 209 -136 -143 -210 -63 133 -33 -149 37 216 94 -120
4448 -120 76 174 -25 -144 -96 142 -12 -197 -232 113 62 -65 30 184 219 52 -223 -11 176 165 -108 -135 51
4471 51 56 -222 -33 6 -49 -9 -70 10 180 32 -71 76 122 93 -117 -120 61 66 -237 -62 40 162 -47 29 94
4496I4l1j0n8Q4O0q9j58J14k2j47J35p7J02j64M6J46r7J28q1j06O1P2J61j49L4
4521D8J1nj75M2K28k27j10K42n5M1j31n6K55J1r5m4L4J06j05M3%m9j50J24Q3j13
4547d7K5P3j55J00J06j3p1J9kJN4j04j05O6J11j73l3Q3Q3O2j05m0O1j8J49r7n2
4574b2K9N0j35M2J55o3j15P1O9j49j8P2K4pN0j10Q4K04j12j98M2J14J5q2p0n4
4600a14J02K4jl6m9J25Lo4Q6q4K5M0J9kj01l0J34j33N9K2j61J18j0l2R9k8J7M8
4628G6p4N4j43LJ46Q2k13j1P5q1N4K5J7J6M6q8J6J28j57j8M8J12r2o1M8q0J46
4655G4o3j10K6NJ57r6m8K03j00n5j05K04J3p6l5M6q9M2j58J11K16k43nK8J59o9
4681C2k3l3J91j15j27L6K8k8l8O3N9n1L7l45K94K84l96L5J70R7j08j62J81P7O5
$$ plain form
4496 94 63 53 -5 79 139 50 -108 6 -16 -163 -28 -105 -3 -167 -121 25 -72 56 -25 -131 -70 2 163 14 48
4521 48 59 54 -121 -79 149 -78 -188 54 -1 40 -91 -147 108 119 24 -20 14 120 15 58 58 9 -141 -17 66 -47
4547 -47 -22 51 -104 -4 102 89 18 37 35 36 90 -14 -119 -53 58 -115 -148 -65 18 80 -25 -65 -4 -22 127 30 -22
4574 -22 7 57 -78 -36 119 56 -59 12 81 -68 -86 -14 10 3 53 -57 27 231 119 -79 -37 77 92 10 -60 -114
4600 -114 -12 12 11 -25 -74 51 54 -10 76 -8 17 57 76 74 -27 -57 77 -56 3 25 -136 -18 -28 -60 39 11 28 76
4628 76 2 56 -87 -84 62 144 -69 -80 -5 -86 -32 -7 10 26 72 -16 0 128 -29 -47 1 113 21 -40 8 -72 74
4655 74 11 -99 -73 -68 89 -7 -55 148 48 -7 -112 92 105 29 -6 40 -49 -7 -165 -54 162 -81 -86 -58 101 32
4681 32 9 -24 167 52 -75 -39 -11 -39 -77 -14 45 -6 31 -314 -20 264 -132 -97 73 170 62 -100 81 158 223
4706B23k66N5m0J31j31O5m9K18j88k15L39J7k34J9R2L0J0k13R8J00j0j04L9O4
4730E0mj76O7J69J9k02j8K90n6j08j68J33m3qO5k45L21r4n3j05J59J36j08n9Q2
4755D4P2m7p7NQ5p1o7r1J64J9j23k7Q8P3r4M5O1L3j82P0J85N0j84j16J59M5p0
4782D9k46J40P9M6j64P5P2q1k6J08j82J92L4k10PK03O8j46q5J46k7r6m9J47R3
4807A47k62L4k4J05lK4k8R0K3l9j15J50j04J2J01j7k23J3J34o5Q3K4p6J29mk4
4833H5q7J28O8k92p5J48K1l0p8l6J88m1kq1J31J22j56j14J33J7k16M7K11r3p9
4858h1j4K9m9J08j28J13M0M9k25P2J43J19k88O5J19n9q6M3n7R4Oo8JJ22Q4j99
4884d7p7K14p9J5j23L7J64j55OJ13l6l9r8L7J16j1r9Q6J37k91J03K3J40j12n0
$$ plain form
4706 223 -43 12 -28 103 -28 37 -12 206 18 -197 142 159 -75 -56 36 66 76 -137 -39 61 51 -53 -14 50
4730 50 46 -130 -63 106 125 -77 -95 195 139 31 -137 -4 -47 -55 10 -235 86 -8 -61 -166 -7 129 21 -38 44
4755 44 116 69 -8 -3 82 11 -56 -147 17 36 -87 -114 -26 47 -47 -2 59 92 -90 -20 165 215 31 -85 74 119 49
4782 49 -197 -57 22 68 -96 -21 51 -30 -56 52 -130 62 96 -114 -107 96 164 18 -67 79 52 -44 -93 54 147
4807 147 -115 -81 -105 0 -3 21 -7 83 106 67 -48 102 -2 10 111 94 -129 -116 18 -47 36 60 -16 113 109 85
4833 85 -2 126 194 -98 -173 -25 -4 -34 -112 -148 40 -1 -3 -84 47 169 13 -101 32 49 -167 -120 91 -2 -81
4858 -81 -95 -66 -115 -7 -135 -22 18 67 -158 -86 57 176 -112 -47 72 13 -73 -30 -87 7 13 -55 -54 68 152 -47
4884 -47 -124 90 11 26 -97 -60 104 -51 -45 68 32 -7 -105 -68 48 37 -62 24 161 -130 -27 -4 136 24 -26
4909b6j22J88Q1j39j39J03K04j42j59P5K03j41P5k1Q0M4j46N8q3J05j18p3N6K29
4933A92k08j31K22Q7p4j62J11L8n3p8K2M9q7L9K9R6J5r6j42K62R3l24l3J39J59
4958A65r8j24M9n3J42j50J2J08k7j26r1K48n0l0q3K23j2j13q9K51j46K13k42q7
4982a10J78j02N8j28J88j05r1k0K17Q9j78o1J40J34k94Q9J5J1n4j28L8Q7J64l15
5006a78J07N5k0j8k0j7J22p1Q1k9R5m5j32k3K10m4l29K63j9k3J35q1j2J17p2o9
5032a7m1J34m0j48Q7J26r4j81J63k8Q3m2q2R8N0j2k86K18N0j29Q2K9J63j30j37
5057h4J53j4l1p0L2M9rj1k7o7J57p2o1l6R6l8L5J35p5k5J36k1j88j3P9r3Q9N2
5085G8j91J17p3N0l1J27o2Qpk5j9o3J37K9p5j15K07j8j26J13k5p3L6Lo7J00p1
$$ plain form
4909 -26 -148 40 121 -18 -157 -54 150 8 -151 -76 127 -14 61 40 120 164 18 76 -7 98 -20 -93 -37 192
4933 192 -16 -147 75 162 88 -74 37 75 22 -56 -34 15 -72 -33 -4 92 107 11 -131 131 224 -100 -133 6 165
4958 165 67 -57 -8 -61 81 -69 -57 51 24 -102 -193 55 5 -25 -108 115 103 -10 -99 152 6 219 -23 -110
4982 -110 68 -34 24 -104 84 -21 -112 -132 85 174 -4 -65 75 209 -85 4 19 30 -24 -152 -114 -27 137 -178
5006 -178 -71 -16 -36 -54 -74 -91 31 -40 41 12 107 62 -70 -93 117 73 -256 7 -12 -35 100 19 7 124 52 -17
5032 -17 -58 76 36 -112 -25 101 7 -174 -11 -39 44 2 -80 18 68 56 -230 -12 38 -91 -9 20 183 53 -84
5057 -84 69 55 24 -46 -14 35 26 15 -12 -79 78 6 -55 -91 5 -33 2 137 62 37 173 152 -36 -49 30 -63 26 78
5085 78 -113 4 -69 -19 -50 77 15 23 16 -9 -28 -91 46 75 0 -115 92 74 -52 61 36 -37 -1 2 -65 35 -36
5112c6k1M8J9K2Pr7K1O8j0k4L7j6lO8o1K9q2JJ31j40K1l3j7j6J14MO4k13O1q9
5142a43R0j8J59p3l8M2n9P7M4j36nO8m4J23j44R9J19j08j26J88o1n9J7m3k1j2
5168f4N0O9j65J23O1j95Q7k9J71j33M9M2r4K1J03j9j07J33k21K25j75k9Q4j5R8
5193G0j02J9k8M1L4oLK2j25J77j06L3n7n7K2J09l0P6j83J29P7j86K21r9j48J16
5219B2J87j28q7o0JR5j4O7j53P5K2O1j6j30J25k4J00j26l7J00p2j00P1J11J2k07
5245a05J67j2m9Nr3K56o7j53L6P1j9N2j18n6Q0J9m3o4O6Pl5J26P3r4l5K4p0J41
5273A10r8L0r5J74j17j47O8L1N3j9K9M9j3l9k2%J0QJ8K3P2j24j29J30J83k43N
5300e3J41r0N2j45O7K27q6k70P6J05j3m6j11J64KL2q5J21j4q1m3RM2J65r4j43
$$ plain form
5112 -36 -57 -9 10 32 39 -58 -37 31 21 -3 34 18 15 83 22 51 -31 -30 101 -39 -18 -51 -68 -84 30 34 98 -115 -54 -143
5142 -143 -53 -71 88 15 -23 19 -40 37 81 -55 -60 8 -36 87 -57 42 161 53 -73 115 54 -5 12 -31 -52 -64
5168 -64 -14 55 -110 13 74 -121 -34 -63 108 -25 24 66 -28 -7 96 77 -30 103 -118 107 -68 -97 -13 -28 70
5193 70 -32 -13 -41 0 34 28 31 53 -72 105 -1 32 -25 -82 -60 49 19 95 -88 41 118 -68 153 54 -94 22
5219 22 209 81 -6 -66 -65 30 16 83 -70 5 27 88 72 -58 67 43 143 17 -20 80 8 -92 -21 90 102 -105
5245 -105 62 50 1 6 -87 169 102 -51 -15 56 37 89 -29 -85 -5 14 -29 -93 -27 -20 -55 71 144 50 15 39 -31 110
5273 110 12 42 -53 121 4 -143 -75 -44 9 -10 19 68 55 16 -6 -6 4 12 30 53 125 1 -128 2 185 -58 -53
5300 -53 88 -2 50 -95 -28 199 113 -157 -81 24 11 -35 -146 18 20 52 -33 88 74 -7 -50 -41 1 166 72 -71
5326g1J24l4mr2J98j61nK1N2n4j5o8L3Q8o0P0l3J54k0q2n9M9K6p1P5R1j47l5P7
5355D7l2O2r5p2J27m4L9j61J54O9L9k10J27m2l8N0l3k6O2rN2j13P8J70l13J70
5381E8rq5l8j8J05kr4L9Q8j60J72j91K04L9j22j54J76N8Q1j74P1Kol7o7N9m8o0
5409a13%R4mN1r5K22j11p0j4j15J76K4r8q5K59jk19J58j02N5l0j01Q7O5Op1K5
5436gN6O8j68k1K04j15j57J28R4j0r7K8Q2J26j98j41L6J27OJ9q8O3Kr9q2J51q8
5463h1J39p2m7O2r0N2L6K2m1n3q4L36j89k2j81J65R1j43J12J1m7m7P6N1j22M9
5489a7jj2J14l4j58Q2L8M9j69m1J34J4m4r8P9R1p2N0Q4J11k42o0J48o5L6Ll7p7
5517i4K9Mo4J17J7l0j8M7j5k0p4Q7J4l8J18k9p4P4k03P0J05J23j15n9M9rl6J8
$$ plain form
5326 -71 53 19 15 -77 121 -40 -45 -24 28 -26 -41 -109 -76 12 -48 22 -11 143 123 41 -18 31 57 -14 61 152 5 -30 47
5355 47 15 77 -18 -90 37 -7 32 -129 25 94 133 -77 50 8 -30 20 -13 -39 23 14 66 -47 31 201 -112 58
5381 58 49 -36 -74 -92 13 11 -83 -44 44 -116 56 -135 69 108 -14 -168 8 66 147 -27 44 46 40 3 -64 -5 -53 -113
5409 -113 -113 -19 -23 28 -67 155 44 -26 -40 -155 21 45 -53 -138 121 120 -99 59 -43 12 -18 -119 -32 33 39 -32 -7
5436 -7 49 117 -51 -72 132 17 -140 -12 82 72 -25 3 85 211 13 -128 -92 35 41 60 -28 35 37 -62 -144 7 -81
5463 -81 58 -14 -61 1 -89 -37 -1 21 -20 -73 -157 179 -10 -32 -213 -48 43 -100 12 23 -24 -71 5 56 -66 -17
5489 -17 -18 -30 84 50 -108 -26 12 61 -108 -149 -15 -1 -45 -143 -64 27 -45 5 89 200 -42 -102 46 -19 17 20 -17 -94
5517 -94 -65 -61 -125 -8 9 -21 -39 8 -7 -27 -101 -14 0 -38 80 51 -23 51 -152 -82 23 146 31 -28 21 12 -24 -6
5545fN0R3Mj85L2N2l5j19P3M9N3j07M8P7j01p2L6Q9R2j22p0Q1r2R7r4j8J12lj58
5574a44R2J38l8p8J8O0J5j00K0O9o0q0J49J4L7n6o7j13J04l1P3J2o3p2rP1J13
5601G4O0k40O9j44J80L6K7j26N2K7q2M1J5J40k18K8R3j16j0M5K38k66lmP1L8n
5628B0k7rPO1j69Q8ORq1J24j8M8r1J22J4q0k8j35M9J04M4l1j0P8N3k14J72j93
5656h7l6J10j27J45j61J27J08j75Q2l2P4k3l7J3J7q0M2R5O0m8om5M1k7M3m6J03
5683A30k32LJ46q5O7r8j4k0P4KnJ15n1J9n0N9k09L4J95J2j02p5J24j26JJ11j6
5710IR3k2l0j64Q6m5J56j97L9N7O3j6J0l8r1J85o8Q5j35nr4K07O7j16k8j6m9l7
5738i4J91j93J90p4n3N7m7J47o7m8k1k0O6j42J19L8K0j43R4q1J09o7NO8r9J21
$$ plain form
5545 -6 44 137 141 -44 -12 40 5 -114 -41 8 61 -46 2 79 -22 -94 -58 31 123 1 -69 12 -80 17 -77 -95 17 14 -144
5574 -144 -52 86 48 -30 -12 48 63 -37 -17 52 -8 -88 61 75 112 56 -11 -124 -20 -51 22 34 -29 -101 -110 -39 74
5601 74 134 -106 -37 -181 -1 35 62 -64 -12 15 -67 -26 -11 129 -89 -61 32 -84 -94 -49 189 -77 -80 -84 -13 25 20
5628 20 -7 -16 -9 52 -117 -29 -23 -14 -95 29 11 59 -32 90 104 24 -4 -139 -90 14 58 27 17 95 148 -66 106 -87
5656 -87 -123 -13 -140 5 -156 -29 79 -96 -14 -46 28 5 -32 -19 -2 -82 -40 55 115 67 61 16 57 30 73 27 130
5683 130 -102 -99 47 -38 29 -69 -83 -103 -29 -27 -32 83 32 51 1 60 -149 -115 80 92 -10 -85 39 -87 -86 25 9
5710 9 102 80 50 -114 -28 -73 83 -114 -75 -18 45 29 39 1 -90 95 27 112 -23 -28 -122 85 152 36 8 -8 -57 -94
5738 -94 97 -96 94 20 -33 24 -23 124 57 9 -12 -32 34 -108 11 49 69 -74 20 -61 48 -19 -14 54 -45 76
5764G6l6J3j8J2Lp4Q1O9j96J17j84P0P1l6O7o7Q6r5q0K24r2K9kr5R2p6N2j9l4
5793d2k3Q0M6k0j16P0l1P0R4q4j0O8Q2j81J0Rn9J53j31J1rM5j8k2J8K1q8J5N6
5822A4K5O5j41JQ3p3J1nN4l0o2O7L1r4o3P8J11M3o5j04M0K2M4n5L4j3n9k29K22
5851d8L8K6n3o1J87j13J15q2r5J49k3p1o2J27n9P0p5P0qr1R2m8O1rmj2J58l4k48
5880a03L9J84k17K52k09J26j13M8k7Q1O4j99o3R3Q0J32j50r3N1J01n7N3m0M7K5
5905A05j33O6K7o8p5Q0n9k4J54J4j71N7k5Q1p9J64j43J7K32k54Q0m6NR8j56J12
5931E9j37R8j02M0O9L3j62J58l2O6j50N0Ql5P3q1J04j79J12J72j47N7j7k7r8M0
5957b8l0J13j43R8N0r9r7O4J39L5j68Q9J8r4J32k8q8Q0pj05P5M0mm3r2J90J7j27
$$ plain form
5764 76 40 53 35 47 50 -24 57 126 -70 47 -137 -67 4 -32 35 -32 54 -41 -121 103 11 40 38 -57 35 -41 11 -8 -42
5793 -42 -65 15 61 41 -75 -5 -36 34 128 44 34 102 184 3 13 22 -37 116 -15 -4 -13 32 14 -8 10 31 -57 -42 14
5822 14 39 104 -37 -36 47 -26 -15 -20 34 4 -58 9 40 -54 -117 -39 72 115 50 -54 -14 8 52 -3 31 18 -41 -270 -48
5851 -48 -10 16 -37 -98 89 -24 91 9 -86 63 40 -31 -93 34 -25 45 -30 40 32 -59 33 -15 46 37 33 21 179 145 -103
5880 -103 -64 120 -97 155 -54 72 -41 7 -20 61 125 -74 -137 -44 36 168 18 -75 -24 77 20 73 33 80 105
5905 105 -28 38 65 -3 -78 2 -57 -81 73 87 -84 -27 -52 29 -50 114 -29 -12 220 -34 46 0 5 103 -53 59
5931 59 -78 20 -82 -42 27 60 -102 56 24 90 -60 -10 -2 -37 36 -45 59 -120 -8 164 17 74 57 30 -68 -28
5957 -28 -58 55 -88 10 60 -39 -136 -72 67 102 -66 23 41 -53 79 51 -37 43 36 -69 6 46 42 -1 -93 97 114 -13
5985a3J1M4N6p3j80O4L5R0k5l4J02m7Jk5N4k9p1mR0r3J06o6J19N8p9k48J28K3
6013fj01n4J02k4N5J1K09k38J23k6j30K43q1K3j42L9K7M5l3j15J66j79J18l5m
6038gJ71j41j1l4M0p1P2L2L4j60K1J84m8q1M7j59J00Mr0R2O2J5k7j26R2L0k5j70
6066a54J49J05j35r7J66J07j3j29J15r9N8p4k4J56q4j10K0lJ0lRM3Q2j52j7J4
6092f0J15m7j0R4o9j9q3j03R6N7J9j7o2M3N0Ql5N8j17L5NN4J2l4nL9O1j83J58
6121F0j27J51k37K20j39J16J41k26p2J28l7k6k9J62j40M9p2R7M5m4o9P6l8p0J8
6146f3J16J0j38K9Q2p0K5N2j3N1r4o8j7R8J62j56O3j32J10k2k9J9J7OJ4r8P0R4
6174A18j56J09k03J09kQ5q6K47k28j34O3L1R3Qk2j42L12j95JJ28j19mq3J76j6
$$ plain form
5985 -13 -2 42 98 25 -155 -91 -56 34 9 -25 77 30 31 6 60 31 -40 -44 46 -47 59 -7 112 170 91 -157 -29 -6
6013 -6 -107 -161 -59 -83 -28 -17 192 -46 77 51 -79 164 83 106 -36 3 30 75 42 -73 93 -86 32 -3 -7
6038 -7 164 23 12 -22 18 -53 19 51 85 -75 -54 130 82 1 48 -111 -11 -7 -97 -5 57 72 45 -81 11 41 16 -154
6066 -154 -5 100 -35 -132 34 141 128 -1 114 15 73 -1 -25 131 47 -63 -43 -46 -36 -39 -30 13 95 -57 -74 -60
6092 -60 55 8 -2 92 23 4 -79 -182 -86 -29 -10 -27 -89 -46 4 12 -23 35 -82 -47 -42 12 24 -10 -15 24 85 -98 60
6121 60 -67 84 -153 67 -72 44 185 -41 -113 15 -22 -48 -77 85 -55 -6 -78 19 64 20 -49 27 -11 -81 -63
6146 -63 53 63 -75 -46 36 -34 -9 43 30 81 -13 -81 -98 0 162 6 69 -63 47 25 -4 15 32 38 52 -46 24 118
6174 118 -38 71 -132 -23 -25 60 -26 221 -7 -141 -78 -47 46 54 32 -110 202 7 8 136 17 13 -70 106 90
6199I0p0j3j0n5O4j3J11q9q1Q4j34J69K9j00L6K6k4j2Rl6k8J34k17K05o5lK0l6
6227ik6QO7o2J3n7Q7p7O9r8qK13j19J9pj00L0J01nl8M3q8o1K53j93k2J09N6j48
6256e0m0mJ63l4j0N3M8k12NR9M7jj56K18j31j18J39j03P1M0k0J38j92Nl4J09j23
6283i3K8P1M7oj20O7j8O0mP9k50J03j02J25N4p2K6p0J88q4n5L6j9o7K7K1oL1J44
6312A41j35K5J78p8l9q0PN0j4k61J31Q1m8K24j07j07k6l5R5Lm2n9J82j27J17j9
6338E7j54J15N5N7j86J07m4rM2j37P8J69j12k2l6Q6l5o2Q6j03J07J9j68mkJ09
6364A3P6l3n3M6k08K57Po5n2pQ5r5n3Q3j1l9N8L6o3q1J49m2R9j09MJ8K4qJ27j02
6394F1K3P1j42K1r7J38o8N7p6N7r2Q8MJ7l0j15Q8J5p2k1J04k7L7q3j9J37r3j9
$$ plain form
6199 90 20 7 -3 -58 6 -7 104 15 -66 18 -116 53 82 -18 18 44 20 8 17 -19 -47 87 -130 75 10 7 27 -9
6227 -9 -35 -27 40 -22 -9 -66 21 -56 13 -85 -93 120 1 20 13 -87 -57 44 39 1 44 -44 -105 148 -45 -67 42 98 -50
6256 -50 -90 -94 69 35 25 78 126 -86 -81 18 65 64 -92 126 -5 -123 16 -87 -16 24 4 142 -50 -45 -79 30 -93
6283 -93 -65 6 53 47 -73 -6 -24 36 32 111 -139 -36 -138 -13 41 -31 -5 -75 113 29 -26 10 -9 -76 -49 -28 -34 -3 141
6312 141 6 31 209 131 92 12 19 69 55 -206 -75 6 -42 182 75 -32 -58 -93 2 5 -37 -96 86 -41 76 57
6338 57 -97 18 73 130 -56 51 7 -2 40 -97 -19 150 38 16 -20 66 31 -31 55 -48 59 78 -90 -94 -96 13
6364 13 89 56 3 49 -159 98 105 40 -12 -19 66 -29 -82 1 -10 -49 9 45 -18 -99 50 8 107 -2 2 20 44 36 163 61
6394 61 84 155 13 34 -63 75 7 64 -12 45 -47 41 45 62 32 -83 5 20 -52 -73 31 4 41 -42 -61 76 -17 -36
6422c6J24j16l3RQ1M7n5j18J02k3J22l4o1O3m1K7o3M4L7p6m1JR7j15l8J9J10l0
6450Cl0j01J04k3P2p1MJ34j78R5K9J6J0j10J36j49Q9Mj46K41k13J07Oj47L7O5
6476a6M1Lk7rP4J9o6p6J20k1J4K0K0j83NJ83j60O5N0j09J21n6j8L7j10Q2M2Rl9
6505A5N0j23J3QN0L8j23Q3q6P1k8j8R6j58Q9N8l2N6N1p4k8K7j63J34N5n7p2J76
6533A08j21L7o8J23r5o7N1L7K5M5j19l3M3k5P2n7q2J13Kj7N7j3m7N2Q4m1p7l8
6561e1Q2ln9J01j04J14o2q7N8P8j24n4Q2mn9P4Q7q6P1j53L4q9J43k7lR6n8p2N1
6590b4o4k4J42k9O2Mo4MJ4Q9o0Nn1pM5Mp1P3Kr5Q1o7k7J38p4O1j15N7q7JQ1NP1
6623H0j20K4l8j33J42J14r5k0j2J40q9p3R4L6k1Q5j45nJ13rj93M2O5R0m6r6P7
$$ plain form
6422 -36 88 -28 -61 -52 29 76 21 -97 5 -18 104 70 9 72 31 58 -5 39 76 0 -41 -40 57 -58 -96 -77 33 3
6450 3 -27 -128 -24 -47 25 -46 -42 92 -86 9 38 54 64 -46 90 -59 30 34 -112 129 -84 23 29 -118 -81 -16
6476 -16 25 28 1 -8 66 85 19 -57 63 42 56 76 96 -87 -82 101 -59 6 56 -53 68 12 -6 31 -79 3 45 54 15
6505 15 65 -58 -45 -37 13 51 -72 11 -75 -4 -32 -50 46 -112 -23 35 3 59 110 36 8 35 -128 6 61 4 -68 108
6533 108 -13 24 -44 79 -16 -83 -32 5 30 75 -44 -77 -34 -59 13 -44 -126 -13 -11 -28 29 16 -31 21 105 64 -13 -51
6561 -51 31 28 -31 70 -34 80 18 -69 -11 67 -57 -111 -29 -33 -92 -18 69 -17 54 -99 -65 -154 -11 -38 -41 55 -3 -75 -24
6590 -24 -88 -112 30 1 63 67 3 7 21 110 50 55 4 -3 42 46 -25 48 50 -45 36 -31 -58 80 6 67 -48 9 -78 -77 4 9 80
6623 80 -40 -16 -54 -187 -45 69 -26 -46 -58 82 -7 -80 14 50 29 114 -31 -36 77 68 -125 -83 -18 72 26 -70 7
6650GrJ08j71J68j12m6m4J22KlP9j81P3K4p8J41n7l7P3j67R4K0L4o6Q2J0j82P3
6678d3O6N2q7j9R2J5J2j31N1J9j61J78j0p1J09q5r4R6M8r8J27l2Qn4L1K5L6o1
6706A9q5j3P1rO6j27oJ30l2j1l9P7l8L4p4J39o7r1rQ8p8J28j17R0J9j38PJ54j69
6735h1R2p6J29o8m4P3K0o1J30j36j32K77k1r2k3J8p9M8L0rN3k3j39J8K2J31r6
6762c9j0J07k9k3L8j68K94j41k4j2j3L5k8l2O6M5j30L7K2L5mj19J94j12J8q0J56
6789H3o8R1k54O8J63j09m5P7M8j03N4l7L8J44k54J24Oj25Q2m7N8K4k7j0n4J73
6815A00q2n8J19j21j35K51n2J19o0R4j10q1jm6jk8J20J05j25j57J51N4j05K1k1
6840d9l5J19p1J20n7m0j43J44Q2k4j8m5rL4KQPn2n6J82j44J12m7l1Q0o0J0r9J57
$$ plain form
6650 7 -2 106 -65 103 -9 -55 -99 23 25 22 101 -80 -7 17 -61 80 23 -14 59 -108 -14 6 40 -26 56 66 -116 -43
6678 -43 23 75 -12 -31 61 76 88 -43 8 27 -134 44 34 -37 72 -13 -107 -11 37 -61 66 34 42 -12 19 44 80 19
6706 19 -66 -79 -8 -17 49 -78 -84 46 14 3 -36 41 3 37 -37 102 35 -56 -65 23 -55 73 -44 46 65 -73 -66 88 -81
6735 -81 11 -65 64 -4 -48 25 45 -16 114 -22 -154 123 102 10 -13 5 -74 -26 4 -5 48 25 -114 -96 -74 57 -39
6762 -39 -49 58 29 6 44 -124 170 29 5 -7 -20 15 -13 -45 21 66 -64 -27 -5 30 26 -93 101 -11 7 -73 83
6789 83 15 106 -148 -80 83 -26 -71 6 54 -49 5 -32 6 150 -104 20 26 -99 -17 -64 -6 18 -9 -19 -73 100
6815 100 18 -40 79 -42 -177 74 22 141 81 175 65 -16 -17 -63 -64 -92 28 133 8 -149 2 56 -49 -28 -49
6840 -49 -84 35 -36 84 27 -13 -156 -12 70 46 28 -17 -26 8 10 18 25 -27 -83 99 -45 67 20 -11 69 9 19 -80 77
6869G7p7j07J28j9O1j23R5m2qR6q3q5J7N6Q4%k7q2m8J32j47Q2JO1m6K3Kq1O5j4
6899il1J6M5k9n2J54j37K2M1m8J9j31R8l0jn9K8MrR7j26J40o5kR8o6N9N3r5P3
6929E7L2j5L9j11QML7k3j97K87k61J35R3k1j83J21O8r7p9K37k13lJ80j54m2J5
6955h6Q7j02J20n0J00j10J45l8p3j8k4J4k3J12j3k7j13J10r4j3O3R4j29M1J61
6980A34j36k4J9Rmq9L8K2J36r6l5j7O6k7O1n9Pq3K11j0j23j00J44rL3m6qJk2L2
7010B5R1j01j8n8K6lN7o5m7K66j77JOM8M7p8p5L9kN2l1r2J03q3N5L5o6J1l2P9
7040A3K6r8J1J11p1K0j1K9K5n3j11K4K2p1J40K9oj0O1n1J26k15J32p8K2R8j80
7067f6K4n9J40Rq5N4Kk6K0Q3n3m6m7P3K7K8r2p3k9J14R6j10R3p5p9Q5M2l1Q0L8
$$ plain form
6869 77 0 -107 21 2 63 -60 35 -7 -15 81 -2 -87 -70 -14 70 70 43 -39 -87 45 -102 -20 -19 42 -4 19 21 -60 5 -9
6899 -9 -40 -24 21 -8 -60 94 -43 -21 20 -28 -9 -140 -42 -72 -73 -132 -104 -100 -109 -12 -138 2 -63 -65 33 -33 26 79 -16 57
6929 57 89 74 113 2 10 14 51 28 -169 118 -143 -8 85 64 -119 2 70 -27 -106 131 -82 -85 95 -59 -101 -86
6955 -86 1 -101 19 -31 69 -41 104 66 -7 -25 -49 -35 -58 54 41 14 -99 11 -83 -96 -33 61 -68 -27 134
6980 134 -2 -26 -7 2 -2 -91 -53 -31 105 9 -26 -43 23 -4 57 -2 5 -78 133 123 0 -100 44 35 68 22 14 15 -7 25
7010 25 116 15 -3 -61 -35 -38 19 -46 -93 173 -4 -3 3 51 98 20 -55 -16 -18 34 3 -89 14 -69 -14 21 -45 -34 -66 13
7040 13 39 -59 -48 63 -8 12 1 30 55 2 -109 -85 -63 -134 6 35 29 19 80 29 155 -60 72 -6 16 114 -66
7067 -66 -42 -101 39 48 -37 17 19 -7 13 96 43 -3 -50 23 50 78 -14 -87 -116 -2 94 -16 77 2 -77 8 50 19 99 137
7097A37j35Op7K9n4N0jnpO4K6p5N4p6J44J03m2j2q4n5J8l2LR7q5r7J96O4k18q4
7127a48K12o9o7P2J5m4J24o7j69R8n9N4M6Rp2N6n8R6kj9N5r9Q1k1O1M2k09J39
7155E7r5p4J53%Pl1r0J61j33L4J03p8N4j31J61Ln0o4P0N1k20K9o3J33L4K2p0j3
7183d0P6j11J56q2M7N1j07j64K12O7r8L4RL9%q1j06R0QmN5K2m2q9J09m2M7o7n
7212a6M8J56j82Jn1J29m6p4o6K62j36r3Q1J86j57o0lM8J02k56N2JP1po2M3J81
7239A52j13j13L9R8j25L4M4N1j29N0Rn6k1J31j08O5Q5j13J7k3J47j01l7J39j58
7264c6mOL2Kk2k%L8j48J89q0J22l6k82J68O0N6l8L3j38J14N3k9k16K07o3j32J79
7292C3j7J44j26m7mJ07q3r5N5J34k6m9k10K25O0j39J14L2n6K7p2nk2r4R6L4q3
$$ plain form
7097 137 2 8 -69 -40 -94 -44 -45 -50 -57 7 33 -42 12 -64 80 183 141 129 45 -10 8 -24 -21 76 -9 -106 90 154 -64 -148
7127 -148 64 -5 -72 0 15 -29 95 28 -141 -43 -102 -48 -2 7 -65 -9 -67 29 27 8 63 -36 45 24 85 127 -82 57
7155 57 -38 -112 41 41 48 17 -73 88 -45 -11 92 14 68 -63 98 101 51 -13 57 108 -112 -83 -146 -13 21 43 -27 -40
7183 -40 36 -75 81 -1 46 97 -10 -174 38 105 7 41 50 89 89 8 -98 -8 0 -4 51 73 31 -58 51 9 56 -11 -16
7212 -16 32 188 6 7 -44 85 39 -35 -101 161 25 -68 13 199 42 -18 -21 27 129 -127 -75 -74 -3 -10 -72 -29 152
7239 152 39 -74 -35 63 -62 -28 16 67 -62 -12 -3 -59 -80 51 -57 8 93 -20 -3 -26 121 20 -17 122 -36
7264 -36 -40 -34 -2 0 -22 -24 -24 14 -134 55 -25 97 61 -221 -53 7 63 25 58 -80 34 87 58 -158 49 -14 -146 33
7292 33 16 160 34 -13 -17 90 7 -88 -33 101 75 26 -184 41 101 -38 76 108 52 79 7 2 -20 -114 -18 16 -67
7319f7Q6r4pJ02O9k01J18J12n6o2j43K24j03oLK5J03o2j62K68J6k12J5PM0L1r2
7346d8J03R3j40R5p0M0o7J10j43nJ7n2M5r0J87j53K6Q4P3j15j5K9Q7p8N9pL9j77
7374g3J60l9j09k8R0n5J58l3r9J7rK8J07j75P8P5r2Q2np6k4J5j03K31p0j41p7
7401a67J17J82j28n8j4R0j0l7Lj2J63j08k8Q4j30n0O0L5j29J36j4qn6J06r7P2
7427BJ67j47l07K51rjQ3j10J20Pn2K2j53J45J0q1J52n9k8j88K66o9M2j08J07k6
7453C6k3R3j09k9J19Kn0q1N2Kq3J27O5j05j14L6J23j33m8K0o0J60mj21J23k8N9
7480B9L2m1O2p2j99K27o9O8j55P5N0P2p0j07J09N9k9Jl0n2Q1J11k22P2P0o1j44
7507a33O3J27j4p1pR0j11O8J50kk31J41q3M7P2j68Q4J6r1J09o6Pj7K4j7N6o2J33
$$ plain form
7319 -67 19 -75 -82 20 89 -112 6 118 62 0 -143 81 -22 -28 -25 0 103 41 -121 147 163 -49 -34 -27 13 44 -48
7346 -48 55 148 8 103 33 73 6 116 -27 -32 -15 -67 -22 -112 75 -78 -52 32 105 -10 -25 4 91 13 72 65 104 -73
7374 -73 87 48 -61 -89 1 -54 104 71 -28 -11 -20 8 115 -60 18 93 1 83 78 2 -22 -7 -110 121 51 -90 -167
7401 -167 -50 132 4 -54 -68 22 12 -25 -22 -34 129 21 -7 77 -53 -103 -43 -8 -137 -1 -15 -23 -79 27 -70 2
7427 2 169 22 -285 -34 -43 -44 39 -71 49 56 4 26 -127 18 28 -53 99 40 12 -176 90 21 63 -45 62 36
7453 36 13 106 -3 -32 87 89 39 -42 10 12 -71 56 121 16 -98 -62 61 -72 -120 -100 -160 0 -4 -125 -2 -30 29
7480 29 61 20 82 10 -189 38 -31 37 -118 -43 7 79 9 -98 11 70 41 42 12 -40 41 152 -70 2 72 11 -133
7507 -133 -70 57 43 -28 -35 55 -56 12 162 160 -71 70 -13 34 106 -62 22 38 -53 56 -10 -3 -20 4 -13 43 -19 114
7535A14J0j93j2M4J47j87N3l7qNO2l2N5LP2l3k5j75J34j7OQ8j4J5o9q3j2Q3p0
7564g6K8M5k5J0K0Q4o1o0J37o7p5P3l9O4k5j78k0J02J62j69rP6ML2K7o5J6j84
7592a73J18lQ8m6Qj6o5J74k7r9J07o0q8J26rq3Q6K7qm8O2j15L8j9N1N4k23M7P2
7621b4kk8J68M3k57J90o9J4K1J21j71o4P3j61R9K16k14q3R0J30j01j31mJK27r3
7647iJ01j25n3J67j00j4pM8lj97K18n1n6k0MP7J08j09J28N1p3r1l4J33j91l9M1
7674i6J42j29M3O1J4Lq0m2J05J51o2j88J23J5q2j00J18L0rj25K11j85J54j6j42
7699h6Q4R3q4n2K6M0M1j50oJ45J2j95J57j7N6o3l6JJ67j27o2J43j9j56L7RJ90
7726A48j63r2R7L7N5j20L1nO5Mj97J57J57j97k5N8Kj03oK00j23J31k68J28O4J5
$$ plain form
7535 114 124 -69 -81 -37 110 -77 -24 -61 -69 -64 -2 -34 21 24 96 63 38 -137 -3 -20 -14 74 60 75 6 -77 -89 -6 -76
7564 -76 -48 -3 -28 -18 2 86 25 -35 102 35 -40 33 -6 58 33 -145 -165 -63 99 -70 -79 -3 1 33 60 -5 11 -173
7592 -173 -55 -58 30 -16 -8 -24 -89 85 58 -41 66 6 -82 44 35 -48 38 65 57 9 71 -44 -6 -25 26 80 -143 -96 -24
7621 -24 -26 -54 114 157 -100 90 21 35 56 177 6 -58 15 -146 -47 169 -45 -128 -38 92 -9 -140 -144 -143 84 -9
7647 -9 92 -33 -86 81 -19 -33 -40 8 5 -192 26 -25 -81 -101 -97 -20 88 -21 107 158 85 -6 -40 93 -98 -137 -96
7674 -96 46 -83 -40 21 35 38 -42 -84 21 172 110 -78 45 60 -22 -122 -4 26 17 -108 103 -82 72 56 -86
7699 -86 -2 91 7 -45 -19 21 62 -88 -94 51 63 -132 25 8 64 1 -35 -34 133 6 -56 87 68 -88 -51 -42 148
7726 148 -15 -107 -10 27 82 -38 -7 -12 53 57 -140 17 174 -23 -48 10 12 -91 -97 103 -20 111 -157 -29 35 50
7752E0p2r4K73r5n4k9O3j2mq6l2J85k17KJ01P7J5j87J8J23K21l08M5M3J56j07
7778G5j83L9J44j01m9J00J0k1k27J05J98n0P6k42J26M0k0o5O8O2m2j99J84l2O
7803Bj22N2J29K4j72J42k1n5J58j71J09N0j35j76K44P5k20j33R5J65J3j35J42
7826F0L9j36QJ17j07P7o2j67J03K05j04k36J71J10j05K6q3O7N5j4j05J64jk0j04
7851d2l2M9k9m3P5Kj09M6Q9N4K4m0j34Q6P2r4K0J30M1o0l26J62J90j12k01J22
7877f0J09m0n8J5OJ65o9j76J42M5p4n1P8j25R9p9l9N2J6N8p1J19l4k37J42J03
7903C6J24k41K6K23j75J6k34K39P6j82J2lK7Q5j27O0J29J3j34L3K9M4j22Q8j4
7928B8J64k41J11j76J62n4q7J82m4j07M0qJ42n3j53J32q2R1j3k2l9l6L6p6o4K25
$$ plain form
7752 50 -22 -116 157 62 8 -21 42 30 26 -60 -92 93 -124 -122 -21 56 71 -116 -98 25 246 -62 -17 26 182 75
7778 75 -108 -69 75 -26 -75 25 35 14 -213 -108 90 40 116 -126 0 40 20 -45 23 85 43 -156 28 -4 2
7803 2 -120 -68 61 85 -87 55 34 -21 137 -34 75 125 -10 -186 58 133 -87 -220 -125 40 53 -82 60
7826 60 99 -37 -29 88 -19 58 -4 -171 -68 137 33 -203 -32 78 -27 -1 -84 -17 38 24 -81 83 82 62 -42
7851 -42 -74 -25 -54 -97 -22 -20 -129 -83 6 60 84 44 -90 -4 68 -26 -6 124 165 105 -221 -59 131 19 -182 -60
7877 -60 49 9 -49 -34 -28 137 68 -108 34 79 5 -46 32 -93 6 -73 -112 -60 -44 14 -57 62 28 -209 -67 36
7903 36 160 -81 -55 168 -7 9 -225 14 90 -92 -80 -83 -56 29 -98 -38 91 104 -30 3 32 76 -46 42 28
7928 28 192 -49 62 -114 48 -6 -93 89 45 -62 -22 -30 112 59 -94 38 -44 47 34 12 -27 -63 -27 -103 -167 58
7954E8r1N4j27J37J4j30P5J34j06p8o1P0N5p7l1Q8J20L7k20O0J50k34K52q2nj32
7980g0J05J28k26J96j75j64K79j51J06n1J63o3q7k1M5P8n3J6Lj07l8Q0m1Q7nj58
8006a24J14j3JlK9P0j41K27r9L1qk5j28P5L7O1j17m7Q9m9n8P3J13oj19j1jJ9N5
8035D5p9n8O3J84j22q0k5l5O9J20j63J15j7k6MK23k32r6R5j5k3kL1K00j41l4j08
8062a07j8J21N1J3j7L8j8p9j17K36j64N6m2k0J70j38Q2Ml7n5j4j2P1K8p6R8k7
8089B7K8q5P7j27J02q5qL8Qq9J34Q3j73J44j29R4L6q9m7J41j39N0N5j0o7j15J07
8116c9J15j11J11l7o8J83q7r0J5m7M0j0J6l8j0Q2l8q3O0r0J39M6p7O2k7p7J35
8143G5Km9j24J52p7N9q9O7r0KK07m4Kj0Kj12k1J05j33M5N1L1K6r3P1o9Q7J5k08
$$ plain form
7954 58 -33 21 -106 31 45 -85 -10 124 18 -60 -121 -51 4 -73 -104 -16 104 141 -79 -19 131 -103 149 67 62 -70
7980 -70 35 163 -63 133 -42 -206 73 -78 28 -23 140 77 -10 -31 14 92 39 55 58 -49 -87 -7 -48 39 34 -124
8006 -124 -10 -23 -22 -25 4 74 -67 160 61 92 84 59 -69 6 43 104 -13 -60 29 -20 -78 -5 108 102 -17 -28 -29 -10 45
8035 45 -34 -92 -29 155 33 -47 -72 -107 -38 82 -81 34 17 -9 -5 218 -14 -110 -15 -30 -53 -55 -24 176 35 1 -107
8062 -107 -125 -4 47 60 43 81 63 -16 -133 103 -61 -5 -47 -67 103 -35 47 51 14 -41 -55 -67 4 32 -44 54 27
8089 27 55 -30 47 -80 22 -63 -71 -33 -25 -114 20 103 -70 74 -55 39 75 -14 -61 80 -59 -9 46 36 -31 -146 -39
8116 -39 76 -35 76 39 -29 154 67 -23 -8 -55 -15 -25 -9 -47 -57 25 -13 -96 -36 -126 13 59 -18 44 17 -60 75
8143 75 77 28 -96 56 -21 38 -51 16 -74 -72 135 91 93 83 85 -27 -48 57 -76 -31 20 51 77 -16 55 -14 73 88 -120
8172a20J74q9O1M9j39J87j41J25k3j19P0k7o6L0N6q3J24J2j5m6j63J55j06N3K28
8197A87k43MJ08l0m2j33J69j01M0N7j25Q4NJ19r7l2l1K8m6J58j20j27J05J33l5
8222C5j8Q7k29J34P5n0m7J23m1p6J17q7N0q4j8J21j05J5O7l4Jr8j77J91Q2m4N1
8249D1n9J3j5J20o3m1J28j31J4q7J54j18J50ok06J56r7n1Q5j17Q8K3O3Pr9O1J
8276A4k8J5m9J12J8rp4L8L8q7j3m3L4M6nJ3N5j86J41l4q9J39J21j27P5J3j90Q8
8304B6PP8p2Kjr5J0J2R2j00j03P3oj3N8J0O4l5O2%m0j33P9JJ45o1J7l5J8j56J33
8335C7O8o1l3j0R0j46O9j7j1K2j01K4J9k0k8P7n4M0J05j97kM6J75j07M4l0L7M5
8363H1p9O9Oj73P7QP5m2j22J26O4j39l2J7m2J43p2M1j32K64k72O9N5K4p7Q6Q4
$$ plain form
8172 -120 54 -35 26 75 -64 123 -18 107 84 -35 35 8 -58 -28 28 -55 69 81 66 20 -143 12 -94 -41 187
8197 187 -56 -52 56 26 -16 -149 20 -81 -41 16 -109 -25 -20 99 2 -30 -61 -33 -79 79 -41 -168 -63 70 35
8222 35 17 104 -125 9 84 34 -13 110 69 -7 110 23 73 -11 -29 92 -13 2 69 35 36 -62 -239 -48 34 -10 41
8249 41 -18 -5 -20 100 37 -4 124 -7 7 -80 74 -44 106 100 -106 50 -47 -98 -13 -130 -42 -19 44 51 -48 13 14
8276 14 -14 1 -48 64 82 73 -1 37 75 -12 -25 -68 -34 12 7 20 75 -111 30 -4 -93 46 167 40 115 128 -62 26
8304 26 33 111 39 41 40 -55 -45 -33 59 -41 -144 -71 -77 -90 -32 -22 42 7 69 69 29 -104 -25 -24 121 60 77 42 60 -96 37
8335 37 105 44 11 1 91 -55 14 -3 -14 8 -93 -69 -50 -70 -98 -21 -75 -35 70 -127 -129 -83 92 -15 29 -1 36 81
8363 81 2 71 77 -96 -19 -11 64 22 -100 26 90 -49 -81 -64 -106 37 -35 6 -126 138 -134 -65 -10 14 -63 23 107
8390A07j01r7mQ2N9O1j83q1K69j13m2l3P7Q6j19%KK5J0K5j55P5o4J7J15L4jj05
8418e4J47n6m7j2p6O3K6j15J91m2k9k3K3j8P1o4l8J49r1j39J25nOL6r6R0mN1l9
8447C0j01J34j34K6o6J13N4n5k1P2m0j5J25j70N5p7j6M5k2K15k68J69o1J0K0M4
8473F6K2j15L1p8q9R9L8%mK8J16j18KJ07J5j56J12n6J20k15J24J8K3k08J0ML2
8500g2J09l4j9Q5j1j1j74J49J27j68O2j1kJ03j79K15k24l3j06j2K26l8Nm3J42
8525H6j71P6O1O2n3j9pq6j9R5j47Q2N1k1LK2q6J52q4QMj8J42q9j21M7Jj14R7L2
8555a4L2N0n0k4k8l9L2P8j76J58l3L5j29R5N0o8M3K4r7n7J52k5k8l4N4O5kr9Q7
8584E2j17Q7K5l1o2L9m4MP2L2j62P9JP8o5o2j2n1J91j76J40m1J7L3j35J53P1j76
$$ plain form
8390 107 6 -91 -95 -13 46 107 -76 -157 112 -1 -43 -76 1 87 -32 -32 -30 -5 5 30 -125 -50 -114 -97 18 52 51 -54
8418 -54 93 37 -10 -22 -98 -35 -9 -124 67 25 -4 -27 -4 -22 49 -15 -53 96 5 -134 -9 -14 -8 28 -68 22 18 69 30
8447 30 -71 63 -71 -45 -111 2 56 1 -20 52 12 -3 122 -48 7 -70 -86 -41 -63 152 -116 53 -8 2 22 66
8473 66 88 -27 4 -74 -163 -64 -26 -26 -30 -2 114 -4 -2 105 120 -36 76 20 140 -75 49 67 90 -118 -108 -104 -72
8500 -72 37 3 -16 69 58 47 -127 22 149 -19 43 32 30 133 -46 169 -55 -88 -194 -206 20 -18 -13 -56 86
8525 86 -85 -9 52 114 61 42 35 -51 -70 25 -122 -40 11 -10 -7 15 -71 81 -3 5 9 -9 133 44 -77 -30 -29 -143 -46 -14
8555 -14 18 68 18 -6 -34 -73 -41 37 -139 19 -14 21 -108 -13 37 -31 12 36 -61 -118 34 9 -19 -53 1 66 64 -35 52
8584 52 -65 22 47 16 -46 -7 -51 -47 25 57 -105 -26 -25 53 -12 -74 -86 -137 54 -122 18 -23 -6 27 -108 45 116 -60
8612f0Q3q6J12Q1o2Kl3O9j89J67m9j23R8Lq2J7J0p0P9l0r6M7J97j21Pm1J08j1
8640B7m3n2Q1K7or1n9J55j02P6N7j04J0j0J38j37J15j02j28J07J3L8n9l5M3J7
8666b4K5k0J2j0JJ6o0N1n4k0J37o8L9P8j30rJ8J62j22p3O7j50J56j13J25L7j27
8693e6J74q3mj26R5J25k43R7n2J09P5o3j7r3M3N3n9R0o7k3m6M0o7N3J3q6K07j21
8721c2q5MN8P7NL2K6q1Kj57J09rQ3l8m2O4K7jq5N4q9L0M9j8M1Q3j14n5P0Q7j71
8752g6l9N7L5j7O6Lm1J3l7J61j7k18J81q6n4K4J17r3L2k0J9mr4P5l5O5j3o1Q8
8781C1O3Qj03nM3j04J68j11l8J03o0k5P2l2j6l0n5J31k06J25LK8o7Q2j17K02k2
8808F8p5j3j35R2O2J9q1k7J77qKo9p8N5j06J67l1l7R3n7P2j58Q7J3Q3j58N0j53
$$ plain form
8612 -60 23 -63 49 130 68 70 37 106 -83 84 35 -88 10 13 -69 -52 -42 -112 -33 -63 -159 -112 85 -36 -29 -70 38 27
8640 27 -16 -68 13 40 34 -57 -116 39 -63 13 70 -34 -24 -34 104 -33 82 -20 -148 -41 -28 10 -49 -84 -41 -24
8666 -24 1 -19 -7 -17 -16 0 -60 -9 -63 -83 54 -14 25 103 -27 -36 -18 144 22 -51 16 -134 22 -91 34 71 -56
8693 -56 118 35 31 -95 0 125 -118 -21 -73 36 111 48 31 -62 -19 34 -25 65 -2 -25 -71 -31 -98 -45 -32 -118 89 -32
8721 -32 -117 -113 -55 22 27 59 85 4 6 -151 -42 -51 32 -6 -48 16 43 42 -43 11 -78 -48 1 -17 24 107 -7 -62 8 95 -76
8752 -76 -115 -58 -23 -40 26 29 -12 1 -36 125 108 -110 71 -15 -69 -45 72 -21 11 -9 10 6 -88 -13 -48 17 4 -57 31
8781 31 94 102 -1 -6 37 -67 101 -10 -48 55 -5 -30 42 10 -6 -36 -91 40 -166 -41 -38 -10 -77 5 -112 90 68
8808 68 -7 -20 -155 -63 -1 18 -63 -90 87 79 81 12 -66 -11 -117 50 19 -18 75 18 90 -68 19 32 115 -43 7 -146
8836a46M5R8k7J01j3q1R1J8pj67j8K7J44j50Q2J46j50mMo0n8J41j6o3P7k2j45
8863a53N4L4J08p0r3R5L9j12R8J14l0J1j11p2J76j68J04pm2j06J32r1P2M8r7n5
8889a22J65j10O6Q5j21PJ12o9r0P2lL1k1nK4m6l7jNJ05K0j13J74r0M0q9P8j4N4
8918A07r0JJ94k06J64j13n8K2L0m7M5j23m5J20J6m3l9J26p9j2J0K2l3K5J1Q9l28
8945b34K03J17q2O7L1j98J5K01q2p2N7n0m2J02j13Q0O4Mp8K4m2o1J08R6r6q5n
8972g1L9N3J3q2L2p2J45kJ8m9M0j3Pr3k4K8K7J54q0j54O6J4L8l8n6J32r1p3J88
9001I6L7j55P7J51n8pj04k4P8pPr5J46o2j22L9L9L2j68J07N0l9q6J24r5J89k22
9028g2O7j3n7R3K2J4o3Pj8Pl2J15j18J59p7K1m1p0o7J14J20k10J46k9J6j24R0
$$ plain form
8836 -146 -101 -3 -30 71 58 -23 68 86 79 -88 -106 -79 65 -85 -3 143 -7 -11 -7 -67 -125 16 0 -63 14 -8 -153
8863 -153 -99 -65 43 -27 -120 -25 14 -98 0 114 84 95 -16 -88 88 -80 24 17 -25 -131 1 -90 -18 30 -67 -122
8889 -122 43 -67 -1 84 -37 -30 82 13 -77 -5 -8 23 2 -3 21 -25 -62 -63 -58 47 67 -46 128 38 78 -11 67 53 107
8918 107 17 18 212 6 170 57 -1 21 51 4 49 -74 -119 1 17 -26 -65 61 -18 -30 -20 2 -31 -6 5 94 -234
8945 -234 -31 86 4 71 102 -96 -81 120 38 -34 23 -27 -69 33 -80 0 64 68 -10 14 -28 -89 19 115 19 -66 -71
8972 -71 -32 21 34 -48 -16 -88 57 55 73 24 64 51 58 -35 -59 -31 -4 150 70 -84 -18 -4 34 -4 -60 72 -19 -92 96
9001 96 133 -22 55 206 148 141 37 13 91 84 91 -4 142 80 -42 -3 36 68 -100 7 57 18 -68 56 -39 150 -72
9028 -72 -5 -18 -75 18 40 54 -9 -2 -20 -13 -45 70 -48 111 34 55 14 -56 -123 -9 111 -99 47 18 34 -90 0
9055@q6R4j4j0J8kP7p6k5p4J16k6J06r5k6R2j8jq4l5j6Q3R2k23J05j1J46j02J17
9084A22r6l3k2N7K0j22J1LJ02j21J13Ro4L8l1j02K33j53k8P6l3R3m1n6k4K8Q7
9111F6p0O3j72J07nn4K07k26J21j8qL3o2K4P1q1l4k5M8Q3j77J38j39O6J29j13
9137b8j7L3M9o4R8l9q7k7R9o3J48q6o6O1m3N7kM3j35rM1j5J81k12J52Jk4l4K0
9166C2k9l6J89oj88Q0q9m5J07o7JJ34m0j61N0P9N2n2n0K9k3J0j3k0J49j9p3Km
9195aJ8q6O1l2J06l1P2j61J21l6Om5k0J07o3J6N6j09M0j4p1j3R1O7l3o1J1j7J6
9224el5r4J45m7J00m3j26J41p6R7j05J43k7lq3Pl7J3O3lP9j10j7K1P2j4o0p4J85
9253A07j70J2KR8j18OL8K5l0om7J08p4J7R1p4o0j1J49K2j9n7M5r9q%J22m0L1m9
$$ plain form
9055 0 -86 8 -6 -16 2 0 77 1 -24 -98 18 -8 98 3 -23 69 51 50 -34 -69 -85 -2 90 -133 -28 -39 107 5 122
9084 122 26 -7 -29 28 48 -74 -63 -60 42 -79 34 43 -21 17 -14 -116 117 -36 -64 12 -21 72 31 -25 -49 -21 66
9111 66 -4 59 -113 -6 -11 -65 142 -84 37 19 11 44 -18 6 77 -4 -38 -63 -15 68 -109 29 -110 -44 85 -28
9137 -28 -45 -12 37 -27 71 32 -55 -82 17 -46 102 16 -50 11 -32 25 23 66 -69 -78 -37 -52 129 -83 69 70 46 12 32
9166 32 3 -33 156 150 -38 42 -47 -92 15 -52 -51 83 43 -118 -68 11 63 11 -39 -10 -33 -23 -36 -56 93 74 1 3 -1
9195 -1 17 -69 -8 -40 66 35 107 -54 67 31 37 -8 -28 79 16 32 88 -21 19 5 -66 -79 12 79 46 -15 -4 -21 -5
9224 -5 -40 -134 11 -36 64 21 -105 36 -40 57 -48 95 68 65 -18 -11 -48 -35 28 25 104 -6 -23 -2 70 56 -4 -78 107
9253 107 -63 -51 -49 49 -69 -63 -25 0 -30 -36 -83 25 -49 -32 59 -15 -75 -86 63 85 66 9 54 -45 -53 -53 69 29 60 11
9283A1J8J4r8P2q2R4n4M9j1k3K1P7k1q2j3N5Ml9m0q5K26j45N5lJ31j45M0r7mK6
9313d9LM4n5J03Lj18P3Qo7J29q4j7O8p7L3K0M5j34N0N1q6Q4M4j07m7P7j2P6Pj6
9343D9m0j92J05L1m1J63Q0j24k7M7L1lo2n4R0j10O4l6l3k8J9K04j88K0J6m3n2
9370a14K04j35n5L9N7k4M0K04k63j3J71j35L1nj08J60r4P2J6M1l9p6k2kk6J08
9396C2O9j44J04l8p3Q0k4r0K91j40j24R0j32R7J5KL2p4n1L5J4O1o4J30n6J9q0
9423a9K3O0j30rJ39N4j9j54J22J3m1q8J22n9l5J39q5j07L5M3k04K73o1MR6j05
9449GL5n4l5P8lJ3n6L7j49J26O6l8j5M3j29p8R2L7m9K1J6J4J8R4k1o8j32K44j73
9478e9P5q9P5K1N2p0q0R5M0m3j4N3o7n8J33j1p2k6J6kJ7O5j34N9J06o7J3m4M9
$$ plain form
9283 11 29 43 -55 17 -65 29 -25 24 13 -10 11 88 67 -15 -28 27 31 -8 -48 -133 93 -52 3 0 131 -14 26 -71 -75 -49
9313 -49 -46 -2 -57 46 49 -69 4 12 -55 74 -10 -27 41 -36 -3 17 62 -72 -22 29 -57 27 71 -36 -83 -6 -18 58 65 49
9343 49 9 -183 -78 -47 -88 75 155 31 4 51 82 79 17 -37 53 -57 7 -29 -62 -90 -71 133 -55 -35 -19 -62 -114
9370 -114 90 -45 -100 -61 -4 -28 12 216 -47 -60 111 -24 7 2 -106 54 -40 32 48 89 50 -26 -48 -50 -76 32
9396 32 101 -43 61 23 -50 30 6 -84 207 67 -57 33 -99 -2 13 15 47 -27 -78 -43 -29 32 -32 98 42 61 -19
9423 -19 4 64 -66 -75 64 118 99 -55 67 80 39 -49 73 14 -21 118 33 -74 -39 4 -200 73 12 16 112 7
9449 7 42 -12 -47 31 28 41 -15 22 -127 -1 65 27 12 55 -74 -152 -60 -23 -72 -51 -35 -21 -3 91 70 2 -130 114 -59
9478 -59 16 -73 2 23 75 5 -75 20 60 17 3 56 -11 -69 64 53 -19 -45 -29 -31 -14 51 -83 -24 82 15 28 -16 33
9507C3n8P8r2j06J44j11J61o4L1l1k7O7o3R0o7O3m4PN9j05J32m3p4J16j24N5j43
9534a16N5R3j3o3J51j61n8J09L4k0k5O8K0k7%l2P3kl7Pp7l7o3Q6O3k2r5J5J33
9563E9m5m0K8K6j5j53R3l0J48j02J29nO4k28M3k8R7k9j11J8P3k0p7K62M8k21l
9590a9m9R1Pk3L2JM6m7l2l6K6n7P3m6m6L1P9lj3J2m9p6R4P4p1l9O2j29P2poN3
9622ER2j80N9r6J80q6J00j56J20m0r3J90j02O0rJ14j55K1m2K4m1J25l4M2j65O3
9648dO8q3J01q5L3j75J45P3K7j41M9j3r0K00j28L7j21R2l8m2m1L4J34n9O8j30
9674h9O4O3k5o0J01j7o7PJ30r1p2nK37j83o0Q4M1oo1j7OL4K2o6L1r0N3j9Q8j7
9704A6j5P6j17Q2j22J69j55K50k42N3k3M1l5l4Q6r5J28q4N5j8o2R9J0j25P4j83
$$ plain form
9507 33 -25 53 -39 -145 -1 -112 49 -15 16 -15 -42 25 -38 52 -15 48 4 11 70 -35 97 54 -20 96 -28 27 -116
9534 -116 -61 32 19 -44 107 -54 -112 -3 31 11 -14 54 74 47 47 15 88 86 49 56 -21 -58 -121 -35 28 6 -89 -74 59
9563 59 14 -26 2 28 13 -140 -47 -77 71 -31 98 93 157 -71 -28 -56 41 12 -99 -81 -8 -28 -105 157 205 -16 -19
9590 -19 -68 23 30 7 39 40 86 39 7 -29 -3 -60 13 -33 -79 -48 31 28 15 27 -22 -98 -4 70 -1 -40 22 -107 -35 -42 -48 5
9622 5 97 -83 -24 -120 60 -26 74 -82 38 -2 -95 95 -7 53 44 158 3 24 -18 6 -35 90 56 98 -67 -4
9648 -4 64 -19 82 -3 30 -145 0 73 100 -41 8 -5 -95 105 -23 14 -107 -15 -53 -95 -136 -102 32 -27 41 -89
9674 -89 -25 38 13 -47 54 37 -30 -23 107 16 -56 -61 176 -7 -67 17 58 52 -9 -26 -20 14 36 -30 1 -89 -36 -55 33 16
9704 16 1 77 -40 42 -80 89 -66 184 -58 -5 -28 13 -22 -56 30 -65 63 -21 34 16 -46 53 63 -62 12 -171
9730a71J17K0n1p3J24p6J03R4j78L3R7lOj17Nm8O3Q4J60k32J02Rj15r1J63l5L3
9757B3q6M2nj22J59o6J42q6K0qO5p2M5j00J2QQ9N2o6j22L2p5J38J6J5j42O9Q6
9785F3j1k4R2Lk34J58j41L5J48n3K6Q0k21K43j30j8J02j38N0j83J52P9Q4j56m2
9810c6l3k1N6k2J41j55M1l4M4l7RL2O1M8o7P8r7p2O1j15K9N8R6o3l3J05J1k26
9838a41J14J57K8j97Pj2n8J28K5l7M1Ln4n9M2J03r7j9k8%K4MM5j13K11q5j28J95
9866I9p5j52pK71j97NJ44p9J8m3L7P0r9M6k2nq7P7Np8P6l1Q7j6o0j03J08l8K6
9895b3K5J0j42K02j52J2O2K5Rk9J21l0j67L8k9J7N7l2K8K7j02J06%n7L9on8J07
9923E8P3q7o0p5R5N8r2j29O7J41j94J06j4J5Q8r5N7RM6j09L4M4o0o3r6J58N9p1
$$ plain form
9730 -171 -54 -34 -85 -158 -34 -110 -7 87 -91 -58 39 36 42 -75 -70 -118 -55 29 189 -43 59 68 -47 -138 25 -10 23
9757 23 -63 -21 -26 -148 11 -55 87 1 21 13 78 6 51 -49 -37 -29 60 112 46 -76 -44 -119 19 35 50 -92 -23 63
9785 63 52 28 120 123 -111 47 -94 -59 89 36 62 142 -79 164 34 16 118 -20 30 -153 -1 78 162 6 -36
9810 -36 -69 -90 -34 -56 85 -70 -29 -63 -19 -56 -47 -15 46 94 27 105 8 -64 -3 -118 -89 -31 65 2 -31 74 85 -141
9838 -141 -27 130 158 -39 -32 -44 -102 26 51 14 55 58 4 -55 -13 90 -7 -26 -54 -54 -30 -26 19 -94 117 32 -96 99
9866 99 24 -128 -135 136 -61 -56 88 9 27 -16 21 91 -8 38 16 11 -76 1 6 -72 4 -27 60 44 -16 -119 -11 -49 -23
9895 -23 2 12 -130 72 -80 -68 -6 19 28 -1 120 90 -77 -39 -68 -51 6 -26 2 29 -73 33 33 -24 15 9 -49 58
9923 58 131 44 -16 -91 4 62 -30 -159 -92 49 -145 -39 -53 -38 50 -45 12 21 67 -42 -8 36 -24 -87 -183 -25 34 -37
9951c7L2L7K5j8p3K9J07q5P7j97J46oj21N0M9j7J28jk79K04m2m9n0J17o4J01j83
9978a20J01j7n5P3R5m7m8j23J51q8L0L7L6q1R9q2Rl4M8j3O2J2j11L3N3j29J34
10005B5lj07M3p3O7m8J53N4l0q9k2K3J81k34l5J64j40P3P1r0L0K9K5P0q2M3j23
10032b5Op5p0R2L7j1k8J10Rj48J05J4J3O9j54K3j45L00n9j29q5K62j73m6J48L3
10058G3q3j3lN8o7M0O4m3o1l7L0J24q0pp5Q3p2P4Q7j08m5J3J03q6K1N4J0j05J86
10087A35j48q0Q9J70j2k88J79q5Q9j00J70m3o2j51J88j14Q6J21j35q0O3p9K00
10110A13j77J1J15k3j19J02k2j3lj2L4o3O4j28k1K04r6n7Q0l4M0L4m3j18K04j9
10136E3j28J20o5K2n1L6o4R0j59P8l7R0j3%mk3K6o2J69p6%p5%J20k13J38J02r3
$$ plain form
9951 -37 -5 32 57 39 -34 -5 102 17 94 -103 43 37 -84 -34 15 -2 126 125 -154 50 8 -41 -91 26 -38 63 -120
9978 -120 -19 -36 -91 -18 77 30 -18 -141 10 -78 -48 -11 25 -56 43 -39 -30 -64 -16 -29 33 45 -66 -33 20 -109 25
10005 25 22 -85 -42 -115 -48 -96 57 111 81 -8 -30 -7 174 -60 -95 69 -71 2 73 -17 13 42 67 137 55 98 -25
10032 -25 -19 -94 -164 -72 -35 -46 -74 36 45 -103 2 16 29 98 -56 -33 -178 122 63 -66 -151 111 -62 -108 40 73
10058 73 -10 -23 -26 32 -35 5 69 26 -35 -72 -42 82 2 -5 -80 3 -69 5 92 -16 -61 -48 55 -31 -10 44 54 -51 135
10087 135 -13 -93 -4 166 154 -134 45 -40 49 -51 119 76 14 -137 51 -63 23 144 9 -71 -8 -87 113
10110 113 -64 -53 62 39 -80 22 0 -13 -16 -28 6 -57 7 -121 -142 62 -34 -91 -11 -45 -5 29 -14 -132 72 53
10136 53 -75 45 -20 2 -49 -13 -77 13 -146 -68 -105 -15 -28 -28 -32 -55 -29 -91 78 2 2 -73 -73 47 -166 -28 74 -19
10164a9kmj05O0R4J9q1P7J5r7O4n9Q8q0KJ09j00k6N2l1r0K00j67L03k55Q2k23
10191a74K24O5o0N3j08k7M1L0k8j25J78j8Q4r7O1m5K1r9Q6o4L6j36R2Kj05Q3l7
10218f7O1J1n6P3mO8j42L5r2L6K3N3j01P6Q8m6m5J0QK3Q7L2j1j56Q1J4k2l8K7
10247B6pn2L6m8O0L1N1j58J04J69j96l6J30j3q1J25j82Q2l9P1o5k0M8P5q2kj8
10274IK4N4o1n0Q4k1q5J8O3Pl7Mj22J26j04M8O0n0l7J06P6o0J1P3r0k4m4L4m2
10303c0j08K66j43J13j61N0l0QJ33n9p6K9Q4p8m3M7J1n8OJ18j40J5KQ7n4m0KJ6
10331c3K7MN4j07o9O9P4KPJ35j83J29k05K11j35K3Nnj04J71o2Ok9J2k1M8M7p3
10359bJ3KN4j52R9J21p8j25J57j06Rk1Om6J14n1k6k2J32n1N3m9Q7k11K4j2K15
$$ plain form
10164 -19 -21 -25 -130 -70 24 43 -38 39 54 -43 21 -38 50 -30 -28 81 -19 -45 7 -24 -114 86 -81 222 -33 49 -174
10191 -174 50 115 55 108 0 -27 14 44 16 -109 69 51 135 38 99 54 75 -24 62 -2 34 -102 -10 -8 -113 -30 -67
10218 -67 -6 5 -51 22 18 86 -56 -21 -113 -77 -54 -1 -102 -26 62 16 -29 -19 -11 12 99 131 120 -36 45 59 37 -1 26
10247 26 19 -33 3 -45 15 46 97 -61 43 212 16 -20 110 97 16 141 -41 41 2 73 8 -12 36 111 29 27 9
10274 9 33 87 26 -24 60 39 -46 -28 35 42 5 9 -113 13 -91 -43 17 -33 -70 36 112 52 63 136 46 22 -22 12 -30
10303 -30 -138 128 -15 98 -63 -13 -43 -35 98 39 -37 -8 76 -2 -45 2 13 -45 -39 79 -61 -46 -44 43 -11 -51 -49 -33
10331 -33 -6 -2 52 -55 -124 -55 19 21 28 163 -20 109 -96 115 -20 3 8 3 -101 70 8 14 -15 -3 -24 24 71 -2
10359 -2 11 13 67 -85 14 135 57 -68 89 -17 -8 -29 -23 -69 45 -6 -32 -54 78 27 80 31 118 -93 -69 -81 134
10386A34k29J41Qm0j11O6R1r1QQ3l2KJ88j29n4j42J38l1N1r1P7q1O7N1o1p1L2
10413b6Lj1p5L4J72j09N0j56L0L2O3N8p2K6k7OM9k3K4j2m3o0J52K4j72J09r4J31
10441H3j47J09l2o3Q4l9N8l8J0q9J20Mr2O4nQ2j45P2K8j0j03Q6j43N7RoN4q0L3
10470c9n2J21J5km3K9j1M6o2M6n3N7PKm2j86J31n9N2OkR9L0m4o3K6M0J8p7k1J3
10501a8l4Q5L1j88K1J41j17J54r7QP9n9ok0j8N2JQ6r6j0P4po0Lj1J6j11K08r2
10530A5q8R2j17J00K21k48P0o0J11r5n3Q9l2j7k4m8J67m7p4J18j09r1J47l4q9
10555i6J01m8J03rr6J3o2J00j6L7p2k7k1Q7l0Q1k7J8l2O2m2n2l2M2J34j52K6P6
10583F6l2j54J70O4j10k5OKL9l3k7N5R6l3j46Q2p6L2O8k9K1j38J06p5O1j5J91
$$ plain form
10386 134 -95 46 54 14 -97 -31 60 -31 -23 60 28 30 218 89 35 -107 31 0 51 -40 37 -44 23 74 13 -58 -26
10413 -26 -23 -34 -109 -75 97 -12 38 -118 -88 -56 7 65 -7 19 -8 -2 47 24 48 36 -7 -67 85 109 -63 46 -48 83
10441 83 -64 45 13 -50 34 -5 53 15 25 -64 56 60 -32 32 27 109 -36 36 64 54 -49 37 -106 -49 -40 -46 8 -72 -39
10470 -39 -91 30 45 43 0 29 18 64 2 48 -5 52 59 61 19 -167 -36 -95 -43 -37 -39 60 90 46 -17 9 49 67 -10 -31 -18
10501 -18 -52 33 64 -124 -103 38 -79 75 -22 -14 65 6 0 -20 -38 14 15 101 5 -5 69 62 2 5 -6 10 -101 107 15
10530 15 -73 19 -98 2 223 -25 45 -15 96 1 -52 37 5 -12 -36 -84 83 36 -38 80 -29 -120 27 -7 -96
10555 -96 5 -43 60 51 -45 -32 -94 6 -10 27 -45 -72 -93 -6 -36 45 18 36 4 66 24 -28 -60 -18 116 -36 -10 66
10583 66 34 -120 50 114 4 -21 -15 -13 26 -7 -34 21 117 84 -62 20 -56 -24 44 15 36 -102 4 -71 -10 -25 166
10610A66k06j1J34j4q3j56J17J06j02j0M8N6L6p6O1j95J45o3P2p3O9k4P5j08m7
10635h3J90k26k6J23j6M6K7o7j23J19n4L4K7j0j69K31j4J21o6o3l6O2j96J44m1
10660f6n0m8J51K6J23j90j1O3L6Pj83K70j70n5nJ33j74J50p6R6j01R3n8J26j2
10685G5P1k23J25k6j0kO5j63Q3m2N1p8K9J7J23j38J19j34Q8j5q2QmL5L5l0M9n5
10713b9K0N0j19N6M4J08j30j10R1Qn6L0P0j7m3pk8l0J9J73q5M8J7r5j9J27j02
10740ij03R9n7J50j42N1Q8j05J12j56J32r0p6P4L4J7l2m1K1O5r9j06J96M6j64
10765i5QM8N1L7m9K2o1R0o5J35o0J1q4O5K5j12K9p7OP7N0j00r0K3J07k8OJ6P1
10794E6j28J9L8Q0k16K01p4J30m5m8M1k6L9j40J46r6O4M5Nn6p4K3j6k8K0n0J76
$$ plain form
10610 166 -40 -51 83 69 -14 -170 -53 53 -49 -59 -11 45 81 5 66 -129 16 -47 25 -48 21 -3 72 -36 -83
10635 -83 107 -119 -145 -22 -38 8 35 -32 -155 -36 -90 -56 -29 -39 -208 23 9 130 64 1 -35 27 -169 -25 -66
10660 -66 -116 -164 -13 13 136 -54 -65 -2 34 41 -142 128 -42 -97 -102 31 -143 7 -69 27 -74 19 -39 87 75
10685 75 146 -77 48 22 12 10 75 -88 -5 -47 4 -74 -45 -28 95 -43 76 -58 30 15 -67 -59 -63 -28 7 -23 26 -29
10713 -29 -9 41 -78 -22 22 130 0 -110 -19 -11 -67 -37 33 16 -27 -34 -62 -92 -73 100 15 63 80 -15 -34 93 -9
10740 -9 -112 -13 -70 80 -62 -11 77 -28 84 -72 60 -30 -106 -32 2 19 -13 -54 -33 32 -67 -173 23 69 -95
10765 -95 -87 -39 12 49 0 22 -39 51 -14 121 61 72 -12 53 78 -34 -5 -82 -76 1 51 -49 -139 -116 -9 -37 -31 -15 56
10794 56 -72 -53 -15 65 -151 50 -24 106 61 13 54 28 67 -73 73 -23 41 86 91 35 -39 -16 -32 -60 -40 -90 86
10821H6j49N5R1j7n1O0Pj29J09l7m6J28j04J1P4K5j15j08Q2O6mL5o8M1pR9j50
10848a6L5n7K2M8j2mM3k7p7m5J4R0Kp0k0LP5J4rP7j44KP3O9r5R2r6L5o4k8Q7j01
10880h4N7M4n1J03j47J9P1Q5Nm0o8o7L9JP7j70J01l4R1m7J43k38K11j07P1l7k4
10907Dp1j19J61O3M4j25J9Qk1J05%m5K6R3k6q1j8m8L5p0R7q7K4k2J69j54J09n5
10935A5q5M1J00om5j6P9R0k65J25p2J8K6P5j0j29K8O7k6Rj31J73J8j29J31j01
10961b0J6J28j66Q3J5q9NJ35j60m8J06p4O9l7J63j26N1o9N3q2J25J5k18J39q4
10986g0j2J04k4m1J15J0n3n9R1o8p7J7J23J3o7l6lM0P3r2j20O5L3L1j40J10J2
11013b5qL2j35L9J25n8n0N9n6KQ3L2Q8j47oO5k0m6JM7jj38K01j10nP0j36K4Q9
$$ plain form
10821 86 -63 -8 83 66 15 75 82 -47 62 25 -21 107 3 14 88 113 -2 -110 -28 38 34 69 1 42 35 134 -16
10848 -16 19 -38 -16 32 20 16 59 32 -45 -90 -76 14 16 -54 -74 -71 4 18 9 86 -58 -56 17 86 -9 83 -13 22 -42 -70 17 -84
10880 -84 -27 17 -34 69 -78 -59 12 97 102 62 -6 -73 -34 -33 44 -126 -25 -59 32 -15 128 -110 101 -6 65 28 4
10907 4 -67 -186 -25 38 82 -43 -24 -16 -37 68 68 23 49 142 116 35 17 -31 4 -66 31 -56 -32 -54 115 -39 70 15
10935 15 -70 -29 71 65 20 4 83 173 -92 33 -39 -21 5 80 70 -59 -31 36 10 19 -112 61 79 -50 81 -20
10961 -20 -4 124 -42 41 56 -33 -28 107 -53 -101 5 -69 0 -37 126 0 51 -18 35 -47 78 93 -125 14 -70
10986 -70 -82 22 -2 -43 72 82 29 -30 61 -7 -84 -67 56 69 2 -34 -37 3 76 -16 -136 -71 -38 -7 -147 -37 -25
11013 -25 -33 -1 -136 -97 28 -30 -80 -21 -77 -75 8 40 128 -19 -25 40 20 -26 -25 22 21 -117 84 -26 -31 39 -97 -73 16
11042A6J7j00J24o5K6j5r6K01k53K36k6j58K28q0R1j38n0K7O1j6j54R9R7lj42
11067g3J26N5m6n3j32J56%K4j87O0Q1p4J23o5k6N9P4j10J41j18K5pJ0Lj32J49
11093F3m5j00PJ67k11P2j12K26j27R4o9mN2J6j06O8J6Po9nR6n1O0J7lj16J41j14
11121c0K6L0M9j47M9M5m0j14J46r1J05J6p2O5j45J92p9m9P5p7L4M6j17N8m0L1
11147c4J73l01J76L6j18J00O7r8k5O0J34j84N3n1j05L5J51K0l5p4mP6n7r6N0J27
11173G6j9J04j03k4n0J5j9N2K0n3l7n2O7j06K96q2j01l4J19m8J6n0K7q0J86p7
11199D3p9J19o1mJ4mjn0M9m3N7j75J63p3J36j36MJ4j3O0k9j3o6J43j90J15P5j08
11227e3l4R8p3K18k24J6k0J47j66M0KQ5j4m4J50k51J54j49Q5m4M0O6K2q2J26j78
$$ plain form
11042 16 33 -67 57 -8 18 3 -93 108 -145 91 65 -93 135 55 146 8 -42 -15 46 30 -124 -25 72 69 -73
11067 -73 53 108 62 9 -123 33 33 57 -130 -70 11 -63 60 -5 -31 28 102 -8 133 15 40 33 43 46 -86 63
11093 63 18 -82 -75 92 -119 -47 -159 67 -60 34 -35 -39 13 29 -77 -9 7 14 -55 -60 36 -15 45 62 59 -57 84 -30
11121 -30 -4 26 75 -72 -23 22 -18 -132 14 -77 28 44 -28 37 -108 84 5 -44 31 -46 -12 34 -83 -25 -65 -34
11147 -34 139 -162 14 50 -68 32 99 1 -24 36 170 -14 39 -12 -117 -82 69 89 54 -20 -24 52 -5 -101 -51 76
11173 76 57 161 58 34 -16 -1 -20 32 52 -1 -38 -90 -23 -129 167 85 -16 -50 69 21 37 -13 14 -66 120 43
11199 43 -36 83 22 18 32 28 27 -23 26 -17 40 -135 28 -45 91 -45 -41 -27 -40 20 -9 -22 -88 55 -135 -20 55 -53
11227 -53 -87 11 -62 156 -68 -52 -72 75 -91 -51 -49 36 22 -22 128 -123 31 -118 -33 -77 -37 29 51 -31 95 -83
11253h3J07L1k6l1N1l5l2L0or2jJ40j81K48r4n6Q8o2J43j85p7J94Pm5o6o7J63
11280F3r0J16j2k51J71J5R7j19m1R4k15K23m4Q0q8j55J28k4L0j6MJ70k2j55l6
11305g7M6j1j21K44j09n8NN6O8m5Q0j77L0N4N4j05pk6J09L0J8l8p9M6J8j34K2
11332a07J32j02n5L6K6QJ66o9L1j34l1J73j16P1j22K10r6q3J0Q0J7j7p1J5K13
11357A85k48L3j8O9j0l2Q5q3l9J29j25m2M5M2rn0J37r5O7J8j38m6J07o2J07P3
11383A00q9l1K2l1%o2M9J25j48M9j14J75M0j08R0j56J11o4l5O8K8q8J2Lq4J04
11409c4R8p6o2N3l5j03J74L7k1j04M2K7k6J71r0L2j57K7m1J63n8N3p5MN9k28J81
11436A1nL4j27N0J61j50m3N2Kj38J70j77J28j3%L5j1N6m7J7j9J21m8m6QJ4q2j3
$$ plain form
11253 -83 24 55 29 -2 49 14 -18 12 6 -86 -87 53 -128 120 26 -30 58 -4 139 -46 -123 71 78 33 -33 -100 63
11280 63 -27 89 77 -174 -3 12 109 -10 -51 43 -172 51 7 87 -1 -156 -28 -52 -22 -38 -34 136 114 -41 -77
11305 -77 -31 -42 -163 81 -28 -86 -81 -25 43 -2 78 -99 -69 -15 39 -66 -73 -99 10 40 58 20 -59 -13 5 -129 -107
11332 -107 25 -77 -132 -96 -70 -62 104 35 66 -68 -99 74 -42 29 -93 117 21 -62 -52 28 45 28 -43 -28 185
11357 185 -63 -30 -48 21 11 -21 64 -19 -58 71 -54 -96 -51 -9 -18 -68 69 -26 41 59 -79 -125 -18 -80 27 100
11383 100 11 -20 2 -29 -29 -91 -42 83 -65 -16 -130 45 85 -23 67 -89 22 -42 -77 -9 19 -69 -57 -54 -138 -34
11409 -34 64 -12 -74 -21 -56 -159 15 52 31 -73 -31 -4 -30 141 51 83 -74 -47 -88 75 17 70 -5 -1 58 -170 11
11436 11 6 40 -87 -37 124 -26 -69 -17 -15 -153 17 -160 -32 -45 -45 -10 -21 35 -12 5 -14 107 59 13 21 35 -47 -60
11464f0MJ25j25ko5K20o6j49J00N8K5j07P0j67J27O6j53J77n7j66K00j4j24J12
11488B9nL3j44Q3J6l3P0j20Q1j09K10j98J10m1m4L7O8M8j44kQl5j32K19nq4R9
11515A5Q8j29Q6j17J7QP1J7j51J6K7R1q1Q9k23K21l4o7P9o7N4r8R2l0K0M1q9O5
11543A1K4q3J24p7L8M1j06l6J23o0KK2J7j04j5J7QO8k5l1J09j2k77J91QO3ol2
11571Bm7O0r9N9R4J4n5n6J64j04p7K5l7J21j30J9J8J9o1J2P6jJ9M5r2m0Q0P0q8
11600A0jL7k5rP9j87J28j24LK17r5n8j09J01p1N3J65j68J52r1K8j2p5N6r0J59
11626G3j69L6K1R3j67J5K58k20MN3J21k60J35Mj4p9JJ12qM5r8L0L6p9O3n6J36
11653H6j01r7J79j12J48j67K3k6K3rL9j8p3J27l6n6N3J33j59L4Nk2p2K10j36M
$$ plain form
11464 -60 -56 69 -56 -58 -123 97 31 -118 -18 40 65 -42 28 -139 -12 54 -99 78 21 -145 55 41 -83 29
11488 29 24 57 -87 -4 12 -21 49 -71 10 -99 111 -87 23 -18 -62 -25 43 91 -53 -55 -47 -82 -214 5 0 -84 15
11515 15 103 -26 60 -57 -40 -32 39 56 -95 -79 -52 39 -42 47 -176 45 11 -56 23 -44 10 -88 4 -26 -6 35 -54 11
11543 11 35 -48 76 -1 37 78 -28 -64 59 -1 1 23 40 -64 -79 -62 -54 14 -11 -42 67 55 -222 -31 -23 40 34 2
11571 2 -45 15 -84 -25 69 83 28 -28 136 32 -45 -20 -57 64 -66 -47 -29 -10 -71 -59 17 16 35 80 -12 -52 28 98 10
11600 10 9 46 21 12 91 -96 32 -92 -89 128 33 -25 -134 -33 -104 -51 114 -54 98 7 35 23 -52 4 -86 73
11626 73 -96 -60 -39 54 -113 -98 160 -60 -56 -3 118 -142 -7 -3 -17 -96 -95 17 9 54 -44 -14 22 -57 6 -50 86
11653 86 -15 -112 67 -45 103 -64 -41 -67 -44 -53 -14 -32 -105 22 -14 -70 -17 116 -43 -9 -4 -26 -98 112 -24 -20
11679b0N9K8ql4M9j15J8j5mo8R4J0n3mO1Q8p6%J47p6n1j28N5K2q9O4O3M0r3O3
11709B7L5p3kj10J15P2j10N5J9r3j6M6k3j7O2J04o2n8N0r9J20j8M4j56o0J91j24
11736h1J93j31L5j05J11l1pP1L3k2p2P4j08o0M3R3j10L5L4pl4k5m0OP5j0Q8p3
11764b5k5J07N1k83J55K7n0j8PJ26k1q3K2J02nj10Q8q5N0J3qr2J60o7l3Ol5r5
11792a21q2J79O3j35J06j01O8K2R1j34P4L5M9q6j34O6Q4o0qM6K3j03M1r6J22P3
11818H2j46N9m2J7J29j4m6q2nR1L0j66O4N3M6j8j40J80o8m2q5O5klo6K51k55P1
11846d2Qk6N4L9J4k6p7J49k58J84r2P1P6k09J61N1M3j33j30J12K6k0P3O5L0j04
11872C9o7K6K5p4mMJ23p3j8k4mL6j11J07J02j31n2J03m7M4Q0q6J07k1j47nN2K0
$$ plain form
11679 -20 39 67 59 25 74 -41 -23 -38 -42 -110 -16 -6 -59 -63 -2 86 10 10 157 81 30 -98 -43 -21 -110 -46 17 57 -36 27
11709 27 62 -11 -13 -123 -8 64 -46 9 28 -65 -81 -35 -58 -75 -13 91 29 -29 21 -78 42 24 68 -88 -148 43 -81
11736 -81 112 -19 16 -89 22 -9 -16 55 88 66 -6 68 -40 -100 -57 36 -74 -39 -5 -12 -46 -71 -111 -105 -30 -40 48 -25
11764 -25 -50 57 108 -175 -20 7 -43 -61 -54 72 51 -32 -10 92 87 -23 65 -20 30 43 35 -57 103 36 3 9 -26 -121
11792 -121 -203 -24 39 -96 10 -91 -23 -1 90 -44 30 65 114 28 -106 -40 44 -16 -24 22 45 -58 -17 -113 9 82
11818 82 -64 -5 -47 -30 99 85 39 -43 -48 43 73 -93 -29 24 70 52 -88 92 24 -18 -103 -38 -40 -43 -109 142 -113 -42
11846 -42 -34 -60 -6 33 47 21 -56 93 -165 19 -73 -2 74 -135 26 77 120 -13 -143 -31 -5 -25 48 113 143 39
11872 39 -28 -2 23 -51 -55 -51 72 -1 -19 -43 -47 -11 -122 -15 87 -44 -96 7 -40 4 84 -2 105 84 -63 -68 -16 4
11900Do8O7l0M5Rr1M5J23j35O2j5j3j9j0K4N2q1K7o6Q0j9mR9j52L9j32J37M1p8
11929e9k7J08J7P6j36LQ4n7q1o3J23k8K8RL8N6r8O2r0Q3q5O6L4q1k1nOKQ6k7q0
11960e7R9m8j23J05J27M1p7q7KO6pK1q5jR0j60J41o8r2N6J31j42R2K5p2J38j52
11987c7L3K2l6r6LJ38rj08pj9J43j71J37J08j4j33N8J2k9L8P7j46P2p2J3Mk2O2
12015B1JK0n4J61j10j59K05p4kL5j12R5l8j7R9J7l7n7J32j05L5j06M1J8k5J02
12041H6j03P6m8%j73M0P7N6n4J01m8l7L6Qo6L8j21J94q8J48j41k0N4M2o5p5M5
12068c8J3N7r0L3N7oj7L9Lj75Q2J49r2j4k6O2j76K13m1j10P5o4J17L9m3j63J21
12095EQ1j85N3rJ42j90Q2N4m4q5J51n7o6O6mL3o2P9M0q7N7j04jL5N6Mn9O6jn0
$$ plain form
11900 4 -64 3 -27 18 27 -64 -19 104 -31 31 16 3 -16 -26 -2 50 -31 -4 -70 10 -9 -13 86 -66 -27 -159 -22 19 -59
11929 -59 -86 22 39 115 -21 -18 66 9 -72 -135 -12 -40 -12 -3 35 91 -7 55 -35 48 -37 29 63 -18 -39 -44 -38 -36 50 23 -57
11960 -57 42 -6 -129 -24 103 144 67 -20 -18 48 41 62 -23 -24 66 -94 47 -21 -113 -57 74 -68 24 49 -23 115 -37
11987 -37 -4 18 -18 -114 -111 27 18 -90 -97 -116 27 -144 -7 101 87 -46 12 24 -5 33 110 -36 36 -36 -23 -19 -41 21
12015 21 22 42 -12 149 39 -120 85 11 9 44 -68 27 -11 -28 71 88 51 -6 126 21 56 -50 -9 9 -16 86
12041 86 -17 59 11 11 -162 -122 -45 11 -43 58 10 -27 9 17 -49 -11 -132 62 -26 122 -19 -39 15 57 -8 -83 -38
12068 -38 -25 32 -58 -25 32 26 9 48 51 -124 -42 107 15 1 -25 37 -139 74 33 -77 -2 -66 51 90 47 -116 5
12095 5 86 -99 -46 -55 87 -103 -21 33 -11 -96 55 -2 -68 -2 -6 27 -35 44 84 -3 54 -50 -51 -16 40 44 -15 51 50 0
12125@o9J02P9j82R5qmo4o0J56p3l2P3K7m3K0k6L4m5N3j01N2m2K9O2N0n7j21J55
12154F0p9R3r5P6l8jom4jn0K0O2L7m1n9J53j93J22p1O3P8j25m2J4J26q1rl3J87
12183A23j28J97j29j02ok1q3K19j13K0m0L0o1J31m4O2j9k2O8m0j12R0P1j42J0
12208d1K8Q3mo1M2M2j85L5j4O7J1M6j64J47K5K4j6o8l8l1J51p7l1jLk3rP3K2m5
12238ipp0r8K12K0Jj22J16k5n5MJ50j96J17J8o2K2r5L7k7K7Q6M3j20l2R6m1o3
12266g3k0J68j10K3J2M7j10L9M6M2K2o9n3J23j43N1j16R2o8J07j67M9J24j29j0
12291a23Q7L4l6J54n2p2j06J65j01O0L8P3j0n3j91J31k8M8j71K04o6J01j02J07
12315I1q3m4K2o2J63j40J27j11K0L2J5j48J62n3J12p6r1K7j6n9jM8M3J1j00J17
$$ plain form
12125 0 -69 33 112 -70 25 17 13 -51 -111 45 -28 -60 13 40 -3 17 -9 25 -20 33 -68 -16 -58 -29 33 83 26 -95 60
12154 60 -19 74 -21 55 17 16 10 -34 -35 -85 -65 -3 34 -7 -66 87 -106 16 -55 8 86 -39 -81 -67 59 -22 -31 -64 123
12183 123 -5 192 63 -39 -45 -66 -149 70 -43 -23 -63 -33 -94 37 -7 55 36 14 82 42 -70 20 91 -51 -41
12208 -41 -13 70 66 5 47 89 -96 -61 -75 -8 3 49 -115 32 57 81 65 -3 -41 -72 79 2 -29 -30 -27 -50 -59 14 36 -9
12238 -9 -16 -86 -184 28 48 49 -73 43 18 -37 -33 117 -79 38 56 -6 16 -79 -42 -69 -42 44 87 -33 -65 31 -10 -73
12266 -73 -93 75 -35 -12 0 47 -63 -24 22 64 86 17 -36 87 -56 -5 -121 -29 -97 10 -157 -108 16 -113 -123
12291 -123 -36 -2 -38 116 64 -8 -114 51 -50 10 48 121 111 58 -133 -2 -30 18 -153 51 -15 86 -16 91
12315 91 8 -36 -14 -76 87 -53 74 -37 -17 15 30 -118 44 -9 103 27 -64 -37 -53 -112 -113 -65 -22 -11 -111 6
12341Fl5j71J87j02R9O2n1M3O0j30J33j46J35j03k5n9J26l5j9M4r7J03K1k8p6
12366e8JQ5K1o7J2m1K1j0N8l4j1m4J04R1j25j17J26L6oJo0K0J2J06j50qJ17J5
12394I5Qo7O4k24O2JN6k3m3J04n0N5N7j16J00j22M1n9NM1l2J47j10j69J48O1j14
12421h4Q2K7M2j44K9j3K3ooP8q1P7o6J17m8Oj04k9J28K3K3q7Qp3Q8P8l9M3k00
12450a08J49pq1J9N5j3rK5l7p9N5m5J12m5r1J15l0j8J0J23pj90K06k08J31o3J9
12477a2kJ27o0j8j58O7l1P4l0J17q2M0n7j13M5M4J9p8N5O4k7J11j39L3m4R4kL7
12505G4j28j16J73oO8j45R4l6o4k4M9J40j3o7L2j32pN7N3p7l8qM2J34l1J1k4o0
12533d9o8Q2pL5k8j14J26PR6P4j30m6M5O7k7Lp0R5n6O2o9J6R9j12j07j4P4J5q6
$$ plain form
12341 6 -29 -200 -13 -115 -16 46 -5 38 98 -32 101 -45 90 -13 -38 -97 29 -6 -25 19 -78 25 46 18 -58
12366 -58 -57 28 49 -18 -6 -47 -26 -36 22 -12 -23 -67 37 128 3 -114 12 48 42 43 -17 3 15 121 -29 -37 80 95
12394 95 103 36 100 -124 -62 -61 -5 -28 -71 33 -17 38 95 -21 79 -43 -2 -61 -56 -15 -47 100 -10 -179 -31 30 -84
12421 -84 -2 25 67 -77 -48 -61 -38 -44 -50 28 -53 24 -42 75 27 33 -71 -100 28 51 74 -13 -5 -78 10 88 49 92 -108
12450 -108 41 34 -47 -28 27 14 5 30 -7 -86 -31 -76 36 -9 -100 15 -15 -33 -23 100 93 -97 109 -99 32 -31 -12
12477 -12 -14 113 53 35 -123 -56 -87 -13 -43 74 -8 32 -25 -138 -93 -49 -30 -108 -53 11 -16 95 -44 -11 -55 39 37 74
12505 74 -54 -170 3 -3 65 -80 14 -22 -86 -110 -61 79 66 -1 31 -101 -108 -51 2 -75 -113 -121 -79 55 24 35 11 -49
12533 -49 -117 -35 -42 -7 -35 -149 -23 -16 80 154 24 -22 23 90 63 66 -4 91 35 97 28 44 143 31 -76 -90 -16 -1 -87
$$ [...]
16383B8
##END NTUPLES=NMR FID
##END=
