##TITLE=abcd
##JCAMPDX= 6.0         $$ Bruker NMR JCAMP-DX V2.0
##DATA TYPE= NMR FID
##DATA CLASS= NTUPLES
##ORIGIN= UXNMR, Bruker Analytische Messtechnik GmbH
##OWNER= root
$$ XWIN-NMR		Version 3.5
$$ Tue May 20 12:58:07 2025 Russian Standard Time (UT+4h)  servis@DPX200
##.OBSERVE FREQUENCY= 200.131235884673
##.OBSERVE NUCLEUS= ^1H
##.DELAY= (6, 6)
##.ACQUISITION MODE= SIMULTANEOUS
##.ACQUISITION SCHEME= undefined
##.AVERAGES= 32
##.DIGITISER RES= 18
##SPECTROMETER/DATA SYSTEM= spect
##.PULSE SEQUENCE= zg
##.SOLVENT NAME= CDCl3
##.SHIFT REFERENCE= (INTERNAL, CDCl3, 0, 16.5164)
##AUDIT TRAIL= $$ (NUMBER, WHEN, WHO, WHERE, WHAT)
$$ ##TITLE= Audit trail, XWIN-NMR		Version 3.5
$$ ##JCAMPDX= 5.01
$$ ##ORIGIN= Bruker BioSpin GmbH
$$ ##OWNER= servis
$$ F:\spectra/data/av/nmr/H1/1/audita.txt
$$ ##AUDIT TRAIL=  $$ (NUMBER, WHEN, WHO, WHERE, WHAT)
(   1,<2025-05-20 12:55:33.75 +0400>,<servis>,<DPX200>,
      <created by zg, POWCHK disabled, PULCHK disabled
       configuration hash MD5:
       00 E9 B6 7A A2 85 ED C7 34 08 36 98 17 FE 4E 26
       data hash MD5: 32K
       62 F6 D1 C1 C9 3A E9 5F 2B 7E B3 E2 D3 E3 72 6E>)
$$ ##END=
$$ 
$$ hash MD5
$$ 95 44 5D E5 D2 D9 AD D1 54 A7 20 FB 2A AD 2F 0B
##$RELAX= 
##$RELAX= 
##$RELAX= 
##$RELAX= 
##$RELAX= 
##$RELAX= 
##$RELAX= 
##$RELAX= 
$$ Bruker specific parameters
$$ --------------------------
##$DU= <F:\spectra>
##$EXPNO= 1
##$NAME= <H1>
##$PROCNO= 1
##$TYPE= <nmr>
##$USER= <av>
##$AMP= (0..31)
100 100 100 100 100 100 100 100 100 100 100 100 100 100 100 100 100 100 
100 100 100 100 100 100 100 100 100 100 100 100 100 100 
##$AQSEQ= 0
##$AQ_mod= 1
##$AUNM= <au_zg>
##$AUTOPOS= <>
##$BF1= 200.13
##$BF2= 200.13
##$BF3= 200.13
##$BF4= 200.13
##$BF5= 500.13
##$BF6= 500.13
##$BF7= 500.13
##$BF8= 500.13
##$BYTORDA= 1
##$CFDGTYP= 0
##$CFRGTYP= 5
##$CHEMSTR= <none>
##$CNST= (0..31)
1 1 145 1 1 1 1 1 1 1 1 1 1 1 1 1 1 1 1 1 1 1 1 1 1 1 1 1 1 1 1 1 
##$CPDPRG= <>
##$CPDPRG1= <>
##$CPDPRG2= <>
##$CPDPRG3= <>
##$CPDPRG4= <mlev>
##$CPDPRG5= <mlev>
##$CPDPRG6= <mlev>
##$CPDPRG7= <mlev>
##$CPDPRG8= <mlev>
##$CPDPRGB= <>
##$CPDPRGT= <>
##$D= (0..31)
0 2 0 0 0 0 0 0 0 0.06 0 0 0 0 0 0 0.0002 0 0 0 0 0 0 0 0 0 0 0 0 0 0 
0 
##$DATE= 1747731333
##$DBL= (0..7)
120 120 120 120 120 120 120 120 
##$DBP= (0..7)
150 150 150 150 150 150 150 150 
##$DBP07= 0
##$DBPNAM0= <>
##$DBPNAM1= <>
##$DBPNAM2= <>
##$DBPNAM3= <>
##$DBPNAM4= <>
##$DBPNAM5= <>
##$DBPNAM6= <>
##$DBPNAM7= <>
##$DBPOAL= (0..7)
0.5 0.5 0.5 0.5 0.5 0.5 0.5 0.5 
##$DBPOFFS= (0..7)
0 0 0 0 0 0 0 0 
##$DE= 6
##$DECBNUC= <off>
##$DECIM= 32
##$DECNUC= <off>
##$DECSTAT= 4
##$DIGMOD= 1
##$DIGTYP= 9
##$DL= (0..7)
0 120 120 120 120 120 120 120 
##$DP= (0..7)
150 150 150 150 150 150 150 150 
##$DP07= 0
##$DPNAME0= <>
##$DPNAME1= <>
##$DPNAME2= <>
##$DPNAME3= <>
##$DPNAME4= <>
##$DPNAME5= <>
##$DPNAME6= <>
##$DPNAME7= <>
##$DPOAL= (0..7)
0.5 0.5 0.5 0.5 0.5 0.5 0.5 0.5 
##$DPOFFS= (0..7)
0 0 0 0 0 0 0 0 
##$DQDMODE= 0
##$DR= 18
##$DS= 0
##$DSLIST= <SSSSSSSSSSSSSSS>
##$DSPFIRM= 0
$$ [...]
##$SUBNAM0= <"">
##$SUBNAM1= <"">
##$SUBNAM2= <"">
##$SUBNAM3= <"">
##$SUBNAM4= <"">
##$SUBNAM5= <"">
##$SUBNAM6= <"">
##$SUBNAM7= <"">
##$SUBNAM8= <"">
##$SUBNAM9= <"">
##$SW= 20.6817932712277
##$SWIBOX= (0..15)
0 0 3 0 0 0 0 0 0 0 0 0 0 0 0 0 
##$SW_h= 4139.07284768212
##$TD= 32768
##$TD0= 1
##$TE= 0
##$TE2= 300
##$TE3= 300
##$TEG= 300
##$TL= (0..7)
0 120 120 120 120 120 120 120 
##$TP= (0..7)
150 150 150 150 150 150 150 150 
##$TP07= 0
##$TPNAME0= <>
##$TPNAME1= <>
##$TPNAME2= <>
##$TPNAME3= <>
##$TPNAME4= <>
##$TPNAME5= <>
##$TPNAME6= <>
##$TPNAME7= <>
##$TPOAL= (0..7)
0.5 0.5 0.5 0.5 0.5 0.5 0.5 0.5 
##$TPOFFS= (0..7)
0 0 0 0 0 0 0 0 
##$TUNHIN= 0
##$TUNHOUT= 0
##$TUNXOUT= 0
##$USERA1= <user>
##$USERA2= <user>
##$USERA3= <user>
##$USERA4= <user>
##$USERA5= <user>
##$V9= 5
##$VALIST= <valist>
##$VCLIST= <CCCCCCCCCCCCCCC>
##$VD= 0
##$VDLIST= <DDDDDDDDDDDDDDD>
##$VPLIST= <PPPPPPPPPPPPPPP>
##$VTLIST= <TTTTTTTTTTTTTTT>
##$WBST= 1024
##$WBSW= 30
##$XGAIN= (0..3)
0 0 0 0 
##$XL= 0
##$YL= 0
##$YMAX_a= 683529
##$YMIN_a= -659761
##$ZGOPTNS= <>
##$ZL1= 120
##$ZL2= 120
##$ZL3= 120
##$ZL4= 120
##$ABSF1= 10
##$ABSF2= 0
##$ABSG= 5
##$ABSL= 3
##$ALPHA= 0
##$AQORDER= 0
##$ASSFAC= 0
##$ASSFACI= 0
##$ASSFACX= 0
##$ASSWID= 0
##$AUNMP= <proc_1d>
##$AZFE= 0.1
##$AZFW= 0.1
##$BCFW= 1
##$BC_mod= 2
##$BYTORDP= 0
##$COROFFS= 0
##$CY= 19
##$DATMOD= 1
##$DC= 2
##$DFILT= <>
##$DTYPP= 0
##$F1P= 11.0000007629395
##$F2P= -0.999999237060547
##$FCOR= 0.5
##$FTSIZE= 0
##$FT_mod= 4
##$GAMMA= 1
##$GB= 1
##$INTBC= 1
##$INTSCL= 1
##$ISEN= 128
##$LB= 0.05
##$LEV0= 0
##$LPBIN= 0
##$MAXI= 10000
##$MC2= 0
##$MEAN= 0
##$ME_mod= 0
##$MI= 0
##$NCOEF= 0
##$NC_proc= 0
##$NLEV= 6
##$NOISF1= 0
##$NOISF2= 0
##$NSP= 1
##$NTH_PI= 0
##$NZP= 0
##$OFFSET= 16.51637
##$PC= 1
##$PHC0= -262.2506
##$PHC1= -4.898466
##$PH_mod= 0
##$PKNL= yes
##$PPARMOD= 0
##$PSCAL= 4
##$PSIGN= 0
##$REVERSE= no
##$SF= 200.13
##$SI= 16384
##$SIGF1= 0
##$SIGF2= 0
##$SINO= 400
##$SIOLD= 16384
##$SREGLST= <1H.CDCl3>
##$SSB= 0
##$STSI= 0
##$STSR= 0
##$SW_p= 4139.07284768211
##$SYMM= 0
##$S_DEV= 0
##$TDeff= 0
##$TDoff= 0
##$TI= <>
##$TILT= no
##$TM1= 0
##$TM2= 0
##$TOPLEV= 0
##$USERP1= <user>
##$USERP2= <user>
##$USERP3= <user>
##$USERP4= <user>
##$USERP5= <user>
##$WDW= 1
##$XDIM= 8192
##$YMAX_p= 0
##$YMIN_p= 0
$$ End of Bruker specific parameters
$$ ---------------------------------
##NTUPLES= NMR FID
##VAR_NAME=  TIME,          FID/REAL,        FID/IMAG
##SYMBOL=    X,             R,               I
##VAR_TYPE=  INDEPENDENT,   DEPENDENT,       DEPENDENT
##VAR_FORM=  AFFN,          ASDF,            ASDF
##VAR_DIM=   16384,         16384,           16384
##UNITS=     SECONDS,       ARBITRARY UNITS, ARBITRARY UNITS
##FACTOR=    0.0002416,     1,               1
##FIRST=     0,             0,               0
##LAST=      3.9581328,     0,               0
##MIN=       0,             -659761,         0
##MAX=       3.9581328,     683529,          0
$$ Real data points
##PAGE= N=1
##DATA TABLE= (X++(R..R)), XYDATA
$$ [...]
9022G1k00R1Q9k6J6j66Q1N8Q4p9p9l0J97o2j51P9J32j58J13j22J4Q6j22J09o5
9047d0M1JN5m7oP4q3p0K2N1l5Oj16P7L5L7j8r5l1J89j50J38j50J47J4m1J37o3
9075G9p9o3j6O0m6m1J34j72J88Rj37j7Q2J10j24J78m7k21J66q9K8M9m8R9l6o6
9101b0OL6j51J93j04J30n2l3J1L3k4q1R5Ll8o3J99k00L4K04k53J72j04o5K7P7
9127C2j6j16K9J8Q8m9M0JN4q1Mr8M5J31j21J35j28l0J06K6K3j00n1J1L3J19j30
9154b5J1J02m4j2j16J61o6LN1j34O1J8O2m0r9N3PJ73j40l8o8J02lk6Q4k07J32
9181Br9N8N4j5J02j89J03m3M1M5p4r6K7Ql1K00q7j8k5L3%j3j06J69j7n9J13q2
9209Ap0M6k6k0K36k13P1r4K6r8J88lJ5m9n7J80j16lRm4P4J23k46M1m5O3J07m4
$$ plain form
9022 71 -129 -38 51 25 41 -125 -44 14 98 19 -60 -90 107 45 -106 -27 105 -53 60 -62 -48 38 -84 25 -40
9047 -40 1 2 57 10 4 78 -5 -75 -53 -2 -37 -31 -147 -70 -35 2 -16 -111 -142 47 -103 35 -115 32 46 5 142 79
9075 79 0 -63 -79 -19 -65 -106 28 -144 44 53 -84 -101 -19 91 -33 145 98 -123 43 -46 -18 31 -17 82 46 -20
9101 -20 -14 22 -129 64 -40 90 38 5 16 49 25 -56 39 42 4 -59 140 -60 -26 178 -75 97 -7 -72 -45 32
9127 32 16 -100 -71 -53 35 -14 26 27 81 0 4 -94 -49 82 -39 96 -32 -62 44 70 93 -7 -58 -47 -14 105 -25
9154 -25 -14 88 44 32 -84 77 11 14 65 -69 -8 10 72 32 -67 -14 -7 166 26 -12 -80 22 19 -7 77 -130 2
9181 2 -97 -39 15 0 102 -87 16 -27 14 59 -15 -111 -84 -76 -107 93 6 -12 -37 -4 -4 -17 -123 46 29 -30 83 1
9209 1 -69 -23 -49 -69 167 -46 25 -69 -43 -141 47 44 59 10 -47 133 17 14 23 -21 53 176 -70 -29 -74 -11 96 52
9237E2l8m0L3o8oQ0p2O1M2o8j4J6n9Q5k3J5lm9OR1o5J0P0q0j31J67J3l4P7m7k9
9268hr0k3J58r8J8MnQm1J39m6j39J4J04P0M9j47J1j41J90N4l4j00O2J00j15K6
9295B0p0R1j3l8J00j59J04j5o3N9j11J60k48J74L3R1n5q5J28r9Q4r9J8N4p5Pl4
9322d1m2N3n5P0J12j08j02K41o1j76N2R0l6K8k2r6J24L5l9j30N8J67j91n6M0J46
9348F1j4p7J30j11p9N2J6J5LK1q9J45p8K5J32j53j5NjR1j19o3K6R7p1j9J21j30
9376g9P6j19m5J53oL8j32J3k8K39r2K2J0j37Q3k0K9l4j8Lk5J27k1K1m7On5j8N0
9405fk8N2o6o4N4RnN6J5k8m1M1j0j6N7k7L4l5Q2j10N9m6L4o1O2o8J00j33M0P7
9435B8Pr6Q0J1j5l7J07j42J56qj83J34j16k7K0P2J3P2j34J71q8O2k04J17oo4P6
$$ plain form
9237 52 14 -26 7 -61 -67 13 -59 2 44 -24 -38 -22 -81 4 -19 -4 -7 -56 -50 41 -24 -14 56 -24 -155 12 25 -9 68 21 -8
9268 -8 -98 -121 37 -61 -43 -39 -44 -36 -77 62 16 -123 -109 -5 65 114 -33 -22 -163 27 81 47 -53 9 109 -6 20
9295 20 -50 41 28 -10 90 -69 35 20 -43 16 -95 65 -183 -9 24 115 60 -25 103 4 88 -11 7 61 -14 -7 -41
9322 -41 -83 -30 -85 -15 97 -11 -113 128 67 -109 -57 33 -3 25 3 -93 31 66 27 -103 -45 122 -69 -125 -85 61
9348 61 47 -30 100 -11 -90 -38 -22 -7 -4 17 -72 73 -5 20 152 -1 -16 -11 -12 79 -40 -103 -77 20 -51 -70 51 -79
9376 -79 -3 -122 -167 -14 -20 18 -114 -101 -129 110 18 40 50 -87 -4 -24 5 -29 -47 -44 -69 58 37 58 11 17 -38 -56 -6
9405 -6 -34 18 -48 -112 -58 -49 -54 2 17 -11 -52 -11 -21 -37 20 -7 27 -8 74 -36 23 -23 11 -50 12 -56 44 -89 -49 28
9435 28 35 -61 19 30 15 -22 85 -57 99 91 -92 42 -74 -101 -81 -9 4 76 -58 113 25 87 -117 0 -6 -70 6
9462Fl0p6J0oJ05n6O3j24J90j34r8J68L5j20J00p8M1j26J3J37L4p1m9P7J23nr3
9489C6k8n5l4L8o8R0J10j34R7J5p8Nj3M5o8K28n4k33J40j01J35k12K6OL8J85o6
9516E0q2O2j03J8O4q7Q4J00k14M2p1J60P1q2Oj35J42o5P8r4J92p9o6RR8j3k3j42
9544h0M7J6L5m9on9LK9l5K9J27j08O4j26K02p0o6N4o5oM5q7j2K50j69P2R2j52
9572b5P0j27pJ61j16m8J18j1O8j56K3M7n5J66j28N5M3m1j6rJ16q1l1m2kQ6n1K2
9600B9J03j90pJ38j07L4n4R5n2j9J62j12pj5m4Nj00J93j5j20Q7LK5m7m0R6r2J61
9628A10J09k10m9J54l4j76J18p5O9p4L7m0N1J40p0k0p2j3R4r6R5j23M6pk9L6J45
9655A16j63n7R6JJ1p7J78j05J1M6j48L1k0j2L7J22k5R6j47k7j13J39OJ5m3J63
$$ plain form
9462 6 -24 -100 -90 -96 9 -47 16 -108 82 -52 -150 18 53 -67 33 -45 -4 -130 -117 20 54 -17 -66 11 134 129 36
9489 36 8 -47 -81 -43 -111 -21 89 -45 52 67 -11 -6 -19 26 -42 186 132 -101 39 -62 73 -139 -113 -107 -69 116 50
9516 50 -32 30 -73 -55 9 -78 6 106 -108 -66 -137 23 94 12 18 -117 25 -40 38 -56 136 57 -9 0 98 85 62 -80
9544 -80 -33 -17 18 -31 -37 -96 -93 -64 -99 -70 57 -51 13 -113 89 19 -47 7 -58 -64 -19 -106 -118 132 -37 35 127 -25
9572 -25 45 -82 -89 72 -44 -92 26 15 83 -73 -50 -3 -58 108 -20 35 78 37 21 12 128 47 16 -26 -28 58 7 29
9600 29 132 -58 -65 73 -34 0 -54 41 -11 -30 132 20 13 -2 -46 -41 -141 52 37 -83 4 7 32 -15 -55 41 -51 110
9628 110 219 9 -40 114 80 -96 22 -53 16 -58 -21 -61 -10 130 60 40 -32 -45 49 -47 48 -75 -29 -36 -65 -29 116
9655 116 -47 -104 -8 -7 4 -73 105 0 11 57 -91 -60 -80 -92 -55 67 42 138 -9 -36 -149 -10 -4 11 -32 131
9681A31q9q6R3pj32n1R4Q6Jj01J36l5k8l4j08M9Q7p2J59j36K6M2o6Q0k03K11q
9708C9lN1j35J0K5%n2J5O5J4L7j87M1O6n2l0P3J14J1q2L9j81P2O9n1J21Or5J04
9737A04l0m1R2r2p1J39j75J89j3r0j12J26r1Q8N0J1j23k0O5QJ7q2M3k5J6J7rk4
9765c3O1k3J9k5P2J24k83%J91r7J07j77J45j66j1O3J23o8j69J06M8q4R1j07pJ37
9791C7j40J29j8o4q6R6Km9N6N6N2j15nK4N3k17J47J15j16M8j3M7j78J93j02l0
9817g8N5j4Q6j10J22p7O6n6K1j9N1k2n7L9JJ9r5Q0r0N4Q5j2n8N4q2J4m4J20jl0
9847B2j0o3m0J01%n3q6J59l3nN1j1l6j58J22J00r5L5p4K9QJ47j70L4NMq4N2K9
9876b0j31R8R6j29P6k8L5L3p2K7L4Jj8j1K21j93j09J9P6NN0K1j52L0R5Qo1p9O0
$$ plain form
9681 131 42 -44 49 42 -90 -141 -47 39 40 -61 75 40 12 -22 -130 -81 6 -66 93 -43 -17 25 -41 39 -164 47 39
9708 39 36 87 -48 -38 -13 -13 -65 -50 15 29 66 -121 -80 -14 -66 -96 -23 91 102 20 59 -122 -50 19 -32 89 95 0 104
9737 104 74 33 125 33 -38 101 -74 115 102 12 -100 26 -65 23 73 84 -39 -59 6 14 31 -51 -8 -33 -17 0 -9 -33
9765 -33 28 5 24 -1 71 195 -88 -88 103 6 113 -64 81 -85 -96 -33 90 22 -147 -41 7 -77 14 -93 -100 37
9791 37 -103 26 8 -56 -142 -46 -44 -93 -37 19 71 -44 -49 -25 28 -189 -42 73 -43 5 -8 39 -139 54 -48 -78
9817 -78 -23 -37 49 -61 61 -16 50 -6 15 -4 47 25 -32 7 8 27 -68 12 -78 -24 61 49 -9 45 -37 -23 -67 53 52 22
9847 22 12 -51 -91 10 10 -43 -129 30 -3 -8 43 32 -4 -162 -40 60 -35 0 -74 -45 -37 110 -60 -26 -21 -17 -101 -49 -20
9876 -20 -151 -53 43 -86 -10 -38 -3 30 -42 -15 19 20 2 -9 212 19 -90 -71 5 10 60 81 -71 -41 54 62 1 -78 -18
9905a8jO1k0l0o3J85j06Lk1J31j34J61j30o9Q9q5J42K9r3k5o5P4j7nn3K8j9K6
9933b5J28k0j2r4RP7o1r5M4J34j02O2k8m2O6k0n9m4J11nj13J11q7P1rj43K38n0
9961D2k1J37r3q2QL6Lk03J71j0MMj5P5j70N2O1%Oq1P8l2l2N9r8O6M1n6m0J56J5
9992H1q1n5m5K30n8p6M4p3J04j07J50j70M6P7j18M9R6j35o6K11j6l7o3J2O5j16
10018e1J54j02p8J35j4J0k1k7K4n0Q4l9m8M5m5Qj1j01N4R3p9K9o3J89p6M6j04
10045c8j17J31J2r7N1K9P6Jj30P1M1nJ8j17m2J04K7M8o2N6j54O6Nl3R3N2j71P9
10073fN1L3j39L9k6J61n8j42P8m7J06k2j21K50j97jk0n6J2J23l3KO6j31J25m6
10099Aj24J17K9q8P8j04M8R0j41L7L4L5QR1j69J2J20j72L8K7LJ01n3q5L3n4N9
$$ plain form
9905 -18 -19 42 22 -8 -71 114 8 11 -10 121 -13 148 18 -51 38 -47 95 124 31 6 -59 15 -2 -7 -60 -32 -51 -25
9933 -25 103 83 71 -23 -14 63 2 -93 -49 85 -17 45 17 -25 41 21 -38 -82 29 24 -89 22 -65 6 -3 -146 92 42
9961 42 21 158 65 -17 -9 27 30 -173 -2 -12 -8 -4 -19 56 -114 -62 -1 -1 5 -76 2 -30 -62 -3 -101 -35 6 -50 -90 66 81
9992 81 0 -55 -100 130 72 -4 40 -33 71 -36 114 -56 -10 67 -51 -2 94 -41 -107 104 88 51 -12 0 65 -51
10018 -51 103 1 -77 58 44 54 33 6 30 -20 64 25 -23 22 -23 -15 -26 -127 -73 20 -59 -30 -93 96 20 66 -38
10045 -38 -155 -24 -12 -109 -58 -29 47 48 -82 -11 30 25 43 -74 -116 -12 15 63 1 57 -97 -31 -26 -59 34 86 -85 -6
10073 -6 45 78 -61 -22 -48 113 55 -87 -9 -56 50 28 -93 157 -40 -41 -61 -117 -105 18 -15 -13 53 -78 47 1
10099 1 -123 -6 23 -65 13 -91 -43 47 -94 -57 -23 12 20 111 -58 -46 74 -98 -60 -33 -30 71 18 -67 -34 -88 -29
10126b9L9l6mk3J31q2R0j09l4K08j16o3M4q6k9J03k6k0L0j6k6m9RJ94j63J7ok
10154e4R0j48J50j8m0O2r0R6p2O7J1j6r4K5MP6l6M6j62K12n7Pr8k3L5K2p8N4N7
10183B8n1Q5K1p9j2P5j90R8j8J4RM3oo3R2l8l6Q2Kj84J47n0j8J25j19J40j7Po3
10212B4p9K26k57J43j5j01O1m0Q1O0j24j2N6pJ10j62l7K6J23Pk37J30o8K7J23
10237E8j13P3Kk9l1O0m8J64j68m6R3N6k21K23j08m4Q4R6j36J09j20R4L5j08o9
10262i4P4J6N0l2l9p9Q6o8J41n3j6R0j58J73ql0l8j2m4P8q0JL8k8K8j33J72n4
10290a9O9k6k5j07K24j13mQ8o9m7Q8mo7q7R9L5k1%p6J4R8j91J41R9j42O6r0L9
10318b8M5m7M9o6K2L0J00q3n0p6J01K8J2L1o5Jj2q6L0M7p9Q8kl9l9k6J24p1J6
$$ plain form
10126 -29 10 -26 -30 -53 78 -4 86 -23 -57 151 35 -28 16 -70 -99 4 -22 -42 -12 -28 -54 -103 -94 100 -63 -46 -52 -54
10154 -54 36 -112 38 20 -20 42 -48 48 -24 43 54 38 -56 -31 -27 49 13 59 -103 109 52 59 -39 -62 -27 -5 -83 -29 28
10183 28 -23 62 83 4 -8 67 -123 -25 -43 -29 -20 23 17 -46 46 8 -28 54 56 -128 19 -31 -49 76 -43 97 80 87 24
10212 24 -55 171 -86 57 42 -59 2 -38 43 103 -21 -33 23 16 126 -36 -73 -47 76 83 -154 -24 -92 -65 58
10237 58 -55 18 20 -9 -40 20 -28 136 -32 -78 15 71 -150 73 -35 -79 5 101 -35 74 -46 48 83 -25 -94
10262 -94 -20 -4 46 14 -25 -104 -18 -86 55 2 -14 76 -82 91 83 53 15 3 -41 37 -43 -42 -4 -32 -4 -137 35 -19
10290 -19 50 24 -1 -108 116 3 -1 87 18 -29 59 55 -12 -99 0 35 14 14 -62 -48 50 -141 0 99 -43 23 -67 -28
10318 -28 17 -30 19 -47 -25 5 105 22 -28 -104 -3 25 37 68 3 4 -8 -94 -64 -17 -96 -8 -10 -49 -88 -114 10 -61 -45
10347d5Q7K7l0l9p5J9J06L9r2l0Q0j64N1R4N6P3j59N5P2j63R6P7n7m1q3N5q3q
10375h2Q0O3j64M7Q1L1Jj04R3P3j85J24l4mq0K6P2l1rK0m4N7J7j5j23J91j87M3
10403d3KO8j45Q3Q0q8P6M9m5j1J5J06o6l9p1Jjm4K27k12O7QJ5o8M7j27J37Jr3
10432g1k9jM6J7J07k4n3q1Q8N2o1M3O0j06%J3j63J14O5J7m6j4jO4o4o7K05j00
10460A0mj7p2J37K0k38Q5Kl7J95m9l6mq8J05J28n2j93J59j58N2Q3j10O7L8k2L9
10487D0l4K5j49J55j82J55p1J21j91R1O5p5O5m0M9m1r9J08l1qRQ0n9m8l0L6J36
10514G7Or5K1o6J20J06k50J35o3p0R7l8m4L4J4N8j28J23j40l6J31p1K11l9k12
10539a19P5L7Ql8n8J66q4N7k3n3O6j7j6j1K8p0K4J4p8Q0m0N0m6L6L9j8Lk4n2J71
$$ plain form
10347 -45 42 69 39 0 -75 -56 50 89 -3 -33 47 -117 -66 28 84 157 -2 53 125 -38 58 135 78 37 -46 9 -74 -82
10375 -82 -2 61 -103 -56 25 56 57 -47 46 119 -66 58 24 20 -60 -34 38 7 -2 18 -26 31 48 33 -90 101 -86 -43
10403 -43 -41 27 -118 -35 45 -43 33 82 37 26 41 147 81 42 -29 -28 -29 -73 154 -58 9 17 32 -36 11 -116 21 22 -71
10432 -71 -100 -101 -55 -38 69 45 -8 -89 -1 51 -10 33 93 -13 -13 0 -163 -49 16 33 -13 -27 -28 36 -28 -95 110 10
10460 10 6 -11 -83 54 74 -164 -79 -77 -114 81 32 -4 -8 -96 9 137 85 -108 51 -107 -55 28 -82 -15 23 1 40
10487 40 6 31 -118 37 -145 10 -61 60 -131 -40 25 -50 15 -25 24 -17 -116 -8 -39 -47 -38 42 -17 -65 -95 -59 77
10514 77 83 -12 9 -57 63 169 -81 54 -9 -79 18 -20 -64 -30 -16 42 -86 37 -103 -139 -8 -79 132 93 -119
10539 -119 -44 -7 1 -37 -95 71 -13 44 21 -32 34 17 1 -10 18 -52 -28 -14 -92 -12 -52 -2 -48 -12 27 9 12 -12 -64 107
10569A07q3Q1j13q2l5m0R8J18q7R1m8o8k9O5j08J52K7l0Kp4N4J2L9j34O6J08o
10596H3j12N1J39k43N3M9Np5j6P7m3N5j05J48l0q0qJ16n2k3j4Q4l0k6Jj37J74
10623D1j54R6pP4j16j9Q1O8j08L0%j32J44m6k7j5J46q6n3O9j2k9M9L0m9K8O8j67
10651i6J03k1nkO5k8j72K35j23K08j33K1j36R5jK7q6R4j04O8L7J7j59J9P6J18
10677A17m9p3q9mK30p9o1p2J37p3O3j09nJ75k08O1N3n3M8r4Q3p2M3q1J15o7k8
10704i2K20o9j03l0J08l2O4p7n6R8Mj2K1p0P8j2j50O0p6Q6Pk9j5M3kj1o2J28j8
10733An5P4o8P1J23j07o2RkK0R4m0p7J8J1l9pM3j10J14RJ9q8J6J00o2Kj7P6o7
10763aJ22m8n0o0N1K2K8r3Q2N3j60M7J4K2j09J98k65J99q3q1J11OK4Kk3Qo9j11
$$ plain form
10569 107 24 105 -8 -90 -125 -165 -67 51 -36 55 7 -61 -90 -25 -133 19 46 16 18 -56 -2 10 49 -85 -19 89 83
10596 83 -29 22 161 -82 -29 20 25 -50 -66 11 -32 23 -82 66 36 -44 -52 64 12 -11 -25 59 29 3 4 -133 41
10623 41 -113 -17 -24 50 -66 -85 -4 64 -44 -14 -14 -146 -2 -48 -75 -90 56 -30 -83 -14 -26 -55 -6 24 -25 3 71 -96
10651 -96 7 -14 -19 -21 44 16 -156 79 -44 164 31 52 -84 11 10 37 -49 45 -59 9 46 63 -96 -77 -1 117
10677 117 68 -5 -94 -98 132 53 -8 -80 57 -16 47 -62 -67 108 -100 -39 14 -39 9 -85 -2 -74 -31 -112 3 -64 -92
10704 -92 128 59 -44 -74 34 2 66 -11 -67 31 35 23 44 -26 52 40 -110 -50 -126 -40 -33 -62 -77 -34 -36 -47 -109 19 1
10733 1 -54 20 -48 23 146 39 -23 -14 -16 4 98 58 -19 -1 10 -29 -36 7 -103 11 20 39 -49 -33 67 5 7 -10 66 -1
10763 -1 121 73 23 -37 14 36 64 -29 53 106 -54 -7 7 29 -80 118 -147 52 -31 -112 -1 5 29 31 8 16 -53 -164
10791a64O9N3K7Q1p1L9j9l1J34j1J16k17p7L7N4K1J7k6O1M5j30o9q5K02q2o7N8
10818c5NQ7j8q5R4pj17r8J37kk2K8p0Q1N2NO5m9j17R5R1k00R5p2Q1k8J8M0l9j9
10848dj08R1K9L1P7k8M9j30Q0k29J94n9M3Qp3k7Q6j7o8O0j05O9OL9M3j14nM7M
10877a1m0J7J30k10J24J2j03J56n1q5Qj5J45k17J65J11l6j81K58j33j33O2R6q1
10901a2Q4Nk08J82Rk13J2J44O0J4o5l0l0l1mJ48p3j3K8Nk8K7m4k1JoM2Q3j19N1
10931bQ1j34O9p2J3N4l9N1J5M8Rp5r6O0J08o8L7p4m2k0J10K7k6j61J54n8O1r2
10959f2L11k09k7K6L3j47QJ81j52K0M8p3L8N3o5P3n2j7j11P9J00j10O6n1O2j3
10985IJ8k3o5O3j60J71L2K8r1n2N6J12m3p0r4J05j7n9J68m3o6p8J32o9j15K22
$$ plain form
10791 -164 -95 -42 -15 66 -5 34 15 -16 118 107 223 6 -71 -34 20 41 58 32 93 138 8 -61 -146 56 -26 -93 -35
10818 -35 -30 57 39 -46 48 41 -76 -174 -37 -39 -61 -33 -103 -22 30 35 100 51 -66 29 120 -80 15 -57 24 -4 14 54 15 -4
10848 -4 -112 -21 8 39 116 88 137 7 87 -142 52 -7 36 44 -29 -56 30 13 -55 5 -100 -31 -25 14 57 -57 -62 -15 -11
10877 -11 -51 -34 96 -114 10 22 -81 75 24 -61 -53 -68 77 -140 25 136 100 -81 177 44 -89 -27 69 -12
10901 -12 72 77 -131 51 60 -153 -141 3 63 77 12 -18 -48 -79 -83 65 -8 -21 7 12 -16 11 -33 -54 -53 -59 -17 66 -53 -2
10931 -2 79 -55 14 -58 -45 9 -30 21 36 84 93 18 -78 -18 90 22 59 -15 -57 -77 33 60 34 -127 27 -31 30 -62
10959 -62 249 40 13 39 72 -75 -67 114 -38 -18 30 -43 -5 48 -17 56 4 -13 -124 -45 55 -55 11 -40 22 9
10985 9 27 4 -61 2 -158 13 45 73 -18 -70 -14 98 55 -15 -109 -4 -21 -80 88 45 -21 -99 33 -36 -151 71
11011G1j03k0Q8J1o4O8j84K01q5N7l2m1o2J86j14p4J28n4O7M7o7k6J6P5j53J34
11037G0j28M4qO9o0N4j%j12mMQJ55k1r7R4j13M0l0K7J74j85pjP2j39J50kj02N8
11067Ij7N7p8K8rm7N3J19l7p3lk4lm7%J03O8j26K4l9R6j14J26n5P5m5J6J00j36
11096B1j01M7J60j81J08l3r3P6o2Q6l7j71K07j02J90q6L8j73RpM5J73j52%K2l4
11122e0nP9j02J16r8l3J44m5q4J39j66R6j42J36r8O2P4r7J95l1j38P2%L0L7p3
11148A8N3j58K0P8L2J04k74J93q2k9J05o0J07k10J86jm0j9Ll9q0Q3J18j45L6k0
11174b1rK9q9J03o7j05J17M1J98j99j40K34j23J9LK4o3N5Q5j14l2n4O4R0j10l7
11200a01Q5J30j99R1L6N2j46J27r6l4k5O9Q3n6o5m3L0O3m0l4J70q0k8n7M9n2J67
$$ plain form
11011 71 -32 -52 36 47 -17 51 -133 68 -17 40 8 -33 -95 91 -23 -97 31 -23 44 91 24 -2 14 89 -64 70
11037 70 -58 -14 -22 47 -13 41 40 40 -72 -76 -72 -64 91 70 -27 67 -46 -6 -36 -9 165 -20 -27 -28 44 -95 55 53 -49 9
11067 9 -8 49 -29 -1 -10 -57 -4 115 78 5 2 -22 -25 -72 -72 31 99 -27 -3 -42 54 -60 66 11 86 41 57 157 21
11096 21 -80 -33 127 -54 54 21 -72 4 -58 28 -9 -180 27 -75 115 29 67 -106 -97 -104 -59 114 -38 -38 -16 -50
11122 -50 -55 24 -78 38 -60 -93 51 6 -78 61 -105 -9 -151 -15 -113 -51 23 -74 121 90 -48 24 24 54 91 18
11148 18 71 -87 -67 11 43 147 -127 66 -16 -45 60 0 107 -103 83 82 42 23 26 -13 -93 -10 108 -37 -1 -21
11174 -21 -30 -1 -90 13 -54 -159 -42 -1 197 -2 -142 92 -31 -12 -9 15 -48 7 92 -22 -54 -108 -44 46 -64 -101
11200 -101 -16 114 -85 6 42 94 -52 75 -21 -55 -80 -11 72 16 -49 -92 -62 1 -39 -73 97 17 -11 -68 -19 -71 96
11227I6j34k5lR5j4l1oM4L2M1p5M4N3o4j00J37o8R3j8j13K5n3J08Jn4m9Q6jM7
11256I4j62Q6J4J3K8o4J42j56L0m6J2j1j19J34n5N0O4l7j64J93Np4j0J0R0j55
11282h8m7J91j17J61m7K2Mk9J8o1l1K7J36r3o1n0Q5N7o9o3P2k6q1J26n2P3j21
11309f4o4O9P4n9j9P0Q2j57Q6j86J93Q3j94J21N4p1k8Q9l4j06qm9J52qk6N2l9
11336A3r8J86j15M5l4K5J8o1j4K3P5p4K2l6k2N8j7l5J0n1Q7j9N9l7Pr1j4J22P0
11365A02L3j31m2k1M9Q5R6k63P2k2Q8j13O2N1J76k60P2j0N5r0J50k6r3n6P6L6
11391G6k17K91k07k5N5l0M1J36j17k0k4J10J8j29N6p9M0R6Qo3j5N6n6j22R3M9
11417B1j9O8j25L1q6J22J30k08J00l2rL1r8P9K3J25j17j00J80j94M0N1K6j17J49
$$ plain form
11227 96 -38 -63 -66 29 15 -16 -22 22 54 95 20 64 117 53 -47 90 22 115 97 -16 9 -44 64 65 11 -38 48 47 94
11256 94 -68 18 32 45 73 9 151 -5 25 -21 -9 -20 -139 -5 -60 -10 54 17 -147 46 51 -23 -33 -23 67 -88
11282 -88 -135 56 -61 100 53 75 79 50 68 7 -24 3 139 46 -15 -65 20 77 8 -55 17 -9 -90 36 -16 57 -64
11309 -64 -128 -59 15 -44 -63 7 89 -68 18 -168 25 108 -86 35 89 18 -10 79 45 -61 -69 -118 34 26 0 52 13
11336 13 -85 101 -14 31 -3 22 40 -21 -35 -12 63 -11 11 -25 -47 11 -6 -41 -31 -82 5 -14 45 8 15 -76 -90 32 102
11365 102 135 4 -38 -59 -10 75 171 -92 -20 -42 46 -67 -5 46 222 -38 34 24 79 -11 139 113 20 -36 40 76
11391 76 -141 150 -57 -82 -27 -57 -16 120 3 -17 -41 69 87 -42 14 -65 -25 71 79 16 1 57 1 -121 -28 21
11417 21 2 70 -55 -24 -110 12 142 -66 34 2 -7 24 -74 5 28 153 36 -64 116 -78 -38 13 39 -78 71
11442G1k3l5L9J2k3j9Jl9M1q1J9Ql3%K3J15n6J4j6r7O6j6j2L3r4J75j37N9j45
11471a50J76l6J17o5n0P2j1k2j04J50j0j36J27L9p3P0q4p7L9R8n8j5k7k5Q9p2
11497c8K8l5J34L6k12MR7m3j07K15J4p8l0j76Q5N5O9kj26M3R1p7O6j92J92o8J49
11524I4j39o8J41n7J6N0n6k9J73j26rm2n0OJ04K7l9O8j47J8n8J04r8J19j00N0
11550d8J48j72J06j29J67j28M4j02K8J86l9j47q0J80j8M0m8Jn0n1K07m6Pr4P6
11575C8M3j68Q3p5J20l0N0k1r8K5p9O9J00o8P6m9M6n4q5k2j5J43m4l9N0m1M2Q5
11603H2o3n4J05j25PL7r9J40o8n9m7J89J5Oo5K1j03LL2J61j57J27r9M0k6q7P5
11630a2qj39N1P8jk6J12j24O3j18nN9L9M8q5Q1K4j10P3r1M1J16M8r3oO5j72J28
$$ plain form
11442 71 48 13 52 64 41 22 23 -16 25 -56 -37 -29 -62 -62 -39 76 20 34 18 -79 -13 -29 -41 -8 -102 73 -64 -5 -150
11471 -150 26 -10 107 42 -8 64 53 31 -73 77 67 -69 58 97 24 94 10 -67 -28 70 12 -3 -30 -55 34 -38
11497 -38 -10 -45 89 125 -87 -83 14 -29 -136 79 93 15 -15 -191 -106 -51 18 16 -110 -67 24 -53 13 -179 13 -55 94
11524 94 -45 -113 28 -29 -13 37 -19 -48 125 -1 -10 -52 -102 -96 8 35 -4 64 -83 -65 -123 -19 -117 2 -98 -48
11550 -48 100 -72 34 -95 72 -56 -12 -114 -86 100 61 -86 -166 14 -4 36 -12 -11 -61 -112 95 49 56 -38 38
11575 38 81 -87 -4 -79 41 11 61 40 -58 -33 -112 -43 57 -11 65 16 62 8 -77 -99 -114 29 -15 -54 -4 -45 -3 82
11603 82 19 -35 70 -55 -48 -11 -110 30 -38 -97 -144 45 60 66 1 22 -81 -78 -46 115 -42 85 -14 26 0 -87 -12
11630 -12 -20 -159 -108 -30 -31 -57 55 -69 -6 -124 -129 -70 -31 17 -68 13 37 -73 0 -91 -50 66 114 21 15 80 -92 36
11658C6r1J18o8J04o6k6m5k0J7J48j44j2J4N5q1K0R9J9j43Q6J9k2lj5J66j72J02
11685I5j72J42l1%kKMp7l2J27m7l9P8j32J41j24J15j53Q0J0q3O2L1p8P0K1m4P
11713b9J20r5Q3n7P4q8p0J2J11J7j5q8R3j16jL7q8J28j05Q7m5J7L1k3K5j12J4
11740h3J34RQ9j46p9O4r3P8PO1M6j26K8k0L9k3j6P3o9N3J8Mq8nJ09j37J22q7O9
11769C1Pl8l9O7K1n0N7J0j93J73n9Kj0l7N1J8K7lk6p9J12j6r8J24r8L1J22j02
11797Er0K8J94j08j43P1M5J7l9j4n2M9Q4j95J41L8N6j43j6J09p8J47j45LM2pn7
11824e8J09j30K4K1M1LM8j49P4k6N3o0m1Q0J2pj84N6Q3J83r4nRo8l5m7J36m4l1
11853d7J32m2n5kO2K9nm0R2j26M7lO3k34J05O7p3J23k08J12N7j75P9m0M7l5J39
$$ plain form
11658 36 -55 63 -5 99 33 7 -38 -58 -41 107 -37 -49 -35 20 -61 -41 58 77 -66 20 39 17 14 -1 165 -7 95
11685 95 -77 65 34 34 32 34 38 -39 -71 56 9 -30 48 -84 57 -67 48 -105 -25 -15 -98 -36 -5 -83 -13 8 -36 -29
11713 -29 91 -4 79 22 96 8 -62 -50 61 78 63 -25 68 -48 -49 -12 -100 28 -77 10 -35 -18 13 -10 15 -97 -83
11740 -83 51 60 149 3 -76 -12 -105 -27 -20 41 87 -39 -11 -31 8 -15 -31 42 -27 26 44 48 -40 -45 64 -73 49 -38 31
11769 31 38 0 -39 28 49 -1 56 66 -127 46 -13 -11 -21 -58 -7 11 38 35 9 -70 42 26 -72 52 -46 -15 107 5
11797 5 -85 -57 137 29 -114 -43 2 19 -20 -34 -86 -37 47 -148 -7 31 87 -56 -72 37 -41 106 -39 -36 6 -1 -58
11824 -58 51 -79 -55 -34 7 10 58 -91 -17 -43 10 -50 -91 -11 1 -6 -190 -134 -51 132 38 33 42 -26 -61 -108 28 -16 -47
11853 -47 85 43 -12 -14 48 77 72 32 124 -2 45 42 105 -129 -24 43 -30 93 -115 -3 54 -121 -42 -82 -35 -70 69
11880F9r9J7R1j18K1r4R4J03j27J16j60M7o2K0P6JM5j29LM6mp1R2j7J20j54K0
11907e4K1m4J02Rq4Q5j05n9K15j01j4l9J03k8j23J36jP4K9j03j78K21o3L9j6J1
11933C3j55J80p0J32j31L0j7N7l4j1M8k26J05kKJ04K3mK3r7l5M6J28o0p9n2k9
11960i1J84j58J09oq8p2J15j5q0lJ4J7P6l1Kl2L8n5J11j2K2N3q6Oj12J21p7OL0
11989a4Ll5l0J44p3Q8r8j3J58j43O2l4K5l1k0Q2p5rl3N5L6q7J3m6J07l4n9J37
12017G6o8p8J39j49J42j0m5j16J34j4q0N5J18j45P0J9P4r6n5o5J06j14L5J60p1
12042B2o7m6M6Q0jO0j28P6j40k4J07Rol8P2k3K1lPK8LO0j84O1q3J49N9k42J02
12071b3L3O8n6JK5k3J4m6j61K14r3M7P8Q6j43j28Q2RQ8n3n2o4Q6L5r8QJ47j58
$$ plain form
11880 69 -30 -13 78 -40 -19 -113 -19 84 -43 73 -87 -40 -102 -82 -6 -5 40 -89 -86 -40 -44 -115 -23 -40 80 -74 -54
11907 -54 -33 -77 25 34 -50 35 -70 -129 86 -15 -29 -68 35 7 -116 20 19 93 122 19 -159 62 -1 38 22 33
11933 33 -122 58 -12 120 -11 19 2 59 25 14 62 -164 -59 -61 -59 45 68 64 87 -10 -45 1 129 69 -10 -62 -91
11960 -91 93 -65 44 38 -50 -122 -7 -22 -102 -105 -91 -74 2 -29 -27 -59 -21 -76 35 23 45 98 12 18 -94 27 -50 -44 -14
11989 -14 -11 -46 -76 68 -5 83 -15 -28 130 -13 49 15 40 9 -11 71 -4 -13 -46 9 45 -42 -29 -75 32 -2 -61 76
12017 76 8 -70 69 -80 62 52 7 -109 25 11 -69 -14 104 -41 29 48 122 26 -29 -94 12 -102 -67 93 22
12042 22 -45 -91 -45 35 34 94 -34 42 -98 -122 -15 -6 -12 -50 22 -1 20 17 24 52 55 115 -69 -8 -91 58 117 -125 -23
12071 -23 10 78 22 23 48 25 39 -7 -168 46 -47 0 78 164 21 -107 -25 -16 72 19 -33 -97 -11 24 -74 -66 81 -77
12099g7J37l5j33J96l3q5R4Jj62J53r7L3n2j00J63l0O0l6n7j7K7R2J3k1%j6Q5
12126A03j1k4j2N8l5j37J06j02k3M7k8J75j42n2Q1Jj5R6k09J45o6j4J8poR1o5
12153b7j2J24m8j20J54j46k8J70%q3NJ45j84K0R9o6L2O1k5r4P2j37Q8L1L1j6j6
12180C0o9rN3O4j66O6L0K0nj07K3J28O0j25k4K0o9R0O0j82J46K1j50J80j37J00
12206D8O4j08k9l1PJ9M2kj8r3J00lPq1K45k24P3j29J19q2Q5n4m3J00R6j30J5L
12234dq8J22K2j5j66J60k3jl3l4K1oN2J8r6R6p4M8Q2p8l5J36nj54P6k4k0jK8k9
12264b5j3J18o9m0l6J30m8J02j36o6J39r7j2J4k1J51j23p6J18l1j2M3J7j2Q6r2
12290Ij6l4P2j89J05O5j5o1J85j59P6qk9L3m3l1J24j34j4M5k9j20J83J9J2j07
$$ plain form
12099 -77 60 25 -108 88 55 -30 64 65 -97 56 -41 -8 -60 -160 3 -27 33 -3 -60 -77 -50 42 55 34 34 18 103
12126 103 92 68 56 114 79 -58 48 -54 -77 -30 -58 117 -25 -77 4 5 -10 86 -123 22 -44 -58 -40 -47 -53 38 -27
12153 -27 -39 85 37 -83 71 -75 -103 67 67 -16 -11 134 -50 -30 69 3 35 96 71 -23 49 -88 0 31 62 46 30
12180 30 -39 -48 5 69 -97 -31 -1 19 14 -93 -70 58 118 -7 -31 -11 -80 10 70 -112 34 55 -95 85 -52 48
12206 48 112 4 -25 -56 -49 -30 12 10 -8 -101 -1 -4 3 -78 167 -57 16 -113 6 -76 9 -45 -88 12 108 -22 -7 -4
12234 -4 -92 30 52 37 -129 31 8 7 -26 -60 -39 -45 7 25 -71 25 -49 -1 81 3 -32 104 99 -55 21 -3 -23 -24 4 -25
12264 -25 -38 80 11 -29 -65 65 17 119 -17 -83 56 -41 -53 -39 -60 91 -32 -108 10 -21 -33 10 27 15 101 9
12290 9 -7 -41 31 -158 -53 12 -3 -64 121 -38 38 30 1 34 -9 -40 84 -50 -64 -19 -48 -168 15 34 46 -61
12316f1J17k7M1j16n6R1K0Ol1P0n8Pl9j4J51j47P2J0o9O6J7j6j28N3NJ00j50Q0
12344fK6j1L5nk3k0m3R3j6O5j42M8J3p3J3R0L2j24P5N6j13J01kJ01j17l4O2j49
12372f8j2R5J6m0m9Q5j52J02JO3j65K76p9j39%N6K9pM1p0m1J0KQ6j58Q1K7k1j6
12401d7N5j1J36j88l4q2R9P7lP3j42N5m8J13r5Q2r9J5N1j7pm4M7q4M1O1m5K8k0
12430c3K4J0Qj5l0j2q2P8J12k4L8r4K0j24K5K04pk12J11n7o1J69m9P9j34QJ22
12457G4j05L7M2j38M0P2k1j00M9J18j06N9j39L1J66j59O2J49p3m8nk3l6M4K0k
12483Hj9k8N2l6n3M2Q9pp8J5O5j27J90n4j22k0N1%O1Qo2j8J17k9J0j93P0J12j18
12512g4K3l2P5O0m9l9P2j14J23l6l8J7K6K9q6J9rk0k3l4K1J35q9J9J87j62q1K7
$$ plain form
12316 -61 56 29 70 -46 -102 -11 9 15 -16 54 -4 3 -36 -50 101 -46 26 36 -33 33 50 34 -94 -41 -36 64 -86 -6
12344 -6 20 9 44 39 16 -4 -47 46 30 95 -47 1 14 -59 -46 44 76 -48 27 83 -30 71 69 170 53 19 81 -68
12372 -68 -80 15 31 -9 -58 27 -125 -23 -22 41 -124 152 73 -66 -66 -10 19 12 53 -17 -58 -48 -46 40 -118 -37 -10 -31 -47
12401 -47 8 -3 133 -55 -89 -171 -72 5 2 75 -67 -12 -60 53 -42 40 -59 -44 7 -10 -17 -61 -14 -98 -57 4 -41 -13 -33
12430 -33 -9 1 9 -6 -36 -48 -130 -52 60 36 74 -20 0 -124 -99 105 98 -114 -3 -60 -121 48 -1 78 -56 -48 74
12457 74 -31 6 48 -90 -50 22 1 -99 -50 68 -38 21 -118 -87 79 -80 -18 131 58 10 5 -18 -54 -10 10 8
12483 8 -11 -39 13 -23 -76 -34 55 48 -30 -15 50 -77 113 59 -63 -83 -32 -32 29 37 -25 -43 74 45 55 -138 -68 44 -74
12512 -74 -51 -83 -8 52 3 -36 36 -78 45 9 -29 -12 14 43 -43 -24 -33 -53 -76 -110 -89 46 -43 -24 163 1 -80 -53
12540e3P4J2L5r9J2P3Kj37J48j76J34o7L3J03j43M8L1j36Q2n2J27l5n1L8k1j5
12566c3M4J1O3n2K2q9L6l5R2j04o8J27l1N0j37R4q3J47J8o8J03k48J00P2p6O3
12592A8j03M8J4j06J38m2r3K54k33J60m9n9j6J45j84J37o7k1M3l7J54j30L2%m7
12617d4L0O9j7o6j3J3%j17J95j06M9P8j29J43j50J58j08Jp3Q4J0o8N5jL2j16Q3
12644hL6q4O6J00j62M0L0j48Q7m8J9Q9Rj7p4R5p1P9p8LP8oR4j47O3n8n1M3k4m0
12674h5J32k09J81m6N7k2j6l7J09j79M7L2k7N6Q0j54J01j44J81j11J09q7J3j7
12698c6r8J60j1n3Lj2j9J17o8L1K2Q2k27J34O4j47O1m9l2J05j02L3l7k5j1R7q5
12725a03P3Q3j40L1P9k05J48ol3J02n8J8J6k0j79J63L8M3k8j27K1J6K7qJ3K3M0
$$ plain form
12540 -53 21 33 68 -31 -19 54 56 -81 67 -109 25 -42 -9 94 -49 -1 30 -106 -24 -76 51 16 -35 3 -18 -33
12566 -33 11 22 85 33 55 -34 2 -33 59 -45 -113 14 -17 33 -104 -10 -93 54 72 4 107 -141 -41 31 -45 18
12592 18 -85 -37 -23 -129 9 -33 -126 128 -105 55 6 -53 -69 76 -108 29 -38 -59 -16 -53 101 -29 3 3 -44
12617 -44 -14 55 38 -28 -41 -28 -28 -145 50 -56 -7 71 -58 85 -65 93 -15 -14 -87 -3 7 -61 -6 -7 25 -91 -8
12644 -8 28 -56 10 110 -52 -12 18 -130 -43 -91 -72 17 26 9 -65 30 -41 38 -40 -37 41 35 129 -18 45 -13 -64 -21 -45 -85
12674 -85 47 -162 19 -27 30 8 -8 -45 64 -115 -68 -36 -63 -7 73 -81 20 -124 57 -54 55 -32 -19 -36
12698 -36 -134 26 15 -38 -35 -47 -66 51 -17 14 36 118 -109 25 89 -58 3 -46 -78 27 -75 -42 -79 -104 -115 -18 -103
12725 -103 -30 53 -87 -56 23 -182 -34 -40 -73 29 -29 -11 5 -15 -194 -31 7 50 22 -105 -84 -68 -41 -49 -36 -13 27
12752B7j20J37k1L6j13J36j54N2O7m8J10J2m5n4m0KJ51j29m8l3K2J18j41K1k6
12777h1Q4M6k5m5NJ18k12J31l1J0k9K5J2N9j20M6J3j68J40p2J02l2L0R5k22J15
12803fm9j81K36L0O4j92J14q9j2o7J88o8k5J46j89K07k60K5R5q1J89o0P6K1p1
12828D1k9P1j40R7j8j13P4N4k5Q5n6Ko8Jj1j42J77M2j26J11O9o4J8j41K02q8K8
12855E1n4K2m1Nk5k6N8M6r9J33r0M0l5L0j01Q2k4Ll0mO0j26Q7N7nJ0n9O4l4j9
12885b4r6J25Q8j17J29j70P4j18J24q6Q0J22k14Q7p3R4j1m4P1o6k1J38l7l8J1
12910B8kj4l0P3j09J1M1M5r3M6%l4p1J83o3mk6Qk4L0kP6qk5kl6J22k44J70j9R
12941C6k7J7m3L6n2M8K9m3o0J6Q6r8J97o7p3Or8N3k5J68J6m6pj0l3q9%O5k8M9
$$ plain form
12752 27 -93 44 23 59 -54 82 -72 -20 47 -1 109 121 76 22 -18 -16 135 6 -42 -75 -53 65 -76 -55 -81
12777 -81 3 49 24 -21 -16 102 -110 21 -10 0 -29 -4 8 67 -53 -7 6 -162 -22 -94 8 -24 6 101 -121 -6
12803 -6 -55 -236 0 30 94 -98 16 -73 -85 -152 36 -32 -57 89 -100 107 -153 -128 -33 -114 75 15 91 112 41
12828 41 12 83 -57 40 22 -91 -17 37 12 97 41 43 -25 -24 -35 -177 0 42 -84 27 96 32 50 -91 111 23 51
12855 51 -3 19 -22 -17 -42 -68 -10 36 -63 70 -20 20 -15 15 -86 -4 -28 -25 -55 -59 1 -125 -38 19 14 24 -35 29 -5 -24
12885 -24 -120 5 93 -24 105 -65 9 -109 15 -71 9 131 -83 4 -69 25 14 -30 41 -25 -46 92 55 17 28
12910 28 26 12 -18 55 -54 -43 -2 43 -50 -4 -4 -38 -109 74 11 7 -19 -11 -35 -5 -7 69 61 36 34 -2 120 -124 46 27 36
12941 36 9 26 -17 19 -33 15 44 1 -59 -43 43 -55 142 75 2 8 -90 -37 -62 106 122 76 69 59 26 -63 -63 2 -26 23
12971B3p0K2N4r7J24Rn2m7J1k7M2n2J87Mj78M4j2j5l6J7R6j29P4o8kJ86j68J09
12999D9lk8k1l1K8K4J05l3o9j39P0J8J15k1j15K5P5o4pR3O5k52J59l3p8R7j73
13026a44K42j28O1J10o9n7K2l3L5j07J99j61j4LJ4J1j04J58l1j7J8K6L6r7K0R5
13052H8Oq1nJ03j07K8p9OK5M2k6j14J35QM2l0q4j9pj1K3n2K1L7J10j20J10l7j32
13081a20P0k5O6L3L4r8m7Q8k5J51j55P1m6j0lJ17j24J4k2p4J09J05l3j93J23L4
13107D0r7P0k8N5p8J13j63P2L4M2r5j16J10N4k9M8rk4o8K4J47q5Rr9R0q1RN9n
13136aoL3pn3m7J2K5N5p4J5J08j30R2p5J25j16J51p3j7J00j58K0k2j6K0J3j4m
13164d4J10m1l3l3Q9k0l0p3O2l3%J11k6k2r2J06m2O4m9J1j73O3J01Q9l1nQ5j35
$$ plain form
12971 23 -47 -25 29 -68 56 65 13 -34 -23 -50 -8 -60 127 131 -47 -3 -15 -30 -66 -49 47 -82 -8 -76 -78 108 -60 49
12999 49 46 18 -3 -34 -6 18 123 90 21 -118 -48 -30 85 64 -51 -26 49 -15 -22 71 136 -116 43 10 -68 29 -144
13026 -144 98 -30 31 141 72 15 37 4 39 -68 131 -30 -44 -41 -27 -16 -120 38 7 -10 8 34 70 -27 -7 88
13052 88 94 13 8 111 4 32 -47 -41 -16 26 0 -114 21 29 71 41 -43 -62 -69 -80 -57 -109 -88 -51 59 -61 49 12 -120
13081 -120 -50 -75 -9 24 58 -40 -87 1 -24 127 -28 43 -3 -13 -16 101 -23 -9 -31 -105 4 109 76 -117 6 40
13107 40 -57 13 -15 40 -38 75 -88 -16 18 60 -35 -151 -41 13 -16 32 23 -1 -69 -45 102 17 26 -73 17 -64 -55 4 -1
13136 -1 -7 26 19 -34 -81 -69 -44 11 -63 -48 60 -70 22 -53 72 -44 107 34 17 117 -41 -21 -43 -59 -39 -26 -40 -44
13164 -44 66 25 -8 -41 48 28 -2 -75 -13 -46 -46 65 39 17 -75 31 -11 53 4 15 -158 -95 6 95 64 59 144 9
13192IJ00j41P2q9J19o4q4n4M0Q2m6J17J04k44O1J6J0J1N3p6k6P7o0n9K8L3P2
13219F1j5k8J03j19n4M1j15l4R1Q8n3Mq5J42n1P4l2J3Oj1l7p6J69n2l2l0L5j20
13247a17K08j05l9R8j0R0q0j48P7l8QM6J9Q9lr0NO8Nq3J20j75Q5m1K6jK5j3L0
13276E6J8J9n2n7J05p8O0l2p9R1n2L4K8l0l6pJ03q9o2K0Q5q0Kn8J7J4J1l9R8k8
13306a8J66j15m2qr1mM9O6J27j38J46j30k3JK2RL9m8K5o4L0j9J16l0j39J57j29
13333d5N%M8j71J42J1N6p5J05n7o1l5J31J9j17R6P6j1j06j7P8o5q3R7j05J09q9
13360f4P2%k0j0PN5k9r1J52r6R9j16P0j3o9J21j56J42j79O4n2K02O9j28n7N9j5
13387A7J4r0kL9oK2rK6o5o5K7J87j29ql3Q8L0m0N7p6o3K2L1MR8j04J22m2j6k9
$$ plain form
13192 9 109 -32 40 -49 70 6 -78 -132 -92 -10 -56 61 165 -79 -18 -2 8 19 72 -4 -30 47 -13 -72 -44 -11 61
13219 61 46 18 121 2 -52 -11 -126 -160 -69 19 -34 -30 -115 27 -24 50 18 31 37 26 -11 -87 82 30 -2 -32 3 -117
13247 -117 91 -14 -53 45 35 125 45 -103 -26 -64 -56 -10 9 98 95 5 10 78 83 0 120 -55 30 -11 15 14 39 26 56
13276 56 74 93 41 -16 89 11 71 39 -40 51 -1 33 61 31 -5 -12 91 2 -60 -40 45 -35 -33 -91 -74 -60 -49 -88 10 -18
13306 -18 148 33 -9 -17 -108 -112 -63 3 130 -8 138 8 -15 -14 8 17 56 8 33 -31 -1 -20 96 66 -73 84 -45
13333 -45 -40 -40 8 -163 -21 -10 46 -29 76 19 -42 -77 54 73 -44 52 128 117 11 -6 72 7 -76 21 -84 25 -64
13360 -64 8 8 -12 -22 -15 40 11 -80 72 -24 75 -41 29 16 -53 68 -88 54 -125 -61 -113 89 158 30 -27 32 17
13387 17 31 -59 -61 -22 -28 -6 -15 11 -54 -119 -92 95 -34 -42 -75 13 43 3 60 -16 -79 -57 -26 -22 76 -28 94 52 36 7
13417GJj2O8j69J48L1r5J46j09l0p2N6q2K66k20M9m5L3j32J63j12n5J04M1M0n8
13443c8j5O5O9j24n9J01j0n0P2J3m7o3N2P1N3j26O6M4p5j0K3J98k63J40j06j37
13469a56J72J6O3o2o0N9o2J39j56J00j3n9l7J29p9J0J7o7l7J36o7j8M5n2J5R0
13495F6r8J8k5L0J9KJ2p7O8j31J16O0o3n7Q3k55K21N9m6l4J88j65pl0k6n0N7j3
13523g8P8p8K13j55O2q9J32L6j38m6m7L5R5n5o8J62l5K6P2j30P6j34O6R5j85J64
13549G4n9o7pJ38j37Q8J5j2J1j00J04j42K10j29l7Q2n1m0N6%K6q4N3N4m9l8n1
13576i2P0q3J74p3MNj28J91j18k2J1J07qLJo1K2l6qJ2L7J1j8l3J04j17j9l1N1
13605d4Mj1M2O3o3k2J19j21o8J25RL0L0k10k3J87k2oj41K40l0o5J19j28p3N5m1
$$ plain form
13417 7 8 -4 64 -105 43 74 -21 125 16 -14 -86 -30 -112 154 -66 -17 -62 -29 -161 2 -110 -165 -61 -20 20 -38
13443 -38 -53 12 81 -43 -102 -1 -11 -61 11 24 -23 -86 -34 37 90 -36 30 74 -1 -11 12 210 -53 87 -19 -156
13469 -156 16 32 95 33 -27 32 -30 109 -47 53 40 -19 -56 73 -6 4 21 -46 -83 53 -14 -32 13 -39 -24 66
13495 66 -32 -14 -39 -9 10 12 24 -53 15 -116 0 60 -3 -60 23 -232 -11 48 2 -32 156 -9 -16 -46 -72 -122 -65 -78
13523 -78 0 -78 135 -20 42 -47 85 121 -17 -63 -110 -75 20 -35 -103 59 24 50 122 -8 68 -66 0 95 -90 74
13549 74 15 -52 -59 79 -58 30 45 33 44 -56 48 -94 116 -13 -50 32 -19 -59 -3 -3 23 -61 -8 46 -3 -41 -92
13576 -92 -22 -105 69 -4 0 5 -123 68 -50 -72 -61 46 38 41 42 -19 3 -33 -41 -29 8 19 1 -32 72 -45 -64 -95 -44
13605 -44 -40 -51 -9 54 -9 -31 88 -33 -101 24 33 63 93 -117 -140 47 25 19 -122 118 88 23 142 14 -59 -4 -45
13632d5Q6m8r3Q7k9j7k9J21n5Qpj5J56r7j26J53l7r2M6J13l6j02O0L0q3M0O6o7
13660a2P3j58J64j2r6L3O1l7M7P5m8q2P9n9o7R9m4J8m7N5ll2j38k7J29QK2p7K1
13689e5R6j19Q3R1j23mL0j50J48m5P9k4L7j44%J96r3m3l7J32r1kK0q3O3J86k30
13716h2K5J44n6j36P7M3n3Q9l3p5J26j36L0lM8M8J1q8l5pL7n2J5J2J6P8Rp3OQ7
13746G2p6qMN2m7rR8K2j54ol7J87m1p4j7kK1N3k1m1n0J71n6j10J13j1r9P8pj40
13776a35J84K6j31R6n3LN2n6M1o3J44m1j5o9L8LJq7K9R0j30pJ28k7J1k5p9N3L8
13805A9K4j54N6J52k05K25j89MP0l4J07j54J42K7j22J59n2n4q7P6P8j89J66k0
13829D5p6l7L5j7m2J31r1J47j78J01p9N3l5pj6Q9j81J04N9K5K4L0q3l3J62j24
$$ plain form
13632 -45 41 -7 -100 -13 -42 -59 -88 33 -22 -14 -21 -36 120 23 -103 50 13 -79 -33 80 44 -58 2 32 -51 -11 55 -12
13660 -12 61 -97 67 55 -41 -8 53 16 63 138 90 8 87 28 -39 60 16 34 -13 42 39 7 -131 -158 -29 -21 1 -76 -55
13689 -55 41 -78 5 96 -27 -31 -1 -151 -3 -48 31 7 44 -100 -100 96 3 -40 -77 55 -36 -38 -18 -101 -38 148 -82
13716 -82 -57 87 31 -105 -28 15 -38 51 18 -57 69 -67 -37 -40 8 56 67 -21 -56 -63 -26 -78 -63 -51 -35 43 52 -21 -15 72
13746 72 -4 -12 -8 44 -3 -12 86 108 -46 -52 -89 98 57 -17 -34 -36 -15 38 17 -24 -74 97 41 -69 44 33 -66 12 5 -135
13776 -135 49 75 -56 40 -13 -10 42 -14 27 -36 108 67 52 -17 21 24 25 -62 -33 57 -73 -80 48 21 32 7 -72 -19 19
13805 19 43 -111 -55 97 -108 117 -72 -68 2 -32 75 -79 63 90 -32 127 75 21 -66 10 88 -101 65 45
13829 45 -31 -68 -33 -50 -92 39 -52 95 -83 18 -61 -8 -43 -50 -66 23 -158 -54 5 30 54 84 1 -32 130 6
13855Fk4P8j46j3K5J54j31nO6MM1L2j11J4P1Jk3j13P7l8L6j3r8J48qj20j4P2J4
13884a8P4Pl3n7j30K14Nk6Q7j43m8N7P4j1o0j8mk7Q3M5o2m5l8O6m4Q1r3l3J54
13913E7K3Qr2J3p0P8Qk2N6k2o7qM7l8P7k7j17m0P9J72j39L4N4j51J19j5O6j00
13941a7m6N6J5rR7l4q0M0j65L7J38r5Q2KO8q3q0o8K34k2kk18J82j3l9Nj3J7r0
13970a01Q2m2N2O4q9J24p5k2K1k7o4N9R6o4k8J27k06J77j65qQ7N3M2K4Pk12O5
13997b3O7m8N1r6J47j55J10N9j00o6KJ39j40M2m9N0L7q0M4KL6j9pOk6k8M9p6O1
14026a1p7J40J8k1j64J50k8Nn0M2k3q3M1J56p0l7J46j01m3l5N4k5k6Q8J7l1l5
14053cR0q8K5R7r6p3qJ22j25N0j18J23L5k00J39M0lm3J01j0j49O6Pj48K23r2N8
$$ plain form
13855 6 -18 60 -86 -99 -74 80 -51 -56 10 14 55 87 -24 -10 61 62 39 -74 3 -35 1 -12 -110 38 30 -90 -104 -32 -18
13884 -18 56 63 30 -27 -157 57 62 36 123 -20 -68 -11 63 52 -8 -26 -30 -57 26 71 9 -36 -74 -8 -52 29 -64 -97 57
13913 57 80 88 -4 9 -61 17 25 3 59 37 -30 -38 9 -29 48 21 -96 -136 -57 115 -24 10 64 -87 32 17 83 -17
13941 -17 -63 -7 8 -1 96 62 -18 22 -143 -106 32 -63 19 21 89 6 -74 -142 92 70 68 -150 32 19 -20 -15 -28 -11 -101
13970 -101 -19 -61 -9 55 -34 90 15 -7 14 -13 -77 -18 78 14 -14 113 -93 84 -81 -89 -2 51 93 117 124 -88 -23
13997 -23 44 -4 47 -49 98 -57 53 112 12 -54 -52 87 -53 -11 -60 -10 27 -53 -9 -7 29 10 3 9 -17 -45 4 -72 -11
14026 -11 -88 52 70 49 -115 35 7 12 -38 4 -19 -102 -61 95 25 -12 134 33 -10 -45 9 -16 -42 46 63 32 -3
14053 -3 87 -1 24 121 25 -48 -56 66 -59 -9 -127 -4 31 -169 -30 10 7 -36 65 55 -94 -28 -21 -169 54 -38 20
14080B0JJ8Q0r2J9NK1j7j7l7n6Jr6J95J2q7m0j4N1J20r7P3jqp9q2K07q5K2Pn5
14111a1J8j0n1M4P6o7j18Q5j0J31q4R4l3q4oMP3nN2j41J4j1K4J09m7MQ9o3N4j32
14141bM0l9l3J84k03qJ36n1q6M3O4m6M7r0P2j03M8o1j4J24k4j7P5K2k1j71J78
14168F4r2N9l0j4pp8J84j86P8k7J21j26J15K9j51J33j89P6k3K4O9r5J05q4kj10
14194a57J61k5LK8o1R9k1o2qrk8J20o5M9r2J41J8M2j85P5j09N4l4j6J23j68J23
14221dR5j58O4j4l8J7m9J96k05J90o1l8j11M5N0rN2N4j28J46j26jK1M0k4rrqR1
14250F9k2j50J28k7L0k7J7q0n9J59m8J07j2j16n0K3J2J4K8k4LJ08j43l2O1O3o3
14277c1R7j4J3j2r8k5K3n4J50l0n2qk3j5J4Q6l2N3q8N3n8K6N0r4l2K14j89J7N2
$$ plain form
14080 20 21 39 119 27 46 51 72 55 38 1 -55 -54 -150 45 57 -30 -70 -84 -33 87 -10 63 62 54 -25 -107 100 15 37 44 -11
14111 -11 7 -3 -54 -10 66 -1 -119 -34 -44 87 3 97 64 -20 -26 -22 51 46 98 -43 -29 -40 -16 93 46 50 139 76 130 -2
14141 -2 38 -1 -34 150 -53 -61 75 24 -62 -19 45 -1 46 -44 28 -75 -27 -88 -102 22 -2 -19 56 78 57 -114 64
14168 64 -28 31 1 -13 -20 -98 86 -100 -22 -49 72 -54 61 90 -61 72 -117 -41 -64 -40 29 -66 39 -45 -47 -157
14194 -157 4 -21 -18 10 -51 48 27 -35 -43 -52 -80 40 -25 24 -68 73 91 133 -52 23 -86 -32 -66 -82 41 -127 -4
14221 -4 91 -67 -3 -17 -55 -38 -87 109 -96 94 33 -5 -116 -71 -21 -30 22 76 -52 94 -32 -33 -12 28 4 -5 -14 -22 69
14250 69 47 -103 25 -2 28 1 18 -62 -121 38 -10 97 85 -31 -81 -58 -46 -32 -4 -28 -25 83 -60 -92 -31 32 -31
14277 -31 66 52 65 53 -45 -70 -47 -101 49 19 -33 -41 -64 -79 -65 21 -11 42 -46 7 -51 -25 25 -69 -101 113 -76 -59 -7
14306gm2L0jp9J10m0P4o7qR5j1j2k1r9J11K4j23P6j01k5J23j3K4M3j64R8l1P8
14334D2lPm7O2j54O9j7M8p3l4R8rn1n7O2J52j72J53n1jn5rM0O0j26M1P7k1k3k5
14364a7M3m2qL0J06r5KJ25k26O2J13j43J7M4K6j15K04j48R4M4pj81K4o1R2q3J18
14391A8Q9q7l8p2J48j06P6r1O7K6m1M5Q3j20j88K26k5Om5R0p2n8N3l9n7J35p2
14418d9k5Q7k5j09J63j49Q7p1N1L6M1j51J64j03J23j60J07Q8n0r6pL7k7k29K67
14443@J08j59p3N5J8O0j05O7rJ83l05N4J07n2P2n5J20j17M5j02M9KN2Op4J08n9
14470dO3j06J9M3n1J32j28J01m8l9KP4l6Q1j18k7J17j25J29l1L9n6j09K2J08l7
14496A5R6n5j66J30l3j4J46r7q4N1m8J16j9o0k8J9P1o4JL0r4N2J1K9j00J6J27
$$ plain form
14306 -7 -49 -19 -20 -99 11 -29 45 -22 -30 65 54 42 21 -78 33 57 -66 10 -91 -116 7 -6 18 61 -103 -5 -36 42
14334 42 39 46 -1 61 -93 -24 -41 7 -66 -100 -2 -11 -62 -119 -57 95 -77 76 25 24 -31 -40 0 60 -66 -25 52 31 8 -17
14364 -17 26 -16 -24 6 112 17 19 144 -82 -20 93 -50 -33 11 37 -78 126 -22 72 116 109 -72 -48 -109 -17 -100 18
14391 18 107 20 -18 -90 58 -48 28 -63 4 30 -11 34 117 -3 -191 35 10 16 -29 61 -11 -69 -16 -55 -112 23 -49
14418 -49 -74 13 -12 -121 42 -107 -20 -91 -40 -4 37 -114 50 -53 70 -90 17 105 55 -41 -48 -11 -38 -267 0
14443 0 108 -51 -124 -69 -51 9 -96 -29 -38 145 -160 -106 1 -51 21 -34 86 -31 14 -88 -39 -37 15 21 -53 55 -4
14470 -4 59 -47 -28 15 -36 96 -32 69 21 -18 -16 58 22 103 -15 -42 75 -50 79 48 87 31 -78 -56 52 15
14496 15 111 56 -110 20 -13 -27 119 22 -62 -11 -59 57 38 -22 -50 -31 40 -24 -23 7 -87 -35 -24 5 -95 -79 48
14523D8J6M8j62l7K82k12n3J4nM1P5o5k6J17j76J68r5o8J37kn5j8J1rmK6k8N7
14551B5nJ7j46N2J06R9j95K2Pk1l8m3N4p5J03L9p4O0O1q9o0L3j2k9K05j64J39
14578G1p8P3l8o6Q4n5O3%j34jJ06n0L4o6L5L1N3j42R3m0o2P9M8r8J25J1J0j2j57
14607h3P4R3j31N3j14J43n4n5J01j6J1k4j09l6J84n6qo2K72j49m2J4m3L6p9J43
14633F3n0j06J2K2J36j71Q3k8L1rJ60j70M5J01j86R3l1Ml7J22r6O3p4J35j60j28
14659a76J01Q6n8nO5q0l2J40rp8J07j06m1L4L3J9O9o4j43J67p1J33k8o8kj01J74
14686F6j33K8J0k02J98P5Ok22J66K2n1N3o1J31k00K4RP3R7j53NM7Pj0j47P8J19
14713C5j17J26j30J40r4N0J84k44R2q2L4p2M1P2p6O5o5J5M6n6k7R1q2Q7O9j29
$$ plain form
14523 48 64 112 -50 -87 195 -17 -70 -56 -61 -20 55 -10 -36 81 -95 73 -22 -90 47 45 -10 -28 -17 -26 -30 -4 -32 25
14551 25 20 37 -109 -57 49 148 -47 -25 -18 -39 -77 -120 -66 -141 -38 1 -73 -13 48 -41 -101 -68 -80 -109 96 -68 71
14578 71 -7 66 28 -38 46 -9 54 54 -80 -81 25 -25 9 -57 -22 9 62 -80 13 -27 -89 -10 38 -60 65 76 86 74 -83
14607 -83 -9 84 -47 6 -108 35 -19 -74 27 11 22 -2 -111 -147 37 -19 -27 -89 183 34 -8 6 -37 -1 -80 63
14633 63 13 -93 -81 -59 77 -94 -11 -39 -8 -17 143 -27 18 119 -67 26 -5 -1 -38 84 -12 51 -23 112 -48 -176
14659 -176 -75 11 -47 -52 13 -67 -99 41 32 -46 61 -45 -86 -52 -19 0 69 5 -138 29 -42 91 63 -5 -7 -108 66
14686 66 -67 -39 -29 -231 -33 42 48 -174 -8 14 -37 16 -45 86 -114 -90 -81 -8 89 -64 -59 -12 -5 -15 -162 -84 35
14713 35 -82 44 -86 54 -40 10 194 -50 42 -40 -6 -78 -37 35 -41 24 -41 -26 20 -36 -63 28 -54 33 102 -27
14739b7J03o3oN0j41Q9L6p1Q2j09M3N4K5J3q0l2Qo3K0K5M6l3J35j36J45k57O3
14766h1J30k3M4J3p0j36J99j59K30k07o9J74m5KP2j56pJ15l8j15J94N8j57R2m5
14791A5j17Q0O9r2N7Mj10N9Q6m5Q1o7j12J04o8J10j17Qk4J11m4r1J32j10j7K47
14817A49p7p0k4J1L0l9O0o8k3J58j8K0Pj63Q6n6m3K8j0L1lk5KL6m4n8Q6M3j57
14846a31J47ROm7J21k9o6p5k9R7K9L7p6PL3q0P5m7p5J18J20k18M1j43K51j56R1
14873A0N7j40N0O6j63J04P0p8K1K1M1j65OJ28o3l1KQ8p1k3Q5L4j90Q5q4J43K2
14900B5m0p4K34j29QM7p9m7N4P8q3n5j09J79N1J1qp1K0J9Om4J0j25J61l7m5j7
14928f0J22m7o0L8j00J94m6q9P6j50rO4k7k5J77j34L4n1J1l8J38j03J52N6j07
$$ plain form
14739 -27 76 13 7 57 -84 5 41 -30 52 -57 -14 40 65 78 -2 -34 -26 -89 -69 -44 2 -31 104 -32 113 -144 -81
14766 -81 49 26 70 83 13 -123 76 -83 147 -60 -129 45 0 2 74 -82 -89 26 -12 -127 67 125 -32 60 15
14791 15 -102 -22 47 -45 12 16 -94 -35 51 6 87 20 -92 12 -56 54 -63 -55 -79 32 -12 -103 29 -81 -98 149
14817 149 72 2 -22 -11 19 -20 40 -28 -51 107 89 109 116 -47 39 -17 -60 -32 -42 -11 -14 -39 -37 -1 -45 -103 -17 26 -131
14846 -131 16 25 31 -16 105 76 10 -65 -94 3 32 69 -7 0 33 -47 28 -19 -94 24 144 -74 -33 -176 75 -81 10
14873 10 67 -73 -23 43 -120 -16 54 -24 -3 18 59 -106 -100 28 -35 -66 -64 24 -47 -70 15 49 -141 -56 -140 3 25
14900 25 -15 -89 145 16 24 71 -8 -55 -1 77 -6 -61 -170 9 60 71 63 -8 12 31 37 -7 3 -122 39 2 -43 -60
14928 -60 62 15 -45 -7 -107 87 41 -48 28 -122 -131 -67 -94 -119 58 -76 -42 -93 -82 -120 18 -85 67 123 16
14953A6M8j57M5L5q8J55om1N1n1l0J7O7n6J9l1mL3mO2l3L8M0j50j3J0R5m6J1O1
14983I3k03K51j90L6M8j33J62p7M9k8L1j35J52j61Q0Mo5J26jl9kj33J51R3j29
15008b0m5J18q9K4K5R8j41n6J32j5n3O1P0j29m0j9M2j1N1q0O5O4q3J4L2j3p8j0
15036h6L3PQ8n3n5lJ57j16n0K6J14q7N0M3j09K2m7M7pL3o0K7N5k9k8Q2k2Kj4j3
15066Gk8P8j9l1P7j15N6n5o%J05j26k1J69j05l8m5J25j3Lk1q5P0k8k5J2o3J55
15094C3o2N2j1l2K5L1n5J43q2m7N2Lr9J49q1%km5j0J19J8j01k2L6k2K4L1j6m1
15123a2K3J2m3Q8N3j76JJ24Q3j23k18R4N4K5O6Q8j67N5m7M5M3n4K2j24K4L6L1
15150CJ58q0q1KQL7j92J60l1l7J28q9J9j03J29O2j15r1M5K3J7M9l9P6J7p2KJ8
$$ plain form
14953 16 64 -93 -48 -13 -101 54 48 7 58 7 -23 -6 61 5 24 -7 -11 22 18 80 47 85 125 -25 -38 -28 67 21 32 93
14983 93 -110 141 -49 -13 35 -98 64 -13 36 8 39 -96 56 -105 -25 -21 -86 40 39 0 -2 -135 16 109 -20
15008 -20 -65 53 -36 -12 13 111 -30 -86 46 31 -22 39 109 -20 -60 -79 -37 -48 3 -77 -12 52 -31 -17 15 2 -76 -86
15036 -86 -53 -46 42 -11 -66 -69 88 -28 -78 -52 62 -25 25 68 -41 -19 -66 -19 -26 7 -53 -26 29 0 -28 54 32 34 20 7
15066 7 -21 57 38 7 84 -31 25 -30 -36 -36 69 -57 -78 91 -14 -52 -97 28 15 18 -3 -88 -18 -46 -71 -59 -122 33
15094 33 -29 23 12 -20 5 36 -19 124 42 -5 47 50 -49 100 19 19 17 -28 -38 81 99 -2 -24 12 -10 14 45 29 -12
15123 -12 11 23 -20 68 121 -55 -54 70 153 30 -188 -94 -40 -15 51 139 -28 27 -20 25 68 14 36 -88 -64 -28 3
15150 3 161 81 0 2 10 47 -145 15 -16 -53 75 -14 5 -98 31 93 -22 -113 -68 -45 -28 21 -18 58 75 3 5 23
15178B3j04J11j19N7n1O4Rk4L2R2m0k0P0n2j00KM8K7O5j79J37r6k4Om5Q5J06j23
15206d3K6K9L0j03P2Q8j84O3K02k02M7J3m8P3j25J5O7M1j97J63L8m0j66J31O4
15231E4Kj37O9J39N3k54j7R8j22P4Po9L1P3m7k4M0M5PL4Kj55j8J98j48J38k6l3
15259A4J16j4r2j0N8K4j3j19J9R9K9q1m8m6P2L5j73O6rM2rj1J05q2om7R6o9L7
15288a7K0n3J10j5P2n2n3M9k2Ko9L6KKPN4j04j7q0J24j3J0J4o2J72k07J34ln4
15317a3r2J77j36L9L0q5M6j9O5n4P4k0Jmo2l3J50j29J19j34j7J51M5k7ml3p5J5
15345b5l8O6J3l5j7J4llPR5rnN4l1j15J33m9n2p9L3j1J05j8k5j16k0J38l9j2L9
15375eL9j11Ql8j3J35J0j88K08k9j09J8J27p4O7K7r5rP7r7J6l4J1K4J76q6n5r2
$$ plain form
15178 23 -81 30 -89 -32 -83 -19 -10 -34 -2 90 50 30 100 48 -52 -50 -2 25 90 -89 48 -48 -72 -66 -111 -26 80 -43
15206 -43 -17 12 42 -61 11 99 -85 -22 180 -22 25 38 -10 63 -62 -47 20 61 -136 27 65 25 -141 -10 54
15231 54 56 -81 -12 127 180 -74 -91 7 -115 -41 -34 -103 -72 1 -46 -70 -30 15 22 56 58 -97 -115 83 -65 73 47 14
15259 14 130 116 24 14 72 96 83 -36 -17 82 111 30 -18 -64 8 43 -130 -64 -73 -31 -40 -51 54 -28 -34 -81 15 -54 -17
15288 -17 3 -50 60 45 117 65 12 61 39 41 -28 8 10 12 19 73 -31 -48 -128 -4 -17 -7 7 -55 117 -90 44 41 -13
15317 -13 -105 72 -64 -25 5 -80 -34 -53 12 -42 32 12 13 9 -53 -86 64 -65 54 -80 -97 54 99 72 68 35 -40 -25
15345 -25 -63 3 16 -19 -36 -22 -25 -28 -21 74 65 60 114 83 -32 101 52 0 -79 -46 -57 48 30 5 -111 -131 7 -32 -44 -5
15375 -5 34 -77 -69 -107 -120 15 25 -163 45 16 -93 -75 52 -22 45 72 -23 -32 45 -52 -36 -70 -59 -35 141 55 0 -92
15403i2J06o2K5R7j5Lm6k4M2o0J31r1Qj02K09k03NM9J11m4j32K20N0j88P7j02
15429b8l5N2N0k1l3j27J00J45p0J10k15o3K16q6J6pJ5L3m4M4j1j48P6Q9q5n0J49
15456G2m4r0K8K1N6O3p1j02Q5j16J11pj6j10OM2N5J4Q1J5k7o2j6l8n9J48j14J81
15484A06j56rQ3j24J44kj12Q1N7Lj21R4Ok6j8J42k24M1P2k9km1J27r9N8N7oJj07
15513dj6n1Q8J17j49k1Q0l4q3J39p2m2J9PJ5j13N7n0K18k10P6J7Q0N8j14p8P4
15540Hj8n5M8l4Q2j2kj1l2J1lJ72r6j62N5n3J64m2j0N6q3R3k4m8K6j47J05J29
15568A17j19N6k46K01J00j47l3L5n3%K8N1R5j40J6k8k8M7J01p3j17K03j79J73
15592F0k4l5l7J03j09j5RJ40n5j33J39n6J0Qo7Q8j1j06J5J20m4q6O5N1j65N8J83
$$ plain form
15403 -92 14 -48 -23 74 59 62 16 -8 34 -26 105 14 22 -80 129 -74 -69 -20 91 47 -85 135 185 -3 74 -28
15429 -28 -63 -11 39 18 -15 -142 -42 103 33 143 -72 -135 81 -5 11 4 19 52 8 52 41 -107 -31 58 -27 -77 72
15456 72 28 -62 -34 -13 43 106 35 -67 18 -98 13 6 -10 -120 -114 -72 -17 -3 78 93 66 4 -12 -50 -109 39 -75 106
15484 106 -50 -59 24 -100 44 42 -70 11 68 71 -50 44 50 24 6 148 -76 -35 37 8 6 -35 92 -7 51 108 102 103 -4
15513 -4 -20 -71 17 134 -15 -36 44 10 -73 66 -6 -48 -29 -22 -7 -120 -63 -113 105 -105 -29 -12 68 126 12 -66 8
15540 8 -10 -65 -17 -51 31 19 17 6 -26 -15 -18 154 58 -104 -49 -102 62 20 10 66 -17 76 52 4 30 -117 -12 117
15568 117 -2 54 -192 9 109 -38 -71 -36 -89 -89 -61 -10 85 -55 -39 -67 -95 -48 53 -20 -137 66 -113 60
15592 60 36 1 -36 67 -42 -57 -48 92 37 -96 43 -13 -3 5 -62 26 15 -91 -76 44 0 -86 -21 30 -135 -77 106
15619A06j50o4J24k6L1j66L7J7J11O6j04n6L9Qm7J46j27N0jQm2M4q8N0n6P2j8
15646c6O2K9Q9k50K14p7j57J74m0Q9j57J01j84J56K5r0P7m0n2K4Q7o2rJ95j86
15671a8J3M7j12N8N7k1j8l8J28n4l8j19J1P0j14J44K4K8J7M0j80J20q0MQ1n6K1
15698A5n9J11j3j42M4L9m9j5R0O5j10J37j08N5j41Q8o6rJ32J1j69N8pJ3mo3J51
15725E4o1Mj22M8R5K3j2j38O2j2O3o0m9J32L0n2q8K2k9M9mL9j6N4lp2p2K94j38
15754D1N2j4l2r2l6J76Nj10n5O4qn1m8J19j08L8m%J51q0r8N9l7P3K1q0K7P9r0
15783c8J51nm8j26R1q0Lloj6P4N4J7j88J33m3j7O1j42J62m1o6nM3O9O1j28J02
15811F9l5j17M7N6m4p6J31O2k39J54J03j15r1M2Q0K2J5k61L79j45N3k4r6N3j06
$$ plain form
15619 106 -44 -108 16 -10 21 -145 -108 -91 20 86 -18 -74 -35 -27 -74 72 -55 -5 -6 2 -40 4 -84 -34 -90 -18 -36
15646 -36 26 55 144 -106 108 31 -126 48 8 97 -60 41 -143 13 38 -52 25 -15 -67 -43 44 -18 -27 168 -18
15671 -18 -5 42 -70 -12 45 24 6 -32 96 42 4 -115 -104 -34 -148 -4 20 48 65 105 -75 45 -35 -31 50 -6 15
15698 15 -44 67 54 -88 -44 -5 -54 -69 21 86 -24 113 5 60 -81 7 -59 -68 64 75 -94 -36 -43 -30 -34 -97 54
15725 54 -7 -3 -125 -77 18 41 29 -109 -47 -59 4 -56 -105 27 57 5 -83 -61 -90 -41 -45 -6 -22 32 29 -43 -115 179 41
15754 41 93 79 47 -45 -81 95 100 -10 -65 -1 -9 -60 -108 11 -97 -59 -63 -63 88 8 -90 -31 -68 5 26 -54 -27 52 -38
15783 -38 113 108 60 -66 25 -55 -52 -55 -61 -77 -3 51 68 -120 13 -30 -47 14 -128 34 -7 -73 -78 -35 34 95 -33 69
15811 69 34 -83 -36 20 -24 -100 31 93 -146 8 111 -4 -95 -53 27 49 64 -197 182 37 90 66 -30 23 -83
15836h3Q8J9n2jj14K00m8K8m4J6M7l8r5J9Q5p9K5M2l7L6k01K28K4k9r4j3M7p6
15864a00Q3N0r9m1R0j7Pq8O8R2j6Pk9l6m5l4J06k0K5N7p2r1j1R6n%K6K7Q9j53
15894c4n1J40J8k5k7P1o1q3j5O8N3M2j26o8K7l2N8J26j66L8M2m3J8k2Q2l8l6L
15922d1m1K21j13L0j3r2J09j67Q4M6j4J28j51oR7kk3j83R3P9O5o2J01j35kN8Q7
15949A53l06K62J2j57O4J06j49Q5j4m5l5L8Ol3jo3J05k3q2M4q4J31j8r2N4J2P9
15976D9L%r3j3LJ16lk3j2j9K1k8M6r4J16J4j27j29K39n8Nl5%l1QQq2R1L4P3n5
16007B4j28N9N5k4NR6j12N0L7M2j38K8l3m3P3K4p3k1J04J4j23j9N8O6J4m0k3J41
16035A13j25jP9m9k2o2M3K4m6R1nm9K2j0J06j51o7L7Q0O0J2j55N2N2j76P1J35
$$ plain form
15836 -83 5 24 -28 -29 -143 57 9 37 -7 9 56 18 -77 -58 27 -52 -27 15 -22 14 -187 41 65 36 -58 -71 -24 -100
15864 -100 -17 33 -66 -107 -17 -34 -27 -115 -47 45 29 36 7 -29 -74 -108 -2 -22 3 60 -12 -103 -114 -18 -23 -23 3 30 119 -34
15894 -34 -85 55 73 48 21 92 31 -52 -67 1 54 96 -30 -98 -71 -103 -45 81 -85 -47 -5 -48 -30 -52 30 -8 -44 -41
15922 -41 -82 139 26 56 43 -49 60 -107 -23 23 9 137 -14 -20 77 75 52 -131 -38 41 106 44 145 10 8 66 153
15949 153 -153 109 121 -36 28 134 -15 70 56 11 -24 14 20 -13 -14 -77 28 5 -77 -33 -117 14 -4 -96 -42 -30 49
15976 49 52 52 -41 -54 -51 65 62 39 27 8 29 1 47 -47 69 83 -44 -173 66 8 13 -22 -22 -53 -45 -37 -119 -28 6 79 24
16007 24 -104 -45 10 -14 -9 87 -25 25 62 104 -34 -6 -39 -82 -9 15 -58 -79 25 39 -84 -103 -45 21 35 -5 -28 113
16035 113 -12 -13 66 17 -5 -67 -24 0 -46 45 40 -9 13 3 109 -42 -109 -72 8 68 80 -75 -23 29 -147 -76 59
16062E9j93K07q5Ll2J1M7j29R1R6l7n2j99J20K39k85J88RP9q6o1n5J1P3P1j34
16088d4L9J0K7M8kj24k1J14pl7l9J53m9j19P9l4PJ19j5j13OqJ78j26pj17Q1K2
16116B1j7OO3j32P1ko6M1K3j31J06J8P7p7J88j75M9j08L9M0j67O3R3%n0J5m8L
16144e7k4Q5J45j66p7N0O3m8k0J7L0PJ1p5J55j93R9K8j33J04o5O2j49J87M3j39
16170f0J0P6K4o6J13Qr8l4oom6J28J4j7l4O7k1m7j21J63j67P9OQ1k5L3Q6j75M8
16199A3k4j38J29q3R1m2N1p7J30Ol4l5j07Q5o8J10J09j09j3P5n7jm8m7n3K03n8
16226Hk2J23j49K8L1j00J99r3j33K75j14K5r0R5j22Q5l7J34j32J1o3N0j30R9K7
16251ELj3nk2R9j38O9Oj0Q4j99J64k0jK4m5j48J05J0j07R7J02J8m9lj2Jm2J82
$$ plain form
16062 59 -134 73 -12 -9 -41 -30 17 -112 -21 75 38 -14 -213 -93 146 -139 49 58 137 51 -10 -65 -54 19 90 -44
16088 -44 -5 5 32 80 78 -46 -67 47 40 3 -36 117 68 -51 28 -6 1 120 105 -8 -2 -10 168 42 35 -82 -1 21
16116 21 4 10 73 -59 12 10 -56 -15 8 -123 -17 1 78 1 189 14 63 -45 -6 34 -133 -70 23 23 -27 -12 -60 -57
16144 -57 -81 4 149 -17 -94 -44 19 -29 -49 -32 -2 5 16 -59 96 -97 2 30 -103 1 -64 -2 -151 36 79 -60
16170 -60 -50 26 50 -16 97 105 7 -27 -33 -39 -85 43 57 40 6 73 52 5 -116 47 -120 -41 -35 46 21 54 140 -35 13
16199 13 -11 -149 -20 -103 -12 -54 -3 -80 50 56 22 -13 -120 -35 -103 7 116 7 -6 69 12 11 -37 -84 -137 66 8
16226 8 -14 109 -40 -12 19 -81 118 25 -108 167 53 78 -12 83 -39 46 9 143 11 22 -41 9 -121 -22 5
16251 5 8 -5 -10 -32 67 -71 -2 4 -6 78 -121 43 23 22 46 1 -147 -42 -32 -139 -42 60 78 29 26 14 15 -27 155
16280A55m7q7J3n7R8j34Q1j6r9P2P5k2n3K6p2R5j17N8O4p0K24k88J85mj03K7N0
16307E4j06M6j29R4J11M5j03J8n2j59K16o5M0j9M4m8N8l5R0j09M0q8k8M9N2rN9
16334F6o0K7M1m1J9n2N0n6j76K16p0J12l8k3m4R2L7k04J18M1l7j26J15j0l3J6
16360b0Q5j19N8O7Rn9%q8O3j00J85j13K6Q3j15m1R6KK7j01P0K6J24
$$ plain form
16280 155 108 21 34 -23 75 -59 22 6 -93 -21 54 32 -21 5 -67 28 -89 -31 33 -37 187 -101 84 80 -23 4 54
16307 54 -52 -6 -135 -41 70 115 12 30 -22 -181 35 -30 10 -9 35 -13 45 10 100 -9 31 -57 -85 -36 16 7 66
16334 66 6 33 74 33 52 0 50 -6 -182 34 -36 76 38 15 -29 63 100 -104 14 55 18 -108 7 -3 -36 -20
16360 -20 65 -54 4 71 80 21 21 -67 -4 -104 81 -32 -6 77 -38 -79 17 19 46 -55 15 41 165
16383A65
$$ Imaginary data points
##PAGE= N=2
##DATA TABLE= (X++(I..I)), XYDATA
0@%%%%%%%%%%%%%L2o4O4o4O4r6J28j60J92k24K56k88L52m16M80n44O09p05Q14
32D30r11J027j183J341j504J696j889K106k344K606k891L196l538L908m319M767
48B498n251N789o380P028p744Q543r436J0438j1577J2881j4387J6152j8260K0829
62A1123k4039K8174l3741M1686n4032P6007j26959M62341J74211r47794k66738
73f59761L84185O28473L1953l56809k98158J21053K00491O2862p8779J8529J2235
84F6274j14458k03105L8777L14090K81837j23731l85554k15782J88174K96537
94A43059N4114j96930j38077N9007J27045K0543m0644K44J4681q7018j27690K8428
106a43238K28884J79104r6011k65618j19066J34986J77536o080j31367m4090R0513
$$ plain form
0 0 0 0 0 0 0 0 0 0 0 0 0 0 0 32 -32 32 -32 32 -64 64 -96 96 -128 128 -160 192 -224 256 -288 321 -384 430
32 430 -481 546 -637 704 -800 896 -993 1113 -1231 1375 -1516 1680 -1858 2050 -2269 2498
48 2498 -2753 3036 -3344 3684 -4060 4483 -4953 5485 -6092 6789 -7598 8554 -9706 11123
62 11123 -12916 15258 -18483 23203 -30829 45178 -81781 380560 554771 -393023 -659761
73 -659761 -275576 352897 384850 28041 -270117 -149064 51427 114289 35510 54039 66274
84 66274 -48184 -251289 -212512 101578 383415 259684 -125870 -341652 -153478 143059
94 143059 197173 243 -137834 -78827 48218 68761 28117 28361 43042 -43976 -171666 -143238
106 -143238 85646 264750 168739 -96879 -215945 -80959 96577 90497 -40870 -84960 5553
117E553O5208n0772n8333M2879O2658n6401j28993o798J68757J43028p6297j95908
129h5419n0217J46067J03292j11323j64207M8799K30848J01429j83783k29753
139a94267L8823K52969J11537j88633k28865M6519K64045J39637j49124k27697
149a35056k9029J54775R9290o3283q7049L0313Q5293M00p8886k7619O6328M5462
161F0939o5804q9961L1961J32934O0740r4663j23326K723R9772M0755p0460o1031
173g5421N4631R9546J132r7347n6208N4384O8772k2970p3714m407Q0362N1238
185G9998n1897p9796K065O5695J8573n8447m1145M9385Q0321M054p2803m6691
197e0688L4091M5050k1772m9525J6172P3680K2558p3454p2213L4876R6348J4634
$$ plain form
117 5553 70761 19989 -38344 4535 67193 10792 -118201 -124999 43758 186786 110489 -85419
129 -85419 -135636 10431 113723 2400 -161807 -113008 117840 219269 35486 -194267
139 -194267 -155444 97525 209062 20429 -208436 -161917 102128 241765 92641 -135056
149 -135056 -164085 -9310 89980 26697 -60352 -30039 55254 55654 -23232 -50851 15477 60939
161 60939 -4865 -94826 -62865 70069 130809 36146 -87180 -84457 15315 56070 -14390 -75421
173 -75421 -20790 78756 79888 -17459 -73667 -19283 49489 26519 -47195 -51602 28760 79998
185 79998 28101 -51695 -49630 16065 34638 -23809 -64954 -15569 64752 68806 -3997 -50688
197 -50688 -16597 28453 6681 -42844 -26672 47008 69566 -3888 -76101 -41225 55123 69757
209F9757j02772q1853O4752J40986L8093j11660j16422J7102J09274N1703n8223
220B0737p2524J0102O1953K2402l3947k7715J0111R582k2090j7687L3981N9380
232E4285O544o3142n4068K4978O3966J0321n6295l9503L5143O1362K995n6855
244a0269l5410K9694M0396j3582m2315K025N3545L3082l4472n6294m395M6664
256H669K5955l1497l9515J1224M5656J7180k9536l1888L367K1024J397j5016N348
269g632L0046J2273k9373l3383J0164L8468P682m0369l4773K4037N7214J5759
281E0113m6774m6973J1215M5720J5188k8434k3941J6560L2326J937k8736j6697
293a8496J3504J4404j2122j8248P787K8606J1296k2138k6289L274K4332Q277j7294
$$ plain form
209 69757 -33015 -114868 -50116 90870 128963 17303 -99119 -82017 27257 78960 20737
220 20737 -51787 -41685 20268 42670 8723 -18992 -8881 701 -21389 -39076 -5095 54285
232 54285 60829 -2313 -56381 -31403 32563 42884 -13411 -52914 -17771 43591 46586 -10269
244 -10269 -45679 -15985 24411 10829 -31486 -29461 24084 57166 22694 -33600 -37995 8669
256 8669 34624 3127 -36388 -25164 20492 37672 8136 -23752 -20385 639 2036 -12980 -7632
269 -7632 22414 34687 5314 -28069 -17905 20563 28245 -12124 -46897 -22860 34354 50113
281 50113 3339 -43634 -32419 13301 28489 55 -23886 -7326 25000 26937 -1799 -18496
293 -18496 -4992 9412 -2710 -20958 -13171 15435 26731 4593 -21696 -18422 5910 14187 -3107
306c107j1552J6297K1437n293k5085r868J6912J4570j5090k5245N110L5613J9357
319C4056k3739l5375j619L0648K0181j4744k5279J092K4794J3711j2899j9478
331h651l667O789J070l633M769J3357M344j4507j6089O047K1215O295j9025j7618
345a9304R429K6406J0154j9680k4461l67J7631P439j0884p488R820J2985k832
358H848j3568m671J0805Q836p906j3068L587J7112P726j1434j6532l199R335O456
372B327l781m969N044R066n68q815l441O847N068n617r285K299J3774P664j0497
387E116j6735k151J2224P676o374q540K556J1738O028o118q894n49M554P02k755
402a522J224N281J598n968p835m83O622M314m253o276K306R086N608l208o696
$$ plain form
306 -3107 -14659 1638 23075 17782 -7303 -17171 -259 14311 -779 -26024 -20914 14699 34056
319 34056 10317 -25058 -26677 3971 24152 9408 -15871 -14779 10015 23726 10827 -8651
331 -8651 -12318 -5529 -4459 -8092 -3323 10034 14378 -129 -16218 -10171 11044 17339 -1686 -19304
345 -19304 -9875 16531 26685 7005 -17456 -17823 -192 7247 -3637 -11125 -1305 11680 8848
358 8848 -4720 -9391 1414 10250 2344 -10724 -7137 9975 17701 6267 -10265 -13464 -4129 2327
372 2327 -1454 -6423 -1379 7687 7119 -1696 -5137 1710 6778 1161 -8124 -5825 7949 15613 5116
387 5116 -11619 -13770 -1546 6130 -244 -8784 -6228 5510 11538 5420 -3474 -4023 531 1233 -1522
402 -1522 -298 4983 6581 613 -7222 -7705 -1083 3231 -1022 -7298 -4992 4094 9702 6494 -202
417b02k824J774J058j686J051N905K776p365j0134r20R187Q243k568r666m143
432i514P169J1121L880n575q913o599l21O898R354L241o013j1553o893N170J2961
447D413O796p238j2786l799R963J4174M775q806j3310n476M462P772N504J039
461G483m928q291m440L148Q896N941k921q992m613N419R783N125l233q610p447
476g680q76N474O461K588k102n361n407o22M607O383L344k852o538l593L955Q322
492F103M499l390r119q367r55Q450J0225K860p007j0995m917N685J1035O499k428
507H178q295p380n91Q516J1350K845j0924j6667o604J0812J9963Q727j2310k1510
521a3890q032J3957K1486O906j3823j9089l218J4697J5086K86j1815j1559k486
$$ plain form
417 -202 -3026 -1252 -194 -1880 -829 5076 7852 487 -9647 -10567 -1380 6863 4295 -5371 -9514
432 -9514 -2345 8776 12656 7081 -1832 -8431 -8752 -1854 7500 10741 4728 -6825 -13718 -8548 4413
447 4413 11209 3971 -8815 -12614 -2651 11523 16298 7492 -5818 -11294 -6832 940 6444 7483
461 7483 2555 -5736 -10176 -7028 1868 7809 4888 -4104 -8717 -3298 6485 11610 8377 -233 -7680
476 -7680 -8556 -3082 3379 5967 3865 -1496 -6903 -7525 -2918 3465 6809 3957 -2581 -6174 -2219 6103
492 6103 10602 7212 -1907 -10274 -11229 -2779 7446 10306 3299 -7696 -12613 -6928 4107 10606 8178
507 8178 -117 -7497 -8088 428 11778 14623 3699 -12968 -19572 -8760 11203 19930 7620 -13890
521 -13890 -21922 -7965 13521 20427 6604 -12485 -15703 -1006 14080 14366 2551 -9008 -11494
534a1494N430P296M674K11n031p496l610O335J1590M318q239j2089k429J1036
548E02J2836o15j4609j2403L033J3348Q175n568j1604l486Q495R632Jp872n586
563e721J606O180M436j263m416l427m47P02Q97J556J261j268l260k474L190Q317
579E869M744o802j2438l048J2319J4170m21j6549j4688M814J8727R554j2189j8923
593a4861k100J7348J6033m197j8388q682J1820J5807q34j4784q518P870J2045
606H559P5j1465p305N475Q148j128o338J70P574L146p079q036L742J3538N839
621A4915j2540j6920j30J8274J5274o455k2293j2970J0758K1969R037j1568j6948
634i597m678R797J3148M635o465j0093n541J629O383O818K973m884r927p719K213
$$ plain form
534 -11494 -6064 1232 5906 6117 1086 -6410 -10020 -3685 7905 12223 3984 -8105 -10534 502
548 502 13338 12723 -1886 -14289 -11256 2092 10267 4699 -6905 -10391 -1896 7736 7737 -135 -5721
563 -5721 -4115 2065 6501 5238 822 -2605 -3052 -2350 -1453 103 1364 96 -3164 -5638 -2448 5869
579 5869 10613 3811 -8627 -11675 644 14814 14393 -2156 -16844 -12030 6697 16251 4062 -14861
593 -14861 -16961 387 16420 12223 -6165 -14847 -3027 12780 11946 -2838 -11356 -3486 8559
606 8559 8634 -2831 -10136 -4661 3487 2359 -3979 -3809 3765 6911 -168 -8204 -4462 9076 14915
621 14915 2375 -14545 -14675 3599 18873 12418 -9875 -22845 -12087 9882 18919 7351 -9597
634 -9597 -14275 -4478 8670 13305 6840 -3253 -8794 -7165 -782 6036 9009 4125 -5802 -13521 -11308
649a1308J2778J3484j13j6025j6295K229K0336J7740n251k4102j7050R279K4534
662A0236J1470j3966k1666m817J5146J5047k275j2953m328R329P189n285r209
675f082J411J1017M624r934j2852J049J4071Q405p407j2225j909Q487O893k220
689C328n320J331O306k76q588n241O981J1218R61j2707j2457K598J4941J0493
703A3568n324j3824p345N140J1235P363j605p696p308j720M608P731M343l892
717E274r539o663K140Q973Q588Q84q597j0854k519R563J3880N195r974j6317n746
732a5712J1409J6407L325j3245j5767j595J3417J2757j347j1253o656L028O628
745A396K760r43n57J07k179m500q76N452N566k189q208m465L989P597L113m063
$$ plain form
649 -11308 1470 14954 14841 -1184 -17479 -15250 5086 22826 17575 -6527 -23577 -14298 10236
662 10236 21706 7740 -13926 -18743 -3597 11450 9175 -3778 -8106 1223 8412 3127 -6082
675 -6082 -4671 6346 10970 1036 -11816 -10767 3304 11709 4302 -7923 -9832 -1345 5548 3328
689 3328 -1992 -661 5645 5369 -3219 -8460 -1479 9739 10700 -2007 -14464 -11866 3075 13568
703 13568 8244 -5580 -12925 -7785 3450 10813 9208 1512 -5796 -7516 -2908 4823 9166 5274
717 5274 -4265 -10928 -8788 185 8773 9657 1060 -9794 -12313 -2750 11130 16325 6351 -9966 -15712
732 -15712 -4303 12104 15429 2184 -13583 -15178 -1761 10996 9649 -1604 -8260 -5232 1396
745 1396 4156 3213 2656 2763 584 -3916 -4792 660 6226 4037 -4171 -8636 -4647 2950 6063 2000
761B000n270k25L638K295j59l87M15j023k657j927J452L808J200m037m348J061
777d164M791L136j708l147o05K222J814n84j244J96O60j210j761k50R33P14j80
794c87n46k47M75N16K74R93J172m63k168j041J652K246J67k807l246K07L220J862
812A879k110k709Q15K910J712j429k030O01K291R43j942k128J76J576M95r44j500
829a394j071N13J211J032Q24j82j127j075J079K573J128j759l004j284J674L092
845B230o4l381k740R87K962J571r14j551L2J535J165o72m12mo2n54k72o4k13j36
865e57k80k70JN07RJ89Q82P62Q3q09m00M25Q41J07j240j506q6J336K03r60q91
886a654M67R56N48m10j98R47J188l47j387l15Q20N03o60j151j120M75Q69K45m47
$$ plain form
761 2000 -3270 -3495 143 2438 2279 1892 2307 1284 -1373 -3300 -1848 1960 3160 -877 -5225 -4164
777 -4164 627 3763 2055 -1092 -1697 525 2339 1755 511 707 1367 157 -1604 -1854 -921 -207 -387
794 -387 -933 -1180 -705 -189 85 1078 2250 1787 -381 -1422 230 2476 2643 -164 -3410 -3203 17 1879
812 1879 -231 -2940 -2125 785 2497 1068 -962 -361 1930 2873 931 -1197 -1021 555 1050 106 -1394
829 -1394 -2465 -1952 -741 291 1115 933 -194 -1269 -190 2383 3511 1752 -1252 -2536 -862 2230
845 2230 2166 -1215 -3955 -2968 -6 1565 651 -900 -868 667 1832 1160 748 744 682 128 -144 -208 -421 -557
865 -557 -837 -1107 -1106 -599 -590 -401 481 1243 1326 517 117 542 1383 1490 250 -1256 -1342 -6 197 -763 -1654
886 -1654 -1187 -231 317 -93 -291 656 1844 1497 110 -205 615 1118 458 -693 -1813 -1338 -469 -224 -671
905f71k27J47J64P38R68P71l93j126r68L90J507P25j926k528j94K022J897o45
923F51k207q62J486K517N79j339q21J31N87L96J37o74j038p72m01Q46J236J31
941E83j692j207R34K483J311r84j907n96J745J783o65j952j159M74L73j02j36
958g14L16L16n49r53M45K313J524j168k301j60J743J378l55j948j345J34O07K46
976d71j23N87J08r43p59Q95K201J114q05k694o93K271J836j035k309r82R22O68
994b12p66m49R15J798n76k213n96K749K840n43k791k202Q40K400Q05j585j620
1011a206k75k0j42N61J997J176j316k667r60L144L967K22m359l448J191L338J313
1028B516j867k014m98M96M7j92K162K242r30l911j583L139M662M93m334l941P65
$$ plain form
905 -671 -898 -751 -587 151 1119 1890 1497 371 -597 -207 1300 2025 99 -2429 -2623 -601 1296 651
923 651 -1556 -2418 -932 1585 2164 825 4 135 722 1118 1255 581 -457 -1229 -1630 -784 452 583
941 583 -1109 -2316 -1382 1101 2412 1428 -479 -1075 670 2453 1788 -164 -1323 -849 -476 -578 -714
958 -714 -398 -82 -631 -1584 -1139 1174 2698 1530 -771 -931 812 2190 1835 -113 -1458 -1324 -717 -471
976 -471 -594 -7 101 -842 -1601 -706 1495 2609 1804 -890 -1583 688 2524 1489 -820 -1802 -880 -212
994 -212 -978 -1427 -512 1286 710 -1503 -2099 650 3490 2947 156 -2046 -1206 1194 1999 414 -1206
1011 -1206 -1481 -1501 -1643 -1082 915 2091 775 -1892 -2852 292 4259 4481 122 -3326 -2135 1203 2516
1028 2516 649 -1365 -1863 -1367 -1320 -1512 650 2892 1962 -1949 -3532 -393 4269 4762 428 -3513 -2748
1045b748L923J336k558j940O08J490p51j574P78L525K174l136m700P1N283L929
1061E710k189n404k212K159L242J42j680o80N72j004j403J262M227K404l024n123
1077c001j625M381N187M3m776m373nK714K653J195q34k333k784o66L520N560J583
1094F439m967o430l10O166N041j516n698l535J550L180R53l96O73j00k975k503
1110d428K330O328L211m748p808j560P107O743k161p877l579L795N176k51l793
1125a515r71L151K017l256k990K690N868P19o035n264K154O515K216m902n106
1140d709J057M417J107k915j064K589K357j710m132L33N183L397l329o158j092
1155d669M026M034p48l832j752J128J144K62P32K070J07l502k658K167N206J984
$$ plain form
1045 -2748 1175 2511 -47 -1987 -1379 111 -640 -2214 -1436 2089 4263 1127 -3573 -3502 1781 5710
1061 5710 3521 -1883 -4095 -1936 1306 1448 -232 -912 -340 -1344 -2747 -1485 2742 5146 2122 -3001
1077 -3001 -4626 -245 4942 4985 209 -4164 -4169 -1455 1198 2393 1559 -774 -3558 -4224 -704 4856 6439
1094 6439 1472 -4958 -5268 898 5939 4423 -1275 -4810 -3260 -80 873 477 1150 1050 -1925 -4428
1110 -4428 -2098 4230 7441 2693 -5115 -6675 432 7175 5014 -2863 -6442 -2647 2529 2278 -1515
1125 -1515 -2486 665 2682 -574 -3564 -874 4994 5713 -322 -5586 -3432 3083 5299 397 -4709
1140 -4709 -3652 765 1872 -1043 -2107 482 2839 1129 -3003 -2670 2513 5910 2581 -3577 -4669
1155 -4669 -643 3391 2643 -1189 -2941 -1813 -669 -407 325 2395 2502 -1000 -3658 -1491 3715 5699
1171E699m319n507l26M726L233k158l100k81J269J20n77J538K902M8m336l674
1187d743K906O814J499o297o638J588P127L473m897o000O91N950K345l802l378
1202c362K668M378o98m802j767M585M249k783o695j148O114M322l361o407l38
1217e045O134M030l308n571M06N829K780l928m636J025M380J100l795l139J865
1232a873L708l27l762j065L805K909k142l769K65M199K356k960m318N81M061J045
1248B713l000k519J149K528k09k333m6K943J463k673k992J878M617N21m609l630
1264d199K371N093N40n309l759L085N201N2m901k177L749M146j314m723n58M293
1280A590K853l439m837J020N064J591m547m544K210N700J409m957l721K737N677
$$ plain form
1171 5699 1380 -4127 -4453 273 3506 1348 -1752 -2033 -764 -644 -1221 317 3219 3267 -1069 -4743
1187 -4743 -1837 4977 6476 179 -6459 -4871 2256 5729 832 -5168 -4477 1473 3818 16 -3362
1202 -3362 -694 3684 2986 -1816 -3583 1002 5251 2468 -4227 -5375 739 5061 1700 -4707 -5045
1217 -5045 1089 5119 1811 -3760 -3354 2475 5255 1327 -3309 -2284 2096 3196 -599 -3738 -1873
1232 -1873 1835 1508 -2254 -3319 486 3395 1253 -2516 -2251 1948 4304 1344 -2974 -2393 1668 2713
1248 2713 -287 -2806 -1657 871 662 -1671 -1717 1226 2689 16 -2976 -1098 3519 4040 -569 -4199
1264 -4199 -1828 3265 3805 -1504 -5263 -2178 3023 3075 -1826 -4003 -254 3892 2578 -2145 -2703 1590
1280 1590 4443 1004 -3833 -2813 2251 3842 -705 -5249 -3039 2661 4070 -887 -4608 -1871 3806
1295C806M11m800k727K779M009r73m439j627L661K920k636m071N67M759J989l343
1311B85l828J557N003J308m084l396J894M095k90l789j849K407K646j340l315
1326b696N3L661J905k685k972J297M202R91l766l041J703M037J01m175k509K648
1342a246L619q49l705j030L459K790j673l497J40M076J615l187l271J211L527
1357A979K80l345k392K121L389k66l632j298L367L010j472l512l48L558K291k423
1373A307l985J84L990J529l375l332J491L697P36k983k308K334L548j84l666j411
1389b428K949K779j565l821n34L039K033k089l288N71L301J285k474k141J544
1404h39L044L13k792j765K047K710q33l493j073K526K194j337l054j0K791J879
$$ plain form
1295 3806 4217 -583 -3310 -531 3478 2505 -1934 -3561 100 3020 384 -3687 -3120 1639 3628 285
1311 285 -3543 -1986 3017 4325 241 -3155 -1261 2834 2544 -1245 -3094 -687 1959 619 -2696
1326 -2696 -2643 1018 2923 238 -2734 -1437 2765 3756 -10 -3051 -1348 2689 2790 -1385 -3894 -1246
1342 -1246 2373 1524 -2181 -3211 248 3038 1365 -2132 -1992 2084 3699 512 -2759 -1548 1979
1357 1979 2259 -1086 -3478 -1357 2032 1766 -1866 -3164 203 3213 1741 -1771 -2119 1439 3730 1307
1373 1307 -2678 -2494 1496 3025 -350 -3682 -2191 1506 2242 -741 -3049 -715 2833 2649 -1017 -2428
1389 -2428 521 3300 1735 -2086 -2620 419 2452 363 -2925 -2354 947 2232 -242 -2383 -839
1404 -839 2205 2518 -274 -2039 8 2718 1885 -1608 -2681 -155 2039 702 -2352 -2362 429 2308
1420B308j863k385P81L113N68k439j787J236K446k38k781j516J808K492j003k617
1436a877m06K546J830j405k249N33K602J039k329k394J179K746K29k860j874J335
1452a355K739j52k280j193J849K266o23k300k8K283J099j734k155M25K302O28
1468A771k276k192J245K621K35k160j370J568K307R9k216r46J702J783j069k318
1484a216l03J804J170j505j856R4K246J087j540j735Q67K036N85j495j045P05
1500a01J283j57j596o99J144R89q68j462J58J561P48r11j107M63J585N17j279
1517B68j063Q57J139k18j619n89Q51J229p52j555LJ648R71r82j046J80J559N30
1535A411j110j184O10J381qj830q23R65J237j80j573p36J408J738l63j410n61
$$ plain form
1420 2308 445 -1940 -1159 1954 2522 83 -1704 -468 1978 1740 -1041 -2557 -749 1743 740 -1877
1436 -1877 -2283 263 2093 688 -1561 -1028 1574 2613 284 -2110 -931 1815 2044 -816 -2690 -1355
1452 -1355 1384 1232 -1048 -2241 -392 1874 1251 -1049 -1077 1206 2305 571 -1584 -1159 1143 1771
1468 1771 -505 -2697 -1452 1169 1404 -756 -2126 -558 1749 1848 -368 -1314 388 2171 1102 -1216
1484 -1216 -1519 285 1455 -50 -1906 -1812 434 1521 -19 -1754 -887 1149 1734 239 -806 -101
1500 -101 1182 1025 -571 -1270 -126 863 -5 -1467 -1309 252 1000 89 -1018 -555 1030 1547 268
1517 268 -795 62 1201 983 -636 -1225 -374 855 103 -1452 -1449 199 1170 188 -858 -678 881 1411
1535 1411 301 -883 -273 1108 1100 -730 -1553 -588 649 469 -1104 -1840 -432 1306 943 -467 -1028
1552a028J316J177l63j272o97Q87P68n84j146l2R10L44m52p39L71J041L90o87
1570B04l52M12M74q8o92l38M30J17n78j38J0L56L3k31j65O33O35p5p09k20O14
1591C32O80n05q15l82O80N39m62j085j50J120N13l50o42J15Q01O17l83r17Q5P54
1611E45L24p35p12j63N97N37n06o71j45Q30O92j13o01M3L06N64m5n28m41K45J91
1632B14k21m22k73J20N31J34k55m36K06P02N51j73p89k36K73Q69J68r67p67J6
1652g55O53L88l12o54j4N67O29k58l39J46N76K50o12n94r8Q13O55q96j247k15
1672a317R96J126k42j231o13Q60J405M26j168q88L87R62J57p60r29L57Q43O2j078
1691f45p75Q71J252K76j206q70O50J506P05j328j275K67J159M14q31j154PJ034
$$ plain form
1552 -1028 288 1465 1102 -170 -867 20 788 204 -942 -974 -64 280 -172 -911 -540 501 891 204
1570 204 -148 264 738 650 -42 -380 50 167 -411 -549 -539 -183 -150 -381 -546 87 722 647 -62 -282 332
1591 332 1012 507 -308 -690 -10 529 67 -1018 -1168 -48 465 115 -527 -412 389 1006 623 -294 -209 545
1611 545 869 134 -578 -741 -144 393 -113 -784 -929 -99 593 480 -121 -78 228 792 747 219 -222 23 214
1632 214 -7 -429 -702 -582 -51 83 -172 -608 -402 300 851 678 -111 -347 -74 795 963 -4 -771 -755
1652 -755 -102 286 -26 -680 -694 -127 502 244 -95 51 627 877 265 -329 -427 386 1041 145 -1102 -1317
1672 -1317 -321 805 563 -668 -1281 -421 984 1410 242 -646 -259 703 860 100 -829 -472 371 433 -645
1691 -645 -1420 -549 703 979 -227 -1097 -447 1059 1764 436 -839 -572 587 1001 170 -984 -977 57
1709E7L88p66p48M33J086M52o03o86p6J023P30n77j168l38N58O80n5p17o31K12
1729g46P97K43k65k19Q0M00K05j02m11P7N07K3o55q02M6Q77O13m60j159m40J223
1750a68J459k88j039o54O18J070J86j151p00M63O64k44r33m43P34J034k61j147
1768h00j83J098J149l35j161m57P10R72k33j072o21M35R09j72r26j09N02O43j17
1787B32n43n9O58N95j84p95l03N02K48p8m85k01PK41J5j51K76lL0LJ01K89j16
1810B79J37j56L9k33k21L7o0J12k5m47k55O00N78j81l12k70N02O29j35p09k21
1831c12M25M80n02p10n2M80M34l07o64O9R27L94l95n84J14P18K52l97p66N7M78
1852A39K52o64l48J01M73L40n19k96K73P58J39l80m65L76L20j20m99k35J84K48
$$ plain form
1709 57 445 -321 -1069 -636 450 902 299 -387 -463 560 1290 713 -455 -793 -235 445 390 -327 -958 -746
1729 -746 51 294 29 -190 -110 290 495 393 -18 59 566 589 -66 -868 -822 55 668 208 -951 -1391 -168
1750 -168 1291 1003 -36 -690 -72 998 1184 33 -667 -204 460 216 -717 -1160 -426 608 347 -800
1768 -800 -983 115 1264 929 -232 -689 21 993 760 -312 -933 -498 411 239 -687 -796 -294 349 232
1787 232 -311 -370 288 883 699 -96 -399 103 351 273 -212 -413 -406 -165 -150 -301 -25 -28 2 5 106 395 279
1810 279 416 260 299 66 -155 -118 -178 -66 -91 -538 -793 -193 385 204 -108 -378 124 753 618 -91 -312
1831 -312 113 593 91 -619 -671 -191 243 -64 -728 -659 268 662 267 -317 -203 515 767 370 -396 -339 139
1852 139 391 -273 -621 -520 -47 293 -226 -522 -249 509 648 268 -197 179 499 379 -120 -355 -171 77
1872G7k23k40J3K98P5k00o4K14M64K7k22j90QK99j94l69L3K62r1m82k25M57L98
1895A25P1l22k56N70M57J5n72k60M55K77l06o61j70N68L02m37n93O3P61L32k90
1916A29m28KO24N02l67p32J07M67O0m96l51R3K79J26l88k39M38O95j74m43j75
1937b71M05M30k43k82j24k6K17o8l47j85L97K6j72R8J73J24J35k12J13J30J23
1958D41j00l59q8J74k5l50k28K34K42R3m15R5L79L90j49l97J5K36M12k52n06k95
1980d53L35L87m69m35Q7O28J14k73k84J88L71L15l29l18J60M06p2l24m14J10K29
2001d1j6k26j11K91K45L6k74J38K84j9Qk18l8J23j9j75j19n1Q5j54o3L4J08K87
2025A15n0j35K02J73M1k08j87J22K38l22k46j6J12K88k41k62O2L50K76j89k78
$$ plain form
1872 77 -146 -386 -373 -75 0 -200 -264 -50 414 441 219 29 37 336 142 -227 -194 68 -23 -505 -730 -273 125
1895 125 196 -126 -382 188 645 660 88 -172 283 560 254 -407 -577 -9 293 -144 -737 -674 87 419 129
1916 129 -299 -297 327 829 462 -270 -163 304 364 -132 -483 -390 -111 15 -373 -612 -174 521 347 -96 -271
1937 -271 134 564 321 39 -85 -111 106 38 -309 -494 -97 -71 -243 -145 28 152 287 75 188 318 441
1958 441 341 -18 -106 68 43 -307 -535 -301 -59 34 -381 -286 93 483 334 -63 -48 188 600 348 -158 -453
1980 -453 -118 269 -200 -635 -548 80 194 -79 -363 -175 196 511 182 -136 24 430 358 34 -380 -270 -41
2001 -41 -57 -283 -394 -103 142 178 -96 42 326 307 315 97 59 182 163 -12 -131 -182 -97 -251 -314 -280 -172 115
2025 115 65 -70 132 305 346 138 -49 73 311 -11 -257 -273 -161 127 -114 -376 -314 36 312 123 -155
2046a55J58K95J18q0l49m1K22K4m16j79N4L18L7r0j66J29J54J40j27P4Q0M1m2
2069A99p8q2j37mn7l3m9k1J91j56J47K18R2j47r6L02K3o0k86j4R5K44l18l46K6
2094c47K70J24q6k11N3L89K37j41l32J44J97ok34l55P3K95k2j50l46p7K73L77
2116A25J41l97o8L30J41J7j18j98J29R1k23m5j99P3m2K65j39k1O1K09O3M0k10
2139B5n5K20J98qm71p1nK03Q8k19l51J54K62K74j47k70J20L48Q3l08k17K7M09
2162B89o1k65l37L1K29K03o6l91p3N19K05j44j25j47L82K14j64m33j27L27j1o4
2184il32o1J56K99K06l06l22L06L78J53j73l65O0J36K02o7n80j39L27K12p2m08
2206c99NL47L01O2l75j76K81M03k6k98m68K17K86ql18k20J68K31J26k00k77J87
$$ plain form
2046 -155 3 298 416 336 -13 -54 168 192 -224 -403 -349 -31 6 -84 -250 -121 33 173 46 120 200 241 199
2069 199 121 39 -98 -102 -159 -192 -241 -262 -71 -227 -80 138 230 83 -13 289 312 252 -34 -48 47 291 -27 -373 -347
2094 -347 -77 47 -39 -250 -197 192 429 288 -44 100 297 291 57 -298 -225 70 48 -102 -448 -525 -252 125
2116 125 266 -131 -199 131 272 289 171 -27 102 193 -30 -75 -274 -201 -243 22 -117 -138 -77 132 195 235 25
2139 25 -30 190 388 380 -91 -162 -167 36 124 -95 -446 -292 -30 244 97 -173 -53 295 378 70 -147 -120 289
2162 289 228 -37 -374 -343 -114 89 23 -368 -441 78 283 139 14 -133 249 463 299 -134 -261 66 55 -9
2184 -9 -341 -402 -246 53 259 -47 -369 -63 315 468 295 -70 -10 126 328 261 -319 -458 -131 81 9 -399
2206 -399 -394 -47 254 316 -59 -235 46 449 423 125 -343 -126 160 152 -166 -386 -218 13 139 -61 -338 -151
2228a51L40K47k71l54J10K49K05l05l64n9L56K26r5m30j39L33K93M7j82k33J92
2249A5M10r3k27k13mJ75J41k19m14M3M35J82k30m10R7L43M31k80k66j59L62L94
2271E13k47n02j44L03K77j89l07j95L58M82k13l57r6L07M89q5m19k73K62M81j22
2292C23n57j69J53L61J01m03k18K55M28O8k85j42J93K23n9j86l02M0K21n5r7j66
2314b73R6m1J51N3j17n2K11K13q3m5j12j52L40L6j07l80j01J27L14r7k52j31L86
2337a6M52j30m96m3N42J39j72l61j94K20K60j79n00J6L88L86k02l75O2K88K99
2358C84k1n67KL76K71k46m73l4J33L14k66j08j62K09L11j24o2n1K62Q8o6j41m
2381B5K22k17j26l1L1N6k40K10J12r8o3O8NJ96J80j69j29N8N4k4k44q5J94Q7l9
$$ plain form
2228 -151 189 436 165 -189 -79 170 375 70 -294 -353 3 229 134 -296 -435 -102 191 238 56 -177 15
2249 15 425 332 105 -108 -112 63 204 -15 -429 -386 49 231 1 -409 -312 31 462 182 -84 -243 119 513
2271 513 266 -236 -380 -77 200 11 -296 -491 -133 349 136 -221 -317 -10 479 394 -25 -298 -36 445 323
2292 323 -234 -403 -250 111 212 -191 -409 -154 274 342 57 -85 108 331 272 86 -216 -176 45 -10 -107 -273
2314 -273 -177 -218 -67 -14 -131 -183 28 241 158 113 1 -151 189 225 118 -262 -363 -236 78 -19 -271 -402 -16
2337 -16 436 306 -190 -233 309 448 276 -85 -279 -59 201 22 -478 -462 -74 312 110 -265 -203 85 384
2358 384 363 -204 -202 174 445 199 -274 -308 -175 139 -127 -235 -397 -188 123 -1 -63 -114 148 236 170 29 25
2381 25 247 30 -96 -127 -96 -40 -280 -70 42 -56 -119 -51 -46 150 330 161 32 90 144 120 -124 -209 -15 72 33
2406C3k78j85L66L15n7k68j73K33M52k08l05j07J76L42j97m48j30K55K39j9k44
2427b08j71L70K91j47k99O0K93K92l99k60O2L73j15j77l43K02J15K65k63r6K08
2448E3k0K23l30K9J42O4j4k27J33M6j07j65m2K01M7k48m9J36K32J95k87N8m8L33
2472C55m8m27QM8K75j97k70j56L47L12j30k86r9L93K22k07j50j14L19J59k06n32
2494c84J09K68K56k94k00NK45K40k64j99J27L55Pj26k43J39J68j20k36n4O7K80
2516A46j94k33O3J43J51j17Q8K4L09j24l56k8K11J56k72k25P7K08J7k40j69K45
2538a20K80J18k17j96J44M34j63k71j22K5L62j45j88k47K62K10p2l31J5K60K31
2559B69q5l02nM51p1j58k52K3K05O0k52k20K20J72P5j94j33K47L05k81%j55K33
$$ plain form
2406 33 -245 -430 -64 251 194 -74 -247 -14 438 230 -75 -182 -6 336 139 -309 -439 -184 55 36 -208
2427 -208 -379 -9 282 135 -164 -104 189 481 82 -178 -116 257 142 -35 -378 -176 -61 204 -59 -155 53
2448 53 33 256 -74 -45 97 161 147 -80 53 99 -8 -173 -215 -14 33 -215 -264 -128 104 299 12 70 22 355
2472 355 307 -120 -112 -64 211 14 -256 -412 -65 247 117 -169 -268 125 347 140 -10 -124 195 354 148 -384
2494 -384 -275 -7 249 -45 -245 -240 5 245 -19 -218 -91 264 271 145 -98 41 209 89 -147 -201 -134 146
2516 146 -48 -281 -218 -75 76 -41 47 71 380 256 -100 -128 83 239 -33 -258 -181 27 44 -196 -365 -120
2538 -120 160 278 61 -135 9 443 280 9 -113 -88 274 129 -59 -306 -44 166 94 -237 -222 38 269
2559 269 184 -118 -123 328 257 99 -153 -130 75 135 -117 -337 -117 55 130 -64 -197 50 355 74 74 -81 152
2582A52K34k82k38R3J23j31j57m7K5M53j43l41O2K33J81l6l52J08K77J0k61j97
2604b34J75Q8P6j97k33K41K55m8n1k25R3L44q5j42k71K72J94j33k34j62K79O8
2626G0j67j74J1L60J12j93q7J9L26m8k26J1N1M8o6j42j35J45N9j37p2m0K88J77
2650A90j03j9j23K36l3J8l16J53Q4j37r2N1M7Q6K3j67LJ74J19k55J6R8K23m7j59
2675G0k67K41J02p9l40M1J45J50m6j60J7J31K41q8j80R0O3Q0j70k25N9J19J20
2698A14j09k38K3K29R4j31o9J33N7N8n3o5O0R7j08r1j93K90j29m4r9j4Q7R0k6
2723c7q4K46J19k38M1N3N6Qj16j80J31J04jk67p7K15J49R2k88K0R5K11r4j54j41
2748a37K92L8j95k35P7K16km1j92k2K65P1O4l14N2K32k5j04j17MJ43Q1j08k04
$$ plain form
2582 152 386 104 -134 -41 82 -49 -206 -253 -228 225 82 -259 -197 36 217 181 -171 -63 214 224 -37 -234
2604 -234 -59 29 105 -92 -325 -84 171 123 72 -153 -60 284 199 57 -214 58 252 119 -115 -277 2 70
2626 70 -97 -271 -260 100 212 19 -68 -49 277 229 3 14 65 113 47 -95 -230 -85 -26 -163 -235 -275 13 190
2650 190 87 68 -55 181 148 166 -150 3 87 -50 -142 -91 -44 42 65 -102 -99 75 194 -61 -45 53 276 229 70
2675 70 -197 44 146 67 -273 -232 -87 63 17 -143 -126 5 246 158 -22 68 131 211 41 -184 -125 -6 114
2698 114 5 -233 -210 19 113 -18 -87 46 103 161 108 43 103 200 92 1 -192 98 -31 -75 -174 -188 -101 -11 -37
2723 -37 -121 125 244 6 47 100 156 164 48 -132 -1 103 102 -165 -242 -27 122 214 -74 -54 41 252 158 4 -137
2748 -137 155 193 -2 -237 -160 56 54 13 -179 -201 64 135 199 -115 -63 169 144 40 -77 -73 70 151 43 -161
2772a61q0K71P7k19k04L23P0nj6j10O2K34j43m4o2j07Q2o1N7j15M7QN2P0n6O9
2798C9o9L5K31j91q3Q0j10J39k15J69k35J01J12l6M0j19J45J07J2k3j97J93J23
2821B48j36mk13M3J06k8k9k30J12K36Kj7j46j8J54L9j02o4J8J45m5k31N4m6J63
2846A1p1m2M3N6J07p6Q3K2j16J20o4M9j15qn1K5M2p2j3nok8J71j41J25Q5m3J03
2874A91k17J80n5J13k40o4l7R2O4J2j55r0J06L36k68K6jJ58j4oj87k6J44Q7p4
2899G5j19j87J96N5K9n3M9j08J33l4r7K8R0lO7r5l6pj06K35k40lk4K21M9j10p5
2926g0J82J04m7Q1k27K1NO1j44j00O0L4J54p1j17j4J80k8M5k45K50rj81k4Q2q3
2952a01N9O7o9L3j59J97q3L1O4Q1j87M5K3J37Q4k41R6m3J02j95j19M8L7l0Q3P6
$$ plain form
2772 -161 -241 30 107 -112 -316 7 77 72 56 -54 8 242 99 55 -7 -114 -32 -93 -36 -151 -104 -96 -44 26 -30 39
2798 39 -30 5 236 45 -38 42 -68 71 -144 25 -210 -109 3 -33 7 -112 33 140 152 129 -68 125 248
2821 248 112 108 -105 -62 44 16 -13 -243 -131 105 107 90 -56 -74 80 119 17 -47 -29 116 71 -160 -106 -152 11
2846 11 -60 -102 -59 -3 104 28 111 133 17 137 73 122 7 -1 -52 -27 15 -57 -70 -75 -81 -109 62 -79 46 131 88 191
2874 191 -26 154 99 212 -28 -92 -129 -37 27 39 -116 -206 -100 236 -32 -6 -7 151 137 131 -56 -82 62 149 75
2899 75 -44 -231 -35 20 49 -4 45 -63 70 36 -61 -33 57 54 121 26 -10 -17 -123 112 -128 -131 -155 66 115 5 -70
2926 -70 112 216 169 250 23 44 49 110 -34 -134 -74 -40 114 43 -74 -88 92 64 109 -136 114 105 -76 -100 -18 -101
2952 -101 -42 25 -44 -11 -170 27 -56 -25 39 120 -67 -22 1 138 222 -19 77 34 136 -59 -178 -130 -93 -123 -40 36
2978C6qK5n7Q1l1J50p4Q7j22k09J73L2p1j9nn4jJ0J17n3L5M4o8M8j24K8P1k3j32
3007a14N0J10j23J88k36k8K21p8j02J07QL03k02j27m5J60J29j55q3P1j03J04k8
3030B7p8j4K8J67J4j20n1N6J29j29k10K36M7P3k32j8o4M2j2N2M9M5r2J02k1j07
3056h1J43N4o8p4K9M9N6j27Pk7J0lP3n7Ml9J03n6k1J45q4j2j19Q1K2K2q5N8o2
3085e9j7P4j06K5M8K49r2j26mR5J0j0l9k0Q1j87R9m9j37M5K29j46j09R2J53K9
3111A28j1q2j8OR1j4j52m3Q6N0l4j26k8J21N5L5m8J2m4O7J15j12L3r4m5J75k22
3138i9N4n5m6Q8M6j2P6k37P5K14k3oj14J16q4M3j90O9O2O0j82N7p5M7J22N6k05
3165a43J32K3L1J27k28J64j8n4j4n7q6J2J94r6n3n6N8K36j31n5q2K46j80J09j83
$$ plain form
2978 36 28 53 -4 77 46 196 122 209 87 -122 51 83 12 -7 -12 -66 -67 -57 60 7 42 86 18 66 -58 -30 41 18 -114
3007 -114 -64 46 -77 111 -125 -153 68 -10 -112 -5 3 306 104 -23 -68 92 221 66 -17 54 -49 55 27
3030 27 -51 -65 -37 130 144 24 -27 29 158 29 -181 55 102 175 -57 -75 -139 -97 -109 -57 -8 37 -55 47 26 -81
3056 -81 62 116 48 -26 3 52 108 -19 -12 -39 -29 -32 41 -16 -12 -51 52 -4 -25 120 36 24 -95 -14 8 30 -55 3 -59
3085 -59 -76 -2 -108 -83 -35 214 122 -4 -8 87 97 87 48 28 109 -78 21 -28 -165 -120 109 -37 -146 -54 99 128
3111 128 117 35 17 23 114 100 -52 -95 -9 41 7 -119 -147 -26 29 64 16 28 -16 51 166 54 87 -7 -52 123 -99
3138 -99 -45 -100 -146 -58 -12 -24 52 -185 -110 104 81 75 -39 77 -7 36 -154 -85 -23 37 -145 -88 -163 -116 6 62 -143
3165 -143 -11 12 43 170 -58 106 88 34 20 -37 -123 -111 83 -13 -66 -122 -64 172 41 -14 -96 150 -30 79 -104
3190a04KN2Q6p8jn7P2km2K4O8L6q2kP6p7lJ05q1L9r7M1%r6Oj0J24o0O3N6j27J23
3222E4q6M0N6l7J23j83lk1M8q9O5r3J65P1j26M0L1rO3kj34K9O8qj41j8j4Q6m5
3251g0j27J16M5M9J16k09rQ2R3L3r2j2M3l8p6K4l4J13j52J25j07K17j80J67j14
3276CK2n0NM7m8n6L6m2O6n9j37J35m6J63q0J86j65L0k01K20N9l2n2l0J41j90K5
3303e0k4K5n0N5O8l6j16K27j31J31Jj63J55nR3k85R6M0%m1l5k2o9K19l9l6l4M4
3331A8J60k25P5j6O6m9o0j4l0NO2KP0j56J4J84q7n6Q9J4N2mp0j15M7O7r7J12o2
3360dJ8j6mK9K3q9M1N3N6q0n2J38K3m3l99L26k4l1q9J00j12J45M9O2k18K16K9
3387A47j28j10J40j91J39L7L5n4p8jL1J41j57j16J00J15N9n8l9N3P7J8k20Mq1
$$ plain form
3190 -104 -102 -50 36 -42 -43 -100 -28 -30 -72 -48 20 56 -26 -28 48 -29 -32 73 -8 31 -66 -25 -25 -121 -115 -125 -1 -61 2 58 -69 54
3222 54 -32 8 64 27 150 -33 -36 -57 -9 -98 -33 -126 39 110 -16 24 55 46 109 107 -27 2 70 62 -79 -97 -111 -25 -70
3251 -70 -197 -81 -36 13 129 -80 -89 -7 86 119 27 15 58 20 -56 -32 -66 47 -105 20 -87 130 -50 117 3
3276 3 25 -25 -20 27 -21 -77 -41 -83 -17 -76 -213 -78 -124 39 -41 145 -20 10 -191 29 88 56 4 -26 115 -75 -50
3303 -50 -74 -49 -99 -44 24 -12 -128 99 -32 99 100 -63 92 87 180 -105 -9 31 31 -10 -45 -67 -136 83 44 8 -26 18
3331 18 178 -47 28 12 78 29 -31 -45 -75 -70 -8 -6 64 -92 -78 106 19 -37 52 66 118 114 44 -71 -24 43 -54 58 -4
3360 -4 14 -2 -6 23 46 -43 -2 51 107 27 -25 113 136 93 -306 20 -4 -35 -124 -24 -136 9 58 120 -98 118 147
3387 147 19 -91 49 -142 -3 34 69 15 -63 -64 -33 108 -49 -165 -65 50 109 51 12 65 142 160 -60 -56 -137
3412a37J61m6JJ6j72J46K3L6l7O9Q8j47K5j07K0J90j55L8q3k9%N5P2j16J9K8K9
3439a3j1r3J49L6RJ4j60J46p5k7J01r3r2O0O0O4j44L6r1K47j83O8j2J11p1O7l7
3466F6o0n1l1Q6j9q7P7K8L1l1Jr0Q8jJ45p6j27K8l7O8p5M4LK5Ll4J3LP2p7O4j20
3498g1J28n3J8r4L0j0M4N4p5q9J60l0M2j38j1K03o5m3L0Rj8m5O8Lp6l8K9OJ58
3527A26k07O9K6J0J2q4O1k0L9K4rr7J0J39j23K2jN5j48J6R5r1R0N5J3j37N9M6
3555E0n5K8n5P6q4P5q7l1N8l4J43q6n8J69jj64J05J3Rp8o8J07m5N7j43J09L0q2
3583d2n3J37m3J13M0j54k2J7n3J8N1qN7n0Nj94R8J35k3m3n4J4oM7j19J34J10j19
3611gn9o8O8k7Q1oM2m8j7PO9j19J31M8K8j8k3o0m0J55j21p8J5Po2R7J5l3R6J3
$$ plain form
3412 -137 24 -22 -21 -5 -177 -31 -8 28 -9 60 148 1 26 -81 -61 129 -26 12 -71 -100 -100 -45 27 -89 -70 -42 -13
3439 -13 -24 -117 32 68 77 91 -69 77 2 -25 76 -17 -109 -49 11 75 -69 -33 -124 123 -60 8 -4 107 36 103 66
3466 66 6 -45 -76 10 -9 -96 -19 9 40 9 10 -80 8 7 152 76 -51 -23 -60 8 -67 -23 -20 5 8 -26 -13 -10 62 -15 49 -71
3498 -71 57 4 22 -72 -42 -52 -8 46 -29 -118 42 12 54 -84 -95 108 43 0 30 39 21 -24 44 47 -29 -67 -38 -32 126
3527 126 -81 -12 14 24 36 -48 13 -7 32 56 47 -50 -40 99 -24 -2 -3 52 -96 -80 15 -76 14 69 82 -55 4 50
3555 50 -5 23 -32 44 -40 35 -52 -83 -25 -59 84 -2 -60 109 108 -56 49 62 71 -7 -75 32 -13 44 -99 10 40 -42
3583 -42 -95 42 -1 112 152 -2 -24 -7 -60 -42 9 1 58 8 13 -181 -83 52 29 -14 -68 -54 -60 -13 -132 2 112 -7
3611 -7 -66 -134 -66 -93 -12 -18 24 -24 -41 -34 35 -84 47 95 123 105 82 22 -18 137 16 -62 -47 -40 -102 -5 10 -23 73 86
3641H6j27L8Ro3L2q0N6k3J82q8n7m4M8jl8J36K7m0n2L5Mk5J33q8j02J02M2r6j16
3670a10J59j43L5M3N4q3M8J17l9j13p9J67O4Lj09O8j56J10K9n6k7m0J20l9L9j30
3696f8JJ58q6M8r0O9L7K7j42R6q3J4J8J8q6Q8J01m7m8o6j12J49J01o5n8Or5Q7
3724b8J58k04O7o5q6J76Mm7Nn0J28R1j89P3L1n9n6l6J4j9R7ll5k9Q8J1o0P0j09
3753f2J27Ok0j36k8L5Q2k6L8j85J63N4J5N7j51M4Qqo8O8J2Qn3R3j76KQ6j8n2J5
3783g0MP9q0oQ3J05j33L5K9Q4k08J52j18l3J22j76O8o8M6P7n4O6l3K08j61K8j12
3810f6K8Q3Q1p4k84K38j9J50j73NPO6J4n2J0J1Q7o6q4Q3O8l8J2j47j0J45p1Q5
3838H9p3j31J16m7K7j36K36m9l9o6lJ22n2j3j52J98m1M8j24j5M9O7P5k3O7k9j5
$$ plain form
3641 86 -41 -3 6 -57 -25 -105 -49 -72 110 22 -35 -79 -31 -32 -70 66 93 53 1 36 40 15 148 60 -42 60 102 6 -110
3670 -110 49 -94 -59 -16 38 -45 3 120 81 -32 -111 56 120 123 14 82 -74 36 65 9 -18 -58 62 23 62 -68
3696 -68 -67 91 5 53 -37 32 69 96 -46 50 -33 -19 -1 17 -69 19 120 73 25 -41 -153 -4 97 32 -26 -20 -115 -28
3724 -28 130 -74 -7 -72 -158 18 22 -25 -20 -70 58 149 -40 33 64 5 -51 -87 -73 -92 5 2 -33 -62 26 37 -23 47 -62
3753 -62 65 71 51 -85 -113 -78 4 -22 16 -169 -6 48 63 120 -31 13 21 13 -55 13 25 33 -20 73 -103 -101 -15 -33 -85 -70
3783 -70 -66 13 -67 -73 10 115 -18 17 46 130 -78 74 -44 -77 45 -131 -63 -131 -85 -8 -62 4 -29 179 18 46 -66
3810 -66 -38 45 126 52 -232 6 -13 137 -36 -31 -24 42 56 4 14 25 112 46 -38 45 113 75 87 -60 -70 75 4 89
3838 89 16 -115 1 -46 -19 -155 81 32 -7 -73 -76 46 -6 -19 -171 27 -14 34 -90 -105 -56 11 86 63 130 101 86
3865H6n4M5lj4j08K6L1J45k27J07J0j04k0Q0M3K4m1j0j7j2K2k8q3P8O1r6j6m4
3893a19J42m8k4J13m6J28p5q5K1k9J12rJ7l1l1J6j28k4N8J16j38J13l9p4RJ36
3919H1j12OO7o5M0p9RkQ3K0m6l8J31Lj83J05K2q8K3K1m2J45r4j3m5J06m3n1n0
3948h9K5O5p4N9j32J69N4m5RN5j27P3M7o0o3m2L9Q2q6Q7J2j38J10K0l0j01J93
3975A12j42N1j51J26J13j08j27Q9K4r9P3J0m2J05j14J42n0q4lQ7m9J4K2o3O4N
4001El0J46j25K5j6r6J28n1n3J11j7m5N6M4K3r3O6j4M3j25M0l8L2j0LOlk9N9j0
4031C2j53K02q3J73q7j64P3n4j0N8r7J8O9N0M1j12j4l0J09o3J52q6l4k8J11r1
4057a8J51j50o7J6J16j1r3L9nP1P1j69nk8O6jL3l3j10J12j18J30rn2o2J60n0q2
$$ plain form
3865 86 32 77 74 60 -48 -22 9 154 -73 34 44 -60 -80 0 43 67 26 16 -1 -13 9 -19 -102 -24 37 -59 -75 -119
3893 -119 23 -25 -49 64 18 146 71 -14 7 -22 90 81 98 67 36 52 -76 -100 -42 74 -64 49 10 -64 -55 81
3919 81 -31 -25 42 -23 17 -62 -53 -55 28 48 2 -36 95 98 -85 20 42 -46 -23 -2 -44 101 7 -6 -51 55 12 -39 -89
3948 -89 -64 1 -73 -14 -146 23 77 32 41 96 -31 42 89 29 -34 -76 -37 45 -41 46 58 -80 30 50 20 -81 112
3975 112 -30 21 -130 -4 109 1 -126 -37 -13 -112 -39 -29 -71 34 -80 62 12 -72 -75 12 -37 -23 -1 -64 0 5
4001 5 -25 121 -4 21 5 -91 37 -14 -67 44 27 -18 38 82 105 12 78 64 107 -18 22 -16 16 6 9 15 12 -17 42 32
4031 32 -121 81 -2 171 84 -80 -7 -61 -71 -13 -110 -92 -23 27 68 -44 -58 -88 21 -42 110 24 -10 -38 73 -18
4057 -18 133 -17 -84 -68 48 37 -56 -17 -22 49 120 -49 -54 -82 -16 -17 16 -17 -127 -15 -133 -3 -12 -64 -126 34 -16 -98
4085i8qJ64n2J32j81m3J3K1pJ01Oj11Q2k2p3j9R3o4rLJ14n9o6M3K5J6MLo8N0j56
4116a66K09k0m4J9M4n7k5J44j11j46J99K5j61J72m8l0m4O7J12k59M6j4N5K3O5
4141E5M5l8l1m9l1J26j48Q4k0k6N0q6rn4P7L5P4q8N6k7L2K3j4Q7p9q3J02q0q5
4170a02RL3L6Q4L0j66O4J70j98M7n5M9p2J16Nr5K4Kr7N7k8O7J0L5q1L6J2P3k25
4199a60K07J2j3k3JJ4p5L2O1n3k3L0L1j97O9M7Q5kq9J40n7J8j23J79j20o2J02
4226C1mj3n5J5L9pk5N6L0rOqj94J09Q3j00K0K3l6mJ12j31N1K3R4m8J2j16J68j50
4256b8L3k8qK04o7j35J21q0O4l4N3q6K1j5m0N1j38R7N3j19KJ25p7rj9M8k8l9J43
4285F5q9K7KK6o3q5K26k48J38j6Q4j86J93r3k1KN9M1j08K1k3J32r7L9qL9j19R9
$$ plain form
4085 -98 -106 58 6 138 -43 -86 -73 -52 -59 42 48 -63 19 -3 -76 -95 -2 -66 -75 -72 42 -17 -83 -40 -15 1 5 8 -60 -10 -166
4116 -166 43 23 -21 -2 42 -15 -40 104 -7 -153 46 71 -90 82 34 4 -40 27 139 -120 -74 -88 -33 -10 55
4141 55 100 62 31 -18 -49 77 -71 13 -7 -33 17 -69 -78 -132 -55 -20 54 -34 22 -5 27 50 36 123 44 -39 63 -17 -102
4170 -102 -93 -60 -24 60 90 -76 -12 158 -40 7 -48 1 -71 45 50 -45 -21 -19 -116 -59 -87 -20 -10 25 -56 -20 -8 65 -160
4199 -160 47 59 46 23 24 38 -37 -5 56 3 -20 10 41 -156 -87 -40 45 43 -46 94 37 55 -68 111 -9 -71 31
4226 31 27 14 -41 -26 13 6 -19 37 67 58 64 56 -138 -29 54 -46 -26 -3 -39 -43 69 -62 -11 12 106 58 70 -46 122 -28
4256 -28 5 -23 -31 173 106 -29 92 12 76 42 95 9 30 15 -25 26 -112 -15 38 -81 -79 46 -31 -40 -59 -11 -39 -78 65
4285 65 -24 3 5 31 -32 -117 109 -139 -1 -17 67 -119 74 -19 -40 -38 21 62 -46 -25 -48 84 -13 26 18 57 -62 37
4313C7J6j72O9M8kj13Q5K26k06k3J18K0j08p2P8%k4L3j9q0J32n1nkk1P8j76K28
4341I4j6j4o9J11q5o3K0J37Jj70J04p9J16k04J04J0jP0j31J51Pn7Ol5J35l5j80
4368g3K2k9K11r7nj25o1PJ94j16OO0k9O1j31L16j97m6k9J13j14Q5l8n5k5Ol5O3
4396f1N2j3j0M1m4L2K7M7j04P2J36o4m4Lj01l7O6nJ26j53k2J38K2j36L0J25j42
4423a9L4J1l6P0j19M5n2OR6J6L1qj18P5k2n1O5Jj09j12J59l7J25k51K17jn7K1
4451b0k8K7R8r9O6l4m6J34j45m6r2J93n7P2j9J6p7N0M2M1j14q1M7J39K0k8L5q3
4479A1J6Q1j49j08K33j40M7j05J36o8K0O6r9J20l8qm5J1k2Q1r4p9J58J6l1L6o3
4506a7p7J50k5J9r0Q9NJ1j14L0Q0R2j88K0O7M8j56l5N4k1O7p4n9J93j61R1j1j5
$$ plain form
4313 37 53 -119 -50 -2 -4 -117 -32 194 -12 -35 83 103 -5 -77 1 1 -23 10 -9 -89 43 -8 -13 -15 -36 42 -134 94
4341 94 78 64 -5 106 21 -42 -22 115 116 -54 50 -29 87 -117 -13 -3 -4 66 -65 86 93 36 42 7 142 107 -73
4368 -73 -51 -80 131 34 29 -96 -157 -150 44 -72 -66 -6 -35 26 -105 211 14 -32 -61 52 -62 23 -15 -70 -95 -89 -124 -61
4396 -61 -9 -22 -32 9 -35 -3 24 71 -33 39 175 111 67 70 -31 -68 -2 -7 119 -34 -56 82 104 -32 -2 123 -19
4423 -19 15 26 -10 60 -59 -14 -66 -60 36 52 83 75 -43 32 10 -41 24 25 -84 -196 -37 -74 51 -200 17 16 -41 -20
4451 -20 -48 -21 77 -22 44 10 -36 98 -47 -93 -185 8 -49 23 4 20 -57 -7 35 76 -38 -119 -72 67 87 59 94 11
4479 11 27 108 -41 -149 84 -56 -9 -114 22 -46 -26 40 -59 61 23 15 -30 -19 -41 40 -54 -133 25 41 10 46 -17
4506 -17 -94 56 31 50 -40 49 54 65 -49 -19 61 153 -35 -15 52 100 -56 -91 -37 -58 9 -65 -124 69 -92 -1 -12 -27
4534b7l4O5j34J18J48k80M5J14J9j13J51k5p4l8rj44K90q7P1j43j0K19q6j5M3
4559F4p2L5L7n6J4O8p0j44J82j6R7j36j05Q0J9l5n0N1O5l5k4q5R0pn2RK25j06
4587D3q0M1M9j25P0r1PJ56r5Q8j31K45q6j19Q4l1l7L0m2k2j7Q3n7J14j05k5N4
4614Ajo1K6J72j22J9nn8j2P8j13mJ49j59O4k1m4J52q3m4J41j94Q9M6J49k80J02
4641a3j23J48roL1m0N6m4N5j53%P8nN7ok9N0j11k8O2P8k8j02J31L7j24j7o5K4
4670i6J59p9P9q0J5j17Q9M7M1j43n5K05m9l8q3O1R1q7qJ53l7o4K7J16j22r3J12
4697D4j8l6n1J09n6p0N9r3MJ66j10jJ9q4K05j38J19P2j39J09j43N8Oj29J03j28
4723a23J01o7oO9Q0j18N6Q8j70P4O3k6QJ2J8p4O5j19N1J35j85R8M8j18J36j07
$$ plain form
4534 -27 -61 4 -130 -12 136 -144 -99 15 34 -79 72 47 -27 -65 -74 -218 72 -15 56 -87 -97 122 36 21 64
4559 64 -8 27 64 8 22 90 20 -124 58 42 139 3 -102 -22 -3 -38 -88 -37 28 -7 -31 -116 -26 -33 -85 -76 149 43
4587 43 -37 4 53 -72 -2 -93 -86 70 -25 63 -68 177 91 -28 56 25 -12 18 -24 -46 -63 20 -37 77 -28 -53 1
4614 1 0 -61 -35 137 15 34 29 -29 -41 37 -76 -80 69 -90 -26 -47 -91 61 -22 -66 75 -119 -30 16 165 -115 -13
4641 -13 -136 12 3 -3 28 -12 44 0 55 -98 -98 -20 -25 32 26 -3 47 -64 -92 -30 48 20 -82 49 86 -38 -55 -120 -96
4670 -96 63 -16 63 -17 -2 -119 -30 17 58 -85 -140 65 16 -22 -105 -44 47 -40 -48 105 68 4 31 147 25 -68 44
4697 44 26 -10 -61 48 -8 -78 -19 -112 -108 58 -52 -53 -34 -118 87 -51 68 140 1 110 -33 25 31 -98 5 -123
4723 -123 -22 -89 -95 -26 54 -64 -8 80 -90 -16 47 21 29 41 59 -15 50 -69 -18 117 -68 30 78 -40 96 -11
4749a1j7O0o8RO5jj90J19R1o3l0P3o7p4J57j83J4J51p7P5p8L2l1O9K1k5j21J23
4777B3j46J26k9Q6j03Q3J03jp2j03J26j32J16q6q3J07O5rr5l9J22j12J06n1j2
4802a0J6K0m5P5jr9P1r3J06Q2N3o0k50J60o5OJ50l8q3j18Q5R7m5k4l7O7n8L6k0
4831b2n5Q2m4L3rn0J64K1j82N2qj02P4N9j8j3j4N9m1j6j65J18J86o7o2M1L0j26
4859g5K01j18N0k1k8l9N3JK1r4Om6R6j9K5p1M4O5o3j15K1J41j14Q6j9L5q3N4p6
4888h2O6Q7j07m1P5lM6M9n6m0l5P3n7J69j01o8J03l1M1o4J7l5K8M3k18J77jQl6
4917Gkl2r5J26rj30R2nJ68r7l7M8j1r0P8j20J82r7OJ27q8r0J96j13N2k3m3j13
4945a13J27J3o3K3Mj6J03k8k4K0n5L1%l0n3p4O0M8m0Q3K2j1n0P3LM5Rk58J67n2
$$ plain form
4749 -11 -28 32 -36 -27 38 37 -153 -34 57 -6 -36 37 -30 -104 53 -130 -116 35 -42 33 -45 -13 -44 25 46 21 -100 23
4777 23 -123 3 -26 60 -43 40 143 142 70 -33 93 -39 77 -9 -92 15 80 71 -24 -63 59 -53 53 2 -10
4802 -10 6 26 -19 56 55 -44 27 -66 40 122 175 115 -135 25 -40 -34 116 78 -5 -123 -38 59 14 -10 -47 20 -38 -2 -22
4831 -22 -77 5 -39 -6 -15 -65 99 120 -62 -10 -18 -120 -46 13 -5 -18 -32 27 -14 -30 -195 -77 109 42 -20 21 51 -75
4859 -75 126 8 58 37 9 -30 23 24 45 -49 -43 -89 7 -12 13 -58 -14 51 -12 -127 -106 35 -79 7 -12 23 -60 -6 -82
4888 -82 -16 71 -36 -77 -2 -5 41 90 34 -6 -41 32 -25 144 43 -25 78 47 88 24 41 6 34 77 -141 36 35 43 7
4917 7 5 -27 -122 4 -5 -135 -43 -48 120 23 -14 34 23 -67 11 -109 73 -24 -18 109 21 -69 127 14 66 43 0 -113
4945 -113 14 27 -36 -13 -9 -25 78 50 26 46 -9 22 22 -8 -61 -135 -75 -27 -67 16 38 27 -23 50 53 98 107 -151 16 -36
4975c6Q4p3N2Qm1J6L9N9j83O7l2K8M8Q5k6r4J6m9Q7K0j75K5J42n7K3O0j98Q6j04
5004a23Q2k7R6j46J07Q6j62J24p1m2M0pM4ll1N6k8K9k6N0j03k2J15q5pP6M1m0
5032B3J0j48J19J6Pp7R1q5k2J47m1j7j13J46j54J38n5j2L7l7j6ql5J66n5nJ3K6
5060E9p4L3P3j35O1n6L6j02J25Jj03m5P9J56k08K47Nk58K31j79L0J05q9J9K1N6
5086H8q0O1L8j09n6J35p7r5Q4Q5n5p2J28l4l2on3J34n3o4J08j01j5J07Rk07K30
5113I8j35K7j09J40N2r9l3J05j29K4J09kl9pm8OQ3r9J70k97J64M4P6j01k5Kn6
5140g9J54k9J3k5nK7q0pR9r7Q7j17K7K4m0J11J5j2m0j50J00p8J63Qj20m0k6Q5
5168c2oJ6%O1l5K2j32P3N6M2j11M8l1p1Q4J19p3Mn3K3o3R7j0o7K7o5Q2MK8q4J16
$$ plain form
4975 -36 48 -25 27 35 -6 10 49 108 -75 -8 -40 -12 36 121 95 1 17 -32 55 75 -100 -75 67 10 33 93 -105 -19 -123
5004 -123 -41 -68 28 -118 -11 75 -87 37 -34 -76 -36 -43 1 -2 -33 23 -5 24 -2 48 -55 -77 38 -47 -54 22 63 23
5032 23 33 -115 4 20 27 -50 41 -44 -66 81 40 23 -90 56 -98 40 -15 -27 10 -27 -43 -51 -86 80 25 20 33 59
5060 59 -15 18 91 -44 17 -39 -3 -105 20 21 -82 -127 -48 108 -100 147 152 -106 125 -54 -24 81 -8 11 32 88
5086 88 8 69 107 -2 -58 77 0 -95 -11 74 19 -53 75 41 9 3 -50 84 31 -33 75 -26 -41 66 75 -132 98
5113 98 -37 -10 -119 21 73 -26 -59 46 -83 -59 50 48 9 2 -46 -40 43 -56 114 -183 -19 25 101 0 -25 -23 -79
5140 -79 75 46 59 34 29 56 -24 -31 68 -29 58 -59 -32 -8 -48 63 78 66 26 -124 -24 -102 61 69 -51 -91 -117 -32
5168 -32 -38 -22 -22 39 4 26 -106 -33 23 65 -46 2 -29 -100 -16 103 30 34 -19 4 -59 38 28 -39 -12 -77 5 9 37 -47 69
5199F9r9jNr4J25J11p8Q9j95P5k6l0K4j02J83k0j9k1p6K3j2K05j24lM0j05m1N8
5227c9jM8n4M0M4r8J6P8p3R1m5L4jj58J62j40J82rp6q9J66j26m9M7P1r5J00k8
5255bj9K4l2j99K62p8l4J56m9J4k5m1KK2l9QJ22j65M0J20j72J66r6M2m4J9O6m
5283F4q8j6J39j12J30j3r2K9o6j9o2O1J08m4j14R2O3q8J58j37L7KJ2l6K0r0PJ49
5311I4p1N9k04J12j13L1J22J30j47L0M8m8o1r1P9L7j4J11j50J55o7k0N4l4n4J15
5337A03j7J5l7K8m7r4NK4M6J9q5J05j31J19l1jKj32J89n9j77J71M5k7o1p0J61
5364F3p6Q6m4n9N6nm1M0N7j9m8J0P1j52K09j21Q4j27J67p7n1j49J29k3J5L9J44
5391A78k44P0q6n9O5J6J99p7k6o2O5Or0m6Q3R8J2n2m2L1q5M8l5P1m5P4j17l1J42
$$ plain form
5199 69 -30 -31 -26 -120 5 116 38 127 -68 7 -19 -49 -25 -127 56 36 17 -4 -80 -57 -69 136 12 9 49 -56 -97 -39
5227 -39 -40 8 -46 -6 38 -60 -44 34 -39 52 7 41 40 -118 44 -96 86 77 1 -88 78 -48 -97 -50 21 -74 26 -2
5255 -2 -21 3 -29 -228 34 -44 -78 78 29 43 18 -23 -21 1 -38 -30 92 -73 -33 87 -85 81 -15 27 -17 2 68 64
5283 64 -24 -40 99 -13 117 104 12 41 -25 -44 -106 -45 63 19 -95 -3 60 -28 130 -7 30 32 44 8 28 -62 -55 94
5311 94 23 82 -122 -10 -123 -92 30 160 13 43 91 43 -18 -109 -30 7 -7 104 -46 109 42 22 76 42 -12 103
5337 103 86 101 64 92 45 -49 -44 -20 26 45 -40 65 -66 53 22 21 23 -109 80 21 -156 15 60 33 -28 -98 63
5364 63 -13 73 29 -30 26 21 -20 20 77 58 10 20 91 -61 148 27 111 -16 151 74 23 -126 3 -20 -5 34 178
5391 178 -66 4 -82 -141 -76 -60 139 62 36 -26 39 45 -45 -91 -8 90 102 50 8 39 -46 2 -33 38 -7 67 -50 -81 61
5420F1p0m0P8p3j5O5k2j6N2J28j04q5L8N6Q7j20k9rL1m0j3OJ0J05n0j1N9r1k0
5449c2M4n%j15L7L5k4Nj07O6L8J23q8J40k37J07l4J70q6rL3j04J20r4J79k73K14
5476A03k02O5N4p5O8q2K07m9k9j42M5J51j17ML2j32O6KO9L1r2o7J22L6q0J9qp0
5504g1L3j2l2N4l8n6J19L0k1k4J22l27K70Pj6j20J28ol6Po8j7J05n7J80k65j1
5531a22R6P4O6p2l2k34K31j7r3J43n9jR2rj19J5R8j33q4J64r2QJ08j59J44j6j9
5558b2k5K4n9Q7m8R8k6m0j5m9L7m0J16n8K8l3M4M1p4LJ26J0o0j5j6J2J9p3m7R2
5588C7j12J12K5j43R2n6L1j8M2J31k23j5NK7q1L7Q4l2m7j4J10N9Kp8P5Ml5M3R7
5617A59j70K7j4j11J43q8k9LJ62j2J7k8p6j08N3R5K5r9O5n6O6J2J2k5r4O6j17
$$ plain form
5420 61 -9 -49 29 -44 -59 6 -16 -32 20 148 44 -41 -3 53 140 20 -9 -18 13 -27 -40 -34 -24 81 31 20 79 -12 -32
5449 -32 12 7 7 -108 -71 -36 -60 -55 -162 -96 -58 65 -23 117 -120 -13 -47 123 37 28 61 -43 77 -17 162 -111 103
5476 103 -99 -34 20 -55 13 -69 138 89 60 -82 -37 114 -3 1 33 -99 -33 -31 38 69 -23 -90 32 68 -12 7 -1 -71
5504 -71 -38 -50 -82 -28 -66 -122 -3 27 6 -18 104 -223 47 54 38 -82 46 40 4 11 -57 -74 31 -26 154 -111 -122
5531 -122 -26 48 114 42 10 -224 7 -10 -103 40 -19 -20 72 63 -56 -41 57 -76 -160 4 -88 -80 28 -131 13 -3 -22
5558 -22 -47 -23 -82 5 -43 55 29 -11 -26 -75 -38 -78 38 -20 8 -25 19 60 -14 -11 115 125 65 50 34 46 65 -8 -55 37
5588 37 -75 37 62 -81 11 -45 -14 -32 10 141 -82 -97 -92 -65 -146 -109 -25 -57 -104 -118 -8 51 53 -25 50 54 19 62 159
5617 159 -11 16 2 -109 34 -54 -83 -80 82 70 87 59 -17 -125 -72 23 48 -51 14 -42 24 36 48 23 -71 -5 -122
5644a22J76r2N4J59k27J53k01N2L9P5K9j06k4n0PJ24%j9K9j20RN0rO9kj13L6J11
5672H7o6j07J86q0j41J62k7Lo0M2N7n4J5M8j12l6N1J19j32l7R5O4j13J5R4j09
5698c6N1j40K3J06j2l4L4J9j17J64j48R2j36L4J63r0J00j46J0q2J29OJ03r3j9
5723a9J25o8jJ0m7q1L3R6j84K27j60M9O0o0k6m1J0n0J49N9q6Q3p8m5ro4J34r7
5751h1o1P6K8K1p8P0M6N8r0q1J62j20qJ56r5k8J62k06R8K5o4k6J9L3k0M8L5q5
5779fJ38mp8lj8o2N7n9ql2p6N0P8k5L0L0k8N0j71P5K9pR0m3j01J05J12q0m1p5
5809g3j6J47j0k2r4N3rN7O7j8o1O3q9m3M9l9O7J48j16q7P2k00J73J1p9K7Lo2N4
5838b7J2j6PL0j03J16Pl6O0j03M4K2j07J66kL1j88J67j59K02j79M6k3K8J4l5J2
$$ plain form
5644 -122 54 -38 16 175 -52 101 -100 -48 -9 66 95 -11 -35 -85 -78 46 46 27 56 -64 -55 -5 -14 55 53 -60 -24 87
5672 87 21 -86 100 20 -121 41 14 17 -43 -1 56 2 17 65 -47 -83 -32 87 -45 -82 13 77 -36 -21 73 -36
5698 -36 15 -125 -102 4 -8 -42 -8 11 -106 58 -90 2 -134 -100 63 -27 73 -73 -63 -145 -16 -10 93 0 -19
5723 -19 106 38 37 47 0 -81 -48 48 -136 91 -69 -20 40 -20 -46 -87 -77 -127 22 81 -5 78 0 -45 -54 -118 16 -81
5751 -81 -142 -66 -38 -17 -95 -25 21 79 -11 -92 70 -50 -58 98 3 -25 137 -69 29 54 -10 -36 -17 16 -4 44 79 -6
5779 -6 132 128 50 47 29 -33 24 -35 -43 -75 -151 -101 -23 -48 -18 12 -16 34 -137 -62 -33 -40 50 7 -94 11 123 43 2 -73
5809 -73 -89 58 48 26 -68 -15 -24 33 100 82 21 84 -5 -48 1 -38 29 177 61 -26 46 -154 19 30 -49 -22 -19 -81 -27
5838 -27 -15 -31 -24 6 -97 19 26 -10 50 -53 -9 13 -94 72 70 101 -87 80 -79 123 -56 -10 -33 -5 9 -26 -14
5865a4j0L7P1j54J3Q1r7O9J4p9N7Oq2K00k9q3q4J5N0J0n1M7k2l7lP8k6L1j41J09
5895b4Q0j29P1K0j19Q5j12J30oqn9J14r2j4R3j57K67j66%J03j46j3O4Q9q0J0j00
5922i9JJ37m1n8J98j08n2l1K7l3l0N8l5P8P6j28p8L0J06j37Q0L1pQ3j39qJ13o0
5950b6Mj7oOo7p6J06N3n0J25o1o9L9Rk7J63j31qK0Q7k7n5J9m4%M1Q4j41J18K4
5980I3j09O5l1q0K8o2J9KR2r4O4m8K04j04o4o7oJ01m8j6k3KP9m8pL8m6O0P6r2
6010b2j3K5o9J51j56J70j7n9K5j09J02n8J1o3N2m3L4n8J02P4r8K9pm8o1Q9L0O
6038A9r4O6j00J27q2J12j06J68q2o5M1MM1K8j39J34J07k33J39m8p4J06j02Lq2
6063a12R6QM5L7j15J3P9J77l47J35J44q4k7n8j06P6N1N1q0K0O0j73%Q2M7j33J09
$$ plain form
5865 -14 -24 13 84 -70 -57 24 -73 -4 10 -69 -12 -6 -88 112 83 0 -84 -69 -19 -9 -60 -13 -35 -72 -75 3 -23 8 -133 -24
5895 -24 56 -73 -2 18 -101 -16 -128 2 -4 -12 -71 43 -49 -63 30 -127 140 -26 -26 77 -69 -82 -18 71 -9 1 -99
5922 -99 -98 39 -2 -60 138 30 -22 -53 -26 -59 -89 -31 -66 12 88 -40 -118 -88 18 -119 -39 -8 -15 68 -71 -79 34 -26
5950 -26 -22 -39 -45 -39 -106 -182 -76 -23 -73 52 -9 -78 -39 -30 -57 106 -25 -33 -13 74 47 -8 11 -33 -33 8 92 -49 69 93
5980 93 -16 49 18 -62 -34 -96 -77 -75 17 -77 -13 -61 143 39 -25 -92 -98 3 -45 -61 -84 -82 -3 -51 -58 -20 -66 -6 70 -22
6010 -22 -35 -10 -79 72 -84 86 69 10 35 -74 28 -30 -19 -82 -30 -73 -39 -97 5 79 -19 10 3 -45 -106 -17 13 19
6038 19 -75 -9 -109 18 -64 48 -58 110 28 -37 4 8 49 77 -62 72 179 -54 85 37 -37 69 -33 -30 -112
6063 -112 -16 -8 37 74 -41 -28 51 228 -119 16 160 76 49 -9 -115 -39 12 63 -17 3 63 -110 -110 -28 19 -114 -5
6090ePl0L0j60P9N1L0j03Q8ok5N2k2k7L2o2J4L2K3QL6n7kk1J0k8J37k33J29K1
$$ plain form
6090 -5 2 -28 2 -158 -79 -28 2 -101 -13 -19 -44 8 -14 -41 -9 -71 -57 -25 -2 6 42 -15 -17 -38 -28 -56 81 -152 -23 -2
$$ [...]
16383i1
##END NTUPLES=NMR FID
##END=
