##TITLE=abcd
##JCAMPDX= 6.0         $$ Bruker NMR JCAMP-DX V2.0
##DATA TYPE= NMR FID
##DATA CLASS= NTUPLES
##ORIGIN= UXNMR, Bruker Analytische Messtechnik GmbH
##OWNER= root
$$ XWIN-NMR		Version 3.5
$$ Tue Jul 22 17:00:39 2025 Russian Standard Time (UT+4h)  servis@DPX200
##.OBSERVE FREQUENCY= 200.131235884673
##.OBSERVE NUCLEUS= ^1H
##.DELAY= (6, 6)
##.ACQUISITION MODE= SIMULTANEOUS
##.ACQUISITION SCHEME= undefined
##.AVERAGES= 32
##.DIGITISER RES= 18
##SPECTROMETER/DATA SYSTEM= spect
##.PULSE SEQUENCE= zg
##.SOLVENT NAME= CDCl3
##.SHIFT REFERENCE= (INTERNAL, CDCl3, 0, 16.5164)
##AUDIT TRAIL= $$ (NUMBER, WHEN, WHO, WHERE, WHAT)
$$ ##TITLE= Audit trail, XWIN-NMR		Version 3.5
$$ ##JCAMPDX= 5.01
$$ ##ORIGIN= Bruker BioSpin GmbH
$$ ##OWNER= servis
$$ F:\spectra/data/av/nmr/H1/1/audita.txt
$$ ##AUDIT TRAIL=  $$ (NUMBER, WHEN, WHO, WHERE, WHAT)
(   1,<2025-07-22 16:59:04.09 +0400>,<servis>,<DPX200>,
      <created by zg, POWCHK disabled, PULCHK disabled
       configuration hash MD5:
       00 E9 B6 7A A2 85 ED C7 34 08 36 98 17 FE 4E 26
       data hash MD5: 32K
       95 4F 21 F6 D6 59 B0 56 B8 58 A9 CD 79 CE ED 6D>)
$$ ##END=
$$ 
$$ hash MD5
$$ FC 6A E1 56 AA 6F BC 60 05 48 28 7C DC 8E C4 6B
##$RELAX= 
##$RELAX= 
##$RELAX= 
##$RELAX= 
##$RELAX= 
##$RELAX= 
##$RELAX= 
##$RELAX= 
$$ Bruker specific parameters
$$ --------------------------
##$DU= <F:\spectra>
##$EXPNO= 1
##$NAME= <H1>
##$PROCNO= 1
##$TYPE= <nmr>
##$USER= <av>
##$AMP= (0..31)
100 100 100 100 100 100 100 100 100 100 100 100 100 100 100 100 100 100 
100 100 100 100 100 100 100 100 100 100 100 100 100 100 
##$AQSEQ= 0
##$AQ_mod= 1
##$AUNM= <au_zg>
##$AUTOPOS= <>
##$BF1= 200.13
##$BF2= 200.13
##$BF3= 200.13
##$BF4= 200.13
##$BF5= 500.13
##$BF6= 500.13
##$BF7= 500.13
##$BF8= 500.13
##$BYTORDA= 1
##$CFDGTYP= 0
##$CFRGTYP= 5
##$CHEMSTR= <none>
##$CNST= (0..31)
1 1 145 1 1 1 1 1 1 1 1 1 1 1 1 1 1 1 1 1 1 1 1 1 1 1 1 1 1 1 1 1 
##$CPDPRG= <>
##$CPDPRG1= <>
##$CPDPRG2= <>
##$CPDPRG3= <>
##$CPDPRG4= <mlev>
##$CPDPRG5= <mlev>
##$CPDPRG6= <mlev>
##$CPDPRG7= <mlev>
##$CPDPRG8= <mlev>
##$CPDPRGB= <>
##$CPDPRGT= <>
##$D= (0..31)
0 2 0 0 0 0 0 0 0 0.06 0 0 0 0 0 0 0.0002 0 0 0 0 0 0 0 0 0 0 0 0 0 0 
0 
##$DATE= 1753189143
##$DBL= (0..7)
120 120 120 120 120 120 120 120 
##$DBP= (0..7)
150 150 150 150 150 150 150 150 
##$DBP07= 0
##$DBPNAM0= <>
##$DBPNAM1= <>
##$DBPNAM2= <>
##$DBPNAM3= <>
##$DBPNAM4= <>
##$DBPNAM5= <>
##$DBPNAM6= <>
##$DBPNAM7= <>
##$DBPOAL= (0..7)
0.5 0.5 0.5 0.5 0.5 0.5 0.5 0.5 
##$DBPOFFS= (0..7)
0 0 0 0 0 0 0 0 
##$DE= 6
##$DECBNUC= <off>
##$DECIM= 32
##$DECNUC= <off>
##$DECSTAT= 4
##$DIGMOD= 1
##$DIGTYP= 9
##$DL= (0..7)
0 120 120 120 120 120 120 120 
##$DP= (0..7)
150 150 150 150 150 150 150 150 
##$DP07= 0
##$DPNAME0= <>
##$DPNAME1= <>
##$DPNAME2= <>
##$DPNAME3= <>
##$DPNAME4= <>
##$DPNAME5= <>
##$DPNAME6= <>
##$DPNAME7= <>
##$DPOAL= (0..7)
0.5 0.5 0.5 0.5 0.5 0.5 0.5 0.5 
##$DPOFFS= (0..7)
0 0 0 0 0 0 0 0 
##$DQDMODE= 0
##$DR= 18
##$DS= 0
##$DSLIST= <SSSSSSSSSSSSSSS>
##$DSPFIRM= 0
$$ [...]
##$SUBNAM0= <"">
##$SUBNAM1= <"">
##$SUBNAM2= <"">
##$SUBNAM3= <"">
##$SUBNAM4= <"">
##$SUBNAM5= <"">
##$SUBNAM6= <"">
##$SUBNAM7= <"">
##$SUBNAM8= <"">
##$SUBNAM9= <"">
##$SW= 20.6817932712277
##$SWIBOX= (0..15)
0 0 3 0 0 0 0 0 0 0 0 0 0 0 0 0 
##$SW_h= 4139.07284768212
##$TD= 32768
##$TD0= 1
##$TE= 0
##$TE2= 300
##$TE3= 300
##$TEG= 300
##$TL= (0..7)
0 120 120 120 120 120 120 120 
##$TP= (0..7)
150 150 150 150 150 150 150 150 
##$TP07= 0
##$TPNAME0= <>
##$TPNAME1= <>
##$TPNAME2= <>
##$TPNAME3= <>
##$TPNAME4= <>
##$TPNAME5= <>
##$TPNAME6= <>
##$TPNAME7= <>
##$TPOAL= (0..7)
0.5 0.5 0.5 0.5 0.5 0.5 0.5 0.5 
##$TPOFFS= (0..7)
0 0 0 0 0 0 0 0 
##$TUNHIN= 0
##$TUNHOUT= 0
##$TUNXOUT= 0
##$USERA1= <user>
##$USERA2= <user>
##$USERA3= <user>
##$USERA4= <user>
##$USERA5= <user>
##$V9= 5
##$VALIST= <valist>
##$VCLIST= <CCCCCCCCCCCCCCC>
##$VD= 0
##$VDLIST= <DDDDDDDDDDDDDDD>
##$VPLIST= <PPPPPPPPPPPPPPP>
##$VTLIST= <TTTTTTTTTTTTTTT>
##$WBST= 1024
##$WBSW= 30
##$XGAIN= (0..3)
0 0 0 0 
##$XL= 0
##$YL= 0
##$YMAX_a= 1422786
##$YMIN_a= -1356444
##$ZGOPTNS= <>
##$ZL1= 120
##$ZL2= 120
##$ZL3= 120
##$ZL4= 120
##$ABSF1= 10
##$ABSF2= 0
##$ABSG= 5
##$ABSL= 3
##$ALPHA= 0
##$AQORDER= 0
##$ASSFAC= 0
##$ASSFACI= 0
##$ASSFACX= 0
##$ASSWID= 0
##$AUNMP= <proc_1d>
##$AZFE= 0.1
##$AZFW= 0.1
##$BCFW= 1
##$BC_mod= 2
##$BYTORDP= 0
##$COROFFS= 0
##$CY= 19
##$DATMOD= 1
##$DC= 2
##$DFILT= <>
##$DTYPP= 0
##$F1P= 11.0000007629395
##$F2P= -0.999999237060547
##$FCOR= 0.5
##$FTSIZE= 0
##$FT_mod= 4
##$GAMMA= 1
##$GB= 1
##$INTBC= 1
##$INTSCL= 1
##$ISEN= 128
##$LB= 0.05
##$LEV0= 0
##$LPBIN= 0
##$MAXI= 10000
##$MC2= 0
##$MEAN= 0
##$ME_mod= 0
##$MI= 0
##$NCOEF= 0
##$NC_proc= 0
##$NLEV= 6
##$NOISF1= 0
##$NOISF2= 0
##$NSP= 1
##$NTH_PI= 0
##$NZP= 0
##$OFFSET= 16.51637
##$PC= 1
##$PHC0= -275.1915
##$PHC1= 4.101552
##$PH_mod= 0
##$PKNL= yes
##$PPARMOD= 0
##$PSCAL= 4
##$PSIGN= 0
##$REVERSE= no
##$SF= 200.13
##$SI= 16384
##$SIGF1= 0
##$SIGF2= 0
##$SINO= 400
##$SIOLD= 16384
##$SREGLST= <1H.CDCl3>
##$SSB= 0
##$STSI= 0
##$STSR= 0
##$SW_p= 4139.07284768211
##$SYMM= 0
##$S_DEV= 0
##$TDeff= 0
##$TDoff= 0
##$TI= <>
##$TILT= no
##$TM1= 0
##$TM2= 0
##$TOPLEV= 0
##$USERP1= <user>
##$USERP2= <user>
##$USERP3= <user>
##$USERP4= <user>
##$USERP5= <user>
##$WDW= 1
##$XDIM= 8192
##$YMAX_p= 0
##$YMIN_p= 0
$$ End of Bruker specific parameters
$$ ---------------------------------
##NTUPLES= NMR FID
##VAR_NAME=  TIME,          FID/REAL,        FID/IMAG
##SYMBOL=    X,             R,               I
##VAR_TYPE=  INDEPENDENT,   DEPENDENT,       DEPENDENT
##VAR_FORM=  AFFN,          ASDF,            ASDF
##VAR_DIM=   16384,         16384,           16384
##UNITS=     SECONDS,       ARBITRARY UNITS, ARBITRARY UNITS
##FACTOR=    0.0002416,     1,               1
##FIRST=     0,             0,               0
##LAST=      3.9581328,     0,               0
##MIN=       0,             -1356444,        0
##MAX=       3.9581328,     1422786,         0
$$ Real data points
##PAGE= N=1
##DATA TABLE= (X++(R..R)), XYDATA
$$ [...]
5640 -153 -503 11 -353 -299 145 243 -146 222 173 387 368 177 90 -105 -97 191 -112 -268 12 -366 -187 -211 -81
5663 -81 -85 -65 281 301 209 208 217 -9 40 -87 -347 -255 -313 -35 -336 -190 -11 81 82 78 264 273 273 271 -47 134 5 -56
5691 -56 -223 -209 -373 -214 -125 -185 142 64 305 434 333 532 305 196 -75 -138 -380 -412 -371 -290 -390 -110 38
5714 38 24 -101 130 104 413 291 85 507 413 151 -496 -318 -296 -360 -218 -226 -261 -96 79 15 -122 291 550
5737 550 264 425 15 -197 -29 -194 -424 -497 -384 -236 -171 -273 124 -12 209 414 257 278 340 387 46 -151
5759 -151 -108 -125 -334 -274 -346 -411 -163 35 -164 119 316 286 170 224 317 309 112 -114 -338 -348 -334 -491 -560 -366
5783 -366 -50 37 15 61 15 281 559 401 280 323 -61 -237 -203 -447 -483 -170 -212 -221 -153 -141 -55 134 263 160
5807 160 64 149 309 196 5 12 -261 -268 -516 -470 -72 -123 -195 62 -110 448 274 236 415 85 189 124 -51 -210
5831 -210 -300 -383 -414 -445 -330 -62 97 153 343 190 494 215 119 247 250 -125 -232 -179 -79 -256 -195 63 -202
5854 -202 7 -89 112 416 165 325 116 81 127 -115 37 -198 -200 -239 -12 30 -349 187 186 78 -168 154 228
5877 228 207 191 2 55 68 -128 -121 -412 -227 -141 30 139 -10 294 -49 59 185 227 94 -81 -115 -39 -251
5900 -251 -69 -247 -99 21 -97 -230 -141 71 291 409 207 177 139 -5 -59 -149 -169 -252 -36 -340 -175 -203 77
5923 77 7 67 117 96 257 220 96 188 -1 22 -74 -106 -29 -450 -244 -200 -16 110 -28 43 -7 423 100 182 -22
5948 -22 238 8 -67 -60 -192 -239 -51 28 -286 48 -18 125 260 266 155 -9 284 259 -22 4 -121 -229 -321 -401
5972 -401 -113 -7 -21 64 346 181 144 182 428 239 116 -29 -117 -30 -362 -150 -168 -144 -179 -66 -70 -17 217 64
5996 64 207 297 61 270 99 -166 -103 -239 -366 -457 -11 -71 -14 -205 182 43 -3 214 192 43 240 142 217
6019 217 -263 -216 -307 -414 7 -330 -172 -35 302 230 91 225 519 366 350 87 -40 -67 49 -244 -399 -180
6041 -180 -154 -239 -114 -211 46 108 252 -95 128 200 335 241 -202 244 -209 -189 -488 -171 -181 73 -68 15 33
6064 33 276 378 345 492 85 131 10 -170 -215 -310 -432 -217 -314 -271 53 8 -27 214 448 113 258 278 95
6087 95 -132 153 -117 -223 -445 -271 -290 -102 -42 -315 -50 309 485 248 355 35 193 184 -65 -55 -111 -299
6109 -299 -498 -289 -235 -127 -95 146 368 26 325 350 281 140 177 -4 176 84 91 -542 -114 -252 -246 -351 -208
6132 -208 -106 213 575 237 260 338 89 300 129 241 -48 -277 -186 -153 -176 -181 8 -418 -121 273 233 154 294
6155 294 303 135 -42 -55 -122 -164 -59 -195 -63 -197 -323 -195 -40 307 141 121 211 33 163 238 194 -117 101
6178 101 -228 -5 -352 -385 33 6 36 21 94 244 258 72 164 20 149 -23 136 -310 -314 -452 185 -232 -253
6201 -253 -121 119 144 54 297 20 272 104 -190 -366 -142 -99 -412 -252 -149 -94 33 178 154 -2 189 -22
6223 -22 127 345 271 -61 244 101 -6 -348 -14 -32 -203 -163 143 43 70 85 577 169 142 344 77 -141
6245 -141 -250 -209 -166 -111 -89 -225 -93 -15 -86 -133 254 200 253 222 250 -11 187 140 -245 -184 -77 105 -522 -37
6269 -37 -220 28 -95 92 357 61 229 27 -201 20 145 -165 -265 -190 -173 -355 67 -134 -158 91 237
6290 237 118 211 326 -23 -36 132 -37 -390 -349 -149 -374 -122 -355 17 122 108 353 170 272 435 154
6311 154 20 297 210 -237 -197 -221 -608 -186 -462 -258 -36 24 46 396 -5 454 304 359 398 348 -93 -74 -162
6334 -162 -287 -410 -356 -185 -67 37 118 255 347 347 402 366 191 208 -241 -56 -226 -224 -278 -475 -476 -125 -191 -9 141
6359 141 196 135 165 273 194 147 142 -6 -122 78 -241 -144 -341 -184 -105 14 366 134 325 275 253 453 318 -117
6383 -117 -156 -212 -338 -155 -366 -435 -81 -208 -174 38 169 244 153 299 633 213 380 107 40 -172 -322 -257 -488
6406 -488 -220 -181 -283 94 153 -32 46 259 248 439 169 -84 -19 -45 -146 -309 -85 -262 -354 102 -108 -22 473
6429 473 206 92 291 432 202 -104 -256 -87 -164 -209 -27 -65 -254 -196 -161 -182 -41 310 358 301 231 353 234
6452 234 329 -152 -93 -207 -192 -206 -460 -343 -220 -202 -103 318 44 302 13 317 292 91 -214 90 152 -182 -274
6475 -274 -497 -128 -83 189 -93 -153 228 42 366 83 324 138 370 7 30 -110 -353 -355 -126 -177 -64 -285
6497 -285 199 144 364 225 72 -68 80 115 -139 51 30 3 -108 -20 50 -91 -283 127 208 204 268 194 130 160
6521 160 -223 -124 -230 97 -198 -28 -313 -136 68 -191 70 -75 265 195 333 185 98 154 52 -65 64
6542 64 -380 -369 -289 -292 -115 -53 11 278 246 208 15 64 282 -53 284 80 2 -231 -227 -83 -148 -80 36 -86 246
6567 246 245 296 376 29 226 262 195 -81 -89 -104 92 -77 -291 -45 -115 86 115 27 253 244 172 184 -32 231 182 -91
6593 -91 -274 -366 -54 -99 -90 -166 -156 258 301 156 80 213 235 81 182 -218 -24 -20 -411 -355 -181 -351 -16 100
6617 100 89 136 183 129 399 44 146 152 49 112 -14 -75 -171 -218 -306 -166 -308 7 -183 -37 429 302 311 124
6641 124 177 180 -3 -132 -428 -183 -124 -368 -216 -72 12 147 67 150 266 118 122 200 -58 -42 -117 -280 24 -285
6665 -285 -173 -283 -145 77 -44 19 234 140 314 397 160 125 -14 -68 16 -48 -316 -114 -155 -44 -52 58 94 157
6689 157 103 73 353 352 100 219 139 -23 -95 -82 -277 -204 -306 -130 167 109 113 -167 302 526 223 310 113 39
6713 39 148 -40 -48 -98 -132 -126 -31 -215 27 272 21 324 300 57 203 55 180 -40 -286 -249 -192 -283 -182 -244
6737 -244 -111 26 120 -89 29 417 215 311 265 -256 172 153 -159 -136 -99 -260 -391 -396 24 107 -147 421 107
6760 107 212 296 107 -205 218 269 -82 -113 -165 -82 -466 -168 -44 -7 59 93 -40 215 198 255 212 -78 163 -74
6784 -74 -173 18 113 -239 -246 -49 103 -5 151 145 -60 156 196 2 138 202 63 -157 -93 -148 -130 -141 -84 -258 88
6809 88 44 -72 142 251 388 18 89 -27 95 -66 -90 -95 -127 -243 -306 -401 -128 138 -24 317 230 390 326 43
6833 43 113 8 -15 -144 -25 -173 -139 -105 -177 96 13 107 175 -44 -19 164 73 64 236 -174 -103 -50 -58 -208 -36 19
6859 19 259 -94 -16 -86 -47 151 217 50 188 6 -82 -107 21 -59 -20 -412 -34 71 29 74 189 -267 -18 230
6883 230 -185 111 131 -29 24 2 5 -128 -324 -55 -39 -44 6 179 -102 138 213 -87 108 63 45 -202 201 -239
6907 -239 -228 -165 -201 -173 45 186 94 283 101 457 242 299 250 293 -105 147 -238 -215 -161 -213 -303 -145 38 66
6931 66 30 191 30 106 284 203 -203 61 -113 -173 -133 -256 -12 -248 -228 7 -61 230 190 313 98 56 566
6954 566 344 -25 -145 -14 119 -181 -250 -122 -327 -109 -193 -81 76 169 289 296 180 139 -40 -45 -38 59 -312 -338
6978 -338 -195 147 18 4 -26 335 184 287 127 113 87 -6 -121 117 -239 77 -209 173 -295 -300 -79 163
7000 163 197 82 95 143 360 242 82 -20 176 -210 -168 -107 -439 -170 13 20 19 247 -6 259 220 325 66
7023 66 249 329 97 -75 -174 -9 -254 -158 -128 -298 -99 8 117 147 260 308 140 83 239 -109 109 -132 -333
7046 -333 -123 -254 11 -299 -155 -162 43 74 27 303 420 231 190 20 -175 37 -118 -290 -186 -329 -378 -127
7068 -127 -211 -353 148 238 374 153 66 302 301 -39 77 -242 -271 -300 -53 -126 -135 -60 -158 22 117 -38 438 349 59
7093 59 222 16 19 -350 222 -113 -427 16 -233 -113 205 20 30 283 184 89 195 106 -127 -183 -70 -284 -21
7116 -21 -235 -331 -262 -382 -3 -132 -99 129 273 94 126 -73 146 98 32 84 -118 -161 -2 -310 -115 -99 -142 233
7140 233 -56 86 53 359 222 309 -154 -53 -170 -143 -182 -15 -212 -300 -227 -146 -70 247 26 4 55 183 173 -58
7164 -58 132 3 -1 -52 -102 -120 61 -26 -69 100 10 69 242 210 118 -78 380 17 -215 -275 11 -256 -66 -173
7188 -173 13 0 -132 164 -35 43 203 -335 42 240 197 -13 -177 -116 -190 -73 -8 19 32 -66 -115 236 -105
7211 -105 160 -4 -98 -8 73 306 166 -253 -81 -278 -195 8 -132 -235 -63 84 457 155 323 48 275
7232 275 187 -287 12 67 -210 -89 -111 -410 -374 -29 50 -95 99 126 170 170 64 72 -19 157 160 -148 -31 122 -137
7257 -137 -239 194 -29 204 -11 201 251 339 89 -2 188 133 60 -111 -274 -52 -213 -248 -110 -15 486 288
7279 288 121 232 243 184 213 76 265 -36 20 -284 -177 -360 -314 -110 -189 229 -22 148 34 352 2 154
7301 154 -77 -93 -84 34 -286 -168 -281 -515 -307 -1 290 140 52 275 174 327 377 174 183 61 -77 -129 -320
7324 -320 -229 -381 -196 -23 -150 -168 25 228 461 301 17 207 -44 205 -98 21 -84 -263 -74 -355 -182
7345 -182 -49 -12 -117 41 195 69 212 258 110 235 148 -122 -311 -240 -215 -337 -75 -35 -218 -90 91 -69
7367 -69 221 420 237 114 366 -7 -22 -127 104 -24 -211 105 -177 58 -159 -3 255 54 277 158 101
7388 101 195 -34 11 -64 -99 -222 -283 -276 -356 -64 -213 -86 149 153 26 200 232 197 135 -59 -18 96 -27 -96 -74
7413 -74 -99 -181 -140 -206 -20 92 281 -17 273 222 -1 -10 86 -51 -233 -97 -140 -214 -364 -76 82 -125 298 217
7437 217 -1 165 144 -84 333 201 -99 -268 -241 -129 -193 -58 68 -147 -91 -105 295 -4 108 235 171 42
7459 42 -135 -149 -144 -13 -17 -70 -332 -111 -107 50 262 -53 115 97 371 146 90 41 95 76 -73 -282 -270 -244 -3
7484 -3 -363 -116 62 185 105 385 349 -44 340 6 -90 -311 75 -100 -34 -116 220 -256 -42 45 -65 10 11 166
7508 166 200 66 85 344 -48 273 -107 -109 -342 11 67 -294 -66 87 -16 317 -26 -32 88 2 -35 -74 -176
7531 -176 -62 15 -165 64 -284 -60 -26 7 130 109 171 277 57 135 170 -15 -67 12 -25 -33 -189 -114 -64 -194 213
7556 213 13 21 131 107 78 -233 -135 30 59 -222 68 75 -227 -16 -283 373 77 39 82 259 240 85 215 51
7580 51 -61 -159 -160 -119 -39 -84 -41 -138 1 -173 -50 458 191 164 174 263 -191 166 -89 -6 -6 -17 -163 -222 265 -98
7606 -98 -62 129 -22 462 345 48 235 166 180 -105 -156 190 -270 -340 146 -176 -115 -71 70 -109 116 172 40
7629 40 112 339 192 -42 307 -281 -355 -127 -100 -253 -144 -116 -111 81 109 262 190 263 377 279 55 -112 32 -470
7653 -470 -48 -435 -85 -262 -165 -152 24 -30 280 244 336 142 300 28 -158 -239 -171 -219 -489 -375 -193 -162 -292
7676 -292 -53 146 66 144 313 105 91 -31 127 -40 39 -48 -376 -171 -295 85 -234 -19 43 -18 -76 55 86
7699 86 281 51 22 21 141 82 -82 -182 -293 -480 -282 -33 -214 133 11 210 223 -2 113 126 -27 113
7721 113 -258 -282 -92 8 -61 -226 -251 66 -33 128 136 256 168 40 155 62 13 -91 118 -284 -90 -168 -174 -48
7745 -48 -35 -56 242 135 91 140 250 254 147 115 -300 -97 -43 -216 -120 -66 -76 -30 -72 112 78 281 221 205 122 212
7771 212 129 98 -181 -179 -158 -253 -152 -209 166 -126 -34 231 -114 212 -60 197 276 4 279 -62 5 -173 -134 -158
7795 -158 -42 -8 43 213 -38 133 -18 245 152 143 254 43 85 -265 -334 -311 -227 -105 -153 131 84 -4 285 -91
7819 -91 36 154 241 201 78 -142 114 107 -88 62 -183 -189 -95 166 65 32 120 -88 141 202 -92 17 58 -208
7843 -208 -42 -165 -125 12 -190 -72 15 -252 296 286 -64 392 360 23 70 122 9 -182 -274 48 -141 7
7865 7 -117 -227 -36 -260 289 329 263 351 86 -53 -225 -118 -141 -148 -14 -373 -40 30 -343 -14 145 373 -56
7888 -56 239 298 18 99 -21 -64 -39 -197 -286 57 -155 -218 -80 -94 150 45 101 121 333 422 64 216 -67 -222
7912 -222 -110 -130 52 -166 -15 -66 195 199 -68 108 287 419 89 31 13 10 -217 -156 -181 -219 -15 -164 -146 -139 310
7937 310 86 -74 164 43 388 14 52 40 -29 -88 -314 -166 -344 -233 -83 -213 76 5 279 244 107 84
7959 84 264 134 13 64 1 -58 -307 -265 -144 -63 -31 71 -415 -158 117 259 403 273 27 86 103 -63 69
7982 69 -250 -319 -372 -101 -18 -235 178 186 -21 267 220 104 288 91 77 -274 -323 -291 -281 -205 -322 -307 -81 47
8006 47 61 62 83 276 287 382 -214 100 46 -43 -132 -170 -241 -242 -32 -151 -232 -31 90 221 158 490 210 157 69 -5
8032 -5 -42 -49 -272 -160 -277 -220 -178 -144 35 -40 194 98 73 37 102 242 -100 -82 229 -213 19 -185 -57 -116 -212
8057 -212 106 62 299 -51 48 -33 151 123 120 -93 -17 2 -97 -278 -122 -227 83 10 -7 242 217 45 -29 52 220
8082 220 135 104 127 -85 -44 -347 -93 -106 -100 -24 -193 -163 279 242 75 302 279 -12 118 87 32 -50 -196 -250 -82
8107 -82 -233 24 -147 -96 -56 -33 186 31 155 166 51 -97 108 -291 -285 -28 105 -182 -86 -3 130 96 -144
8130 -144 54 311 167 8 125 92 138 -69 -75 -68 -125 -169 -18 98 15 39 45 53 -2 145 169 -48 230 -294 -122
8155 -122 -116 -120 -389 -107 -184 -88 66 41 195 318 213 5 179 -28 31 -59 -209 -16 -203 -28 -97 -74 49 -347
8179 -347 46 44 123 339 227 -6 -104 126 172 90 -191 162 -193 -298 2 84 -137 -272 -29 -12 85 101 107 279
8203 279 181 164 30 -160 7 -156 -204 -47 -227 -81 -24 400 328 -233 320 233 -15 26 301 -286 -94 -103 114
8226 114 -53 -83 -195 -157 175 -66 155 32 139 159 165 -56 162 -45 -240 -163 -45 10 -47 -138 -279 -186 78
8249 78 95 125 356 173 346 199 48 129 -25 -70 -210 -49 -36 -217 -178 -161 49 66 103 190 54 262 281 0
8273 0 11 73 110 -145 -364 21 -248 -251 -51 67 59 71 188 216 189 307 216 228 107 1 -76 -370 -223 -13 -118
8298 -118 -147 136 50 43 285 388 37 345 187 190 86 8 -1 34 -95 -40 -148 -308 -108 -71 141 45 -78 270
8322 270 205 64 107 185 9 -165 -203 -213 -58 -26 -67 180 -23 119 -17 230 67 341 270 47 39 134 226 -249
8346 -249 -47 -87 185 -125 -422 -121 -51 -71 72 314 48 168 70 253 152 182 4 -390 -325 -104 -130 -240
8368 -240 74 123 -171 113 -32 186 51 152 -53 -33 -292 24 19 -96 -346 -46 -153 -210 34 -102 286 106
8390 106 67 -52 72 220 0 -87 25 36 -54 -154 -315 -169 28 -169 91 -198 63 -216 45 71 92 -3
8412 -3 126 -227 146 173 -311 -149 -213 -128 -178 -83 219 -12 110 97 120 120 153 357 -175 -30 -79 -136 -5 4 -254
8437 -254 -12 -165 192 119 149 -19 211 121 93 251 56 -92 245 -235 115 -245 -115 58 178 -124 75
8458 75 329 172 49 121 206 263 143 -136 -63 -102 16 -244 -263 -145 4 -85 95 -35 -119 213 180 33 59 50
8482 50 -105 -234 -97 -76 -312 -310 78 12 -158 -34 41 19 -38 38 66 37 296 18 -222 -87 -232 -240 -86 160
8506 160 5 -145 207 66 64 26 4 179 64 -62 -156 -27 -201 -229 -69 -122 125 -159 -70 -24 2 -44 228 107
8530 107 -64 26 -49 -55 -29 -294 37 -230 -251 -197 -17 -168 -190 13 296 118 203 163 62 107 129 14 77 11 -172
8555 -172 -91 -167 5 -179 -138 -1 133 226 333 51 13 95 -117 -123 71 -9 76 -79 -383 -89 -114 -168 -186 63
8579 63 298 124 228 203 78 75 70 -97 -96 -27 -225 -291 -130 214 -142 23 114 150 11 277 87 188 327 59
8603 59 107 0 -18 -220 -216 -19 -96 6 -72 218 -58 -106 -147 349 114 278 13 -118 39 -206 58 -324 -187
8626 -187 -110 -80 -217 -162 -93 33 49 125 125 131 30 108 49 -23 -29 -278 -141 -258 -258 -294 -209 -2 -49 211 55 201 314
8653 314 304 83 268 43 -208 -120 -196 -120 -27 -281 74 -84 -59 123 211 136 198 15 46 72 185 -42 -121 62
8677 62 -25 -297 -65 29 -126 90 -20 90 -18 127 122 224 421 -167 -205 78 -208 -80 -368 -90 36 -128
8699 -128 -213 196 67 243 91 -17 -22 -51 -46 -19 -37 -9 -239 -101 -198 7 -178 -96 110 14 11 135 -67 132 -45
8724 -45 -149 331 39 -157 -1 -123 232 66 -227 -8 35 -17 57 -177 151 145 -15 49 -28 9 -164 -288 -35
8747 -35 -96 -74 -162 -3 30 -62 88 -19 120 115 253 303 48 105 109 -145 -12 -3 -6 -186 161 -23 22 35 -27 -117 118
8774 118 115 -130 72 -274 -92 73 -46 -105 -67 -116 -71 10 -76 190 -31 70 71 123 173 -32 242 -114 -106 97 -163
8799 -163 -13 -5 -10 226 -21 166 223 -11 91 154 85 -26 251 -207 -307 -167 -156 -3 -193 -177 -220 -9 -132
8822 -132 28 140 170 135 -63 12 12 -27 -129 0 -67 -206 -277 -141 -75 -223 -34 96 154 173 274 197 -97 84
8846 84 123 -27 -262 72 112 149 -182 -24 -192 -233 103 75 174 -129 253 63 211 -6 -87 119 -210 -88 60
8869 60 -406 215 43 6 -24 199 -75 -28 202 262 23 68 205 -71 -272 -156 -262 -181 78 -110 -67 175 65
8892 65 17 308 28 153 63 -135 -30 -29 -150 -98 -58 -41 -119 -163 6 -13 38 -87 142 289 322 174 202 43 -37
8917 -37 -56 -21 -295 -221 -51 143 1 -45 68 0 25 36 98 18 12 169 -54 -318 -205 -338 -123 -32 -168 35
8941 35 -257 81 148 8 73 231 170 50 117 193 -196 43 -127 -270 -272 -77 49 -289 91 -104 22 269 217
8964 217 277 -38 250 -27 126 -199 95 -40 -115 -190 -55 -106 -68 -69 -70 193 175 94 72 256 177 31 -21 -88 -56
8989 -56 -34 -366 -299 -125 -1 13 36 -97 190 94 154 240 117 -60 -221 -25 -49 -95 -188 -45 -155 -195 -106 127
9013 127 -48 45 179 -258 25 -80 -10 -46 36 110 -135 -248 123 -48 -172 64 104 55 213 -19 191 -45
9035 -45 218 -66 -57 55 281 -165 -92 -125 -24 -165 -1 -108 138 -30 102 158 -10 186 332 -156 211 -48
9057 -48 -349 -333 -115 -4 79 -201 -256 8 293 -26 139 -56 -34 86 60 52 25 122 -303 31 23 147 -54 146
9081 146 -63 80 347 74 -48 79 177 53 174 -38 16 -128 53 -23 65 112 66 115 193 20 -13 115 75
9104 75 83 -55 -51 -102 -45 -115 -130 -307 -163 -279 34 51 151 219 298 138 7 -50 253 -223 121 75 -115 -90 -103
9129 -103 -4 -106 -240 -62 -24 229 -12 281 141 17 123 -99 5 -114 108 -46 -217 -175 92 -146 -22
9150 -22 116 160 40 128 258 114 234 276 62 -68 101 -197 -406 69 32 -20 -63 79 136 -167 233 36 169
9173 169 265 73 104 -99 -70 -181 -172 -215 -163 -325 8 67 -97 408 1 82 -16 98 184 -60 -137 -30 -173 -43
9197 -43 -244 72 98 24 -100 -118 61 109 -5 113 8 240 -3 14 67 -96 -92 -11 73 -7 258 -294 -210 38
9221 38 62 56 -68 276 134 340 26 -45 -176 -173 -162 -176 -117 -247 -178 -39 63 72 397 132 169 -85 -73 -57 35 -84
9247 -84 88 -195 -248 -121 -11 -106 179 74 126 -39 292 -237 -14 5 68 56 91 -170 42 16 -183 -345 39
9270 39 -12 29 -66 128 166 1 230 116 90 -99 -94 48 -164 54 -54 -178 -107 -126 -141 57 47 16 141 9
9294 9 287 -51 -215 122 110 -199 -23 -155 -203 -207 76 -154 -42 135 11 -4 49 44 165 -37 -4 148 -36 -57
9318 -57 -24 -218 -193 -61 -267 -191 -58 277 75 82 76 317 -11 258 57 -143 96 27 -55 54 113 -105 -22 35
9342 35 140 -152 -36 238 301 95 300 3 -19 -106 71 -213 -167 -131 -96 -162 -196 -74 -14 133 165 106 -31 143
9366 143 247 48 -21 -119 -155 -86 -90 -44 222 51 70 83 70 29 147 208 176 10 -3 -71 -100 -68 73 -113 -367 30
9392 30 -236 -56 -161 188 153 123 129 209 96 125 53 -32 -283 -175 47 -83 169 42 159 120 167 66 24 44
9416 44 -36 107 -5 104 -292 -8 -245 -54 -6 197 -16 72 -139 168 -72 81 66 19 13 201 -138 -193 -12
9439 -12 86 -183 -131 138 -102 81 -223 -90 259 264 -7 215 3 80 105 264 37 243 -135 -11 -56 -150 -35
9462 -35 118 3 108 95 96 -241 170 221 -2 18 -316 60 -58 56 -108 -174 19 210 40 -44 230 315 259
9485 259 228 5 152 336 -46 -205 -57 -86 -213 -87 -204 -1 258 279 -20 -140 262 -56 -47 -185 1 174
9507 174 -75 -70 93 -158 -186 -228 -231 57 23 -151 224 3 74 -127 150 67 -54 -232 111 -23 -32 -196 -152 -97
9531 -97 60 30 -4 65 279 83 -42 112 -74 -22 141 13 -9 -288 -200 -60 -116 -277 71 20 137 179 226 195
9555 195 -43 59 -212 31 -40 -112 -161 -103 -119 -39 -155 -55 -10 16 107 17 98 81 -45 6 40 149 -25 -36 6
9580 6 -116 -92 -25 173 -119 -48 258 -81 185 5 76 -145 78 19 61 -372 -330 -257 -233 -175 4 179 -107 394
9604 394 136 135 -136 296 -20 96 162 68 -63 12 -235 -10 117 -86 -123 114 -109 -84 -134 250 218 54 -83
9627 -83 275 -159 -111 117 -203 -46 -142 -202 -97 -19 -69 74 110 34 62 223 148 55 -254 5 -1 48 -147 -170 12
9652 12 43 -21 214 202 -62 121 13 47 254 15 126 195 -164 161 -271 -201 97 -119 16 79 -60 192 13
9675 13 -114 413 178 -16 30 35 -23 -45 -85 18 91 -136 158 -293 35 -37 -146 148 379 -166 222 -102 -116
9698 -116 32 -292 -302 -219 55 10 40 96 -55 119 163 280 -35 -96 8 24 -43 -141 5 55 -35 -61 6 -7 93
9723 93 97 34 308 -52 118 134 14 125 23 -77 -154 -256 -104 -238 -196 -137 -173 6 80 61 150 183 -138 282
9747 282 -26 -44 94 -67 -48 -73 -143 72 319 -250 73 71 -137 109 135 185 225 -2 -112 -284 -104 -183 -299
9770 -299 -59 -56 -167 -33 -61 210 308 95 256 -30 47 50 -169 18 32 -20 -74 -67 -187 -77 -163 -154 43 187 117
9795 117 97 77 -106 184 115 -40 -108 -63 -107 30 25 -172 73 -94 -50 29 257 62 -162 211 105 80 193 192
9819 192 25 172 -197 -165 -268 -3 49 58 247 -36 29 96 82 -55 92 78 -390 4 -134 -22 -121 -33 -99 52
9843 52 216 -156 87 37 270 297 -237 3 148 23 -103 -60 -206 -265 -181 -124 162 164 -202 220 140 157 151 53 265
9868 265 207 -28 -14 114 -105 -61 3 8 -274 73 307 38 81 38 271 197 -70 59 -30 -90 337 0 -70 -213
9892 -213 -216 14 -24 126 105 12 115 117 42 55 32 288 -110 -188 96 -258 -9 -56 -44 -36 184 -106 133 8 19
9917 19 128 310 243 -93 -68 140 -50 77 -22 37 119 -283 -146 -90 64 170 185 98 97 222 -63 -44 184 -10
9941 -10 53 -1 -127 -124 17 -22 -43 -163 -105 -91 8 103 187 129 121 -123 121 -39 -17 -2 -230 -153 -159 -97 -48 32 105 56
9969 56 -11 256 270 136 45 -110 -134 16 30 26 31 -88 -165 101 112 104 8 80 15 73 -26 115 39 320 174 127 20
9996 20 -110 -58 -106 -37 -168 151 85 125 -105 12 173 -152 -113 75 -88 107 -29 -47 -361 -33 142 -12 10
10019 10 163 97 131 217 100 101 72 -47 -171 13 -175 -143 -128 -189 -106 -237 -116 62 259 -57 87 78 -100 97
10043 97 150 27 22 27 125 -140 42 -25 -74 198 75 -38 151 379 155 184 -73 1 75 44 20 -170 89 -204
10067 -204 -110 117 -272 154 -53 149 81 86 -31 -154 151 186 12 0 -86 8 -109 20 -77 23 -167 -25 64
10090 64 121 -113 -88 -62 -37 394 231 -19 -196 58 -296 81 122 -273 -220 115 299 139 19 110 -25 162
10112 162 -133 83 -121 -45 -221 -258 91 7 -86 -152 184 98 154 123 402 116 -168 29 116 -102 102 -63 -209
10135 -209 119 -73 -55 176 68 80 -168 -29 -122 85 121 -31 -231 -75 116 -55 -78 -221 18 81 85 -33
10157 -33 79 113 251 226 67 141 -6 -9 97 -31 -60 -263 193 39 -182 -54 -124 -100 106 284 277 89 -16
10180 -16 -59 -1 -65 -93 -156 -88 -477 -164 -73 -85 188 -138 170 100 215 10 296 173 14 21 -130 -25 -234 315
10204 315 -260 -56 118 -118 189 -100 -25 -182 229 347 104 -69 -4 -6 -83 -132 -255 64 159 -219 -56 106
10226 106 45 149 86 -143 -223 111 -4 110 31 -72 185 -92 -119 -23 -271 -45 -196 178 111 251 233 175 202
10249 202 97 -8 -1 -62 -2 -126 -145 -84 -63 -121 143 15 -71 5 132 128 -110 209 -96 -108 -362 -194 106 96
10273 96 -193 -55 -56 -113 105 -146 42 173 -40 250 186 -60 -47 -63 -161 76 -152 -212 -202 -215 -299 -79 46 120
10297 120 64 63 -13 103 107 81 -136 40 -66 -16 -130 -155 164 79 -52 -153 174 154 87 151 58 199 129 -142 99
10322 99 151 -126 -31 -113 -54 46 -83 -14 -8 200 56 256 -103 282 192 -41 205 -49 159 164 -94 42 181
10345 181 -72 -94 2 29 22 222 -31 28 6 -17 121 86 -54 -3 -219 -264 -318 -141 -16 -23 -1 79 215 83 -63
10370 -63 -76 187 -180 -207 114 114 44 -182 193 -209 119 261 -21 115 -31 158 1 -13 -39 105 82 4 -192
10393 -192 -49 -234 -95 -89 -87 89 12 219 71 132 -67 45 -82 21 3 93 -280 21 -37 -111 2 -47 19 116
10417 116 133 -21 43 -109 276 266 36 216 -160 -99 -18 -72 5 -106 -75 -125 3 80 86 13 132 271 5 151
10441 151 -7 217 -68 -8 -115 -139 -110 -78 -37 21 -139 -1 -78 27 84 -33 226 202 -124 -106 -167 -81 -78 -171 64
10466 64 7 43 129 136 7 175 86 -249 104 -35 -246 97 146 -173 -106 44 -319 47 -51 70 106 -164 96
10489 96 123 83 194 237 -386 143 -114 -69 -324 -104 -281 -238 -283 22 -119 -150 249 -4 306 30 148 -23
10511 -23 71 -40 -63 -142 -267 41 -143 -104 158 -109 -92 -70 328 303 124 138 45 -147 -51 -58 -121 37 -141 -143 22
10536 22 -31 86 149 -37 9 222 166 60 91 100 -36 -79 -138 95 -221 -74 -45 -275 -57 -53 139 73 65 208 171
10561 171 195 50 -38 -10 -148 -120 -204 -176 -246 61 -138 146 -3 -119 133 0 -73 158 300 -6 -24 -123 49
10584 49 -200 -64 -205 -154 75 -118 19 196 148 -107 64 128 232 -81 -60 -261 -72 -46 -6 -19 11 270 -31
10607 -31 160 -37 -308 60 60 226 52 -17 102 -158 -104 165 85 -1 -21 -1 43 122 -153 79 205 25 -58 -12
10631 -12 128 -89 149 -92 -71 243 26 87 71 -49 -126 -64 76 -168 73 -174 -37 -16 -65 131 -32 84
10653 84 16 28 -86 -93 -4 49 115 46 -95 130 215 78 -1 137 -161 -27 37 -1 83 123 -134 -127 -23 79 6 -57
10679 -57 105 -6 -105 24 172 110 -39 -248 -86 -164 -11 64 26 30 100 95 82 10 170 213 300 26 -75 442 107
10704 107 -56 -48 -85 158 -68 -33 23 -38 -131 58 7 55 355 -21 93 147 13 147 -155 -70 43 -166 -135 51
10728 51 29 303 19 -38 345 69 -45 -73 70 143 54 152 -61 -26 -79 -87 64 -240 26 144 -37 110 68 -57
10752 -57 -173 57 -184 -187 -65 10 -211 -141 137 92 -135 -284 -118 231 217 280 -64 -194 43 -56 -120 -196 -10
10775 -10 -218 -153 -110 -342 -82 149 -99 156 119 199 -86 294 15 -234 87 -120 -356 -228 -42 170 7
10796 7 -7 -1 -37 129 65 -176 -168 300 -201 -123 100 -16 12 -125 -113 -134 34 -203 -13 148 50 168 225 -9 -65
10821 -65 -15 90 126 98 -132 -131 32 12 108 106 -78 156 239 46 42 -39 411 97 102 269 258 60 60 -343 -176 -21
10847 -21 -102 -111 -15 -68 91 129 68 -73 -12 -109 48 -79 -24 -182 76 -47 -105 -227 11 -32 -104 198 -14 138
10871 138 31 171 -59 -29 -22 74 31 -16 38 -175 143 -158 -82 88 170 142 -25 -4 -93 100 -11 144 -50 -6
10895 -6 -111 -61 64 -269 -233 -53 90 93 -107 80 -124 355 240 442 66 -124 40 -95 -264 13 -143 126
10917 126 133 -79 -59 193 78 -143 219 155 130 163 25 -158 14 99 -46 -67 -289 86 -1 125 -49 138 -108
10940 -108 -84 85 0 -3 134 -104 -30 98 -273 -247 -74 16 -129 212 -98 178 95 39 240 36 -259 89 -58
10963 -58 -95 189 -26 -26 -82 -246 -33 142 53 18 124 67 128 489 293 123 -202 34 -118 -122 -54 -23 -153 2
10987 2 -126 -61 252 19 204 124 -240 47 8 -40 -57 -236 9 -9 131 -147 240 11 -41 54 -97 47 152
11010 152 230 27 -204 41 83 48 -135 -176 -66 -340 -108 -177 204 -17 108 16 -207 21 290 93 145 -49
11032 -49 230 -196 -59 -112 22 -81 -40 81 157 -178 58 139 55 99 -112 79 237 153 -136 -85 -232 35 -138
11055 -138 111 20 7 -80 440 68 200 -68 280 29 110 -114 -18 -39 -292 -12 -290 23 92 117 36 -60 81
11078 81 186 208 27 -45 60 -32 -105 -171 -44 -225 35 -94 -92 87 101 269 130 -22 43 378 -86 -20 -36 62
11102 62 51 -29 26 3 -127 176 61 -296 29 112 157 89 131 203 116 -118 135 -185 -54 -162 -248 -256 -17 -288
11126 -288 51 50 -45 185 303 297 182 186 -37 42 -199 7 134 -11 -60 20 -128 136 146 207 -58 159 -33 -50
11150 -50 299 254 -138 141 -189 -147 -115 34 -107 185 6 -23 45 95 249 -61 321 89 153 -86 -149 15 -33
11173 -33 -97 -142 -202 317 -7 -182 -71 -7 133 58 62 93 140 0 -50 -54 50 -61 -95 -35 -96 -41 30 2 137 148
11199 148 149 127 132 78 91 71 17 122 -212 -168 -254 -216 -95 192 -71 20 189 128 200 -177 77 -55 267 -7 43
11224 43 -103 -89 147 128 93 -253 146 -85 -227 275 17 172 210 114 10 -35 137 -175 -82 95 -144 -249
11246 -249 -60 167 17 110 69 -222 43 108 -138 -206 6 -166 -251 -10 -168 -198 -236 228 -39 -137 141 -5
11268 -5 -2 154 203 -79 182 114 -10 -112 -86 -251 -42 -71 -49 -120 137 -155 -47 -42 112 -31 -115 169 211 100
11292 100 -83 104 -17 -275 3 37 -4 -14 -26 -7 -17 250 229 133 0 43 -180 35 32 -62 -66 206 -138 -202 -66
11317 -66 -92 -32 -120 156 346 -61 71 111 84 -123 -61 -68 -37 -209 -9 -172 -3 133 229 -120 20 -24 -183 -9
11341 -9 88 47 204 3 -83 -119 -102 -95 -283 103 134 -72 -3 140 83 122 74 42 -22 -101 15 7 -84 313 -62 -354
11367 -354 118 -14 91 86 -2 199 -8 90 81 -136 39 -167 3 -73 -273 -122 86 -245 101 167 -104 -171 238
11390 238 0 266 136 -63 260 155 152 13 237 -188 37 278 -40 35 74 147 282 448 -65 497 191
11411 191 -73 123 -39 -120 -68 -193 -39 -6 -90 -118 -13 -13 234 211 -108 -71 -40 247 -158 127 -179 186 -185
11434 -185 -6 -213 -186 23 -64 45 119 -200 44 -49 155 -33 -142 -197 31 107 -127 -160 -63 -383 48 13 -27
11457 -27 15 -92 193 36 157 -26 -194 -35 -36 -80 -17 -251 -75 -236 -208 -266 -123 -57 180 137 -123 229 -146
11480 -146 160 -117 -17 -56 -104 -53 -6 -101 -116 16 121 98 41 -77 245 261 -62 157 6 148 162 -342 -117
11503 -117 221 -319 -157 -145 -111 -46 63 61 -80 54 190 32 9 -50 -22 -163 -100 11 94 -20 -103 -8 -256 -35
11527 -35 169 277 -19 -30 -94 153 68 -37 21 84 49 -227 28 -49 -247 -44 212 8 89 162 -249 35 17
11550 17 -154 -53 -45 70 52 -66 -92 1 -163 197 -239 82 -52 260 -5 89 -12 31 -16 -28 -20 -264 -140 -245
11574 -245 -34 51 147 73 163 114 -22 250 11 27 -54 12 -140 -166 -1 -117 41 -178 29 -235 -79 -5 -305
11597 -305 83 177 -41 148 145 -41 -55 -70 120 56 -72 -20 26 20 -19 -18 6 -47 145 296 -66 -119 -51 184 -49
11622 -49 101 -51 -20 -200 -210 -48 221 20 29 157 219 179 41 183 -123 18 266 -84 218 -117 -50 179
11644 179 65 -120 195 22 139 294 62 -97 94 106 20 -18 96 -115 129 81 -215 -237 -192 204 84 295
11666 295 -42 85 204 27 165 -46 -205 -111 95 19 125 -137 -2 57 157 7 -117 176 -65 271 -16
11687 -16 -90 115 71 98 -16 -196 240 -282 74 -68 27 240 -110 131 182 82 -42 6 44 43 -201 11 34
11710 34 42 -193 -62 15 -127 -89 57 170 69 -7 190 5 0 -163 -228 12 -105 -67 -28 170 -51 108 107 167
11734 167 15 133 169 204 -160 30 -134 4 102 -17 116 -187 24 133 20 54 29 -251 28 90 -116 174
11756 174 256 30 43 41 91 -188 -148 -125 -50 66 -2 -15 -41 -59 171 166 -39 390 159 181 -30 17 23 -206 -80 -184
11782 -184 20 45 86 -30 95 101 145 -18 34 -34 63 108 79 371 -139 -93 36 -216 56 8 115 -27 -76 152
11806 152 236 89 -38 62 41 151 -60 -215 -464 20 -151 -50 -52 13 -304 159 329 49 -19 215 193 163
11828 163 -8 -170 -20 -82 24 -57 147 -44 134 52 84 -139 4 114 56 107 56 89 201 -171 151 -110
11850 -110 -59 -247 -43 -206 20 -6 -152 -23 279 270 -14 205 -5 94 167 160 -131 13 -267 -171 -115 41 -2
11873 -2 -206 -102 93 152 135 -19 -116 112 -84 153 -114 46 52 94 -101 -227 -51 -27 327 -25 3 153 27
11896 27 20 173 136 62 -223 46 -224 1 25 25 203 86 -75 178 122 169 -287 -47 370 -246 106 22 -70 -159
11920 -159 -111 185 57 -317 -132 -156 203 170 -74 -1 86 -31 -40 122 -175 -135 -116 -150 -103 -98 16 -101 45 12
11944 12 150 20 146 14 37 -170 236 33 24 -29 -5 -137 38 216 -34 -192 47 208 -130 -38 2 5 91
11967 91 -86 106 -215 37 87 66 -214 -83 105 -47 355 146 77 -38 27 19 -10 -171 -137 -82 18 -99 -22
11990 -22 143 -170 212 31 -155 149 33 50 -15 -114 122 -23 4 -151 -101 -153 14 4 -12 -92 153 0 286
12013 286 292 101 15 3 4 55 -24 42 -252 -158 -125 -92 -39 -32 -231 8 35 51 28 244 31 -163 56 -136 -37 -127
12039 -127 -71 -33 -302 54 8 -76 173 311 75 -144 170 295 78 -18 111 -102 -123 -148 -61 -250 26 -175
12061 -175 -55 95 -32 138 -6 265 -132 107 275 -270 -63 27 78 200 -13 -207 -217 80 94 -140 -162
12082 -162 68 -34 -45 190 44 89 -48 -196 -250 -37 -235 -45 -23 -114 26 -179 -20 6 137 24 102 88
12104 88 115 5 40 -12 57 26 -20 -173 -107 13 54 163 -13 -29 16 93 -35 99 124 -212 54 -13 28 -237 20
12129 20 29 -141 -101 17 166 0 156 46 -102 113 -42 20 -28 -376 -41 -43 -55 -36 17 123 -152 143 84 53
12153 53 209 150 -61 -113 -18 139 188 97 66 -92 -96 -87 -33 -25 155 191 122 10 16 145 46 -61 123 -45 -90 -20 46
12180 46 162 136 132 -215 124 -131 30 155 69 -251 -90 270 4 165 -121 -154 -37 5 78 -237 -110 70
12202 70 -87 -116 -128 -251 228 125 -57 -62 -66 38 -63 49 310 74 84 6 -203 26 -59 36 338 168 -231
12225 -231 37 -60 111 34 -64 -59 -95 -101 140 -264 51 89 368 43 -64 145 167 -2 -77 122 27 48 -124 33
12249 33 -114 -91 101 61 174 88 -49 296 122 -168 138 -81 26 57 -3 37 29 62 -41 14 -105 132 -127
12272 -127 -291 46 45 73 108 56 232 80 -40 -85 31 72 48 57 116 166 74 -87 27 -14 48 -31 -53 5 18 -137
12298 -137 12 -256 102 -109 -103 -6 -25 37 -127 -29 57 -59 16 125 39 -14 -15 -117 -40 77 -188 -90 -173 5 13
12323 13 -144 143 143 88 45 34 -53 14 162 5 109 -140 82 122 -168 -48 111 -15 113 165 35 -28 33 -29
12347 -29 115 -55 215 17 56 -121 -46 -89 75 43 178 -38 330 185 -21 233 62 219 -38 -45 -222 -100
12369 -100 -152 -17 -179 -113 -18 88 135 139 281 -141 -99 29 -66 58 99 -69 -145 45 -23 -12 153 -100 -16 -119
12393 -119 41 14 184 -90 29 -82 130 26 69 -163 100 158 77 -77 -34 103 -54 29 19 -196 -59 146
12415 146 18 180 53 -105 -11 3 -257 -375 -52 124 85 26 152 -58 -62 118 22 243 34 58 -28 -24 -59 -54
12439 -54 8 122 -114 -224 18 78 -13 -66 33 88 113 -26 238 6 -42 -113 -162 -27 119 144 -31 0 46 -128
12463 -128 82 299 17 -185 239 192 147 16 56 -216 -104 -68 34 -155 -257 -145 -222 88 -164 -90 255 84
12485 84 180 100 -70 97 -212 -224 17 -45 -113 -125 -33 100 -119 99 40 -44 256 103 -80 -49 -113 49 288 -156
12509 -156 -94 -110 47 -187 244 -125 92 -52 110 12 139 -85 24 -62 -66 -53 -75 -129 12 61 -55 128 -76
12532 -76 -92 -44 165 -115 70 118 -74 102 289 -53 -59 -78 -243 66 -100 -118 38 2 46 54 329 204 113 -25
12556 -25 25 128 -36 -121 -38 -40 -243 24 -165 178 -36 15 6 175 213 -35 -104 51 111 -72 -28 -18 -122 126
12580 126 -69 -189 244 -51 348 146 93 -126 102 135 92 304 -107 -13 -51 -61 165 -139 196 -106 -107 55
12602 55 77 42 -105 276 -19 13 -215 4 -18 -135 -37 2 10 -2 -73 -44 84 8 220 7 3 185 -69 -39 231
12627 231 12 -65 -41 -160 97 -67 60 -7 -5 -62 -10 39 -118 94 24 156 13 186 -131 -84 -218 111 -58
12650 -58 -12 -30 -215 53 -201 -93 -51 -19 73 53 100 52 -35 154 -149 -239 -152 -65 -80 75 -150 -74 9 0 292 -37
12676 -37 305 128 -272 -163 -56 -149 35 -130 -104 153 -46 -21 86 44 -84 61 -2 106 194 -13 46 -59
12698 -59 27 -73 -212 49 93 41 11 -18 -163 12 -58 -10 6 103 -12 -180 110 122 -69 -288 -135 112 54 -38
12722 -38 -16 -41 -65 83 149 -97 -13 108 33 -123 -78 -176 -149 98 6 -290 -61 22 46 59 89 90 95 165 7 -184
12748 -184 -105 -99 -127 -337 -54 45 7 -129 41 -39 -43 -52 141 28 195 -59 -38 101 -2 22 55 19 126 139 26
12773 26 -30 75 153 198 20 -165 170 -103 172 92 42 -5 -27 126 62 115 31 -85 -94 180 -101 170 186 115 140
12798 140 -47 -219 -81 27 -21 -160 -126 -33 48 -93 -29 207 190 -72 69 84 -146 -17 15 187 -255 -23
12820 -23 -152 0 -2 -61 179 -86 183 58 88 -33 214 -16 -121 -147 -75 26 86 -81 -29 -173 -144 -223 -1
12843 -1 61 -217 199 16 225 147 112 134 -13 14 -67 -32 -184 -12 -82 -57 179 162 -163 49 6 180 38 103
12867 103 -119 -29 -217 15 93 144 -44 62 49 -83 -156 -117 81 -202 211 109 43 19 92 -194 146 137 -18
12890 -18 127 70 -83 -136 216 -54 -31 0 54 171 34 -188 -117 -127 -396 -75 -161 14 68 -185 200 -96 293
12913 293 -49 204 -36 122 105 11 60 200 -94 -12 -2 -101 31 78 64 169 219 -2 -125 -65 103 8 98 33
12937 33 287 115 -47 69 -104 -212 -2 -28 3 -10 -20 136 -35 -70 -35 153 9 204 172 39 142 -289
12959 -289 -139 -172 3 -160 -32 44 11 -21 137 295 -94 13 27 125 41 244 -85 -168 23 208 265 -184 15
12982 15 250 121 44 -110 17 -37 -132 156 174 41 -24 1 -81 160 28 -116 -31 122 36 -9 101 151 5 -73
13006 -73 50 -120 53 -81 -29 -74 -96 -95 -143 196 46 -193 52 -118 57 -9 146 4 -46 -142 118 -87 -99
13029 -99 -2 -141 -183 82 100 76 -61 155 -25 -2 81 -2 114 118 -148 161 -252 -227 -189 -24 -28 82 -68 41
13053 41 107 182 138 -30 -7 23 394 98 -83 -195 148 198 87 137 156 60 62 -136 215 -5 242 52 39 192
13077 192 -320 -132 -193 -167 -3 120 55 134 -155 242 109 55 102 184 167 -84 -208 15 -46 -24 -131 -154 20
13100 20 -199 87 -197 -196 -58 73 -178 -65 86 168 106 75 -7 -76 51 -214 212 -150 -47 -35 -143 130 -61
13123 -61 163 -5 136 325 -33 30 -38 -6 -234 127 4 -145 -22 6 -96 15 -99 -69 -115 146 -17 140
13145 140 11 -267 -154 -126 -34 52 -171 -120 -180 106 162 0 206 57 -57 88 189 11 97 -96 272 -272
13167 -272 36 -33 81 -154 132 296 164 113 -141 8 -113 118 -251 39 -144 -164 3 -30 -57 -69 -19 -18 71
13190 71 -12 16 29 12 198 140 4 -52 -68 123 12 -45 -128 -144 110 124 96 13 147 191 293 -165 -89 -63 -46 -4
13216 -4 220 -442 148 60 40 -287 -116 140 65 4 69 8 -94 24 112 -302 -14 -37 153 -52 -148 136 -244
13239 -244 -209 -36 70 87 307 -64 249 -127 -11 -25 -247 9 34 86 59 81 126 287 -343 -154 33 -83
13261 -83 24 74 195 18 63 110 -268 -152 -38 -120 119 -83 -49 86 25 -86 177 124 -235 -44 -171 -22
13283 -22 -86 -253 75 -142 -59 -106 109 -13 74 89 -199 -16 -139 130 15 -66 33 204 -11 93 -145 66
13305 66 103 135 -62 -5 -105 46 33 -60 100 130 287 46 68 268 -16 54 23 -101 -106 -24 35 -71 227 -263
13329 -263 37 148 85 10 208 193 -54 181 75 169 65 -103 -33 75 -34 -191 -205 33 -83 -48 3 123
13351 123 293 82 -71 -80 -175 -226 35 166 -40 -36 144 -116 22 -38 -76 -110 -41 78 -106 -98 -261 -134 42 129
13375 129 -98 24 58 1 5 -71 -129 -97 103 81 153 -47 -98 72 -142 42 -9 56 -1 64 -176 73 3 72 -59
13400 -59 76 -84 168 176 -30 -13 -170 154 137 -108 -170 482 61 82 -69 -47 60 154 -28 84 -72 -106 44
13423 44 -82 -89 -200 -177 -29 -124 -10 189 -96 -103 -25 112 16 96 122 -8 -9 -134 49 -182 -79 171 -154 122
13447 122 203 55 -45 300 182 -6 91 38 59 -126 98 94 -226 -45 220 -44 162 -115 63 -115 80 -112
13469 -112 24 270 -180 73 -54 -91 -134 -55 46 78 7 51 51 -94 -192 277 -217 -73 -25 75 49 261 119
13492 119 145 296 -254 203 -278 142 -21 217 166 245 259 59 55 84 55 150 202 80 -26 155 96 -204 -42
13515 -42 -83 -34 88 10 -180 313 49 106 -9 -106 180 141 173 -37 -89 3 -103 -228 -183 -209 48 -78 112 9
13539 9 -24 91 2 -19 -5 123 -182 285 51 -210 -55 27 -25 119 53 94 46 95 73 -10 -199 26 -33 -238 -34
13564 -34 -279 -113 -16 92 -124 140 -79 -25 113 -42 76 120 -70 158 4 71 37 -315 -152 150 -72 -5
13586 -5 -165 20 107 18 112 149 29 -133 -115 66 42 104 154 -111 241 62 -69 1 -14 -23 -191 89 176 154 30
13611 30 -76 38 80 20 -39 -67 -22 -78 5 12 -15 -147 -201 -88 -54 125 121 25 106 68 -130 -13 187 23 19 70 -233
13638 -233 71 -95 63 100 16 205 8 -43 -160 -57 -146 112 -87 172 -88 -146 -37 -44 397 -70 -2 -110
13660 -110 117 40 43 136 28 59 -8 12 -69 -56 -144 -39 14 -81 -82 365 99 248 -110 -76 107 116 -190 -39 -117 -38
13686 -38 16 -104 104 62 -40 -88 40 -24 168 -72 23 -97 242 -73 -131 -123 89 -47 -45 -9 142 -47 -164 30
13710 30 -150 -41 47 29 -70 134 50 -66 -260 -36 -17 -237 0 123 -109 -150 326 32 -75 113 -195 33
13732 33 62 -121 -61 -213 222 -62 78 37 71 70 -229 191 46 -193 10 -18 -163 -131 -4 137 -52 -124 -21
13755 -21 -168 -314 152 -75 -42 -168 98 40 -109 -118 22 157 58 -98 -4 -174 -74 107 -216 -113 216 76
13777 76 -27 59 40 -102 29 -102 48 39 -156 -26 -17 -47 -150 257 -88 -353 -78 -256 -72 83 -87 51
13799 51 134 -204 8 7 -15 -72 -19 -111 -39 -16 38 -45 -70 130 -51 -51 25 58 -151 89 -217 -74 -5 426 34 -66
13825 -66 -29 -87 150 22 -157 -168 -1 -100 32 -125 221 3 -215 -85 -131 86 57 102 257 87 47 -25 -75
13848 -75 76 221 65 124 -244 23 -81 65 -61 -139 -185 59 228 108 -192 118 176 97 -50 192 61 2
13870 2 117 -3 -40 98 170 -77 27 75 248 -188 106 -177 -260 45 7 80 30 95 125 -147 159 44 -313
13893 -313 -131 24 -181 129 -189 -302 -111 -135 121 -140 -109 141 -299 46 228 -250 183 58 -53 31 89
13914 89 67 -122 272 205 161 255 -195 218 -302 -24 268 -71 1 -188 -236 -108 52 172 -109 -251 93 52
13936 52 12 36 -127 -118 -210 171 99 -1 163 -243 -54 -70 221 -294 187 37 117 -187 222 -119 -33 -252 41
13959 41 185 -163 -57 -167 -20 -197 -186 136 -297 61 -120 45 -5 112 79 -19 -181 -3 -39 142 -82 -105
13981 -105 97 76 79 -63 83 166 -62 226 16 -35 26 12 -53 5 124 -63 72 77 -100 -18 17 -238 225 -60
14005 -60 175 73 156 35 -171 111 147 153 51 -74 -102 -27 184 68 -166 -111 -46 -62 116 250 25 107 -118
14028 -118 118 82 217 -220 13 -166 -36 -83 -184 -1 -46 129 192 1 -54 228 -28 -108 -422 324 13 -19
14050 -19 -154 -48 -170 23 -27 -23 -224 -139 -111 -4 -37 279 112 143 59 -35 -199 56 170 -251 -71 -58 -66 134
14074 134 -81 36 -16 -324 149 24 34 -225 131 -166 -172 -270 -75 -38 -26 -79 79 -109 59 90 95 -29 -131
14097 -131 58 148 -37 154 -313 -72 -67 1 97 9 -174 -39 136 154 237 70 -79 33 -21 -85 125 -103 106
14120 106 -186 51 61 5 -230 -66 7 20 -75 59 99 -127 50 -35 -143 -50 -123 -161 -113 -365 -15 -172 -71
14143 -71 16 31 -57 50 38 2 189 -28 -81 -69 -29 141 -173 -6 8 22 225 65 99 261 -119 21 -36 -25
14167 -25 19 -31 99 164 -100 -136 -44 182 -160 -38 134 71 127 -61 75 170 62 -268 99 -13 139 -111 107
14190 107 -179 -89 -172 12 250 -52 -23 -3 -35 -80 34 10 -10 -405 186 125 -127 -66 -178 83 -50 -91 111
14213 111 26 -64 -54 40 213 163 -1 137 106 -73 -147 -30 16 -48 75 113 151 -94 178 120 -133 94 223 -228
14237 -228 -118 98 82 -149 -34 181 -216 -50 105 307 68 96 -20 37 -136 -50 30 2 45 -87 -205 -64
14259 -64 -129 -185 29 -54 -143 -102 0 164 64 151 -141 -255 -112 70 -39 120 -31 84 43 -37 95 -20 61
14282 61 -12 -109 -91 -49 9 -184 -66 -55 -112 -170 -98 -173 -8 163 -136 56 -21 -204 -82 -131 140 -14 -291 -109
14306 -109 -105 -119 -71 52 -45 -339 -57 126 77 -312 -101 -110 53 112 190 -209 -121 -112 -226 -112 -128 -101 71 -149 -97
14331 -97 341 -116 102 -269 43 16 168 33 -219 -45 27 149 -101 0 20 -25 113 238 -100 176 -123
14352 -123 201 -115 172 0 -105 14 -139 -69 -82 128 75 -106 -14 226 -27 -59 41 -71 51 134 -229 291
14374 291 7 32 85 24 -70 -216 47 -121 -22 -112 -12 -23 2 4 -93 6 97 119 -169 111 320 86 -111 -334
14398 -334 -56 -23 -39 -121 -47 -210 -40 6 27 -47 42 -153 189 -244 163 -40 -27 85 -133 -233 272 -124 21
14421 21 -30 17 -191 71 -183 -101 -5 -125 46 -59 -93 46 -347 -81 116 49 165 81 -83 -184 -39 -114 -88
14444 -88 62 -142 -18 118 173 11 -191 221 -141 -294 53 172 124 198 45 -89 -54 59 8 -97 116 49
14466 49 23 26 21 -222 62 72 84 -122 153 -77 93 -16 242 -82 -98 -245 -86 33 -238 -100 -60 125 138
14489 138 23 23 -85 145 5 57 137 82 -44 -189 -222 -305 22 -164 69 25 88 105 335 -70 -139 -22 -31 -237
14513 -237 127 1 -127 -80 -199 161 -43 -272 -323 65 90 97 34 -141 60 14 -148 8 92 43 -5 -392 -194
14536 -194 -177 -93 -17 18 -361 161 191 116 38 154 144 114 -55 -160 -180 18 -93 35 -98 22 21 -8 10 83 190
14561 190 196 324 -184 176 59 -14 4 64 -4 -89 -115 -75 -60 -4 -110 -149 39 83 -132 165 -15 -24 31 -169 89
14586 89 24 -305 -186 -88 26 -217 -46 -26 -277 133 246 -40 64 206 423 -52 -90 60 -94 -293 14
14607 14 -64 0 -150 5 21 94 162 44 269 27 -75 -209 -207 -107 -139 -220 -50 63 58 -104 95 309 32 12
14631 12 -127 109 11 44 -188 167 106 -205 42 -41 -57 -9 -200 -13 -119 51 20 -3 89 -113 -122 135 40 38 0
14656 0 5 -88 3 154 -104 -77 184 -152 17 197 -42 -25 -86 -66 -123 225 64 -224 -106 1 21 -16 -83 65
14680 65 -59 68 -13 -9 -155 59 -202 20 32 -101 82 202 -150 -78 84 21 -18 -140 -9 49 215 22 76
14703 76 34 -53 146 -171 119 -102 -209 49 -166 178 -82 -8 110 186 -152 -36 317 122 218 -29 122 -241
14725 -241 116 -74 29 -322 -128 -239 -30 144 266 6 -51 118 131 -92 -159 62 -8 -371 35 -2 -80 -109
14747 -109 -164 -7 -96 144 -45 -36 -78 -236 -105 154 -151 117 186 -45 43 -81 219 -24 3 42 11 29 -64 -112
14771 -112 281 -99 -63 -67 -232 -8 -22 -165 -55 265 -16 74 150 150 -21 74 -164 81 -22 -218 266 20 47
14794 47 -42 71 47 -217 -72 370 25 64 -59 121 262 143 193 10 -59 180 -1 -119 8 -204 -95 42
14816 42 194 76 -156 10 123 -33 -95 23 228 168 29 -147 157 157 -124 61 -100 0 36 -114 -126 210
14838 210 175 31 -132 257 -70 320 -70 -230 71 189 80 -146 149 -150 -18 -145 -26 -16 11 72 -77
14859 -77 -124 -82 -76 -252 -3 -25 9 -75 42 310 6 -128 1 52 -141 -165 36 -226 -113 55 -154 -87 108
14882 108 206 -175 20 -117 -133 -26 -167 -160 -12 -29 27 -119 -1 98 137 -142 -124 -30 143 -189 29 -2 57 -245
14906 -245 130 159 231 -14 -72 280 -260 -23 -20 95 253 -120 -223 1 -199 -55 126 -9 -61 58 280 -15
14928 -15 -48 176 -24 -81 -44 -225 -90 82 -136 -112 281 137 -21 221 -79 0 406 38 89 302 110 -220
14950 -220 167 -117 -57 -157 95 203 114 -40 -8 247 -1 -5 10 -135 257 0 55 52 -144 -155 -178 -214 -248 6
14974 6 -68 -2 -90 205 -2 -210 30 -61 -123 -159 33 46 -102 57 -72 -207 71 -143 97 -78 -330 -121 -104
14997 -104 26 46 80 -36 102 71 -17 -219 -147 -287 189 -87 174 -15 13 275 61 306 129 114 -46 -313
15019 -313 -162 -123 135 68 -162 43 -274 42 -207 65 122 30 -36 57 96 -64 -13 -75 11 129 -116 -179 206
15042 206 179 -1 -133 97 -99 -30 124 53 248 143 -83 -20 -239 27 103 11 7 136 -40 9 12 220 136 84
15066 84 -62 -203 -155 -3 -153 -2 -192 -22 -79 -189 -28 181 103 107 79 143 -36 150 14 -151 284 15
15088 15 -218 50 141 -418 78 46 154 -23 -272 19 17 -56 -104 99 -105 -127 277 22 -15 -43 80 96 -49
15111 -49 89 76 64 65 24 206 124 93 -114 13 51 47 -220 -99 -95 -21 -113 -194 123 34 54 -91 190 206 63 -54
15137 -54 155 -20 -113 227 -221 -142 29 80 14 127 -214 243 123 -86 -113 -67 -164 107 92 -50 41 -10 47 -47
15161 -47 49 -172 -103 174 113 127 -32 -179 241 66 -112 -84 258 -200 58 -44 -77 115 -63 -50 157 -3
15183 -3 147 -138 -322 271 29 164 111 8 22 117 141 -147 213 44 141 -8 13 -60 225 125 20 -78 -200
15206 -200 12 109 -479 -136 63 -115 -144 -143 42 121 -138 -42 -112 190 120 46 350 27 -17 181 -89 -63 125
15229 125 42 257 -93 226 -10 99 55 46 4 51 -44 94 -153 -111 -125 -104 105 -15 -248 32 70 -90 33
15252 33 296 153 100 64 84 2 250 -47 -298 240 84 -122 -161 -16 -64 61 9 172 70 58 -106 66 22
15275 22 -337 -43 -32 -33 -304 -167 -96 -50 86 17 47 185 113 -57 207 -86 239 125 72 -72 17 73 82 -94
15299 -94 -52 -367 -58 38 156 -35 -43 11 -40 -161 -185 -48 199 126 -119 15 -189 -32 -45 23 4 -94 163 -115
15323 -115 182 -40 17 161 -71 78 -71 148 169 -145 -174 -116 -42 197 -89 47 15 -57 105 -64 -16 -24 -7
15346 -7 83 -42 -277 0 109 41 68 -42 -58 37 239 267 -84 102 278 -18 47 -53 73 -30 -29 -100 -263 -2
15370 -2 90 396 122 -88 -91 -41 299 88 239 148 -32 -114 -138 -112 -84 119 42 -108 -135 -68 -96 -114 122 -72 90
15395 90 -102 -102 -144 -68 71 232 -50 -125 92 -42 82 274 -205 -81 -35 62 182 10 -26 241 163 -51 59
15418 59 2 101 -332 102 -79 70 300 291 236 -34 158 -52 278 -93 -232 -54 -77 -53 -124 14 65 71 59 -42
15442 -42 17 -196 -44 -39 -127 -178 -8 -49 96 -14 -60 26 -8 -198 -113 265 119 52 164 264 12 70 244 -82
15466 -82 -10 -2 -249 87 44 219 89 -137 33 -35 214 -71 -27 33 30 122 46 -19 162 -120 -118 -73 58 38 -3 81
15492 81 -152 87 229 -42 -50 -12 -56 77 162 112 89 -103 146 182 35 -15 -102 23 272 90 -149 17 325
15515 325 -17 81 348 82 -100 83 -24 -186 -41 -146 213 -215 -141 208 16 50 135 126 95 -109 21 -274
15537 -274 160 18 22 -18 257 89 -3 -6 115 -78 -1 238 259 141 35 70 -23 -94 -77 -246 182 -19 -5 23
15561 23 -130 -40 16 -88 328 -90 132 294 8 59 -129 -29 -21 -135 29 -54 115 -107 -51 2 235 56 -5
15584 -5 186 66 90 76 80 87 117 -160 -14 32 -105 203 177 -80 185 -102 108 244 -25 -34 -17 170 189 -207 -217
15609 -217 -41 -14 93 14 21 -13 -85 162 -34 170 61 -22 -227 129 -149 -88 1 -51 -239 -184 71 -188 -15
15632 -15 -137 -45 -23 59 94 4 -71 -19 127 165 -57 -37 83 -18 141 -65 -134 59 -27 17 45 -18 -122 -125 -195 -8
15658 -8 7 -191 -36 -61 -144 -357 10 -40 118 17 238 242 -61 253 117 -9 -42 18 -29 11 -240 -152 223 32
15682 32 120 100 30 264 87 78 -128 116 -99 -56 39 -4 -271 -79 -224 -16 -134 -29 -95 147 209 -112 75
15705 75 103 38 78 233 -90 44 109 -18 -112 -32 30 -259 224 22 -59 -70 -59 -75 132 25 129 -5 -10 210
15729 210 108 113 -24 -152 -16 -14 255 46 -101 -17 -51 -81 61 341 5 -70 49 -51 96 67 183 -126 115
15752 115 143 8 1 -23 -125 157 -82 113 85 52 -165 -330 93 46 -9 -141 65 -199 173 32 51 64 127
15775 127 135 43 -189 -115 204 157 29 -163 43 145 89 -29 -250 -1 -49 376 -16 136 118 205 -85 36 192
15798 192 28 7 -49 -63 -109 -58 30 76 -124 57 116 273 -3 159 92 -96 219 -17 -139 -44 -117 -3 90 144
15822 144 50 81 -274 -32 82 60 134 242 -172 -140 238 -183 -9 -51 -136 11 -223 123 46 170 -17 -7 -115
15845 -115 1 217 204 -108 -69 11 7 3 131 111 -1 228 -85 214 -194 7 -7 404 -48 -163 88 39 -23
15868 -23 -232 28 -102 -63 -258 59 -71 42 37 131 -23 -14 -37 -197 19 28 -82 -176 -48 119 -92 65 87 -15
15892 -15 5 -64 -96 -143 -103 30 -120 28 -88 -230 4 64 -102 -90 -2 8 37 51 193 12 5 -84 50 68 -391
15917 -391 70 181 -46 -44 -129 4 50 70 2 -256 258 26 121 317 323 -52 265 205 142 -230 -86 149 98 157
15941 157 36 -49 125 -20 265 -99 48 -138 112 48 68 32 279 143 -69 -104 -91 -82 -81 131 -89 -144 -43
15964 -43 255 -26 -256 -8 28 -59 -98 -119 -3 -96 8 25 163 217 -124 -156 -57 91 319 -185 122 73 84 111
15988 111 70 133 -24 74 -31 40 -236 36 -23 11 -11 9 46 -22 -100 13 -73 3 32 7 -109 -56 12 -261 -58
16013 -58 147 -4 76 -42 14 -56 80 35 256 -226 27 -235 18 11 -343 11 68 122 99 15 -2 113 -141 331
16037 331 322 -170 112 48 -168 -2 186 -112 -85 84 -90 140 60 182 -28 -78 -101 8 -12 -19 -211 -113 -117 6
16061 6 -87 98 165 136 19 -13 197 112 64 123 125 153 -133 74 -88 262 79 -36 66 -76 18 -179 57 -53
16085 -53 -285 153 -10 81 179 -164 -63 303 -154 -39 -87 -83 -2 30 231 -28 54 -67 117 177 -309 51 149
16108 149 -8 -55 -276 -19 -191 23 139 -41 -43 -71 58 103 55 -89 -85 -169 206 -82 -86 -31 -15 87 94 72 26
16133 26 30 107 77 17 -51 -128 -54 232 196 -91 -50 61 -79 -147 159 2 105 103 -2 -31 81 -60 236 -137 -97
16158 -97 -33 -68 -132 55 -88 53 -69 24 -99 33 -1 193 161 145 105 -3 46 4 -125 56 -57 -203 55
16181 55 187 -269 153 -131 174 -54 -116 211 50 15 23 121 336 360 200 44 -105 -52 6 26 24 139 -112 127
16205 127 17 170 19 41 -127 111 -59 76 -97 -170 26 -250 -17 -114 -188 67 217 -37 144 -144 210
16226 210 96 -19 134 -141 105 95 17 95 -23 -142 16 -143 -27 225 72 -36 88 55 112 401 36
16247 36 131 -94 17 -48 163 17 6 -69 -18 19 -49 38 -121 1 -129 231 251 158 -60 -54 -15 -185 182 -241
16271 -241 -65 216 270 -258 -112 -111 -133 57 -193 35 -114 24 -15 -44 -264 -165 63 71 -24 -88 -127 210 28 194
16295 194 29 11 39 -60 -11 -16 184 -21 125 34 -124 97 -276 -226 67 -22 5 125 222 -1 -279 78 -1 -134
16319 -134 159 119 -265 -128 -109 -101 140 -22 -133 -96 108 16 -48 -130 50 -115 240 -4 26 87 17 -91 -154 -71
16343 -71 -98 89 150 188 -20 34 41 105 -251 -98 3 -188 -132 -35 -16 18 -25 -204 54 -158 102 179 66 100 -180
16368 -180 223 56 -238 -12 -47 39 210 42 3 -42 -54 238 80 -67 -237
16383b37
$$ Imaginary data points
##PAGE= N=2
##DATA TABLE= (X++(I..I)), XYDATA
0 0 0 0 0 0 0 0 0 0 0 0 -32 32 -32 32 -64 64 -96 96 -128 160 -192 224 -256 288 -352 405 -480 544 -614
29 -614 706 -832 929 -1057 1207 -1348 1537 -1717 1922 -2147 2402 -2664 2966 -3287 3639 -4028
45 -4028 4450 -4911 5415 -5968 6574 -7238 7974 -8795 9702 -10723 11877 -13182 14687
58 14687 -16444 18512 -20996 24051 -27910 32956 -39887 50020 -66310 96868 -174178 799774
70 799774 1010991 -1017578 -1356444 -408154 820642 787954 136128 -412900 -347178 -252837
80 -252837 -173388 18138 484487 586066 41147 -745046 -779749 65921 964199 834672
90 834672 -140216 -867420 -577961 169941 517356 266215 -75823 -212044 -214752 -218862 -73551
101 -73551 269388 484667 178008 -376476 -496594 -4571 453463 336157 -100147 -243214
111 -243214 -34368 52799 -165994 -249442 106901 461652 223721 -391184 -585142 -54092
121 -54092 585399 570577 -67714 -549803 -331737 215214 364596 36061 -198829 -38572
131 -38572 128321 -86279 -381026 -173842 417032 583276 -22271 -665689 -482265 320209
141 320209 739783 296691 -412430 -552724 -81944 331547 253218 -45894 -144275 -64386
151 -64386 -59960 -116204 -15226 218677 272009 -8370 -315628 -239340 160234 384832 151997
162 151997 -239732 -321146 -45227 206088 143661 -78401 -134576 -10437 38131 -41526 -25692
173 -25692 138273 176931 -53937 -259024 -104440 248131 303774 -64230 -382303 -220444
183 -220444 200204 324480 24642 -277543 -210214 96006 234894 73574 -110576 -63530
193 -63530 83698 62329 -89229 -99857 85086 189102 6391 -258683 -228557 107790 316279
204 316279 109680 -231944 -252479 50496 261293 134773 -112440 -143484 27920 105166
214 105166 -14985 -103849 -9878 96021 25611 -116911 -112755 42595 142244 56265 -90083
225 -90083 -87239 56206 124602 19728 -99599 -63570 69277 101699 -29550 -153775 -84529
236 -84529 96705 133448 -19822 -127177 -42153 88441 79635 -21928 -41353 45596 75751
247 75751 -38059 -136598 -43914 130328 126138 -70021 -199221 -91922 116116 174573 31639
258 31639 -118412 -95650 38248 99340 44534 -16738 -18277 -4932 -30216 -61574 -23868 69601
270 69601 87109 -36132 -150883 -80293 107917 175554 38701 -121970 -106042 47351 124403
281 124403 39339 -63918 -55308 -296 -5662 -38418 -14592 44221 44359 -32792 -86328 -24120
293 -24120 94745 117245 9362 -92216 -68694 36058 89578 29679 -67845 -82706 -9792
304 -9792 36401 1896 -33286 -2016 40661 20816 -31880 -27762 47111 90486 22037 -74503
316 -74503 -63397 31640 63035 -9206 -73438 -46897 19519 34158 -11720 -38998 2660 54815
328 54815 41679 -10820 -25373 8511 38289 25255 -19194 -44260 -19549 12230 -4599 -40299
340 -40299 -26646 24081 37053 -6731 -40929 -6790 64710 75206 -620 -60513 -25838 37890
352 37890 34505 -18590 -43746 -24867 -4172 -9234 -19331 517 33183 26933 -14143 -24360 16782
365 16782 54146 43082 -3945 -43532 -37214 9021 31594 -3112 -46048 -41045 -4638 16539
377 16539 9830 -116 9332 25088 13645 -11735 808 41399 36498 -20738 -55246 -28080 16190
390 16190 21785 -12726 -42078 -27367 9015 21487 13204 13677 18290 10137 194 2765 9294 13968
404 13968 11058 -11703 -40025 -37775 -4842 18688 9735 -15696 -25052 -3452 25180 25591 10950
417 10950 14876 22711 2596 -25421 -18494 11550 21684 -3262 -36151 -42410 -16570 10659 18347
430 18347 16305 11996 -2696 -14757 -239 29088 40405 22961 -11046 -39875 -38963 -7156 24330
443 24330 23517 -9340 -42368 -40958 -2114 35624 39024 21507 5653 -11448 -23708 -8044 30691
456 30691 47468 12990 -45372 -69592 -32096 26316 44223 14429 -22872 -36053 -20049 17224
468 17224 48730 42958 7822 -20951 -25291 -12121 6106 17727 14413 -5169 -33448 -47584 -21291
481 -21291 28313 49630 22093 -17750 -30777 -11289 23190 43936 30508 -8253 -37697 -33861
493 -33861 -4192 19368 11131 -12881 -17974 -4831 -2723 -9222 3558 30495 36877 9119 -26560
506 -26560 -31942 2121 36660 29622 -11619 -44139 -39271 -3357 29250 23502 -11732 -24940 2602
519 2602 26159 13645 -9239 -3877 21674 27584 -6151 -42496 -31369 15468 34626 4580 -32847
532 -32847 -35974 -5300 30372 35012 3305 -22910 -8844 22985 27958 -380 -27708 -20402 14151
545 14151 26364 -8694 -43598 -28618 15377 34236 15438 -13881 -21693 1346 28420 24955
557 24955 -2372 -16737 -4117 12502 6326 -23891 -39929 -5581 44679 35683 -31319 -67000
569 -67000 -18854 59478 78655 16795 -56703 -58257 7657 56509 36217 -18025 -45781 -27884
581 -27884 4477 10596 -8614 -7745 24012 34329 -8673 -51325 -26138 48290 85386 30520 -63880
594 -63880 -89845 -17628 62697 62245 -5484 -61593 -56519 -4145 41058 39183 8004 -8612 -2267
607 -2267 2167 -4218 -7037 8235 32345 26927 -24515 -71737 -50385 23304 68622 39533 -30602
620 -30602 -70397 -36323 39134 77067 42629 -19366 -45596 -21757 14331 19052 -3516 -9200
632 -9200 9583 3758 -41282 -61139 -7350 71558 83276 5123 -80890 -73800 23313 100299 73571
645 73571 -20845 -83304 -62473 6150 46915 26951 -12936 -24363 -16291 -16939 -16061 13122 55396
658 55396 59950 3899 -63664 -64051 12392 80214 61410 -21947 -83945 -71892 -4079 54558 54119
671 54119 4629 -40804 -42872 -5778 35372 47290 26115 238 -15045 -25174 -26464 -4856
683 -4856 27240 32793 -1107 -47020 -60693 -21086 43225 69956 31410 -31096 -55064 -17051
695 -17051 43391 61030 18644 -29961 -36320 -17177 -8675 -8131 5911 23101 15240 -22960 -51512
708 -51512 -24895 43019 78715 39030 -32016 -61668 -27020 32764 57495 22319 -33550 -56252
720 -56252 -34387 830 23565 26844 12331 -8638 -24088 -21091 8146 46747 51058 6933 -41460
733 -41460 -45808 -10462 25121 32263 6670 -29891 -46414 -27715 12971 43638 36294 -2982 -31080
746 -31080 -18276 15024 32400 23737 1306 -19953 -25657 -15148 -1745 6241 8263 417 -13371
759 -13371 -18728 -7072 14832 31438 25414 -2204 -22480 -11333 14343 19808 2414 -16139 -18699
772 -18699 -9988 -3928 -5318 -2268 9163 11335 -2385 -10058 669 16123 20093 10939 -4485 -14995
786 -14995 -11736 -442 5250 1584 -7810 -14861 -11930 -1083 7019 10939 12271 5865 -6203 -6727
800 -6727 8433 18644 9326 -8701 -17244 -12011 -1280 2651 -555 -3102 -5003 -7534 -3989 9485
814 9485 18566 11912 -1998 -8688 -2998 7668 11083 1567 -12066 -15858 -10049 -826 6802 5388
828 5388 -4313 -8037 -158 8796 11048 10008 5722 -2615 -7824 -4606 2800 6849 -242 -14322 -17058
843 -17058 -2784 8862 5569 -190 274 1067 1761 6667 9715 6163 -366 -5650 -8071 -3342 1987
858 1987 -1001 -6410 -6660 -4947 -2157 5770 10068 3908 -1958 2185 6653 5620 2038 -1893 -4581
873 -4581 -3637 -3624 -7362 -5686 931 288 -4892 -1624 6327 7167 4171 3805 3940 3162 2135 -995 -4233
890 -4233 -2824 -2305 -6339 -6764 -2577 -2345 -2935 3534 7116 3115 680 4540 6826 4884 2209 -533
906 -533 -3538 -4704 -6302 -7043 -1608 1461 -5001 -9154 -1108 8529 9040 5925 3487 1569 2302 3824
922 3824 2107 -155 -1935 -6619 -10992 -7970 -1809 33 -192 562 -1470 -1037 6838 12813 10187 2351
938 2351 -2530 -1856 1909 1007 -5799 -9468 -5239 -3180 -7385 -6559 2082 6789 4401 2369 4010 6901
954 6901 8405 4712 -448 -1121 97 -3540 -7859 -8574 -7211 -4767 -19 1205 -2028 -1895 4649 9800
970 9800 9343 6318 3950 2774 123 -4531 -6279 -960 1864 -6579 -16034 -12003 878 8737 7159
985 7159 1298 -482 4141 7660 7039 7208 6998 752 -9028 -11804 -7201 -1577 876 -2070 -8753 -11031
1001 -11031 -2489 8186 12555 10568 5618 1733 1087 1083 465 3892 6707 -3593 -20080 -20789 -3682
1016 -3682 10225 7477 -4034 -9650 -1650 10105 11178 6607 8313 10601 1400 -11408 -12727 -2613
1030 -2613 8652 7213 -9586 -25551 -18608 6226 20614 13620 -1979 -8770 -739 11821 12829
1043 12829 4957 1847 2344 -6644 -17499 -13739 1134 10015 3796 -10883 -17393 -6350 11929 19553
1057 19553 14649 4716 -5499 -9910 -818 12679 12885 -1380 -16112 -19908 -10800 3767 8757 1327
1071 1327 -4176 -1374 2314 3193 3978 8204 14486 13419 -4530 -24104 -17609 10670 23275 1952
1085 1952 -27791 -29514 -1305 23986 17350 -6295 -11389 6091 15652 5234 -6890 -2352 11478
1098 11478 12449 -7649 -28507 -20244 9554 23660 5185 -20932 -23540 860 25368 22638 -92
1111 -92 -11882 -2510 7832 4993 -1925 -3690 -1372 -2430 -8090 -11666 -5791 4423 8134 5219 1197
1126 1197 -3857 -5217 5112 17986 15161 -3955 -18686 -14705 4434 15763 3700 -18320 -20433
1139 -20433 140 16439 10278 -7066 -10774 6316 22141 10991 -15216 -18193 7872 24698
1151 24698 5645 -25922 -29002 1558 26636 12516 -20924 -24430 7219 28654 14246 -12161
1163 -12161 -16005 5959 22169 8760 -18091 -21613 693 15903 4766 -14309 -17712 -1285
1175 -1285 16198 13090 -4759 -9704 4220 13764 6786 -3839 -6471 -2417 1561 488 -4647 -6914
1189 -6914 -5415 -4030 822 8945 7712 -4668 -8319 4892 16749 10737 -5669 -13831 -4458 10285
1203 10285 6588 -12637 -18665 -1084 14585 6745 -12276 -15618 5117 26701 19214 -12255 -24031
1216 -24031 -202 24977 16548 -13921 -27164 -9110 14463 11035 -12578 -18388 4378 19855
1228 19855 6677 -12332 -8128 13224 22837 6603 -17124 -17818 2487 14313 3138 -13380 -15254
1241 -15254 -4776 5241 4827 -144 1282 7634 5965 -2463 -2166 7879 10949 651 -10528 -10863
1255 -10863 -2372 2034 -3735 -8361 -1250 5765 -66 -7748 -62 15667 18064 2164 -13343 -8453
1269 -8453 10005 15079 -2748 -18900 -13018 2698 5768 -5339 -11296 -1611 13253 12219 -4173
1282 -4173 -10519 5588 21176 13493 -9312 -19067 -4917 12000 6615 -13964 -18949 -2241 9971
1295 9971 1632 -8462 -2109 12799 15597 1902 -9399 -1309 13643 11710 -6522 -16942 -8920
1308 -8920 2886 3291 -6891 -11697 -2931 8483 5920 -3260 -441 11565 14615 3165 -8148 -5582
1322 -5582 6520 8952 -5841 -18235 -10361 4572 4189 -7113 -9085 2285 11838 7996 -2584
1335 -2584 -2161 10602 14514 560 -12066 -6562 4557 3983 -7152 -15103 -9465 4392 7765 -2966
1349 -2966 -7867 2936 14172 10177 -1289 -4307 4284 11798 3377 -13368 -14347 1226 8243 -4849
1363 -4849 -15950 -8957 6917 11785 2104 -6562 521 14282 12626 -2622 -8386 1239 7914 798
1377 798 -11298 -14045 -3362 6519 1812 -9747 -8069 5692 12342 6152 -1654 -536 7679 10336
1391 10336 -208 -10854 -5417 5828 2361 -11039 -13930 -2675 7581 5040 -4442 -5734 5890
1404 5890 13476 5371 -4253 -582 7969 5527 -4859 -10978 -6009 3027 3523 -7404 -12286 -2226
1418 -2226 9552 7618 -1113 -2843 3937 10778 6825 -4338 -6535 3061 6659 -4181 -13752 -8303
1432 -8303 3691 6219 -3033 -10004 -2919 10909 11454 -27 -5033 3114 9239 3502 -5511 -7403
1446 -7403 -1057 3824 -1757 -10516 -8078 3207 7734 1180 -4705 -1940 7018 10644 3526 -5473 -2901
1461 -2901 5542 4168 -6054 -9719 -2739 3343 696 -6641 -6638 3166 9952 4174 -3893 -751 6924
1476 6924 7104 313 -5005 -3225 1512 1165 -5566 -8363 -1618 4605 1621 -3782 -2569 3683 8502
1491 8502 5858 -1925 -3660 3185 6441 -1031 -8066 -5366 1063 1762 -3993 -8160 -2444 7524 7322
1506 7322 -1867 -4720 3920 9292 4965 -2313 -5072 -1322 2690 -294 -6826 -6878 -298 2118 -1140
1521 -1140 -3215 -675 4208 7470 4295 -1889 -1317 4522 4331 -1950 -5422 -3526 -1174 -1674 -4345 -4641
1537 -4641 -29 4425 1625 -1762 1588 6851 5929 1349 -945 -142 1209 -2 -4393 -6328 -2690
1552 -2690 -7 -2205 -3657 -1645 2265 4824 5025 1930 178 3095 5355 2024 -2842 -3687 -1905
1567 -1905 -1306 -3266 -5892 -5014 332 2827 -169 -1094 2682 5558 4622 3344 2098 670 -106 -1255
1583 -1255 -2857 -3299 -2660 -3781 -5185 -2749 305 919 1909 2998 2897 3389 4668 3708 1053 84 410
1600 410 -984 -3536 -5736 -5878 -2408 674 -1413 -4185 -1581 4524 7205 4914 2093 1214 2768 4037
1616 4037 893 -3376 -4351 -3043 -2987 -3599 -4851 -4958 -1580 4187 5161 264 -924 3211 7992 7537 1846
1633 1846 -4418 -4258 552 1105 -3922 -7044 -5629 -2174 379 991 -1099 70 5306 8025 4570 -54
1649 -54 -606 2384 5011 1986 -6226 -9992 -4568 1303 56 -3826 -4830 -1972 3437 6741 4924 1120
1665 1120 2001 4371 4339 1253 -2727 -5282 -2659 983 -1760 -8394 -8189 -609 5163 4905 314 -2797
1681 -2797 1204 8993 9754 1814 -4194 -3428 884 2279 -1775 -8340 -8586 -168 4251 -1016 -6273 -2443
1697 -2443 6444 10651 5429 -3426 -4025 4977 9141 1752 -7842 -8919 -3387 2063 1124 -5067 -7634
1712 -7634 -1100 6402 5622 333 -1242 2512 7089 6509 -603 -6464 -3073 2820 1573 -4650 -7878
1727 -7878 -5496 -56 4293 2848 -1577 -1840 3053 6724 6066 1719 -2769 -2354 2668 2708 -3714 -8415
1743 -8415 -4556 923 2261 -1139 -4938 -2687 5332 8969 3550 -2709 -1944 3437 6647 2450 -5684
1758 -5684 -8666 -2122 4058 662 -6829 -6943 522 6784 4831 -1731 -3228 3531 8689 4213 -3366
1773 -3366 -5015 -589 2890 661 -4988 -7235 -2754 3145 2617 -1033 -2374 783 4911 6023 1886
1788 1886 -1688 -513 2164 1013 -2462 -3779 -3149 -1971 -563 -761 -976 -573 825 2355 3566 3285
1804 3285 564 -981 1454 3227 124 -4186 -4677 -1782 1023 376 -3620 -4172 856 5137 3691 107
1820 107 -530 2145 4504 3531 -1928 -5232 -1329 2456 -176 -5266 -5840 -1379 3618 3161 -1636 -2946
1836 -2946 2912 7345 3529 -1726 -1289 1577 2093 -727 -4695 -4947 -1045 1101 -1737 -3620 -768 2437
1852 2437 3497 2670 1094 833 3064 3596 -14 -2604 -1123 -628 -2448 -3812 -3089 -1102 393 169
1868 169 -1082 692 4797 4431 710 295 2866 2436 -646 -2983 -3223 -1114 -697 -3137 -5140 -1800
1884 -1800 2654 2646 -63 -108 2597 4715 4775 1014 -1870 -520 2051 -338 -4772 -5691 -2674 341 -187
1901 -187 -3021 -2959 2660 6292 3352 -774 710 4867 4361 610 -3328 -3688 -375 -282 -3967 -5746 -2544
1918 -2544 1007 1126 -48 241 2399 4944 4992 1296 -466 1691 2122 -633 -3985 -4235 -2428 -1520 -2303
1935 -2303 -3830 -2042 2152 3105 720 1099 4078 5160 2966 126 -1266 -105 792 -2336 -5568 -4211
1951 -4211 -1192 -880 -1955 -1669 673 3491 4275 2553 768 2353 4515 2600 -1434 -3309 -2436 -950
1967 -950 -1815 -4486 -5273 -1306 2133 697 -997 1305 4897 5151 2500 -40 465 2261 1681 -2506
1983 -2506 -5282 -3072 -1067 -2372 -3228 -2623 -345 1979 3099 1387 1155 4188 5008 1910 -441 -1044
1999 -1044 -668 -363 -1812 -4606 -4727 -1248 281 -1261 -1366 1438 3305 3096 2423 1790 2379 3353 1189
2016 1189 -2271 -2610 -985 -2022 -3415 -3296 -1806 -1308 -78 1027 962 2250 3900 3163 1136 1009 1770
2033 1770 923 -920 -2695 -3691 -2353 -414 -1799 -3707 -1555 2111 2516 1123 813 2230 4146 3613
2049 3613 -12 -2435 -626 1104 -994 -3803 -4020 -2370 -242 487 -576 -1048 1496 3924 3029 1308
2065 1308 918 1228 1752 721 -1907 -3527 -1994 -421 -1655 -3097 -1697 130 1325 1464 1419 1997 2390
2082 2390 2017 634 382 847 -425 -2418 -2447 -1609 -1252 -1287 -1552 -1272 518 2261 1490 645 1560 2903
2100 2903 2446 695 -1183 -2092 -388 347 -1804 -3824 -2743 343 1436 241 -988 -69 2845 4080
2116 4080 1244 -940 265 1573 393 -1929 -2751 -2308 -922 -355 -1476 -1833 153 1791 2013 1590
2132 1590 1398 1328 1314 1137 -115 -1233 -672 -940 -2444 -2575 -1030 -399 -651 -492 177 1694 2805 2054
2150 2054 143 840 2649 1342 -1755 -2499 -1387 -447 -719 -2192 -3237 -1261 1932 2146 368 239
2166 239 1839 2710 2730 1008 -1297 -1496 523 -36 -2931 -3370 -2065 -287 -63 91 -547 647 2955
2183 2955 2881 1685 1412 1580 477 -325 -58 -1398 -2924 -2581 -1586 -1318 -438 -485 -1015 605 3339 3376 1308
2202 1308 754 1607 1849 1456 -601 -3188 -3512 -889 -306 -2174 -3214 -1824 1040 3020 2234 -108 449
2219 449 3996 4480 939 -1863 -1914 -316 437 -1356 -4333 -4480 -1128 1184 432 -320 -140 1547 4317
2236 4317 4263 1406 -778 392 1926 549 -2477 -4086 -3657 -1053 148 -1887 -3011 -819 2157 3609
2252 3609 3149 1564 280 1940 3683 1713 -1878 -3171 -1780 -468 -1301 -3504 -4153 -1521 2415 2078
2268 2078 -13 -227 2460 4198 4053 1401 -1211 -1490 116 194 -2221 -3742 -3719 -2288 137 727 -880
2285 -880 -785 2400 4172 3182 1358 386 1141 2118 1393 -2146 -4715 -3183 -839 -320 -1430 -3020 -2357
2302 -2357 1249 4597 3029 -75 681 3236 3867 1461 -2127 -3021 -714 1121 -1837 -5309 -4082 -236
2318 -236 2051 1045 -582 -845 2456 5450 3519 102 -726 853 1305 -317 -2873 -4105 -2245 128
2334 128 -869 -2739 -1516 1524 2337 2107 1833 1437 1818 2540 1266 -31 -813 -1570 -2597 -2065 -905 -1552
2352 -1552 -2409 -1408 528 1949 2061 1400 657 2097 3353 1739 -1402 -1794 -603 273 -1005 -3374
2368 -3374 -4191 -1528 2437 1414 -1564 -1533 2315 4873 3298 -2 -1584 861 2933 -201 -3847 -3895
2384 -3895 -576 497 -1084 -2849 -1903 1070 3440 1980 -762 209 2715 2780 705 -1453 -1766 -359
2400 -359 166 -1745 -3348 -1748 770 16 -791 114 1815 2411 1566 445 811 1868 1071 -1546 -2241
2417 -2241 -388 -116 -1884 -2767 -1491 641 1522 441 -1123 213 3107 3415 310 -1438 -292 1298
2433 1298 1031 -1737 -3756 -2115 999 855 -2232 -2427 989 3685 2820 -47 -1170 1307 3463 1385
2449 1385 -2566 -2502 -153 612 -1314 -3014 -2231 516 1880 185 -780 900 3182 2382 655 -137 283
2466 283 470 53 -2060 -2592 -1177 325 -1331 -2324 -387 1729 2059 1068 -173 606 3240 2729 -1098
2483 -1098 -2287 189 1001 -1058 -3263 -2859 -386 1395 202 -1709 -1010 2975 3979 1165 -853 487
2499 487 1743 1450 -537 -3346 -2700 290 91 -2594 -2933 -91 2035 2018 415 -338 1632 4009 2168
2516 2168 -1104 -1441 456 433 -1940 -3060 -2172 -459 -134 -1080 -1951 654 3339 2425 369 756 2264
2533 2264 2328 878 -1397 -2273 -412 42 -2140 -3820 -1853 1012 1191 -30 -956 765 3682 3748 603
2550 603 -1196 823 2440 273 -2744 -3184 -1350 -47 -1193 -2881 -2358 1243 2776 834 -272 1410
2566 1410 2878 2898 944 -1016 -1138 328 -153 -2902 -3648 -1262 -151 -727 -1316 -636 1693 3797 2282
2583 2282 -9 720 2924 2420 -865 -2255 -1600 -98 -991 -3064 -3957 -988 1545 762 -897 -240 2688
2600 2688 3848 3017 -20 -378 947 1578 -729 -3199 -2868 -884 -463 -1541 -2332 -1337 1697 2706 901
2617 901 -120 1908 3339 2114 -167 -931 -405 -185 -1336 -3263 -2551 -542 -10 -1469 -1251 902 2518
2634 2518 2397 1286 526 1424 2925 1177 -1477 -2117 -636 -412 -1662 -3224 -2509 -7 1511 503
2650 503 -1199 320 3890 3706 892 -690 -190 1423 1245 -1379 -3614 -2119 206 -536 -2137 -1443
2666 -1443 352 1746 1662 599 711 1941 2839 1291 -1227 -920 -162 -636 -1540 -1890 -1951 -908 -44 -680
2684 -680 -633 1579 2672 1315 195 1057 1941 1508 -17 -2048 -1654 -82 -397 -2422 -2524 -429 1236
2701 1236 497 -191 -183 1540 3325 2104 -504 -1122 746 1326 -394 -1858 -2731 -1392 70 -79 -1663
2718 -1663 -932 1480 2186 876 299 757 1242 1553 338 -1433 -1239 -253 -756 -1580 -1266 -426 -647 -264
2736 -264 249 1050 1379 1676 840 247 1166 1191 -523 -1343 -1075 -661 -717 -985 -1456 -952 951 1659 141 -348
2756 -348 718 2107 2042 637 -1161 -1140 585 605 -1669 -2657 -1088 282 339 -299 -643 144 1834 2169
2774 2169 902 -132 426 950 574 -459 -1510 -1948 -842 -243 -753 -1186 -580 383 995 1559 907 673
2792 673 803 1327 679 78 -612 -1275 -1410 -451 -505 -1373 -1484 -61 912 1155 1122 351 694 2349 1993 -27
2812 -27 -1236 -710 -232 -353 -1170 -2194 -2179 -136 1136 49 -692 557 1835 2210 1948 148 -630 745
2830 745 1346 -641 -2267 -1942 -1065 -838 -455 -1057 -1145 431 2040 1703 910 649 797 1253 1461 142 -1749
2849 -1749 -1714 -505 -653 -1482 -1898 -1362 -71 1394 1165 266 630 2090 2477 1396 251 -602 -770 -199
2867 -199 -168 -2051 -2619 -1379 -292 -128 -74 -397 526 1984 2364 1216 613 1130 737 348 -667 -1608 -1930
2886 -1930 -1764 -873 -1002 -1534 -787 -136 1126 1970 1535 805 966 1944 1221 -216 -936 -1509 -1218 -699 -1271
2905 -1271 -2380 -1951 45 900 861 349 447 1668 2583 2239 117 -746 298 403 -831 -1973 -2531 -1480
2923 -1480 -261 -83 -1052 -553 1033 1931 1651 1230 768 980 1459 869 -880 -1642 -815 -861 -1614 -1657 -1354
2942 -1354 -1017 361 643 821 836 1639 1521 1027 1070 698 -505 -1217 -1088 -1122 -720 -1221 -1821 -1174 373 902
2962 902 308 336 1383 1764 1980 764 68 257 780 5 -1831 -2628 -1400 -320 -276 -868 -1263 -321 1971
2981 1971 2413 785 240 1490 1743 708 -531 -1254 -948 -67 -857 -2250 -1799 -35 712 -27 119 699
2999 699 1177 1541 1356 482 335 696 2 -1444 -1346 -708 -844 -782 -1094 -1031 222 1361 682 177 956 2014
3019 2014 1012 19 -213 -69 250 -304 -2245 -2402 -601 782 -90 -1142 -496 851 1797 1271 373 134
3037 134 1168 1175 -299 -1665 -648 -57 -398 -1329 -1958 -965 1027 1587 304 -336 798 1857 1242 307
3055 307 -193 271 52 -393 -1746 -1560 -16 29 -952 -930 22 1171 1076 747 295 744 1362 326 -858
3074 -858 -758 -117 -300 -1366 -1722 -1290 329 1175 71 -947 507 1979 1698 278 -363 229 1170 357
3092 357 -1565 -2125 -750 363 -683 -1437 -1050 398 1377 1152 -32 -61 1094 1635 359 -825 -660
3109 -660 5 -417 -1130 -1959 -1168 122 387 -364 -382 652 1623 1178 388 304 673 918 -86 -1667 -1536
3128 -1536 -87 -275 -1716 -1466 -177 666 600 -54 145 1406 2122 1379 -577 -408 727 345 -711 -1767
3146 -1767 -2071 -737 361 -186 -1207 -471 1582 1552 862 467 845 1512 1368 -264 -1701 -780 279 -779
3164 -779 -2037 -1667 -577 179 644 99 505 1381 1815 1078 99 926 1157 53 -921 -1436 -1196 -355 -655
3183 -655 -1768 -1505 216 1421 851 146 986 1634 1771 1034 -520 -604 369 -78 -1994 -2618 -1287 -28
3201 -28 -223 -853 -1106 765 2226 1951 406 253 1186 1430 513 -529 -1732 -1078 -505 -1156 -1811 -1475 -95
3220 -95 467 204 172 926 1548 2129 1196 429 394 643 -504 -1277 -1165 -962 -899 -1087 -1393 -490 587 1174 312
3241 312 141 1403 1982 1401 493 -420 -216 362 -629 -1931 -2134 -832 83 -595 -1236 -479 1267 2330
3259 2330 1741 270 -49 1553 1664 -105 -1198 -1154 -878 -582 -1094 -1606 -707 371 696 -81 112 1172
3277 1172 1628 1380 682 197 -288 183 -224 -1139 -1353 -523 -1062 -1444 -601 230 831 719 629 360 1449 1899
3297 1899 861 -728 -374 -10 -311 -1037 -1836 -1600 -124 247 -543 -877 376 2112 1499 655 46 175
3315 175 1467 836 -745 -1813 -948 -25 -512 -1518 -1307 -445 642 715 -59 128 1346 1805 889 199
3333 199 47 182 -2 -437 -926 -1474 -442 -544 -681 -256 832 624 486 685 933 903 770 358 -455 -456
3353 -456 -214 -577 -1447 -1129 -381 24 -120 -321 -142 796 1993 1114 -231 125 714 798 -192 -1146 -1271 -297
3373 -297 108 -804 -1516 -339 698 695 265 278 298 1035 1236 512 -365 -154 -147 -236 -559 -1036 -1096 -325 367 65
3395 65 50 379 1163 847 616 360 426 -85 -203 -464 -842 -641 -901 -986 -454 318 183 -117 154 662 1105
3416 1105 1000 424 -373 84 273 -109 -1026 -1191 -484 -412 -285 -474 -658 176 890 1048 453 102 850 916
3436 916 829 35 -1061 -841 -2 -510 -817 -942 -358 215 422 632 348 541 1338 956 507 124 -151 -408
3456 -408 -143 -423 -852 -1303 -566 -291 90 240 531 416 528 1226 945 564 339 -83 -180 -481 -822 -1622
3476 -1622 -897 -448 -330 -650 -523 440 1051 1179 1092 277 388 936 448 -253 -541 -989 -1140 -655 -648 -771 -728
3497 -728 37 443 360 642 1087 1029 1268 956 268 -354 -293 -393 -587 -1119 -1232 -1520 -692 363 201 110 560
3518 560 933 1205 991 853 174 427 391 -437 -1297 -1258 -839 -598 -659 -735 -550 151 923 838 912 997 912 736 730
3541 730 175 -449 -880 -724 -865 -1329 -1264 -616 -436 310 923 335 310 1119 1260 1422 785 -190 -661 -134 -86
3562 -86 -653 -1518 -1433 -681 -195 120 -19 179 984 1630 1114 603 311 545 595 126 -661 -1399 -849 -198 -539
3583 -539 -1123 -894 195 1044 903 840 462 1140 1286 611 -282 -464 -290 -342 -948 -721 -859 -907 -166 -159 85
3604 85 666 656 530 961 1222 1105 265 -37 -376 -231 -586 -1186 -1155 -753 -154 -117 -261 31 731 1120 1416
3625 1416 740 -244 56 840 501 -761 -1618 -1124 -282 -47 -689 -989 -146 927 805 129 432 980 1057
3644 1057 960 124 -735 -331 221 -242 -1161 -1054 -420 -419 -140 160 -87 525 1071 790 354 576 621 83 -321
3665 -321 -447 -439 -464 -745 -810 -243 -86 107 -163 183 984 1146 639 159 -111 94 330 -158 -945 -1045 -437
3686 -437 -154 -569 -535 -127 572 930 409 -198 128 1246 1027 -202 -984 -588 27 -218 -291 -1194 -832 252
3706 252 588 -212 -4 639 1026 550 112 -7 171 509 -148 -837 -857 -275 -553 -471 -467 -45 378 401 404 105
3728 105 833 750 422 -119 -209 92 25 -818 -929 -724 -4 248 -296 -626 189 1295 702 237 -200 614 819
3749 819 252 -738 -1212 -501 -289 -494 -1053 -688 52 555 567 -172 265 1213 1071 464 -91 0 20 150 -639
3770 -639 -1266 -1059 -70 -21 -352 -362 643 636 740 782 543 678 782 -20 -713 -237 -70 -729 -1199 -1051 -499
3791 -499 42 400 -94 -246 900 1383 632 391 254 557 173 -58 -871 -1112 -255 -332 -649 -1321 -16 893
3811 893 658 478 415 422 1005 1079 105 -143 -4 -80 -720 -1257 -1094 -661 -452 37 -326 -307 766 1056 659 446
3833 446 643 684 320 -138 -536 -817 -347 -611 -1416 -690 -201 -47 -18 357 642 1027 1250 828 101 446 501
3854 501 -72 -1142 -983 -450 -525 -283 -782 -643 168 949 808 114 791 811 855 622 392 -105 -120 -69 -691
3875 -691 -1277 -1039 -132 -268 -435 -259 407 771 998 742 364 780 589 -39 -355 -83 -354 -856 -776 -884
3895 -884 -773 72 390 -100 483 799 1074 842 535 394 491 270 -415 -1058 -798 -174 -296 -787 -744 -455 63
3916 63 704 471 187 717 1081 568 201 29 -98 -418 -285 -810 -1257 -756 -131 -83 -376 92 564 458 962
3937 962 560 193 428 248 -273 -344 -323 -107 -807 -706 -587 -314 94 206 209 389 874 845 476 304 360 -67
3959 -67 -204 -594 -797 -753 -288 -73 -558 -345 95 409 694 598 603 185 829 468 -185 -391 133 -474 -1044 -460
3981 -460 -911 -391 116 186 51 309 623 648 462 666 307 -150 0 -61 -505 -220 -239 -477 -603 -152 224
4002 224 128 507 411 626 603 552 140 82 -5 -79 -502 -884 -616 -430 -199 -89 -324 -237 178 712 455 222 448
4025 448 319 150 -89 -237 -674 111 -191 -377 -403 -319 -259 271 572 349 147 442 865 313 12 18 -100 -222
4047 -222 -315 -657 -740 -387 -251 -246 -271 265 209 468 949 494 192 56 84 -86 -223 -180 -311 -477 -259 -416 -262
4070 -262 -4 409 281 483 699 413 378 621 -56 -240 -466 -502 -569 -158 -561 -525 -488 -72 490 527 569 630 309
4093 309 873 718 1 -366 -9 93 -539 -322 -754 -527 -326 98 142 -112 102 778 758 633 480 -42 -18
4114 -18 225 -223 -642 -860 -387 -465 -308 -369 -187 152 409 838 450 487 662 420 72 135 -222 -704 -614 -565
4136 -565 -574 -605 -202 185 43 656 525 197 524 930 361 334 -24 -237 -400 -161 -859 -799 -511 -179 -207 87
4158 87 174 89 541 997 970 403 308 430 285 -495 -781 -974 -919 -424 -329 -646 -409 105 459 706 477 381 567
4181 567 642 310 -148 -313 -474 -209 -686 -685 -745 -479 -237 45 105 156 514 554 671 417 360 -20 -96 -101 -231 -724
4205 -724 -589 -849 -647 -281 46 -88 188 590 573 809 646 332 104 189 16 -668 -527 -555 -717 -440 -483
4226 -483 -307 -188 568 792 433 556 545 861 550 84 -238 -302 -130 -92 -613 -622 -512 -99 48 146 5 256
4248 256 832 790 366 426 53 -48 206 -412 -450 -656 -666 -347 -546 -385 282 261 393 465 540 422 529 303
4270 303 170 -228 -183 -289 -627 -471 -335 -465 -430 -106 238 386 523 420 297 634 619 183 -387 -122 -164
4291 -164 -409 -450 -706 -652 -100 144 114 107 361 400 344 428 194 -29 164 143 -578 -661 -370 -381 -28 40 -112 -69
4315 -69 524 678 549 298 744 276 289 -107 -247 -585 -239 -358 -628 -468 -303 42 -50 107 376 371 277 541
4337 541 242 388 215 -366 -677 -437 -153 -378 -387 -367 -270 23 257 268 218 331 468 330 208 43 -156 -99
4359 -99 -59 -628 -789 -415 -66 -13 -300 -4 54 480 896 514 -120 177 491 -250 -141 -232 -194 -553 -383 -99
4381 -99 -404 -84 114 145 218 531 498 206 442 209 19 -270 -647 -573 -471 -92 -548 -209 -8 99 170 269
4403 269 404 526 724 455 156 -282 -208 -245 -497 -783 -638 -686 -61 413 -50 -64 261 587 377 455 186 93
4425 93 90 15 -328 -502 -334 -297 -467 -366 -27 -253 302 535 322 600 435 658 697 83 63 -155 -409 -398 -644
4448 -644 -570 -565 -247 -158 40 229 589 292 719 421 377 124 220 -308 -349 -142 -656 -919 -643 -92 -372 -71
4470 -71 258 218 652 600 420 275 274 405 -110 -27 -352 -449 -217 -468 -750 -590 -187 -56 345 258 672 708 763
4493 763 681 276 -134 -45 -139 -607 -832 -535 -427 -529 -253 -142 150 270 805 499 315 725 333 48 114
4514 114 -319 -343 -443 -180 -789 -425 -385 -255 -48 86 476 708 372 618 389 343 150 -46 -353 -422 -394 -461
4536 -461 -577 -251 -291 -44 131 202 345 399 770 351 415 146 169 42 -94 -378 -739 -579 -273 -225 -352 -189
4558 -189 315 293 285 278 363 517 413 134 -125 -286 -530 -210 -233 -498 -641 -356 -20 -10 63 308 500 539 605 273
4582 273 150 69 -55 -100 -372 -420 -600 -512 -483 -149 -87 439 276 490 699 100 173 228 361 -62 -326 -412 -469
4605 -469 -352 -330 -437 -219 -117 256 466 368 314 357 461 284 208 -189 -254 -464 -191 -579 -490 -428 -159 125 245
4628 245 360 289 277 435 307 247 362 -170 106 -155 -232 -571 -433 -9 14 -3 10 173 155 445 444 204 67
4651 67 334 -19 -86 -198 -413 -545 42 -62 -474 -85 106 351 391 400 377 97 143 353 229 -213 -404 -762
4673 -762 -290 -153 -291 -454 -182 383 221 -123 288 471 579 344 -18 -272 23 -87 -437 -312 -424 -198
4693 -198 -7 -97 -4 55 391 506 566 459 160 284 259 166 -246 -198 -240 -309 -401 -346 -185 -133 28 540 204 211 384
4718 384 239 308 -60 85 -392 -408 -507 -302 -617 -273 -59 28 60 164 337 322 538 703 182 69 -12 -39 -256
4741 -256 -330 -418 -540 -417 -240 -158 -20 163 242 402 601 622 91 79 305 -130 -457 -215 -353 -584 -493 -285
4763 -285 -299 0 330 139 401 576 643 227 418 294 52 -125 -365 -244 -692 -436 -473 -74 -46 83 323
4784 323 105 519 329 209 433 350 -42 -121 -66 -371 -733 -532 -369 -374 -361 -79 153 405 879 566 411 754
4806 754 149 -31 147 -136 -296 -441 -409 -676 -333 -214 149 113 207 328 373 275 503 549 63 132 -190 -537
4828 -537 -567 -399 -409 -389 -324 -184 78 14 191 421 465 473 452 126 155 377 -252 -429 -437 -407 -736 -238 -459 -124
4852 -124 172 328 505 485 493 418 541 167 -9 -342 -433 -141 -369 -631 -343 -636 -152 80 -148 179 578 562
4874 562 206 211 329 206 -207 -136 -320 -415 -361 -286 -518 -38 -111 -57 80 201 299 504 540 181 79 215 75
4897 75 -284 -384 -321 -330 -273 -328 -120 -194 -80 534 365 260 416 424 256 61 -71 -384 -159 -351 -315 -463 -371 31
4921 31 -61 -51 176 79 334 427 481 249 363 2 -376 -359 -31 -82 -419 -330 -177 -141 128 241 164 317 527 624
4945 624 81 -24 -47 -110 -256 -345 -387 -356 18 -107 -211 152 356 447 395 218 77 -1 547 122 -302 -191 -89
4968 -89 -216 -160 -269 -568 -234 144 238 157 334 234 247 502 180 -281 -307 -261 -411 -284 -231 -520 -238 -81 196
4991 196 139 501 598 291 330 360 453 -69 -218 148 -163 -191 -367 -547 -249 120 36 3 191 434 397 312 467
5014 467 201 37 -136 -115 -441 -335 -233 -270 -152 -264 -345 36 256 271 82 319 395 386 -229 -276 33 89 -131
5037 -131 -172 -461 -299 -222 7 50 -59 375 577 253 143 356 453 272 -360 -370 -370 -64 -483 -281 -164 -45
5059 -45 -15 273 180 234 612 667 439 -44 384 126 -32 -230 -317 -518 -352 -322 -440 -53 240 371 -50 320
5081 320 496 394 440 195 105 -279 135 -18 -492 -594 -254 -258 -146 171 -48 456 663 471 266 310 318 235 -2
5104 -2 -108 -293 -428 -401 -586 -723 -388 160 351 202 319 369 297 491 350 -67 173 173 -263 -246 -521 -347 -435
5127 -435 -342 -170 269 141 419 311 340 450 323 282 282 -60 -458 -339 -677 -607 -472 -91 -554 -44 169 455
5149 455 482 328 448 134 283 374 -15 -194 -264 -381 -287 -675 -560 -359 -201 125 343 262 136 554 529 240
5171 240 308 36 331 -250 -304 -607 -435 -381 -221 -251 109 -69 292 767 162 212 336 461 266 164 12 -239
5193 -239 -375 -142 -407 -320 -326 -132 2 13 219 599 357 337 256 438 212 124 44 -585 -233 -129 -316 -447 -278
5216 -278 -59 80 186 168 274 378 495 140 59 -85 34 -92 -358 -523 -436 -100 -7 -148 -57 147 311 423
5238 423 531 398 380 390 224 -241 -191 -338 -202 -312 -134 -338 -245 146 96 211 193 390 363 238 163 126 -197
5261 -197 -124 -120 -347 -207 -275 -250 71 193 -77 82 330 358 200 240 6 -64 -69 -51 -194 -278 -265 -392 -375 -62 25
5286 25 86 64 380 363 246 383 78 229 89 -202 -262 -253 64 -371 -267 -283 -9 44 34 234 374 314 240 167
5310 167 198 -133 102 48 -64 -282 -456 -402 -254 72 -129 231 332 247 128 439 127 -153 -152 122 -187 -479
5332 -479 -105 -196 -161 -99 153 -107 77 245 281 82 471 336 143 82 -142 -88 -361 -260 -237 -312 -225 64 -153
5355 -153 218 222 166 308 320 321 152 343 -154 -160 -324 -277 -318 -378 -171 -310 -62 152 108 377 453 354 180 238 50
5380 50 119 -117 -482 -616 -268 -378 -289 -193 -183 92 234 340 271 107 423 536 319 -132 -185 -7 -142 -219 -274
5403 -274 -503 -396 -275 -19 38 -40 589 219 177 447 435 -200 206 95 -357 -381 -277 -373 -587 -94 -175 -116 166
5426 166 255 307 199 363 290 141 8 -40 -356 -454 -262 -396 -318 -142 -169 -344 -80 285 441 530 370 134 119
5449 119 273 -66 -235 -234 -103 -393 -393 -50 -282 4 264 282 -2 516 303 365 123 155 5 -250 -206 -293 -521
5472 -521 -430 31 -539 -140 186 145 260 193 676 583 404 374 307 243 -22 -266 -534 -408 -188 -193 -174 -322 68
5495 68 -95 527 169 316 403 340 248 152 189 -53 -386 -6 -390 -484 -117 -307 -312 16 328 45 151 477 320
5518 320 15 132 -141 -144 -439 -334 -281 -275 -436 -145 -352 -69 392 231 343 509 399 -36 112 65 -80 -244
5540 -244 -57 -420 -406 -30 -22 27 -195 -69 49 423 325 102 337 207 77 110 -169 -175 -158 -429 -330 -467 -306
5563 -306 -40 -26 69 364 589 225 217 161 -210 64 74 106 -432 -465 -384 -116 -238 23 -154 -30 240 258 260 185
5587 185 190 -89 15 49 -179 -228 -355 71 -429 -140 -148 -116 -112 67 76 142 490 54 94 97 -125 -262 -213 84 -340
5612 -340 -372 -154 -51 -228 45 308 238 273 156 132 -103 95 -149 -247 -43 0 -219 -465 -21 -251 -2 111
5634 111 302 43 484 132 130 128 38 -72 -135 -504 -173 40 -540 -140 -115 -55 326 366 141 115 453 226 186 -23
5658 -23 91 -233 -120 -487 -326 -324 -269 -14 -146 178 194 163 69 263 -46 172 104 -67 -256 -240 -294 -348 -285 -200
5682 -200 -356 -150 -116 78 116 342 189 519 136 240 157 -265 47 -259 -213 -68 2 -443 -176 187 200 58
5704 58 151 175 380 337 76 10 20 -194 -306 -411 -247 -156 -48 -232 -32 -87 279 444 112 254 509 343 -94
5727 -94 122 -5 -322 -207 -297 -525 -489 -150 -39 -53 -23 85 269 484 488 368 364 363 -2 -355 -368 -197 -79 -196
5751 -196 -178 -401 -233 77 332 60 264 588 302 341 374 66 178 -205 -140 -587 -324 -131 -144 -124 20 110
5773 110 -9 209 390 245 187 503 157 -26 -220 -249 -532 -402 -422 -193 -244 -87 -2 76 172 561 607 473 536
5796 536 39 -97 -74 -39 -302 -293 -32 -203 -33 -36 12 88 270 211 224 206 325 275 153 16 -66 -228 -181 -562 -530
5821 -530 78 -193 63 -206 287 342 252 522 217 276 204 27 -321 9 -196 -299 -500 -21 -222 -155 174 194
5843 194 -45 66 430 140 200 195 -74 -142 -69 -172 -587 -279 -140 -378 -416 51 109 126 494 216 231 293 300 399
5867 399 -26 149 -93 -181 -207 -128 -354 -213 -105 82 131 402 220 284 535 366 14 -18 129 -239 -239 -53 8
5890 8 -359 -106 -20 123 142 199 115 530 323 194 124 208 126 -332 -195 -185 -283 -196 -357 -57 -200 114 138 184 253
5915 253 -42 287 44 167 -52 -36 -448 -53 -299 -325 -248 -153 -19 -68 -68 341 86 290 345 45 56 -18 -60 -290
5939 -290 195 -329 -157 -282 -40 243 49 -9 113 420 425 298 -209 -44 281 -16 -152 -318 -25 -75 10 -34
5961 -34 -46 -25 390 213 332 233 177 261 39 -199 47 -128 -270 -326 -244 -240 -163 -283 324 219 1 61 335 257
5985 257 141 369 95 -191 -41 -167 -397 -185 -26 -288 -112 276 286 162 67 209 368 287 204 -238 54
6006 54 1 -21 -286 -364 -313 -259 -187 -295 25 263 80 294 2 86 296 467 -19 -48 -200 -127 -140 22 -186 -194
6030 -194 -70 -53 -26 136 426 211 378 302 26 187 -187 -4 -315 -129 -185 -296 -336 -151 -5 -284 509 78
6052 78 139 234 325 286 217 56 -102 -250 -204 -158 -231 -263 -410 -258 74 77 402 78 490 287 178 376 192 184 -239
6077 -239 -39 -208 -92 -146 -265 72 -51 -203 155 300 317 345 299 409 177 157 -86 19 -354 -538 -371 -481
6099 -481 -211 -493 32 260 270 219 51 235 436 201 88 -220 29 -195 -246 -509 -529 67 -125 -152 -114 428
6121 428 413 168 448 300 351 218 -28 -20 -247 -218 -173 -390 -256 -218 -37 -121 107 111 297 207 255 96 7 222
6145 222 -24 -268 -409 -205 -258 -8 -20 -255 25 79 188 222 17 358 157 266 -28 198 -26 -166 -59
6166 -59 -301 -254 -322 -74 96 265 236 68 223 386 157 157 111 -67 103 -281 -146 -180 -237 -116 -86 123 118 42
6190 42 250 352 546 419 296 108 117 -55 -116 -152 -297 -39 -417 -173 -211 -144 51 123 310 -44 258 250 77
6213 77 316 -43 -95 -16 5 22 -232 72 22 -231 -56 38 272 275 94 451 51 101 334 -64 -263 -205 -133 -190
6237 -190 -118 156 -118 26 -22 179 123 231 281 141 68 211 -209 -117 -18 -205 17 -156 -35 -90 115 20 269
6260 269 -16 252 403 -58 374 196 -6 -150 -67 -200 90 -308 -107 23 253 331 67 179 260 66 333
6281 333 249 -255 110 -11 66 -344 -18 -140 -167 -48 117 -183 154 314 187 399 -24 360 83 -166 -237
6302 -237 131 -316 -288 -145 -378 -121 -170 191 -10 437 251 175 145 327 80 254 -30 -282 -245 -85 -256 -237
6324 -237 -295 103 101 -221 104 191 99 265 95 81 133 -8 -89 -283 -165 -477 25 -172 -189 -45 196 128 318
6347 318 75 229 175 98 68 197 39 -10 -71 -148 -249 -219 -144 -156 160 115 138 234 365 246 305 213 271 20 -4
6372 -4 -296 -240 -96 -440 -267 -27 -122 337 352 418 355 207 76 296 58 3 164 -193 -528 -138 -391 -301 -227
6395 -227 84 114 -65 65 203 296 284 389 2 109 100 -125 -147 -42 -334 -431 -115 -180 -151 17 105 139 53 478
6419 478 305 101 44 107 -52 -270 -161 -242 -89 -216 -286 -216 -4 64 -14 -6 69 221 115 126 106 -61 -246 -130
6443 -130 -334 -285 52 -185 -178 -33 269 25 411 377 214 231 263 109 29 -302 -43 -395 -147 -146 -232 -296 8 265
6467 265 317 17 244 245 238 129 105 354 56 -33 -382 -214 -244 -133 67 -83 -30 216 110 251 170 243 169 43
6491 43 372 -86 15 -415 -10 -201 -73 -158 -295 -70 78 134 251 249 196 584 -29 246 -232 153 -134 -94
6513 -94 -60 -456 -261 129 75 -81 -45 84 477 363 267 186 16 46 -194 1 -298 -453 -270 54 -48 -69 24
6536 24 198 39 235 253 294 177 -88 159 -113 11 -58 -210 -375 -4 -117 -118 113 47 301 156 138 155 209
6559 209 53 181 30 -251 -126 -288 -54 -214 -227 -341 -42 158 295 144 374 133 275 172 199 110 -73
6580 -73 -124 -120 -288 -377 -291 -372 128 -120 51 194 36 194 134 -14 34 -78 -120 -49 -194 -344 -293 -433 -117 -68
6604 -68 37 -60 283 99 133 96 0 -25 98 -60 -129 -189 -371 -16 -99 -3 -238 80 -49 267 242 236 347 257 66
6629 66 -112 -7 -54 -297 -38 -358 -92 -116 166 -105 -165 195 457 345 186 222 -85 111 189 -55 117 100
6651 100 -427 -43 -141 -53 -84 155 4 -53 132 185 172 327 159 132 52 -144 -171 -268 -148 -432 -243 115 116 191
6675 191 234 393 225 277 182 302 153 -114 -171 -52 -245 -239 -8 -269 -144 -281 -332 165 160 225 289 144 157 328
6699 328 105 -306 139 -160 -212 -424 -158 -291 -37 -139 100 92 308 296 201 386 403 206 22 6 -241 -17
6721 -17 -38 -212 -141 -146 -197 71 122 324 62 245 157 80 105 158 31 -317 -13 -263 -455 -55 -274 -359 -165 154
6745 154 228 160 264 209 351 246 25 -215 -118 -102 -199 -161 -194 -260 -153 69 107 280 129 433 204 65 173
6768 173 31 151 134 -53 -196 -391 3 -166 -352 -241 -90 135 406 201 246 243 270 201 15 95 -106 -263
6790 -263 -274 -33 -52 -202 -193 -70 -132 258 179 311 54 263 235 54 -49 44 18 161 -361 -397 -160 -343 -347 146
6814 146 -220 195 298 151 266 317 128 149 17 -60 32 126 -101 -142 -205 -94 -37 55 75 192 341 134 237
6837 237 132 303 -202 -1 -92 -288 -368 -186 -229 -293 156 153 167 37 25 517 76 -135 -20 196 4 -205 -251
6860 -251 -287 20 -410 -208 28 -129 17 -31 24 112 189 -70 -20 -70 320 -132 -237 282 111 -22 -15 -133 -137 -96
6884 -96 -48 98 72 211 256 170 -15 -110 -184 -81 -120 -237 -388 -131 -111 -101 112 119 253 206 166 79 -92 -12 -48 119
6910 119 -293 -44 -197 -248 -171 -15 -20 42 122 158 117 358 5 60 161 98 224 -98 -84 -151 -175 5 -10 -63 -83
6935 -83 -11 17 357 220 83 155 90 251 -178 -244 -154 -215 -94 -164 -269 -61 106 344 290 483 295 303 -4 -38
6959 -38 365 -192 49 -184 -221 -196 68 -282 -20 54 244 109 140 305 315 142 218 119 -6 257 -372 -150 -97
6982 -97 -99 -161 4 30 -163 244 315 500 100 155 460 164 -6 -216 -156 -225 -114 -334 -316 -93 -28 100 -3 222
7006 222 260 278 501 250 248 56 208 -155 -364 -127 -255 -316 -157 3 -194 86 -114 3 267 143 225 350
7028 350 158 133 -79 -136 -127 -143 -191 -182 -257 45 -83 -33 -12 293 226 337 252 44 -144 -70 -272 -97 -256 -144 -226
7053 -226 -85 -29 -63 163 177 98 -42 264 270 -108 40 152 72 -4 -398 44 18 -55 -241 -145 329 -8 100 205
7077 205 310 279 694 475 159 -199 194 -51 -233 -287 -186 -183 -128 -70 -57 179 263 191 222 122 -58 50 123 75
7101 75 -302 -10 -82 -190 -302 -387 54 -35 2 -157 275 -47 117 -73 184 64 100 -114 -256 -173 -199 -192 -95 -219
7125 -219 -133 235 274 125 126 262 437 244 48 40 -268 -154 -95 -180 -222 -334 -244 -26 118 -17 -110 287 -119 184
7149 184 76 81 -138 258 57 -221 -213 -56 -281 -202 -126 98 65 -9 199 126 151 264 170 134 -29 -87 -308 -396 15
7174 15 -68 21 -34 106 -153 115 195 85 65 143 164 245 -58 3 -229 -40 -232 8 -137 -114 15 172 194 420
7198 420 252 7 -32 142 -205 -36 -193 56 -139 -5 -298 -320 -183 -205 -40 256 186 246 261 100 80 122 235
7221 235 -46 -202 -144 -269 -118 -71 36 -108 -95 48 53 12 69 161 413 15 131 -174 -161 -83 -194 -93 -118 -303
7245 -303 -50 -43 102 209 273 167 97 206 -74 -19 -51 -163 32 -104 -80 92 -59 -91 -95 137 -47 202 267 177
7269 177 252 415 -46 -251 1 -47 -286 -222 -72 -108 -66 -135 -90 162 43 151 69 241 251 22 158 59 -179
7292 -179 -125 -206 -143 -181 -265 -211 86 -40 213 99 89 224 119 -93 -45 -43 33 101 -48 56 -98 -232 -191 -216 54
7317 54 106 337 118 131 -192 -7 76 -97 -143 -168 -19 -234 -193 -316 -65 -27 -250 360 240 144 61 10 -29 38
7341 38 232 116 -246 -233 -277 -176 -145 -307 -63 -102 202 184 282 206 323 251 95 -25 -198 32 3 -300 -208 1
7365 1 -50 -217 -38 -74 145 162 93 93 24 385 233 99 -242 72 25 -354 -316 -143 -211 -163 -16 -97 277 -24 110
7390 110 79 277 80 282 16 163 -319 -226 -2 -2 -621 -203 -175 59 38 271 -2 102 112 7 187 27
7412 27 68 -192 -341 -51 -376 -274 -108 12 -168 125 180 2 155 470 189 346 140 -59 -32 -353 -371 -243
7434 -243 -240 -104 -16 57 88 168 300 196 277 -86 389 37 -103 -76 11 -64 44 -75 148 -137 -3 -72 -144 78
7458 78 -101 197 -13 25 228 78 211 -307 -183 -148 -224 -253 -39 77 108 72 80 251 263 408 56 -248 178
7481 178 138 1 -174 -110 -69 -171 -72 -251 205 -13 -25 84 -64 148 285 147 202 69 -136 -158 -260 -93
7503 -93 -411 -114 143 24 -143 -92 222 247 214 329 51 280 -128 121 -97 -42 -240 -423 -81 -271 -128 -88
7525 -88 -125 -15 202 -2 224 46 194 159 64 -359 -170 80 -242 -131 -111 -70 82 28 -107 223 319 252 86
7548 86 266 212 188 -19 140 -247 -270 -51 -325 132 -184 82 24 270 99 107 107 190 135 -22 -220 -14 100 -335
7572 -335 -14 -125 -54 -5 -10 -105 40 343 114 88 240 -244 170 155 -31 -55 -143 -270 -30 -83 202 272 33 112
7596 112 248 71 -15 273 215 143 24 11 -213 -80 -51 -319 -122 -71 -176 -256 197 219 -53 172 456 436 289
7619 289 21 -113 -50 -76 106 -336 35 -208 -96 -178 226 86 417 349 161 237 105 -107 -53 19 -311 23
7641 23 -242 -210 66 72 100 131 97 15 305 468 34 329 123 -40 -182 -140 -192 -91 -112 -155 -221 42 54 -91 63
7666 63 107 212 250 114 33 87 68 49 -141 -197 -266 24 -288 50 38 74 -39 -72 83 93 487 -68 139 51 130
7691 130 -150 -164 55 -129 -292 -460 8 29 -36 324 -158 237 453 294 69 332 -206 -277 -290 -226 -205 -183 -53
7714 -53 -371 -262 -42 82 300 198 260 81 81 15 3 -6 -108 27 -190 -30 -12 -217 -63 97 178 194 432 117
7738 117 267 271 72 -19 -37 24 -90 -204 -71 122 248 -96 -74 85 55 311 408 233 299 240 -62 -117 -201 -71
7762 -71 -29 215 -314 -376 228 -191 -111 -30 -48 -25 192 172 248 14 -32 15 -108 -201 -182 -48 -198 -117 11 -17 -106
7787 -106 97 130 91 214 -39 -120 115 80 -53 -139 -1 -94 -109 -275 183 -133 -80 176 279 -8 431 4 45
7810 45 228 -33 -300 -72 -71 -322 -271 -169 -131 154 -187 213 94 104 173 0 -55 -52 -116 -166 -124 -79 -269 -62 11
7835 11 -125 239 141 83 -122 391 384 249 -57 80 -124 -277 154 -185 -158 -221 -35 24 -87 91 -35 -45 47
7858 47 16 266 120 126 176 27 299 -135 -155 -180 -122 -193 -85 70 -28 199 271 298 433 63 281 -107 -68 -206
7882 -206 -337 -118 -139 -67 -151 139 178 76 -82 297 415 67 381 205 57 -121 -12 -32 -197 -146 -287 -433
7904 -433 -84 121 -63 188 150 168 224 147 107 13 156 -295 -167 -114 -133 -143 51 -288 -230 -133 170 121 295 351
7928 351 290 54 75 55 -106 -202 -3 -379 -291 -209 -130 2 -190 24 107 208 96 86 -202 -67 149 -181 -206
7951 -206 -41 -300 -175 -140 -177 -189 -26 52 18 32 236 356 354 -93 122 41 178 32 -242 -307 -162 -304 -240 48
7975 48 37 55 375 51 182 49 295 -14 -96 -28 -230 -158 -269 77 -314 35 -82 18 -96 145 24 103
7997 103 -238 498 174 -74 -8 -80 -224 -58 -80 -182 -246 -84 -63 5 -5 126 49 191 217 29 148 86 147 -146
8021 -146 -39 -19 -169 -65 -88 -169 -133 139 133 31 69 168 221 81 100 -115 -29 -203 -318 -172 -113 -95 -125 -358 0
8046 0 92 -12 171 115 -7 120 262 28 -45 -25 -242 -230 -251 -196 -197 1 132 -195 29 224 459 133 472 14
8070 14 30 100 135 -271 -88 -262 -77 -3 4 -168 -106 125 284 265 -85 119 169 -98 102 -41 -169 -270 -48
8093 -48 -135 -116 -151 -51 -149 21 -52 105 26 78 366 -66 77 -182 -286 -272 0 -18 -337 103 -101 133 -3
8116 -3 71 26 119 286 73 26 170 37 12 -45 -184 -59 218 -4 -104 -121 -13 313 204 276 -8 8 -4 -176
8140 -176 -43 51 -2 -237 -446 155 -353 -124 160 201 -2 61 75 -87 301 260 141 -34 -126 7 -49 -70 -139
8163 -139 57 -3 -52 232 -14 150 95 386 168 145 151 -111 -28 29 -128 -125 -400 -290 -156 -151 -128 27 263 0
8187 0 210 41 290 320 -96 -58 109 -137 -242 22 -101 -33 -163 92 267 178 110 143 14 263 116 -45 -217
8210 -217 -178 -302 -122 -102 -65 -71 205 -40 114 189 183 234 -41 404 94 196 95 -33 -5 -162 -161 -84 -74 -289 -207
8235 -207 -89 151 171 -11 259 232 297 -82 55 -92 -263 -119 -86 -109 -381 -74 -234 -310 -92 84 -22 55
8257 55 87 -53 260 197 62 -201 -79 -133 -391 -187 -273 -87 -36 321 33 169 -57 385 244 158 -281 43
8279 43 -82 -76 -127 -400 -164 24 -94 -327 188 124 169 78 112 -37 417 223 331 -171 0 -253 -299 -147 -131
8302 -131 -553 -40 -23 -107 -137 108 3 100 105 183 240 -66 62 -243 -200 -154 205 -183 -391 -168 96 53 86 -47
8326 -47 271 333 -180 265 -263 51 -51 -222 -186 -197 -203 -212 -149 -106 41 100 325 65 -21 -74 75 12 49 -159 -68
8351 -68 93 -172 -190 -126 -82 49 -80 71 64 -102 44 146 161 298 92 -109 -146 -284 -175 -249 -57 -103 -32 31
8375 31 -152 63 -74 245 98 228 -47 151 88 4 -238 -90 -94 18 -270 -55 -110 -69 49 15 19 210 65
8398 65 254 -306 -131 73 57 260 -213 -5 18 142 44 -47 25 45 7 139 316 117 -215 -67 23 -167 -165 -192
8422 -192 36 -47 -77 -108 -82 -22 -44 124 275 77 51 -104 -226 135 -204 89 -124 -178 -95 -163 4 99 90 102 -65
8447 -65 18 118 104 224 -134 -21 11 -90 -90 -379 -115 59 170 -103 78 66 86 26 205 392 5 61 99 29
8471 29 -39 -95 -92 -87 5 -6 -354 -198 157 11 -107 24 -157 205 238 -63 -98 -7 -183 -167 -8 -56 -289 -103 146
8496 146 163 154 -34 303 93 370 107 -12 -106 -28 -93 -208 -267 -246 -198 179 -43 37 -12 242 173 107 136 120 -190
8521 -190 -6 -36 -236 -392 -123 170 -133 -134 -70 176 237 291 -62 50 11 170 145 -91 -9 -162 -5 -70 -342
8544 -342 -418 36 147 178 115 -35 264 210 282 352 -145 -32 -52 6 -264 -156 -246 -87 99 81 -18 -13 208 277 182
8569 182 225 116 -155 -143 -121 -4 -32 -85 -38 -202 -18 -118 -183 57 -41 -77 270 147 -1 425 21 56 -86
8592 -86 -223 -229 -237 -216 -345 -61 -19 -211 2 34 256 191 129 -113 77 -56 81 -167 -30 -101 -85 -95 -54 -56 -211
8617 -211 47 364 47 166 -4 58 -72 41 119 40 2 -246 -246 98 -134 155 -68 -103 25 205 141 46 156
8640 156 203 111 93 -28 -144 -232 -149 -83 -222 -141 -20 20 86 121 99 260 95 -56 333 155 141 15 -43 72
8664 72 -132 -206 -388 -206 -202 5 50 68 140 257 269 141 62 -58 -51 237 70 -211 -115 -128 107 -120 77 114 37
8689 37 253 308 263 225 73 -66 -62 -64 -37 -132 -235 -109 -150 -68 20 184 102 50 146 95 195 298 1 -133 131 -214
8715 -214 -86 -283 -148 63 6 -236 -37 58 43 80 1 204 249 -180 -141 -59 -89 -55 2 16 302 -212 -56 142
8739 142 -25 25 155 170 19 321 119 50 216 -238 -62 149 -19 -207 -20 -56 -55 150 174 174 195 149 245 135
8763 135 -53 12 -19 187 -287 -170 -9 -62 -2 -78 -71 -49 66 159 -253 -146 193 42 -52 -244 -148 -92 -76 -93 1
8788 1 -111 -249 118 105 52 11 114 -185 160 23 -185 84 -197 -140 -60 107 -93 -151 -187 204 39 44 334 169
8812 169 70 -3 -279 -101 -137 -13 197 -331 -234 -52 -84 -33 -147 -50 79 226 -46 -26 -38 -20 26 49 -98 -354
8836 -354 9 -86 -198 -52 -105 210 152 -83 195 131 208 228 -85 40 228 -7 -64 -153 -70 -222 -160 -15 -176
8859 -176 12 -3 262 181 43 159 134 -54 252 26 -33 -177 -51 -75 -213 7 56 -174 15 139 2 375
8881 375 250 196 125 57 -176 -69 -61 -147 -66 12 -61 -188 48 -303 66 1 59 218 254 184 161 -147 -9 25 -175
8906 -175 -252 -210 -275 -130 87 -126 228 150 82 300 11 235 -4 139 -28 -61 -168 -262 19 -146 -98 -134 -16
8929 -16 -139 14 130 -57 206 -28 139 151 226 43 -10 -53 -219 -37 -231 -182 52 -5 -94 -63 51 187 112
8952 112 135 60 -84 65 26 -4 -370 14 -30 -237 -145 -221 36 28 107 260 -73 94 115 204 83 -197 138 -129
8976 -129 -321 -233 135 -430 -120 -63 23 53 42 95 14 -22 189 -86 -86 213 30 -123 -157 -98 -79 -120 -23 77 71 298
9002 298 84 159 -3 157 111 -214 19 -129 -55 20 -250 -171 77 -276 -51 28 206 196 4 119 141 -89 216
9025 216 -182 -125 -22 -31 -92 -256 -7 149 166 224 19 -148 383 184 260 50 -4 -30 72 115 -187 -196 -284 26
9049 26 107 -14 115 -40 152 166 39 189 288 -61 130 91 -23 -173 -104 -70 19 -290 62 -318 98 -77 -58
9072 -58 93 113 -120 239 403 9 83 -91 -50 -96 -204 -20 3 87 62 -9 288 161 178 300 184 22 168
9095 168 2 -91 -205 -191 -83 -429 135 -79 25 -7 -81 -45 136 -257 44 -95 23 3 8 -312 -96 18 67
$$ [...]
16383A46
##END NTUPLES=NMR FID
##END=
