##TITLE=abcd
##JCAMPDX= 6.0         $$ Bruker NMR JCAMP-DX V2.0
##DATA TYPE= NMR FID
##DATA CLASS= NTUPLES
##ORIGIN= UXNMR, Bruker Analytische Messtechnik GmbH
##OWNER= root
$$ XWIN-NMR		Version 3.5
$$ Wed May 21 12:21:25 2025 Russian Standard Time (UT+4h)  servis@DPX200
##.OBSERVE FREQUENCY= 200.131235884673
##.OBSERVE NUCLEUS= ^1H
##.DELAY= (6, 6)
##.ACQUISITION MODE= SIMULTANEOUS
##.ACQUISITION SCHEME= undefined
##.AVERAGES= 32
##.DIGITISER RES= 18
##SPECTROMETER/DATA SYSTEM= spect
##.PULSE SEQUENCE= zg
##.SOLVENT NAME= CDCl3
##.SHIFT REFERENCE= (INTERNAL, CDCl3, 0, 16.5164)
##AUDIT TRAIL= $$ (NUMBER, WHEN, WHO, WHERE, WHAT)
$$ ##TITLE= Audit trail, XWIN-NMR		Version 3.5
$$ ##JCAMPDX= 5.01
$$ ##ORIGIN= Bruker BioSpin GmbH
$$ ##OWNER= servis
$$ F:\spectra/data/av/nmr/H1/1/audita.txt
$$ ##AUDIT TRAIL=  $$ (NUMBER, WHEN, WHO, WHERE, WHAT)
(   1,<2025-05-21 12:20:41.45 +0400>,<servis>,<DPX200>,
      <created by zg, POWCHK disabled, PULCHK disabled
       configuration hash MD5:
       00 E9 B6 7A A2 85 ED C7 34 08 36 98 17 FE 4E 26
       data hash MD5: 32K
       5E A6 10 D8 4A D0 F4 AE B3 97 29 82 37 AE 92 5E>)
$$ ##END=
$$ 
$$ hash MD5
$$ 4A 9D DB A5 67 DD 93 5D 9F 44 26 93 72 BB 5A 68
##$RELAX= 
##$RELAX= 
##$RELAX= 
##$RELAX= 
##$RELAX= 
##$RELAX= 
##$RELAX= 
##$RELAX= 
$$ Bruker specific parameters
$$ --------------------------
##$DU= <F:\spectra>
##$EXPNO= 1
##$NAME= <H1>
##$PROCNO= 1
##$TYPE= <nmr>
##$USER= <av>
##$AMP= (0..31)
100 100 100 100 100 100 100 100 100 100 100 100 100 100 100 100 100 100 
100 100 100 100 100 100 100 100 100 100 100 100 100 100 
##$AQSEQ= 0
##$AQ_mod= 1
##$AUNM= <au_zg>
##$AUTOPOS= <>
##$BF1= 200.13
##$BF2= 200.13
##$BF3= 200.13
##$BF4= 200.13
##$BF5= 500.13
##$BF6= 500.13
##$BF7= 500.13
##$BF8= 500.13
##$BYTORDA= 1
##$CFDGTYP= 0
##$CFRGTYP= 5
##$CHEMSTR= <none>
##$CNST= (0..31)
1 1 145 1 1 1 1 1 1 1 1 1 1 1 1 1 1 1 1 1 1 1 1 1 1 1 1 1 1 1 1 1 
##$CPDPRG= <>
##$CPDPRG1= <>
##$CPDPRG2= <>
##$CPDPRG3= <>
##$CPDPRG4= <mlev>
##$CPDPRG5= <mlev>
##$CPDPRG6= <mlev>
##$CPDPRG7= <mlev>
##$CPDPRG8= <mlev>
##$CPDPRGB= <>
##$CPDPRGT= <>
##$D= (0..31)
0 2 0 0 0 0 0 0 0 0.06 0 0 0 0 0 0 0.0002 0 0 0 0 0 0 0 0 0 0 0 0 0 0 
0 
##$DATE= 1747815641
##$DBL= (0..7)
120 120 120 120 120 120 120 120 
##$DBP= (0..7)
150 150 150 150 150 150 150 150 
##$DBP07= 0
##$DBPNAM0= <>
##$DBPNAM1= <>
##$DBPNAM2= <>
##$DBPNAM3= <>
##$DBPNAM4= <>
##$DBPNAM5= <>
##$DBPNAM6= <>
##$DBPNAM7= <>
##$DBPOAL= (0..7)
0.5 0.5 0.5 0.5 0.5 0.5 0.5 0.5 
##$DBPOFFS= (0..7)
0 0 0 0 0 0 0 0 
##$DE= 6
##$DECBNUC= <off>
##$DECIM= 32
##$DECNUC= <off>
##$DECSTAT= 4
##$DIGMOD= 1
##$DIGTYP= 9
##$DL= (0..7)
0 120 120 120 120 120 120 120 
##$DP= (0..7)
150 150 150 150 150 150 150 150 
##$DP07= 0
##$DPNAME0= <>
##$DPNAME1= <>
##$DPNAME2= <>
##$DPNAME3= <>
##$DPNAME4= <>
##$DPNAME5= <>
##$DPNAME6= <>
##$DPNAME7= <>
##$DPOAL= (0..7)
0.5 0.5 0.5 0.5 0.5 0.5 0.5 0.5 
##$DPOFFS= (0..7)
0 0 0 0 0 0 0 0 
##$DQDMODE= 0
##$DR= 18
##$DS= 0
##$DSLIST= <SSSSSSSSSSSSSSS>
##$DSPFIRM= 0
$$ [...]
##$SUBNAM0= <"">
##$SUBNAM1= <"">
##$SUBNAM2= <"">
##$SUBNAM3= <"">
##$SUBNAM4= <"">
##$SUBNAM5= <"">
##$SUBNAM6= <"">
##$SUBNAM7= <"">
##$SUBNAM8= <"">
##$SUBNAM9= <"">
##$SW= 20.6817932712277
##$SWIBOX= (0..15)
0 0 3 0 0 0 0 0 0 0 0 0 0 0 0 0 
##$SW_h= 4139.07284768212
##$TD= 32768
##$TD0= 1
##$TE= 0
##$TE2= 300
##$TE3= 300
##$TEG= 300
##$TL= (0..7)
0 120 120 120 120 120 120 120 
##$TP= (0..7)
150 150 150 150 150 150 150 150 
##$TP07= 0
##$TPNAME0= <>
##$TPNAME1= <>
##$TPNAME2= <>
##$TPNAME3= <>
##$TPNAME4= <>
##$TPNAME5= <>
##$TPNAME6= <>
##$TPNAME7= <>
##$TPOAL= (0..7)
0.5 0.5 0.5 0.5 0.5 0.5 0.5 0.5 
##$TPOFFS= (0..7)
0 0 0 0 0 0 0 0 
##$TUNHIN= 0
##$TUNHOUT= 0
##$TUNXOUT= 0
##$USERA1= <user>
##$USERA2= <user>
##$USERA3= <user>
##$USERA4= <user>
##$USERA5= <user>
##$V9= 5
##$VALIST= <valist>
##$VCLIST= <CCCCCCCCCCCCCCC>
##$VD= 0
##$VDLIST= <DDDDDDDDDDDDDDD>
##$VPLIST= <PPPPPPPPPPPPPPP>
##$VTLIST= <TTTTTTTTTTTTTTT>
##$WBST= 1024
##$WBSW= 30
##$XGAIN= (0..3)
0 0 0 0 
##$XL= 0
##$YL= 0
##$YMAX_a= 3196938
##$YMIN_a= -3059467
##$ZGOPTNS= <>
##$ZL1= 120
##$ZL2= 120
##$ZL3= 120
##$ZL4= 120
##$ABSF1= 10
##$ABSF2= 0
##$ABSG= 5
##$ABSL= 3
##$ALPHA= 0
##$AQORDER= 0
##$ASSFAC= 0
##$ASSFACI= 0
##$ASSFACX= 0
##$ASSWID= 0
##$AUNMP= <proc_1d>
##$AZFE= 0.1
##$AZFW= 0.1
##$BCFW= 1
##$BC_mod= 2
##$BYTORDP= 0
##$COROFFS= 0
##$CY= 19
##$DATMOD= 1
##$DC= 2
##$DFILT= <>
##$DTYPP= 0
##$F1P= 11.0000007629395
##$F2P= -0.999999237060547
##$FCOR= 0.5
##$FTSIZE= 0
##$FT_mod= 4
##$GAMMA= 1
##$GB= 1
##$INTBC= 1
##$INTSCL= 1
##$ISEN= 128
##$LB= 0.05
##$LEV0= 0
##$LPBIN= 0
##$MAXI= 10000
##$MC2= 0
##$MEAN= 0
##$ME_mod= 0
##$MI= 0
##$NCOEF= 0
##$NC_proc= 0
##$NLEV= 6
##$NOISF1= 0
##$NOISF2= 0
##$NSP= 1
##$NTH_PI= 0
##$NZP= 0
##$OFFSET= 16.51637
##$PC= 1
##$PHC0= -265.2507
##$PHC1= -4.898466
##$PH_mod= 0
##$PKNL= yes
##$PPARMOD= 0
##$PSCAL= 4
##$PSIGN= 0
##$REVERSE= no
##$SF= 200.13
##$SI= 16384
##$SIGF1= 0
##$SIGF2= 0
##$SINO= 400
##$SIOLD= 16384
##$SREGLST= <1H.CDCl3>
##$SSB= 0
##$STSI= 0
##$STSR= 0
##$SW_p= 4139.07284768211
##$SYMM= 0
##$S_DEV= 0
##$TDeff= 0
##$TDoff= 0
##$TI= <>
##$TILT= no
##$TM1= 0
##$TM2= 0
##$TOPLEV= 0
##$USERP1= <user>
##$USERP2= <user>
##$USERP3= <user>
##$USERP4= <user>
##$USERP5= <user>
##$WDW= 1
##$XDIM= 8192
##$YMAX_p= 0
##$YMIN_p= 0
$$ End of Bruker specific parameters
$$ ---------------------------------
##NTUPLES= NMR FID
##VAR_NAME=  TIME,          FID/REAL,        FID/IMAG
##SYMBOL=    X,             R,               I
##VAR_TYPE=  INDEPENDENT,   DEPENDENT,       DEPENDENT
##VAR_FORM=  AFFN,          ASDF,            ASDF
##VAR_DIM=   16384,         16384,           16384
##UNITS=     SECONDS,       ARBITRARY UNITS, ARBITRARY UNITS
##FACTOR=    0.0002416,     1,               1
##FIRST=     0,             0,               0
##LAST=      3.9581328,     0,               0
##MIN=       0,             -3059467,        0
##MAX=       3.9581328,     3196938,         0
$$ Real data points
##PAGE= N=1
##DATA TABLE= (X++(R..R)), XYDATA
$$ [...]
8903gO6L1Pj11P8n5K0J19k63J49P7p8j26J8R7q2j6M0N1Q4o9K5j12%N1P6q6L5O6
8932H5r5p3J14m9L4P6j60Q8j50J17J06n9l0Nk3J05j2L4j47M0M6j52N5kQ0j8n6
8959d1J10p0J1J68k36R2j0K8r3J42j03N0O7r1j65J22J18k11J21j6J7p9N1J23j87
8984h2J67Mj64J00m1j5J8Q%j9J5O6p2m5P0p5J02N1n9j9jj3M5j15M3M2n1J14q6
9013a2K2K3j06M8J08o6O9j72K9jj2J27j50J02n2J51j46J04j19j0J5j7M9p4J37
9038D7j8o0Q1j48J6Q4p3R7j76J60N6o7R7l8o4j8j2QL5l0KK05j15n4M4Pj23M8J45
9067A36r9l8J5j13Q0j04J95o7j8PP0M3j26n4J45M1k10J10o0Qn9P4O0j3m7N7M0
9094G3q0k8R2l6m8J8K3L3q0N0k6n6M3M3j02J05J21j1j34rJ31j37J24j09k4oO2
$$ plain form
8903 -7 59 90 97 -14 64 9 29 148 -115 34 111 33 -93 -75 22 -60 -76 -36 15 99 30 55 -57 -57 -6 70 -16 19 85
8932 85 -10 -83 31 -18 16 92 -68 20 -130 -13 93 34 4 9 -14 91 79 113 -34 6 52 -100 -45 -47 33 15 -41
8959 -41 69 -1 10 178 -58 34 24 52 -41 101 -2 48 115 24 -141 -19 99 -112 9 -7 10 -69 -18 105 -82
8984 -82 85 89 -75 25 -16 -31 -13 -5 -5 -24 -9 57 -15 -60 10 -65 37 88 29 10 9 -4 41 -74 -31 11 -40 74 -12
9013 -12 10 33 -73 -25 83 17 86 -86 -57 -58 -70 57 -93 9 -43 108 -38 66 -53 -63 -48 -65 -16 -90 47
9038 47 29 -31 50 -98 -82 2 -71 26 -150 10 66 -1 96 58 -6 -24 -36 -28 7 -23 -21 184 69 15 59 66 -57 -9 136
9067 136 37 -1 14 -99 -19 -123 72 5 -13 -6 64 107 -19 -73 72 113 -97 13 -47 -39 -98 -24 36 23 -24 33 73
9094 73 -7 -35 57 21 -27 -9 14 47 -33 17 -9 -65 -22 21 -81 24 145 134 0 -9 122 -15 109 0 -24 -30 32
9121C2O7j75J15m4q3N7L3J3m7l1L1R6O8j23J07k01q6K36j91J31Mj6L5kL7j07L5
9148iP5j06l3K15r2j1n3K8o9J8k2L2J28j60N3J11j44O8k7J07j54J9K30k62k8K18
9174A32J1k5r3j51M4R2m9m7N6Q3Np6K3k3P2k0p2J5J2p5J37k9L9o2M5q8N0J6r7
9203g5j4J19O7j85P9Q5rm6m6n4J77p2J21j23r0R8m8J7O6j84O3K0m5J36j02M3j73
9230a75R7J17j6L1L6j21M3j21J45j01K9K8N7J02j19j30lQ0O8L4o8q0M4q1J51J
9256D8j53J18l0N6j4k4o6J30p3k2k6J5r1J44n1N0J4l0M5j93J17n5Q7oK3K6o8O
9284b3q8j3J28p1K6qQ5j00R8k6m8R6j5P7j29O2l7J12k03J9J49j41J6N6L8q7O6
9311C9rJ04q2n8L8l0J53k01MJ6M2Po5J19Kj03m7J39R3r3l1k5n7Q7j78O0K5N0j0
$$ plain form
9121 32 99 -76 39 -5 -88 -31 2 15 -32 -63 -32 64 132 9 116 -85 -171 65 -126 5 9 -7 28 26 63 -44 -9
9148 -9 66 -40 -73 142 50 39 -14 14 -55 -37 -59 -27 101 -59 -6 105 -39 29 2 109 -45 -26 204 -58 -86 132
9174 132 143 118 25 -126 -82 10 -39 -86 -30 53 58 -18 5 -18 54 34 -38 -23 -11 -86 51 22 61 -1 44 -44 6 22 -75
9203 -75 -89 30 97 -88 -9 76 67 21 -25 -79 98 26 147 24 -66 32 -16 1 67 -117 -54 -34 -79 57 -45 -2 -175
9230 -175 -78 39 23 54 90 -31 12 -109 36 -65 -36 -8 49 151 32 -98 -101 -21 47 81 13 -67 -23 -104 47 48
9256 48 -105 13 -17 39 25 1 -65 65 -8 -30 -56 -41 -132 12 -39 11 25 -5 40 -153 -36 -91 -4 -10 13 39 -29 -23
9284 -23 -111 -124 4 -67 -41 -49 36 -64 34 8 -40 56 41 118 -11 51 14 126 -77 -58 91 -50 -34 22 60 -27 39
9311 39 30 134 52 -6 32 2 155 -46 -42 -26 16 23 -42 77 79 -24 -71 68 161 68 37 12 -45 42 -136 -76 -51 -1 -11
9340a1N1m4j7L9j09K15n0n7l8J17j79J59Lj8n7M5k9j10N7N3N2o7P1p6J48j79K6
9367eN7j7j41J70Oj8n9n9L1K5j21R3pj1K71k50L9n9P0M2j14J2J17nj21k8J04N
9395B7mJ6j73J28P2q4r5J20o0M8k8J14l7j62P8j1K6K1km1J00qJ8O7j10k6PL5q3
9424d7J10j10O8R9n3J3q7j7J08j23NR9m4J8j29J42q5N1M0j5O1m6Qk7O5j05M6n5
9452a0Q1p3L0l3P9J3p8L0n7J57j12Jj99J89j59K57k17R0O9ko8NoK4P6k12K47o3
9480E9r2J32q9J01k01N8K9NL2o0O5L2L0j08J5o6J18j43J20n2JPL1j07L1P3j15
9507i4J37q4n2J6J13L3k9n8N2j00J00M3j72J80l9m0Kl0N3q2p6J60q8L4j21J13
9533b9J26j62K9J29j22j9J7Mj73J72P6j26J09l0M7m7R5p9k6j23L06j22k6pnM3
$$ plain form
9340 -11 40 -4 -21 18 -91 124 74 17 -21 96 -83 76 79 61 4 49 20 -90 -33 20 72 5 76 0 148 -31 -5
9367 -5 52 35 -106 64 70 52 -7 -66 -35 -10 -131 -38 -45 -56 215 -35 4 -55 15 57 -57 -45 72 67 -54 -82 22 27
9395 27 23 39 -134 -6 66 -18 -113 7 -53 -5 -33 81 44 -118 -40 -51 -25 -4 -6 -47 53 45 63 130 20 -6 1 36 -47
9424 -47 63 -47 21 120 67 80 -7 -24 84 -39 -34 65 21 39 -90 52 -33 18 58 43 104 58 66 39 104 -1 45 -10
9452 -10 71 -2 28 -5 74 87 9 39 -18 139 27 28 -171 18 -141 116 -101 -11 58 56 -12 -7 -13 11 87 -125 122 59
9480 59 -33 99 10 111 -90 -32 -3 2 34 -26 39 71 101 -7 8 -58 60 -83 37 -15 -14 -7 24 -83 -52 21 -94
9507 -94 43 -41 -93 -77 36 69 40 -18 34 -66 34 77 -95 85 46 6 8 -22 31 -51 -127 33 -55 -21 -142 -29
9533 -29 97 -65 -36 93 -29 -48 -31 -27 -200 -28 48 -78 31 1 48 1 96 17 -9 -132 174 52 26 19 14 57
9559E7n1o8J8J1n5J37j2J2j42J63K8n1m4J38p9n3k6M0M4mj05R2Jj09J77kj4j05
9587bm8J6OM9J2m2l5j4J31L6r5k4l8P4j97K25M7j37Q4m7K3l5J5Q3m3q1j9N5l4
9616c5p2J02k1L2J00n3m9j28J65K8K6j07J5O1o2p2J4M5N9n1L2n6o0P5J4M0L1r8
9644b5N5l1l1o5Q9M1k3r9J02j20P0J7%o0K5J05n1N8j22J62j36K4O7j3o5R1p9J1
9672cn1R0p9P2j2J38j49kN0L2j77J25n6O2n7Q5j0K2j04J03j66J55q5n0K54k14
9698b7R8k8K1o4n0N6j1j43J47o9O7n5K5MqRl1m3J92j67L5Q0N1j03N8m4O7j17R7
9727D7J2q3m4%K6N4P2j53NJ39%J0q8N6R3k29J11l9Q8j53O6R3j69J14k4J5o0L0
9755a1q8J00q0J16q3K4L0O6r0j53J34K5l3J1J17n5jk5N6jl0j58P6oK0J05o7m7
$$ plain form
9559 57 6 -62 -44 -33 -88 49 37 49 -93 70 98 47 3 141 62 9 -17 23 67 63 -42 50 51 -58 119 117 103 -2
9587 -2 -50 -34 -28 21 33 -9 -44 -58 73 109 14 -10 -48 26 -171 54 101 -36 48 1 24 -11 4 87 44 -37 -56 -1 -35
9616 -35 -107 -5 -26 6 106 53 4 -124 41 69 95 -12 3 64 2 -70 -56 -11 48 -3 29 -27 -87 -12 2 42 73 -25
9644 -25 30 -1 -32 -97 -8 33 10 -89 13 -107 -37 -20 -20 -80 -55 50 -1 57 -65 97 -39 -15 52 39 -26 65 -14 -3
9672 -3 -54 36 -43 29 17 155 6 4 54 86 -91 34 -22 40 -17 68 58 80 -24 79 -87 68 -17 -67 187 -27
9698 -27 71 43 64 0 -50 6 -5 -148 -1 -70 -3 -58 -33 -29 -37 -28 -59 -102 90 -77 -42 38 89 -14 44 0 67 -50 47
9727 47 59 -24 -68 -68 -42 12 84 -69 -64 75 75 85 -3 53 146 -83 28 -11 77 -76 -10 83 -86 28 4 19 -41 -11
9755 -11 -99 1 -79 37 -46 -22 8 74 -16 -169 -35 -10 -43 -32 85 30 29 4 60 59 29 -129 -53 -59 -39 66 -1 -48
9783d8J91q7j03J04o5J02kj38J34j70J62j9K7l0k2j78K46mj70J58j01L8o9J42
9807I8j04m1Jp6J72j13L0K8L3j23J08p5M5K0j00L6M5M9MN3PK5j20M1J5o5m3O7
9835A7j82J17J9K2n4K03j44J29j89J31j38K34j29j21J33j12K8k2j8R8N5j33J87
9858A31j66O7j03O0J1o8J68o9m1Q8q6L8o8j6jJ11p7p8R5N1LN5o6p7J32r8R9j28
9886c3J29p9MP9o2L6l5Rj79O7P9j29J18J1j2K1K4L8j51lO8L3j16L6J3N7j17M4
9914e0M2mq1J04J0J5k2p2K0L8M8j10l9J47k5m7O8k9P2k02N1L6J3N7Mn7K1P3j33
9943e2R5p1j9m3J16L9j05rrL0Q1P6j99j8J33N1k40J87n4o2N4Q1n1P1j39N0J5m4
9971c6K0k2k0J01N2o5j5l3O1k20J56Nj2qrjL6K9j34K18o8k7j0j4Q2M4p9j67J66
$$ plain form
9783 -48 143 56 -47 57 -8 94 92 -46 88 -82 80 61 88 58 36 -142 104 100 -70 88 -13 25 -44 98
9807 98 -6 -47 -46 -122 50 -63 -33 -5 28 -95 13 -62 -17 3 -97 -61 -16 33 37 90 97 122 2 43 58 -7 -50 17
9835 17 -165 -48 -29 -7 -61 142 -2 127 -62 69 -69 165 36 -85 48 -64 -36 -58 -76 22 77 -56 131
9858 131 -35 32 -71 -11 0 -68 100 31 -10 78 -8 30 -38 -54 -55 56 -21 -99 -4 47 50 105 39 -38 94 -4 95 -33
9886 -33 96 17 21 100 38 74 39 48 -131 -64 15 -114 4 15 3 24 48 86 -65 -68 0 33 -83 -47 -34 23 -94 -50
9914 -50 -8 -12 -93 11 21 36 14 -58 -38 0 48 -62 -101 46 21 -26 42 13 85 -117 -66 -30 -17 40 44 -13 8 81 -52
9943 -52 43 -28 -47 -90 26 65 -40 -49 -58 -28 53 129 -70 -88 45 96 -144 43 -11 -73 -19 62 11 82 -57 -7 8 -36
9971 -36 -16 -38 -58 43 95 30 15 -18 43 -177 -21 -16 -28 -36 -45 -46 -10 19 -115 103 35 8 -2 -16 66 110 31 -136 30
10000C0l2m8O3l3q5Q3J5q1M0K5M5p1j6Q1r5P0n6J3O4j01J53o2J2M4n8mR0o7p9
10029f0NJ01j04k9O7L1j37K19j12r5J54k2j46J94j46O5M7q8Q9L5N2r4K0j34J8
10054g0r4J39K3M1q7M4q2j6J12N0q4J09j14N7j29J52J4K2o7K5J5ro5m9J21m9m7
10081c8j00J37JJ0K8j11L0R8j33P2J6n2o9J91n4K4j81N9J11r6J07o0J74j41j31
10106a08L7o9J71q2J00j8J50p8k58K62q2Ro2Lr6J75j11Q1J4q8P9p7P8or6J21l4
10133A5j4PR5j42K5K7J1j9n0j08J70L4q4P2qj90L00j68j7L7j11j2K7N7J0J56m2
10160G8m8p2L0J26j30JQ0m8Qj28J00Rq8K1r9K04n9K17j71M4k3j50q5J39K3KL3
10187A4j13P7l3O1J7L0j12N0M7q2N9O2j77J95l9O2j32j35J52j8j4oJ01j34M6L9
$$ plain form
10000 30 -2 -50 13 -20 -105 -22 -7 -88 -48 -23 22 -49 -65 16 -79 -9 -65 -52 12 -89 64 2 14 58 0 -4 86 19 -60
10029 -60 -55 46 -58 -87 -20 11 -126 93 -19 -114 40 18 -128 66 -80 -15 32 -56 33 68 120 26 46 -88 -70
10054 -70 -164 -25 -2 39 -48 -4 -86 -102 10 60 -24 85 -29 28 -101 51 65 87 20 45 60 51 -14 -63 58 9 -38
10081 -38 -138 -1 0 10 38 -73 -43 55 -78 -6 10 -42 -111 80 26 50 -131 -72 39 -57 50 -10 164 23 -108
10106 -108 -71 -140 31 -51 49 31 181 103 -155 107 25 34 -28 -25 -121 54 -57 24 38 -50 29 -48 30 24 -72 49 15
10133 15 1 8 103 -39 -14 13 24 5 -45 -153 17 51 -33 39 31 -159 141 -27 -44 -7 -118 -130 -103 -46 -36 120 78
10160 78 30 -42 -12 114 -16 -15 65 17 25 -103 -3 6 -82 -61 -160 44 -15 202 31 75 52 -98 -183 -44 -21 -19 14
10187 14 -99 -22 -55 6 23 53 -59 -9 38 -44 15 77 -100 95 56 118 -14 -149 3 -15 -29 -35 66 -68 -22 17
10213A7P9q3j46J63k5P8j81J91j36j2J4K2J02q0qJ8j12J09q4OK02j68J8l1L2J6
10239AM3N2j23J5j8k3J04k8Qn9P3m1j39J19J5k0n9L5rO8K4m3KL3n0n6Q9j8J0N8
10269F3M7k2N7l0j6p5p6J48j07m0R3j08J36k8j9L4k5L4m1Q7r3J0j23N8MJ2m9J25
10297E6q1J37p3n1K4K6j0p9qJ3O5q5l1J91o6q5N0j36J46o2J2O6q5%Q0k2m3J16
10325F5r1kK0O5r0Qp5K01j32p5K01o1j04j2J01rM7r4J65k40J12M3p6Jo1O5q9J19
10353Bj3ROP0l7Mm9k0N3k5m8j6J86p5R6j42r6J09p0N6J91j87p0N1m8L4M2j9o0
10382f6P1K8M9n1J3j29mOR9N1m4r0l6J8P7p0M8O1J5r4Q5o2O3rk7q9J35K1q5RP
10413@R2j72O7m0J75j13Jm3Lk6p4J42N3mj58qR0N4j05K3QJ45j20o8M4L7J4q0J3
$$ plain form
10213 17 96 13 -133 30 5 83 -98 93 -43 -55 -41 -19 83 3 -5 13 -99 10 -74 -68 134 -34 -16 -47 -15 1
10239 1 44 96 -27 -12 -30 -53 51 23 31 -28 45 4 -135 -16 -1 -21 -80 -45 -54 14 38 -5 -3 30 -20 -76 13 -5 5 63
10269 63 110 88 145 115 99 24 -52 96 -11 -51 42 -66 70 42 23 57 32 66 25 112 19 29 -94 -36 -32 -20 -69 56
10297 56 -25 112 39 -12 12 38 28 -51 -59 -46 19 -66 -97 94 28 -57 -7 -143 3 -59 -47 19 -66 -66 14 -8 -51 65
10325 65 -26 -28 -8 57 -33 -25 -100 101 -31 -106 95 34 -70 -82 19 10 57 -37 128 -112 0 43 -33 -32 -93 -28 -117 2
10353 2 -11 -2 4 74 37 41 -8 -28 25 0 -48 -64 122 47 143 1 -95 14 -56 0 191 4 -66 -15 -63 -29 13 -6 -66
10382 -66 5 33 82 31 44 -85 -89 -83 16 67 23 -67 -103 -85 -8 -78 -30 31 46 -48 37 -25 38 29 2 -87 48 69 -16 -7 0
10413 0 92 -80 -13 -53 122 9 10 -33 -30 -56 -130 12 65 61 -97 -105 -15 39 -66 -43 -35 110 -10 -78 -34 3 17 -63 -50
10442e0j6M9j2k3q9J41k9m9R9m9o8J22j20K5O5k2R2p5J37j04O4p3j4mM0r5J04
10469D6j21J8N8Kl2J02p3O3p7J0l6P3NN5mq4l3J2K8l1J1p8N1N8j17R8N6j05J13
10498F8j53J07n8o2J84k7NL1q1k2Q4j18J27j4k24Q5R8N2q1Jm8qP6l1M5j1p1K09
10526A63j92p3K79k48R6k6j05j0J53N5r9r3N9J85j48Q2o2j37Q8k2N8KkpQL3J0
10553D7oP7j49O8J0K2J7K2j16k0P2j28J01j21J00N1j08J36Q9j51pJ0R9j34O1m4
10579bm6nj5J12r6mQ8j15P7l7j19K35j47J25nr6R5O3k6q8l4o8N3J37j01k3R6q3
10607b9M0J09n7Qo6J28q0l0On3MQn5LJ8MJ9RJ6o1J16j6k6J2l5LO3n2r2R4k6K4
10639Fq3N3Q1l5J04p7rj55l2J39J03j18N5p4J9MK1kj41J35m1P5J3n5M1J4p5o4
$$ plain form
10442 -50 -66 -17 -29 -52 -141 0 -29 -78 21 -28 -96 26 -94 -69 -4 -26 66 -9 128 24 88 15 1 -3 37 -58 46
10469 46 -75 -57 1 3 -29 73 0 63 -14 -4 -40 33 38 93 89 5 -28 -16 12 -19 -8 -86 -35 23 -94 4 60 -45 68
10498 68 -85 22 -36 -98 86 59 64 95 14 -8 76 -42 85 71 -153 -68 30 82 1 2 -46 -54 22 -9 36 25 -46 163
10526 163 -29 -102 177 -71 25 -1 -106 -116 37 92 -7 -100 -41 144 -4 78 16 -121 -33 -55 3 5 3 -4 4 37 47
10553 47 41 118 -31 37 47 69 86 108 -8 -28 44 -84 17 -104 -4 47 -61 75 164 13 6 16 115 -19 42 -2
10579 -2 -48 -53 -68 44 -52 -56 32 -83 -6 -43 -162 73 -74 51 46 -50 45 108 82 -6 -40 -108 -55 82 -19 -42 54 -29
10607 -29 11 120 63 71 5 133 53 23 29 -24 -20 -12 -67 -64 -46 -42 -23 -14 2 -59 57 41 15 27 -8 -5 58 6 -86 8 -18 6
10639 6 -77 -24 57 22 126 49 40 -115 -147 -8 95 -23 32 -42 -23 -19 2 0 -141 -6 -47 28 41 -14 27 41 -34 -98
10667i8K26j43r3P1J00J2j22K1P7j87J25k8O9p7J58l0ql4k8j06L3n3L9R2Q4p8
10693B2k5Q0k2n9R7j75J8P5P4j21R8k9j2M1M9j27J41r8Lp9N5JK5J2r5Q6Mj21N6
10722b6k4O9n5LpK62j58p3N9p0o1J20o5m4N8P3n7J2o1Q6l4j8O4q0k6J08r0jJ19
10751H3j85R3l4j0R0J7o4M8o6J41j9j0q8N1J36j02j06L2k7QR5q7o4J07Ln0k6N7
10779B3OJ4j33O0J03Mr4l1j0N5j01J47q5J29o3n2O9JP9r5qL4m9r2R9o9M3Q5n8
10808A1P9j09N7kqKlJ3m1m8K7R1p4K9p3J19j63K47j75k7O9n3J02k8o6O6j1k3p1
10837f3j02J11R2K5j22OK9j20J74l5j05J63M3r0O2l8q2PJ00R9j24m4L3o8P9l4
10863dK0Qj83J44k2J02J5LP8j43K7o1j75K47o1J06j66L1j6Q3M1N2j79n1J65r8
$$ plain form
10667 -98 128 -15 -108 -37 63 75 -47 -26 51 -136 -11 -39 30 -47 111 81 73 39 11 -95 -62 -115 -76 16 100 22
10693 22 -3 77 55 -4 93 -82 -64 11 85 -36 62 33 21 62 111 -16 125 27 30 -49 6 7 32 44 -51 35 39 -82 -26
10722 -26 -50 19 -36 -33 -40 222 64 -9 50 -20 -81 39 -26 -70 -12 61 4 16 -45 41 7 -11 53 -27 -53 55 -35 -36 83
10751 83 -102 -9 -43 -53 37 54 -10 38 -28 113 94 84 -4 47 183 81 -25 7 -20 -12 83 -4 -68 39 42 -8 -34 23
10779 23 29 43 -90 -30 73 77 -17 -48 -58 -3 -104 43 -42 87 24 -28 41 42 121 26 18 52 3 -89 10 -59 -16 69 11
10808 11 90 -19 38 36 28 30 27 40 -1 -49 -22 69 -5 24 -49 70 -93 154 -21 -48 21 -32 70 42 -24 42 31 8 -63
10837 -63 -165 -54 38 63 -59 -53 -24 -144 30 -5 -110 53 96 6 68 30 -52 -45 55 154 30 -14 19 -49 30 -4
10863 -4 16 24 -159 -15 -37 65 80 83 161 18 45 -16 -191 56 -5 101 -65 -34 -50 33 74 126 -53 -104 61 -37
10889c7O4%N4p3K9j9j29PN6J07J1r8R2m7m7K8nO0q7pR1r6J36r8n1J22o1J9K2j07
10919f4J22Mn0mlL5p6O6o0J05n2J8Pn8K8O1n6p2j6R8j4j08J30j6p0OQ2k6O9p9
10949GP0r0lj54K42r4n7R5J1O3p8K3o6n4J53l3k9o7Q8K6j70J13j44K04q2R3p7
10976a0Q0%r8P6n9P1PK5j44p2J25r1Q0l3J0J00j51J02j5m8O5O8n9j07M2l9J75
11003A00p5n6J4o9Q5L3J12j39M3P1j80J49k0J9j34K4N0k7l3J63k38R0n9J7J21
11028F1j2L3m9k3o4M9M1o7J54k36L1R8j5r1J15jj40N7M9L3j8N5lL5p8M7Q8j51
11056bl6k1N2p7J3q7R2j0J28q7JP6j1O6n9m6rM3j68J51j15R9j6J08j15k0nMK07
11085A56j81Q6j00R3j27J08J5j07O7K4n2%J7m6J04p2RrJ19n0%Oj16L8K1K8q5N9
$$ plain form
10889 -37 27 27 81 8 37 18 -111 -104 -48 59 70 -28 64 17 -30 -2 -7 53 -34 -41 50 -46 90 -8 -59 63 2 21 43 -64
10919 -64 58 62 12 8 5 40 -36 30 -30 75 23 41 48 -10 18 79 23 -49 -65 33 19 -89 41 25 -45 -39 43 17 86 7
10949 7 77 -13 -16 -170 72 -22 -79 16 27 90 12 35 -31 -85 68 35 6 -61 27 53 -117 -4 -148 56 -26 67 -10
10976 -10 70 70 -28 48 -11 60 67 92 -52 -124 1 -90 -10 -43 -33 67 -84 18 3 -45 20 88 29 -78 -36 -75 100
11003 100 25 -31 -17 -86 -1 32 144 5 48 119 -61 88 68 87 -47 -23 27 0 -33 130 -108 -18 -77 -60 61
11028 61 49 82 33 10 -54 -5 36 -31 123 -113 -82 16 1 -90 25 24 -116 -59 -10 23 5 60 57 92 14 61 149 -2
11056 -2 -38 -59 -7 -84 -71 -158 -66 -76 52 -35 -34 42 31 97 38 -8 -17 26 -142 9 -106 -7 -23 85 -30 -50 -55 -51 156
11085 156 -25 61 -39 54 -73 35 50 -57 10 34 -18 -18 -1 -47 57 -15 -6 -15 104 54 54 60 -56 -18 3 31 -54 5
11113Ej6m9K1r5J43n3J68k91K97l1j26j5M7K2k5N0l0k4o9J13j14M0J05p1o2J07
11139D7Oo2K8J9q7J6R1l9k0N3k2r4M9l1J05O4j31k1N0k5J3O4j19k2J6M7R5N7q7
11168F0n6j03J2R0r2M4K1%o3M9L2l7M8L2n3j4K5J06p0n6j5QMQ5j25J03O0j16R2
11197G1q1J2l3j15J77j22pOJ66j22r4P2P6p1J51j35J55k12j7J13o4J70k56J73
11221A3o1O0N3j46L7J5l8Q4j41K1P2K9N3N5j60J11M2j37M9p3J4l2J84j57J14j08
11247d7NJ54q5j20J78r3m3N2p3J85l8r4L2p6l1K17k33K35j85Q3j0no3J4k2O4k1
11274b0k9pO0l5N2J5J7j7j8m4j8O5J26j51J7KN9L9j6j50L8j0J93k20M9o5Q3o5
11302e0R0m9nJ33k66N9Q1m1N5rl1P8j59O9Qk9Q8k3J9Q0J0o9O8r3On8%L3k6O5q4
$$ plain form
11113 5 -11 -60 -39 -134 9 -44 124 -167 130 99 -27 -42 5 27 2 52 22 -2 -71 42 -72 -32 73 2 -60 47
11139 47 53 -9 19 38 -49 -33 58 19 -1 52 30 -64 -15 -46 59 123 -8 -29 21 -4 9 73 -46 -68 -52 -5 90 147 60
11168 60 4 -99 -87 3 -89 -45 -24 -24 -87 -38 -6 -43 5 37 -16 -30 -5 101 31 -25 -40 -32 -28 57 -68 35 95 -21 71
11197 71 -10 2 -31 -146 31 -91 -98 -92 74 -48 -142 -70 6 -65 86 -49 106 -106 -123 -10 -74 96 -160 13
11221 13 -48 12 65 -81 -44 -29 -67 17 -124 -103 -31 -2 51 106 -54 57 99 -38 11 -62 -48 -80 104 -53 61 -47
11247 -47 -42 112 27 -93 85 -8 -51 1 -72 113 75 -19 13 -63 -94 123 -110 125 -60 23 13 8 -55 -41 -63 1 -20
11274 -20 -49 -56 4 -31 21 36 53 36 18 -26 -44 21 147 -4 13 15 74 113 97 -53 -15 -25 168 -52 -3 -68 15 -50
11302 -50 40 -9 -14 119 -147 -88 -7 -48 7 -2 -33 45 -114 -45 -37 -66 22 -1 18 98 108 39 107 14 20 -38 -38 -5 -31 34 -50
11333e0J21r9J28j34j8J08K2j90M8J02R9j19J19k20R3o5P6K5J52j29m9oq6N4n3
11358g1O9k0J5J20k0k43J86P5j36Q4j34M1N1m1P1l8Q7q0M3k6l6K3k0o2J21n0L2
11385D1m5L7N1l0J0j90J04j24J81L2M8j33j3M2k2J89k14k1O3n2L9M7p4qL1l2K
11412d1K1K2J3LQ5k36J21R7Lj21QP7p3P0P0o7N6k9l0K0k6l1R9q7J5R4j08j8n1
11441d4N9q8J77j64O3R0p7o2J27l7Nj42N0J05j22QM1M2Jj9M8j91J45P9mn1m8p
11469a6j01J18L3r0O1kP3p8p0N9q8Q2L7q2R5l5L8j23%J99j16P6m3r1KJ76p7q1
11497d4Q9q5J07q3N3j46J20j2J0j6Q1q0p6M5O0q1oO1LJ00j15%Q4j33J41j55O8
11524a0O1j31O0Q2J1r2j1O9l2L9k9l5M0m4j6l1R6rk6m5o2K18j42J8R0j29J09q2
$$ plain form
11333 -50 71 -28 100 -34 -52 56 78 -112 -64 38 137 18 137 -83 10 -55 21 46 198 69 20 14 -72 -18 -71
11358 -71 -2 -22 -7 113 93 -150 36 111 -25 59 -75 -34 17 -24 47 9 96 16 59 33 -3 20 0 -62 59 9 41
11385 41 -4 33 84 54 64 -126 -22 -146 35 67 115 -18 -31 11 -11 178 -36 -57 6 -46 -7 40 -34 -42 -11 -43 -41
11412 -41 -20 2 15 18 103 -133 -12 85 88 -33 -25 52 -21 49 119 52 108 79 49 69 43 12 111 24 39 133 25 7 -44
11441 -44 15 -73 104 -60 3 93 16 -46 81 44 49 -93 -43 62 -60 -52 -11 31 32 13 61 -130 15 94 90 39 -9 -16
11469 -16 -117 1 34 -56 5 3 76 -2 -72 -13 -101 -19 18 -64 31 -4 34 -89 -89 110 -6 70 27 -64 -62 114 37 -44
11497 -44 45 -40 67 -16 37 -109 11 -1 9 -7 74 -6 -82 -37 23 -58 -64 -3 0 100 -15 -15 69 -64 77 -78 -10
11524 -10 51 -80 -20 62 73 -19 -30 39 7 46 17 -18 22 -22 -38 -69 27 18 -8 -53 -115 103 -39 -21 69 -60 49 -33
11552c3o4J64j20R5O3r7P0J7k10R1M4l7K8n3J02j53N2N4j00J44k03J49L7Nj25
11577h0N5O7L7j26Q1JOm4N4rq2O5j23P4N5P9j04L1j51J42j50P2%O1p5ON6m0P8
11606C6n1p3J16l1J2J0j09Q1l4J59r2l0o6M7J8K2j1k2p3J24j37J85j23mNKj8j7
11634g4P5n2J04R6k44R9rr2Q4j5L7O3j04J0oj2O4m4J00k4l6M3q1qL0j11J80j03
11662c0m2M7kN2q0M3m4M6L6O2o8P2j80K9m2j5K23k06N4Q1Jj92K51k20J01k0N8
11689A5k7m2R7M8q3J1n7J7P9l6P2j33p8J26k7K1J8j15J06j07J04j6Q0J2l2k5o7
11716c9l2M0m7K9J55k8j03P6j14J27r7O4J3J05j26r0J70n7J5J5j8j41J01M5j4
11741D9j44O8pJ11p4j8j42J47j0P0o5j16J34j24L9Q1K1j39J88j06J5R6j04k0J29
$$ plain form
11552 -33 -97 67 -53 42 105 8 78 95 -115 -24 20 -17 11 -42 60 -93 -41 13 -87 57 -146 3 40 45 -80
11577 -80 -25 42 79 -47 34 35 41 -3 51 42 -40 25 -98 -24 31 110 6 37 -114 28 -122 -50 -50 11 -64 -58 -2 -42 36
11606 36 -15 -88 28 -3 9 19 -90 -9 -43 116 24 -6 -72 -25 -7 15 4 -18 -91 33 -104 81 -42 -46 -41 -39 -57 -74
11634 -74 1 -51 53 149 -95 4 -5 -97 -13 -28 9 72 -32 -22 -28 -40 24 -20 80 56 20 63 -18 -26 4 -107 73 -30
11662 -30 -72 -25 -27 25 -55 -12 -56 -10 26 88 20 92 -88 -59 -101 -116 107 -99 -45 36 37 -155 96 -124 -23 -43 15
11689 15 -12 -54 43 91 8 19 -38 -21 58 22 94 -39 -117 9 -18 3 21 -94 12 -95 9 -7 73 85 53 28 -39
11716 -39 -71 -31 -78 -49 106 78 -25 51 -63 64 -33 31 44 149 23 -67 103 46 61 76 58 -83 18 63 49
11741 49 -95 -27 -34 77 3 -15 -157 -10 -20 50 -15 -131 3 -121 -82 -1 20 -119 69 -37 -22 74 -30 -50 79
11766G9j48J58j00M5l8M8p9j32J29O8j37P4L4L9M7j12o5P8Q7l8j07K6N4L5n1j
11792gPl6O8L3K9j34j1L3q6K3pL3N2K5rK6m7o1J39r5m7Q2K4K9o0J46j49M5K9j06
11822c2R6o9M0j09O0j3K9%p9L5P4Q7j11j1oL6l9RJ1M6n8O6oj36P9n2o9J0K25j27
11852a4L5j43O1L5J3nk1l7O7M6Q4j42k0kqk1J48j11J7K8p5J2J28m2l5J55r6r0
11880c3J33J0j94J09m5J14j38R4qj38k6Q6J19j4n1o2J17j14kK8K5j35NQ5r0K03
11906G8j34J47j22k8M3p2K67j96OJ3l1Np3J23o5O7K3J2j2o3k5J1M1O0pj30j7J09
11934C0j0M5m8K7j49K1J46o9n6M4J23k30J48m4L8Pj12M1%L2M4j9n2M5n3qK1O0
11962B2j36J47Kjk7Q7k04J39Oj7o8J11Q1k41k7J27N8o8k8L1p7J17J8lj45j2P3
$$ plain form
11766 79 -69 89 -11 34 -4 44 -35 -167 -38 30 -107 -33 1 40 87 -25 -90 -12 75 37 -70 -44 10 45 -6 -7
11792 -7 0 -36 32 65 94 -40 -51 -18 -104 -81 -88 -55 -3 22 13 39 -8 -69 70 -25 -72 10 34 63 3 149 0 45 74 -32
11822 -32 64 -5 35 -74 -14 -27 2 2 -77 -42 32 119 8 -3 -9 27 -12 -3 8 54 -4 62 56 -80 -1 -53 -122 -112 113 -14
11852 -14 21 -122 -61 -26 -13 -18 -39 -76 -9 37 121 -21 -41 -43 -51 -72 76 -35 -18 10 -65 -53 75 33 -2 153 57 -33
11880 -33 100 110 -84 25 -20 94 -44 50 42 -96 -122 -36 83 69 18 -44 73 -41 -43 -15 10 -125 -120 -35 -125 78
11906 78 -56 91 -31 -59 -16 -88 179 -17 -11 2 -29 -24 -97 26 -39 28 51 63 51 -12 -37 -26 15 75 68 -62 -79 30
11934 30 20 65 17 44 -105 -84 62 -7 -63 -19 104 -126 22 -22 16 23 -89 -48 -48 -16 28 9 -43 2 -51 -59 -38 22
11962 22 -114 33 35 34 7 94 -110 29 35 18 -50 61 142 -99 -126 1 59 -9 -37 -6 -83 34 52 49 -96 -108 -35
11989c5k4m4RO4P1j06Q0o5J7J2J6p9l8J29M6J7qn6jj2K3k4J7P7j27J15m2l1P9
12018H0j3j34O8l2J5J2L8j59N5J8JM9M4j0o6M6j83K33n4k7Q5p8J02l1j33R0L6
12045E2r3K23j41P5j3j17Q9j08o6J58k8L7r9P2l4Rj3p8mR1J34j18j27J7O6O1n6
12072a1r1L17m6j39l3k7K1n0O4m4m6J11m6m7P6q2N0Q2jp3j7j23K22j03O4L5p8
12099a5K1m6K1L6j51L7R5P9l3pJ6p6k6K19r3j22J38j55M0LjnN7J6o9P1j24M2J55
12128A23j24j7J3l3M2%Rj02J01L7Ml4j36O3rJ21j43o3J6K12j23M5jR6j23j2Q6
12155D8Lm8M2kMj35O0J42n0j44K25j13m4M8oj9L1k9Q5j10r4J85p3j05P5l3k7R7
12183A3pM3j20RN2P1k0N5k53J41P0l6r8P5k0q4K4o6J58j4k7P1J20j95k3P0rn0
$$ plain form
11989 -35 -59 -103 -94 -30 41 -65 15 -50 -33 -21 -5 -84 -122 7 53 70 62 6 5 -7 16 -8 9 86 -41 74 32 1 80
12018 80 67 -67 1 -31 -16 -4 34 -125 -70 -52 -51 -2 42 32 -34 12 -171 62 8 -19 66 -12 90 59 -74 16 52
12045 52 -41 182 41 116 103 -14 75 -33 -99 59 31 68 -31 41 7 16 3 -75 -79 12 146 28 -99 -82 -16 45 -11
12072 -11 -102 215 169 30 -3 -30 -9 -59 5 -39 -85 26 -20 -67 9 -73 -23 59 58 -15 -32 -155 67 -36 28 63 -15
12099 -15 6 -40 -19 17 -134 -97 -2 77 44 37 53 -23 -49 170 77 -45 93 -62 -22 -19 -20 -25 32 48 -21 50 -74 -32 123
12128 123 -1 -18 -5 -38 4 4 13 -89 12 49 53 19 -117 -54 -63 58 -85 -148 -132 80 -43 2 1 97 -26 -38 48
12155 48 51 3 45 43 47 -88 -28 114 64 -80 145 32 -12 36 30 11 42 13 98 -12 -106 79 6 -99 -24 -57 -84 13
12183 13 6 49 -71 -62 -10 61 41 96 -157 -16 54 18 -80 -5 -25 -109 -85 -151 7 -7 -34 37 157 -38 -61 9 0 -50
12211e0l5j2P3p4J91j46K27p8j10l7M4L1n8l8K7J43Rp1l3m2qJ18m9l0n5jM5m8
12239f7J45r9J4J04o0l9l4j60K42j48K07m1K6j25P3p8L7l7M0J19j17q2P8m1R5
12264E2k7j16J33L6n3O3p6O0j45L7J3k6O7k1N9p4J6o4O0L3L4l9j5m5O1J5Nl2M3
12293E4p1k2k2J4N2k8r7K22j23j3K8P5o8Qj4n5N7jN4j04O2o5L2K0R3j46k7L7o5
12322a13J22p7mj5O1L7l8J13q8j4n2jQ1R7o1j46M2N1q7J51p1P1p3Q4N7r2k1K6
12350D0j25J32PM8j25O1m8r2J11r6R3o6M9l9M0J34J0j78O7j00K1J7k1K38j99J8
12376cp1R3m6M3N8K4j38J03o3L2rq6J60j57J82o3k3j34J31M1j63O9m4Q1pO0j27
12403e7J1nPK2L2k0q2K1N5O8o7j8J32o2jm1r2J40o7n2K6P2o3l6O1l7lp1O9M9o1
$$ plain form
12211 -50 -85 -97 -24 -98 93 -53 174 96 -14 -51 -7 24 -34 -72 -45 98 107 36 3 -39 -47 71 22 -8 -63 -64 -19 -67
12239 -67 78 -21 -7 97 37 -2 -36 -196 46 -102 105 64 90 -35 38 -40 -3 -40 0 119 2 -80 -2 -43 52
12264 52 25 -91 42 78 25 88 12 72 -73 -36 -23 -49 18 -3 56 -18 -2 -66 -6 27 61 22 7 -38 23 38 43 11 54
12293 54 -17 -39 -61 -47 5 -23 -120 102 -21 -34 -6 69 1 9 -5 -60 -3 -4 50 -54 8 -57 -25 -5 88 -58 -85 -48 -113
12322 -113 9 -68 -72 -87 -26 11 -27 86 -2 -16 -68 -69 12 109 48 -98 -56 -5 -92 59 -12 59 -14 70 127 35 14 40
12350 40 -85 47 54 102 -23 38 -10 -102 9 -87 6 -60 -11 -50 -10 124 134 -44 23 -77 -56 -39 -60 178 -21 -3
12376 -3 -74 19 -27 16 74 98 -40 63 0 32 23 -63 97 -60 122 59 36 -98 33 74 -89 -20 -64 17 10 70 -57
12403 -57 -46 -51 -44 -22 10 -10 -92 -71 -16 52 -15 -33 99 37 36 -5 -97 43 -24 -76 -50 22 -41 -77 -16 -53 -56 -127 -58 -9 -70
12434g0n9J14K0J8j5o2L4m9O1N9%J2j16o9%M2Q4N2o7N9m7K2J2k1jlq5Qk9QJ09
12465B1Lp8lJ09k2m1N9j34J92k58P3J58r4N3K6N9q5n7l3q4N5J55k5k2j8o4J44
12492H9j83J01j23R9l3N9J0oQ0j26o5K01oJ8j59oK0J1M3j1Mo2L0p5N8J00r7M5
12520A6j92J82P3l6k2Q0k15J46o4m0Q6P5o8J09j49J28j06L7N9q4J46r0n2o5Q9
12545D3J8o0m4O1j05J04n1O4J1j02J98j91J26j65P6p6J46j24M6J58p1q8n3K00
12569A21q5L1p0K4q2J28m2j11P6Q9j63n4J47j04L7J5N4K4j34P6m8L3K9o0R2p1
12595d8M1%L3J4j0l9k1Q5n0J8L0l9J9l5M2oK7n7o1J10n5j13J08J05n6j00LJ03
12623D8j16R4J0k6o1j1N7j10K58j83J18j23j3P7r5J68j09NO4m5J7N5r5k1L0n7
$$ plain form
12434 -70 -129 -15 5 23 8 -54 -20 -69 -8 51 51 63 -53 -122 -122 -80 4 56 -11 48 1 23 35 14 13 10 -75 -67 -96 -88 21
12465 21 24 -54 -57 52 30 -11 48 -86 106 -152 -79 79 -15 38 64 123 38 -19 -52 -136 -81 74 49 27 9 -55 89
12492 89 -94 7 -116 -17 -50 9 19 13 93 -33 -98 103 97 115 -44 -50 -30 -19 24 13 17 -45 -15 -90 -32 68 -29 16
12520 16 -176 6 79 43 21 101 -114 32 -32 -72 14 89 21 130 -19 109 3 40 99 15 161 71 19 -46 43
12545 43 61 1 -43 18 -87 17 -34 30 41 -61 137 -54 72 -93 -17 -93 53 -71 -25 133 62 -26 -79 121
12569 121 36 67 -3 21 -61 67 25 -86 -10 79 -84 -138 9 -95 -58 -43 11 35 -99 -23 -71 -38 -9 -69 23 -48
12595 -48 -7 -7 26 40 30 -9 -30 55 5 23 53 14 33 -2 40 34 61 4 -57 53 -2 -115 -7 98 42 -58 -55 48
12623 48 -68 26 36 10 -51 -62 -5 -115 143 -40 78 -45 -58 19 -76 92 -17 -12 52 7 24 79 -16 -37 -7 -64
12649f4R4kRl1m0M4nLJ18p9q7M6L7L2J5j37J5J02n6l9l5%J3J1O2p1P7N0K6j3r1
12680DL0l2Q0l9J8j35P9o4N7J8l1o9K8N9j27J34o3K8MO9o3n3P0k9O5K0j36K09
12708A31k45Q3K7k8O5j85J51M4j35N2R8j13L7K6r2K2K5L5q5O8p6M0J52o1n9j8
12734d1K0rJ3j4RqO2r6J18p2o4j0P4j50J12K16j68jno5P3J0K0j36J16PL8R7j51
12763eM5m0j16K20l7j95J10L7M6j36J15P1j45O4m9m3L2NJ04j25R3l1L6Rj51O5
12789b1J1L9K7K6j19J15K7j22N8M8k15J14J61k11n4J47R5j17m4P3j14Q0p5J17
12813D6jn8m8k9J41j51O8J35r5k7p7P4r6K30j56o5J62o4j05J25k9P6kM0j91J46
12839D9j85R3P4r8l4R6n7J23m6j5K6o3P4J7j07J7J18l5j97J78M2m0mo1Rlj8N7
$$ plain form
12649 -64 30 28 37 6 -34 10 5 8 126 47 -40 6 43 75 90 -47 -32 70 14 -25 -60 -60 -47 -36 26 -45 32 82 108 95 4
12680 4 34 2 82 43 61 -74 5 -59 -2 16 -15 -84 -56 3 -124 10 -53 -25 -21 48 -15 -68 2 -27 38 58 -78 131
12708 131 -114 -31 -4 -32 33 -152 -1 43 -92 -40 58 -55 -18 8 -84 -62 -37 -2 -87 -19 -95 -55 97 36 -23 -41
12734 -41 -21 -30 -17 -31 -22 -30 32 -64 54 -18 -82 -92 -18 -168 -56 160 -8 -9 -14 -79 -6 4 24 -112 4 11 49 146 -5
12763 -5 40 0 -116 104 67 -128 -18 19 65 -71 44 115 -30 34 -15 -58 -26 -21 83 -42 51 20 56 65 -86 -21
12789 -21 -10 29 56 82 -37 78 105 -17 41 89 -126 -12 149 -62 -116 31 126 9 -35 38 -76 4 -71 46
12813 46 45 -13 -61 -90 51 -100 -32 103 8 -19 -96 -22 -118 112 -44 -109 53 -11 -116 9 -20 56 54 94 -97 49
12839 49 -136 -43 31 -67 -101 -5 -62 61 15 0 26 -37 37 54 -53 -36 82 47 -150 28 70 30 26 -35 -26 -29 -47 10
12867A0m1K3J36r5j08K1R8j3M9r4LP1j3kQ5j54J05j04J2N1q5k9J48j64Q4l8ML0
12895a0N2j28N7Q4J0M7j45Q8k2l6QM4q9K4Oj26J04OJ5K2j2Q7j33R6j27MN9J1n5
12924e9J60j36qO6%l9J28j74O3L8oJ1L3j20p3J26q0J18j79J10r3O8j08J44kJ12
12950A00j33Kk2j2J7m3J48l0o6O9L0m2r4L9J61q3Kj04O2L5L1ML3k5r3PK8M7p9
12979a1R4m9o5O8j71J63k6N9j01m8J04j1J3j8O9j32O1j13J35l3O1l2k8N9O8j55
13005c9Jq6J50j9rr5J51j42N3L3p6J4L0jN7L7j37L8J05O4j70R1j6jk6p6J53r4
13033a0q0J36q8P6j92J62L6M4o5l0l2M6N0m6L0L0j21l2Q7o9J37q5M4j01J48q4
13059im9O5l1P7r3RQ1q7O6j05N2N3k1P2r5j19M7J35J2j6o3L3r7L5J81j25O5l9
$$ plain form
12867 10 -31 -8 128 33 -75 -54 44 31 80 -14 -11 60 47 45 130 -24 81 -23 -11 40 -45 -74 74 -90 -6 -44 -40 -10
12895 -10 42 -86 -29 55 65 112 -33 55 33 -3 5 49 -40 -16 -10 -136 -32 -26 -11 11 -1 86 -47 49 -78 -74 -15 -4 -59
12924 -59 101 -35 -43 23 23 -16 112 -62 1 39 33 44 77 -43 -116 10 -70 48 -131 -21 -114 -46 -154 -10 -12 100
12950 100 -33 -31 -53 -65 -48 -91 57 27 -39 30 60 18 -76 -37 124 41 43 -61 1 36 67 71 104 79 -14 -7 21 68 -11
12979 -11 83 34 -31 37 -134 29 3 62 -39 -87 17 6 19 1 70 -62 -1 -114 21 -12 49 17 -11 48 116 -39
13005 -39 -38 -124 26 7 -2 -97 54 -88 -35 -2 -78 -64 -34 -35 22 59 -78 -40 65 129 -41 50 34 33 7 -69 84 -10
13033 -10 -90 46 -42 34 -158 4 40 84 19 -11 -43 3 53 7 37 67 -54 -86 1 -68 69 -16 28 -73 75 -9
13059 -9 -58 7 -24 53 -40 -31 50 -37 29 -76 -24 29 8 80 -15 -134 -87 48 60 44 -19 14 -83 -48 133 8 73 34
13087C4p8L5O6q0j37K77j05Jp3O9N5q2O5M0K5j01Q5p6q6J61k21J34j9nK8M0Rl
13115E8q3K4Rm4J06k3N9p0j5L3j36mJ73j74J60m2r8J3J28k5Om8k8M4Q4n2j2n9
13143a6rn7J5JL1K4N3Qj94K01O4j54J2Ll3l7LM0J5nK7p3N1L4R8M4k52K50n0o5
13173B9jmK8r5L1j9J01j59P7k8M7P6n6K7j28K1K4Q4j41P0%N8l7O0j42pM1K00j86
13202b9o7O9l9J5PO0J08n0r0N6j60J48N3K6o1n6P7m4l0Qm1M8Kl9J6Om3J51q8R2
13232A05o9n7M6r7N6Lr1J8J16k1m3P2j05Q1J09p9n9Q2q3J13n7M4j00k8J11Jj4
13259E4L5j7j25O0Q5n2j5J5j22Q5j29J36o3L5j16O1N6J18k42N9K14j10O9n7J6
13284E0j71J49Mr9J27K7j66M9M2J0J5kL2r0K9O6j00R6p2m5Q5J1M8j76R5k5j6Q
$$ plain form
13087 34 -44 -9 57 -23 -160 117 12 13 -60 9 64 -18 47 87 112 11 96 20 -66 95 -126 8 -11 -16 12 52 61 58
13115 58 -25 -1 8 -36 70 47 106 36 21 54 -82 -86 87 -87 73 31 -67 -54 74 49 55 7 -21 23 107 55 43 -16
13143 -16 -25 -82 -67 -66 -35 -11 42 50 -144 57 121 -33 -21 -18 -51 -88 -85 -45 -30 -35 -8 -81 -30 4 102 146 -106 144 94 29
13173 29 28 24 52 -43 -12 -31 70 -89 -12 -40 7 83 27 54 -74 -53 -29 55 -86 -16 -16 42 5 65 -77 -84 -43 157 -29
13202 -29 -96 -27 -66 -51 -44 16 124 74 -16 40 -120 28 81 107 46 -10 67 23 -7 1 -40 8 10 -29 -13 -7 -50 101 13 105
13232 105 36 -21 25 -72 -16 -13 -104 -86 30 9 -34 38 -67 14 123 44 -15 67 -16 97 40 84 -16 -44 67 68 54
13259 54 89 72 -53 7 92 40 25 40 -82 3 -126 10 -53 -18 -134 -73 -17 101 -141 -82 132 22 91 34 50
13284 50 -121 28 32 -67 60 87 -79 -30 12 22 37 35 67 -23 6 72 -28 68 -4 -49 36 47 95 -81 14 -11 -27 -19
13312a9NoN7o7l1O1l5P8M5m0j56P4P5q0R3r9m9Q5m7O4p5J7J76j15j4Or4J24j2
13341B1m4Q8qj54J01l7k8O4m5r1Q9O1j6p8O4R2Jr5N3j96J88r7N5NQL1K9Q1j77
13370c5L4P9j9m1j13R7j6o1J38j43M1N9kp5J66j56P3j43J39mL0Kj22P2Q5j36J51
13397A00p6K6j33Q0P2j14L2M0o6M8o1J86n8j46J5Q5m3J08q6J1J70k31L8k2O9o8
13423b4J8l3L6k6r7J83k69K05P5j67l2K6J61j28J04o2p0P0R0r2j5L4l0K8j3J46
13449A18l1Rk1q4K0L7o1k9Q1q9k9Q4o1R5j6N3p0J88k94P3l0mQ0j43J81p8j8R8
13477E9k0j00M5k3JJ44R1j53m6k5J19qj62P8k0M7r5J3J42j09k6J3Jj8J16o2j7
13504a5J26j25Q5j65k5K21k19J82K3j14N4k3j96J67q6K14j80O8Q6l5o4JL2M8M8
$$ plain form
13312 -19 -14 -20 37 -30 -61 0 -35 43 88 48 -108 -34 41 -39 54 -45 -94 -9 -56 8 -67 -50 126 11 -3 3 -91 33 21
13341 21 -23 65 57 -97 4 -33 -61 3 -42 -133 -44 17 1 -77 -13 79 80 -15 38 -158 30 -67 -12 -7 1 32 61 142 -35
13370 -35 -1 78 59 18 -95 2 -14 -75 63 -80 -39 20 18 -57 109 -47 26 -117 22 18 48 50 -72 0 85 -51 100
13397 100 24 50 -83 -3 69 -45 -13 27 -39 9 -52 134 76 -70 -55 30 -13 95 9 20 190 -41 -3 -25 44 -24
13423 -24 -6 -39 -3 -29 -126 57 -212 -7 68 -99 -131 -105 56 -72 32 -30 -100 -30 60 -32 -47 -13 -43 -15 -28 118
13449 118 87 96 75 -9 11 48 -13 -42 39 -50 -79 5 -56 39 23 76 6 194 -100 -27 -57 -61 19 -124 57 -21 -39 59
13477 59 39 -61 -16 -39 -38 106 197 44 -2 -27 92 84 -78 0 -20 27 -68 -55 87 -22 -48 -35 -34 -52 64 2 -15
13504 -15 111 -14 71 -94 -119 102 -117 65 88 -26 28 5 -191 -24 -110 104 -76 -8 78 43 -21 -20 12 60 108
13529A08r8M4m4N2j17L9L7Lk0j4QN1om5O4j73J11k1lO0j3o7J48m3l8j16L7N3J01
13558I8p9MM3N4k6j91P8L5k4J9j2m0O9j36M1P5RJ40j37l4O6r3J08n7n0J05j01
13585c6K5l3M8m7J38j24J76j64n7L7L1l8K5L1JK5L4q8L7Kj3pO2q6l0K04j78L5
13613A0k9n5R6j08M0kO6n2k2O2J4M9L2o1q8J18j34N4J15j02j05J46r6J44J8n6
13639E4k8m5qN7q7L2k4N5p2J62o3rj16J20J5rM2m1M6j07J84j72P5j01k1K2J31
13666I2j25ML6L2M1o9l8l1k6L0L7m2M9K3n8jL2N1QQ0k4j61l3J31n1Q6j3j85J81
13695E6L0l3j34Q6O5J3j42N9P5p7O5n1QQ9j29l2NJ24n4p7J15q9O9j61J88o9n7
13722e8J67j70Q8o3J02k46J82n6P4j12J18ln6J26j10M8P8M3j77R3q2n9QJ08j18
$$ plain form
13529 108 10 54 10 62 -55 -16 21 24 4 -10 -2 49 43 -2 62 -111 0 -21 -24 36 23 -44 104 61 23 -93 -56 -3 98
13558 98 19 23 66 120 94 -97 -19 16 -8 11 -1 -41 28 -108 -67 8 17 157 20 -14 52 -41 67 10 -40 65 -36
13585 -36 -11 -44 4 -43 95 -29 147 -17 -74 -37 -6 -44 -19 12 13 38 72 -16 21 23 10 3 65 -21 -51 153 -25 10
13613 10 -19 -74 22 -86 -46 -48 18 -34 -56 6 20 69 101 40 -48 70 -64 -10 105 3 -102 44 -52 92 110 54
13639 54 26 -19 -27 30 -57 -25 -49 6 -66 96 33 24 -92 28 43 34 76 35 81 -26 158 -14 61 -40 -61 -39 92
13666 92 -33 -29 7 39 80 11 -27 -58 -84 -54 -17 -59 -10 13 -45 -46 -14 37 45 125 101 -60 -93 38 -13 73 60 -125 56
13695 56 86 53 -81 5 70 83 -59 0 75 -2 63 12 20 109 -20 -52 -47 77 23 -54 61 -28 41 -120 68 -1 -58
13722 -58 109 -61 27 -36 66 -180 2 -54 20 -92 26 23 -33 93 -17 31 109 152 -25 68 -14 -73 -65 43 -75
13747g5n2K49L0j98l5K7N2Q2j30Q3k8P0m3P9j71l0L9M3J09o5o3J5j9L9m9J09j37
13774f9N2M2j29M5K9K4K10k17L5q3J24Km5l4l4jL3N2J9k7r5K07k10N5NP2P5mj69
13803c6m7Q0l1L4Rj6p4Q8j27P9J01q5J48j1j27j8o1M0M3L7m9O0q7lp7J74Q0n4
13831G0J4k8j09J21j26P2j7Pn0J89j45j66L17q9k10K20Rj07P4j7L1j16PM5o1k1
13857h6J11J7j49P5J25k22K35j9j0Qn1M7r0l5L7N6n8n8O2o4J63j86J12o0n8J48
13883E0N4L4r0k1n4L4j17Q6J7Q7k33J46N2N8j3j42p1J37O4J0o9N9j28R6j33O9
13909a8K6j4l1j4J9j14K43j49O4p8J9kJ11j01J5q1Q3NJ53k20P6M4p4M7k2j8L2
13936Aj3j9oJ01J8q9O3j28R9R5j51n3J04n7R4oj21M9PR9j19%MJ4J7%k3k9L4M0
$$ plain form
13747 -75 -127 122 152 -46 -81 -54 -2 80 -50 33 5 75 32 111 -60 -90 -51 -8 101 36 -27 -12 -31 8 -41 68 -69
13774 -69 -17 25 -104 -59 -30 -6 204 -13 22 -61 63 65 20 -14 -48 -49 -16 36 55 28 -67 140 -70 -15 -10 62 137 133 -36
13803 -36 -83 -3 -34 0 9 -7 -81 7 -120 -41 60 -25 123 112 -15 -33 -94 -54 -11 26 -23 37 -50 -53 -130 44 124 70
13831 70 84 56 -53 68 -58 14 -3 4 -46 143 -2 -168 149 60 -150 70 79 -28 46 29 60 -56 -49 -4 -65 -86
13857 -86 25 42 -107 -32 93 -129 106 87 77 85 34 81 -9 -44 -7 49 -9 -67 -5 -69 94 -92 20 -40 -98 50
13883 50 104 138 48 27 -27 7 -110 -24 -7 80 -153 -7 45 103 90 -52 -123 14 78 88 19 78 -50 46 -87 -18
13909 -18 8 -6 -37 -51 -32 -146 97 -52 12 -66 -47 -49 62 -39 -24 -105 -22 -17 136 -84 -8 36 -38 9 -13 -31 1
13936 1 -12 -31 -37 64 82 -7 56 -72 27 122 -29 -82 22 -35 59 53 -68 -19 -12 87 -32 -32 -28 -14 3 3 -20 -49 -15 25
13966B5m9j12k7J16L9n9M1j2R4m6P0n4M8j2Q0j09k7j8N3O3k52J58j43J41M5q1
13992b8J0j36J44K0L4n3J2n6j04K08l2J8Ln6P6j4o9J6qM3m7l6L6J77j33j6k5J38
14020A22j28K8q8P2K1L5k8k1M4n9J05r1J33j84K5O7k3r2K1R0k4K0qj18P1o1N0
14047b1P0Q1j5l5o1P9Mj22QJQ3j10M0p8N6l9K3P4l8j17J19L9q3J12n9J04j89N9
14075a5k7J4N5K4RN8r2J8l6kj7R3o4o6K2J47k26J96l0K9n6l6j2J0L8k8k7J6k4
14104b9O7l9J6q2J17r3Rj6J9Q3j4q3L5M5N5j26R6j45K4Q6K9o6J33j73K03q8L2
14131I5l7l3K8j40J47j3m8J8N0J1j14J4P1j2p4l9P4k9j6LOj7nO2j19M9J23l1O0
14160H4k02K65j06l8k7r8K13j63L9J09j46mR2j4J33j77N0j08J61l7m1K1n9J06
$$ plain form
13966 25 -24 -136 -163 -47 -8 -67 -26 -38 56 10 80 26 74 62 142 33 6 -12 41 104 -148 10 -133 8 53 -28
13992 -28 -18 -154 -10 10 44 -9 3 -53 -157 51 19 37 40 -16 60 46 -23 -7 -15 28 -19 -55 -19 158 25 9 -16 122
14020 122 -6 22 -66 6 27 62 34 13 57 -2 103 12 145 -39 -14 53 30 -62 -41 49 25 45 37 -81 -10 -71 -21
14047 -21 49 130 115 80 19 98 102 -20 -12 -11 72 -38 2 -76 -20 -59 -36 38 0 -117 2 41 -42 70 11 115 -74 -15
14075 -15 -42 -28 27 51 60 118 26 44 8 6 -11 82 18 -48 -26 121 -105 91 61 90 34 -2 -14 -4 34 6 -21 -5 -29
14104 -29 38 -1 15 -67 50 -43 -34 -50 -31 52 38 -45 -10 35 90 -36 60 -85 -61 25 54 -12 121 -52 151 63 95
14131 95 58 25 53 -87 60 47 -1 17 67 78 -36 -22 49 37 -37 -76 -2 -31 -47 -44 -38 -55 -60 2 -117 -68 55 24 84
14160 84 -118 147 41 3 -24 -122 91 -72 -33 76 -70 -74 18 4 137 -40 10 -98 63 26 -15 6 -53 53
14184E3L7j00p2O7j05J38M1N4j41qK26j78p0K2J13j11nJ23o9J4q3jj8J03l0J8
14210A8Rm7L7n1Q1p2J8l4J37j64O9M9k08J92k5P9j01J10m9O8o0j3p7O2l6m8K48
14237A92j40o0o6J18L6j61J39n6l9r5Q0J30j36n4J53n1k8o6Q8o9J8N8j05J31k1
14262dk9%j6P2j13J70q2L8k7j1n3L3J33kj23P2l7lo4LK03j38K8j0j0J3K9j50L6
14291d2O2M6m4O1j60N0R1m3m7OJ1o3J9J22j1n0j31P0p0Q1j7R8j01R1K7r3R6P0
14319A29k00J0J3J33k2k8oO6q8O6j30L5J56j32n1M8N7l0k04K54o5K0r4R4j0M9
14345G0p5P7n1l6n0N3J08q7m0J73j18k9j4P5K2j19m5O9j18rK04o1k9j9l7L2k7
14372h1R8j73K07J9j19Q3K6oo2n9j02J62J11n5r7J20m1o2O9j0l1L9L8oM3j20R
$$ plain form
14184 53 90 -10 -82 -15 -120 18 59 113 -28 -36 190 12 -58 -36 77 -34 -39 84 15 29 -54 -55 -73 30 0 18
14210 18 27 -20 17 -34 47 -25 -7 -41 96 -68 1 50 -158 34 9 88 -13 97 48 116 56 43 -34 28 -8 -56 192
14237 192 52 -8 -74 44 80 -81 58 2 -37 -132 -52 78 -58 -112 41 -10 -38 -104 -16 -85 -67 -9 -114 17 -4
14262 -4 -33 -33 -49 23 -90 80 -2 36 9 -2 -55 -22 111 109 -14 58 21 18 -46 -43 160 22 50 40 30 43 72 -78 -42
14291 -42 20 66 22 83 -77 -27 64 21 -26 -20 -9 -72 -53 69 58 8 -123 -53 -123 -42 -59 39 -62 29 56 -37 59 129
14319 129 -71 -61 -48 85 63 35 29 95 7 73 -57 -22 134 2 -49 -1 56 26 -178 76 11 31 -63 31 21 70
14345 70 -5 72 21 -15 -65 -12 96 9 -31 142 24 -5 -19 56 78 -41 -86 -17 -135 -144 60 -1 -30 -49 -86 -54 -81
14372 -81 17 -156 51 70 -49 34 60 54 -8 -67 -169 -7 104 49 -48 72 31 -31 38 28 -3 36 74 68 111 -9 0
14399@N1r0n9J94o1k14J96m0M3N1j24o2J5N7n5N8J73j19j3J01o0m7P1p7L0o3R1
14426D7o8K1K5J8r4L4O2r3J50n9QM2j68J27o7J13j15K5m9n0Q2L3j2K0Q2j39Rj3
14454b9j2j1Q0oj08P2q6Q5K5j07K62j10L7j12n6M8J36q8J19q7p9j8L2o3M9J35
14480A08j00j40J29K8k1rq2M4LK8J05j72M7J26j10R1k9j04J25j23J62j05N3q2
14504b8k7K0L8R7l3j26L6P8lj23K9J10q0K9J9m3ll7J47n0P6k7j37J07m1J4J6j05
14532d7Q5j57J11oQ3r5k9K2JO2L1K0Nn9r1J42j44L3J15p8K5j4jn7Q8k2K1o3N0
14561C1R2k17P7j8J55j97P9l9P8n1P1k1q6M3oL3L5o9L3qn8m5J63Oj17lO8j00J28
14590E7Moj6j26J6J37Jj88P9n5J03M6j14N2J3j15J17K3J0p9J22l6J04r6j3j9o8
$$ plain form
14399 0 51 -39 -98 96 35 -179 17 -23 20 71 -53 -115 -100 -43 -98 -40 133 14 1 102 42 -5 66 -11 19 -44 47
14426 47 -21 0 25 43 -51 -17 45 -48 102 43 51 93 -75 52 -15 98 -17 8 -41 -91 -9 24 12 32 114 -25 -16 -29
14454 -29 -41 -52 28 22 -86 -14 -100 -15 10 -97 165 55 92 -20 -76 -28 108 20 139 52 -27 -45 -13 -76 -27 108
14480 108 8 -132 -3 25 4 -5 -87 -43 -40 -12 93 -79 -32 94 -16 75 46 -58 67 -56 106 1 54 -28
14504 -28 -55 -35 3 100 67 -59 -23 55 52 -71 -42 68 -12 17 36 -7 -10 -47 100 50 126 99 -38 69 28 42 58 -47
14532 -47 38 -119 -8 -14 69 -26 -55 -33 -32 30 61 81 86 27 -64 78 -66 -33 82 4 29 15 14 -43 45 23 44 -19 31
14561 31 123 -94 -17 -35 120 -77 2 -37 41 -10 61 40 -46 -3 -9 24 59 -10 23 15 -43 -88 75 81 -36 -39 29 -71 57
14590 57 61 55 39 -87 -71 66 67 -121 -42 -97 6 52 -62 -10 3 -112 5 28 38 -41 81 45 149 53 40 21 -47
14617d7J5M3K7l5M2j57J12m8n7K4L4q2J60NL%pM2j41P5Q2O9o0j70m8J0J29r6M6
14646c0J0j47J29P1j1j12M1J11K6j15L7m3l3J09j25J78N3j69j03J23J6N3j2k4
14670C3J60k18M4n2J57j48K1R6N8j75K8J5k6LJ27j56p3J17n3J20k01L2O9Q5k9
14695C4L0o7q3J51m6Q0k27J25n5R6K6J08j80M4R3j12J5Klo2Jn3J23M1k15J52n5
14722c7L2Q1m5J02j07j36P0J72j41N7k4k20J65o5m6J05J39j40Q1n6rj14J86p2
14746b2n7J13j27P5j8PJ42j4j22J00j18K3j23J53K8P6r0k6M6n0J14j43J2k1N8
14771A6N7j76J45M8J7j55j06J76J1j6k9R5j26R1o4LJ7K1J1q4n7J99j19J33j10
14796bm0O0l1j0Jj5J74n5j09J6M5l1J5l5Kj0l5K4L5M4r9R5r2o3J36j1j06N1j8
$$ plain form
14617 -47 -32 11 38 3 45 -112 0 -48 -105 -81 -47 -129 31 36 39 39 32 74 -67 8 90 159 99 -71 -119 -109 20 -76 -30
14646 -30 -20 -167 -38 33 22 -90 -49 62 88 -27 10 -33 -66 43 -82 96 149 -20 -123 0 16 69 57 33
14670 33 193 -25 19 -33 124 -24 -3 93 151 -24 4 19 -7 -4 123 -33 -106 11 -42 78 -123 -91 -22 63 34
14695 34 64 -3 -86 65 19 99 -128 -3 -58 38 64 172 -8 36 129 17 32 34 31 -31 -30 -83 40 81 -134 18 -37
14722 -37 -5 76 31 133 26 -110 -40 132 -9 48 24 -196 -31 -96 -142 -37 102 -38 43 -13 -22 -136 50 -22
14746 -22 -79 34 -93 -18 -36 -29 113 99 -23 77 -41 -18 -141 12 40 116 26 0 46 -4 110 -33 -21 -42 16
14771 16 73 -103 42 90 107 -48 -154 22 33 17 -12 83 -43 48 -16 -13 4 25 36 -48 -105 94 -25 108 -2
14796 -2 -42 18 -13 -23 -22 -37 137 82 -27 -11 34 3 18 -17 -15 -25 -60 -36 -1 43 -56 39 -53 -116 20 9 -97 -46 -64
14825f4O0j31J46p6Q7l3L3o1o8J12l0J14r5L3Lp5L2nP7n6J1n9J43r9J46j49l8
14852d2R9O3l7l0K9j6k91K31J14q5N2j47O3J0l5J7n9K4N0P8o9j65P2P8q4j1J06
14879A5J1o6m3L8o1R9QJQo2J30j17N9P3r3Kn7Q2j9j04J53q1J3J04k9j36K01j68
14907c9P3O8r8O6m6K4J4q5j4K9l3M5k6M0Pl3j6J33o1n9J06q1qrQ8q8o5Q1p7n5
14937a19J21p9J98j73%J0l1r3K02J3P4l0j45m2J9J77j78RM9L3L0Lo7J6M3j70J61
14964C1jq0J5k8Q6o4J39j73N4mL0m4Q9N9j13Nk5O7q4m1m6J50l5m9P7M9q4N4k53
14993b19K08nL1K6oR4j65R6p1Q7j3q6J50p7J6o3l7m5K9J84j19Rm6n3N1J0Q7j30
15021e7L4K7o8K9O6m1m9j8O9N6j35n3J03l2J05%n8o4J23J4J23k61J07k8O6rj17
$$ plain form
14825 -64 -4 -135 11 -65 22 -11 22 -39 -107 5 -25 89 -6 27 30 -45 -13 -18 59 3 14 -45 98 -1 145 -4 -42
14852 -42 57 120 83 53 82 66 -225 6 120 35 87 -60 3 13 -22 -5 -64 -40 10 88 19 -146 -74 4 -80 -91 15
14879 15 26 -40 -83 -45 -106 -7 1 2 10 -52 78 -39 20 93 0 2 -55 27 8 -96 57 -24 -11 93 64 -72 129 -39
14907 -39 34 102 4 70 24 48 62 -23 -37 -8 -41 4 -22 18 25 -8 -24 109 48 -11 95 14 6 -3 85 -3 -68 13 -64 -119
14937 -119 2 -77 121 -52 -52 -42 -73 -166 36 49 123 93 -52 -94 -75 102 -76 -67 -18 15 45 48 -19 -3 40 -130 31
14964 31 30 -50 -35 -63 23 -41 98 -75 -21 -25 5 -39 50 109 -4 1 -24 43 -41 -82 -128 22 -13 -62 15 64 -20 34 -219
14993 -219 -11 -16 15 41 35 129 -36 60 -11 76 63 -23 127 50 66 3 -34 -79 -50 134 15 24 -22 -75 -24 -14 73 -57
15021 -57 -23 4 -64 -35 31 -10 -59 -77 -8 48 -87 -140 -37 -69 36 36 -22 -86 37 51 174 -87 20 -8 58 49 -68
15048f8Q1l2NP7p2M1n7kP6P8n0q7M0j25P0kMm6J78n7j15J31K8j59M3P8p4qj7Q2
15078D1j02N8J5Kj51J42J07j27M2M2r7l2J24j8K4pr0j9n5O4K23k20l5J3O9m1q7
15105a15K00P9lk33N2O9K7o1jm2L4k0j10J58j46J49k8M4j5P5q3p4K8L4Jll5PL
15134il3J03m4p3J23k9j23J18o8j8j4M8P4J4p1l9Q5Pq6L8M3j37N2n9K06q8k8K8
15162B0p9Q8L5j9n4j10J19j1p2O8K5j9N3m5k9J24j02J7P7K0n0l7j17J16L0K7j35
15189f0pK06k01K8o0K8L8N6L8onm9l2M5l0nJ9M6r8O3Nm1M3l0P8lq3M5n1O4M8j90
15221a01N6j6J39k15P8O1n8l1J90j29J21o6O0j25M1L4Q3j25n4J27p5M0q0J15q2
15246a2l3ok1j0O5J34q8L9p5L3r3J5L9j03O3O5O1p2n9m7J41q0N7k3N6j2J5M2o0
$$ plain form
15048 -68 13 -19 -14 63 -9 32 -25 -27 49 127 77 -10 30 -95 -25 -27 -23 -69 109 52 -63 68 96 -63 -20 58 -16 -24 -41 41
15078 41 -61 -3 12 14 -137 5 112 -15 27 69 -28 -60 64 46 70 63 -27 -46 -101 -37 186 -34 -69 -56 13 -28 -115
15105 -115 85 164 161 -72 -20 49 76 15 14 -28 6 -14 -124 34 -112 37 9 53 38 113 30 -44 -16 18 19 16 -19 -12 -9
15134 -9 -42 61 17 -56 67 38 -85 33 -35 -53 -67 -19 55 69 -2 -41 44 51 -35 3 46 -91 -39 -98 108 20 -8 20
15162 20 -59 29 64 45 -9 -119 0 -11 -83 -15 10 -9 44 -1 -30 94 -8 9 86 106 56 19 -98 18 48 75 -60
15189 -60 -67 139 -62 -34 -94 -66 -28 28 66 60 55 6 -26 19 -11 -16 3 49 -49 14 19 -22 21 -9 69 66 -17 28 -23 41 89 -101
15221 -101 -45 -61 78 -137 -59 2 -56 -87 103 -26 95 29 89 -36 5 39 122 -3 -57 70 -5 35 -45 70 -12
15246 -12 -45 -51 -72 -82 -17 117 29 68 -7 26 -67 -52 -13 -116 -53 12 73 1 -58 -105 36 -44 13 -10 46 34 49 91 31
15275C1j9o8p9J09J8o6j1J8qRQ7L4j42k2mJ71p0j5J7J02m7j54K08j14N6l5R5j62
15303f1Mn6J71q4n0J51j31J56m9j4k22J33R0r4Q1j8Qn1m3R0m1R5j53J44K7P6j48
15330A1m8L8n7O2j0J15l4l4q0K5m8J27O3j82N5j19J68j86P8O7l6j39J60N5j11
15355f0l1Q4P2r3j1M2N0q9Q8m3l5P0k2Rr0K7N4j6k5j7R8k8jp0J8r4JJ17P2r8j25
15386a46J27N2L4k5p2N7n2N5q2J61k5j38N0n1N0Jj07J86o8N4k1o9L0K0n9K9km
15414a5m4L4P3m4MQR5j17J02j28K2K6j7l4o5J8J20R7j43n3K0O4l0k8O2o3OJ8O3
15443E1J0Mn8q6R4J49j01l4j5n0N4L4k8m4J40k36J14q7L0O2nq1Q0Q6o2j26J23
15470A8j05JJ94j31K2M0j6n7J8J10J7k09M1Q5k3J79j83O8j14k8P0j60K02j2j10
$$ plain form
15275 31 12 -56 -135 -26 -8 -74 -85 -67 -75 -66 21 55 -87 -109 -113 58 -12 -27 -10 92 45 -109 99 -15 41 6 101 -61
15303 -61 -57 -113 58 -26 -76 75 -56 100 51 37 -185 -52 38 -56 25 7 15 -36 -79 11 -30 65 -88 56 83 159 11
15330 11 -37 1 -56 6 -4 111 77 43 -37 -12 -60 67 130 -52 3 -116 52 -134 -56 11 -25 -164 -4 51 -60
15355 -60 -91 -7 65 -28 -39 3 53 -36 52 9 -26 44 22 31 -59 -32 22 6 -19 -36 62 34 33 -37 -19 -113 -112 5 77 -21 -146
15386 -146 -19 33 67 42 -30 27 -25 30 -52 109 84 -54 -4 -55 -5 -4 -111 75 7 61 40 -29 1 21 -38 -9 -11 -15
15414 -15 -59 -25 48 4 8 16 111 -6 96 -32 -10 16 -1 -35 -100 -82 38 135 -8 -61 -41 23 -7 -35 27 -36 -30 -12 51
15443 51 61 65 7 -79 15 164 63 29 14 -36 18 52 24 -20 120 -116 -2 -89 -59 3 -2 -83 -3 83 21 -105 18
15470 18 -87 -86 108 -23 -1 39 23 -34 -16 94 111 -98 -57 28 5 184 1 69 -45 -73 -3 -163 39 27 -83
15495h3J33mr5LQ7L9j06M1k9j4J04j12Q3j05J6L2Lqj59J55J7j5Q2j63N6j03J03
15522d2N6J5j4q2K8M3J68j70n0l3Q7N8j57O8N5j19J06J28k6n6o0J5m8nR1q4J56
15549A28j51k7J75k47J01m4K0k9J10j4Rj08J58J0j17J22l3p4k9j4Q0j11R5J8O
15574C4j21J34K2n8J9p3L0j0n9J40o3J12p3o3N7nr3K7P3j61K87k33R6ln1j5j6
15601f6K1J63k34R1M1J1n5n8J32o9r0P5J15j4n9nQ8J0j64N3P6p2j11J77j8o3o1
15628h6K1O1Q4r7j3J18j66L2K5K0p6J22p3n5J13K2r8J6j1J29k04J92j25J12j44
15653h1qkJ41K7q7P8q0l1M6j03J20N6j13R4j54J32Qk8M3j56L5J53J5n5j33J33
15679E0r4k1lJ37o2l0J36j59N1l4L0k3L5j01o1J16RJ54p0o2L2O5J6j13j0O3j9
$$ plain form
15495 -83 50 46 -49 -46 41 80 -26 15 -14 -28 76 -36 47 -58 -42 -10 -7 -15 -174 -19 -2 -17 65 -98 -42 -145 -42
15522 -42 14 29 15 -67 -39 4 172 2 -48 -81 6 64 -93 -25 30 -89 17 145 119 63 3 18 -30 -35 56 -28 128
15549 128 -23 -50 125 -122 -21 -65 -45 -74 36 22 31 -77 81 91 -26 96 63 -11 -40 -54 26 -85 10 28 34
15574 34 -87 47 69 11 30 -43 -13 -23 -82 58 -5 107 34 -29 28 23 -70 -43 30 -131 156 -77 19 16 -35 -50 -66
15601 -66 -45 118 -116 -25 16 27 -28 -86 46 -23 -113 -38 77 63 4 -1 87 97 -67 -14 62 -10 -121 56 38 -25 -86
15628 -86 -65 -4 80 -17 -30 88 -78 -46 -21 -1 -77 45 -28 -83 30 52 -46 -30 -41 88 -116 76 -49 63 -81
15653 -81 -89 -91 50 77 -10 68 -12 -43 3 -100 20 76 -37 57 -97 35 43 15 58 -98 -63 90 105 50 -83 50
15679 50 -44 -65 -68 69 7 -23 113 -46 5 -29 1 -22 13 -88 -149 -33 -24 130 60 -2 30 95 111 -2 -12 51 32
15706C2NL1J1q6k1M1J1r4K25j33o8J13Q6j32m9J4%J24j1q4P6m8j48Q2R3k9Lm9
15734eL3q7J7J88k55j4J00Q7j09JRM8q3O4N3j62O5R5n8l8J07k7q8J2MR9k0o7O3
15763C2j24J63r0R5j3m8N2l5j09J13r6J5O8k5m9o1J84j32Q1L8Ml2M6k15J64P6
15789A02j38J84j62q9R8J2j24J72Kj74l0J66L2j08k9J26k7J5%rk8Nq2O1J02qk25
15816a56J15L9Q2p9J09j21J2j6L5n6J5p5RJ09P4j89pJ05n1J43r7j11lJ67kj23
15842g2O4l0j16J45l2m1J23k06K44j84J61l4Rj82J10K6m3J45r3k2J13q5Q8j35
15866d7M1L2q3n1R8K2l2O7j33J91K1j45J39j84Q8J4q6L0n6N6O1q2M4Q1j69J08
15892B5o4M1m0J23k53N1J06J1k7m0K7NQ5r2nJ28j38J11M9m6n2p2N6k6O5m2J2m4
$$ plain form
15706 32 37 68 79 -7 -28 13 24 -70 155 22 -46 67 153 21 -28 -14 -14 110 99 15 91 43 -105 -23 70 41 44 -5
15734 -5 28 -59 -42 146 -109 -123 -23 64 -45 -44 -35 13 -70 -6 47 -115 -50 45 -13 -51 56 29 -59 -47 -43 56 36 -31 32
15763 32 -92 71 -19 76 63 15 67 32 -77 36 -60 -45 23 -2 -51 -112 72 -60 21 59 63 31 77 -138 26 102
15789 102 -36 148 -14 -103 -5 7 -117 55 57 -117 -147 19 51 -57 -86 40 13 28 28 19 -9 -4 -86 -25 77 69 -156
15816 -156 -41 -2 80 1 110 -11 1 -15 20 -36 -21 -96 -87 22 96 -93 -100 5 -46 97 0 -111 -114 53 51 -72
15842 -72 -8 -38 -154 -9 -41 -82 41 -165 79 -105 56 22 31 -151 -41 -15 -58 87 -6 -28 85 0 88 -47
15866 -47 -6 26 -57 -108 -10 12 -20 47 -86 105 126 -19 120 -64 24 38 -48 -18 -74 -18 43 -39 5 86 -83 25
15892 25 -39 2 -38 85 -168 -117 -11 0 -27 -67 -40 -35 50 -42 -47 81 -57 54 103 57 5 -67 -11 -37 28 -14 -2 -46
15920d6Q9L5o2Ro1j31J15Mo4J46R1j19J5n3NpN0r2P3J15q8j05P5j34O9J7P5KQ6
15949A09p0j25Q7L3j6N4J0q1P7n5K4j0r9M2J63j18P0o9P8q6j08J68o6j85Q1Q8
15975dP7%K7k12R4J11j05m7O8omJ00n2m7j8M4k5J19k11P5M7n3K8l0J36p3j36J37
16003D0l6Q5j7j08Q9p4j36M8J21m1O4o1Jj7O6L5k09J72j7L7o1j6q7J18Q4q3qp2
16031h3q2J78p2M9r2J15N7r5P7j04n4N1J20n6j3O2r4j19J55K2j48R9O1K6p2m9
16057f1P5O9j59j5K41j29J20k21J49j00j1P0J26k52k6ON6J71j40J59j00m5RR0
16081H2j57pK3P1l8M3k9J5k2K8m1M7o3J50m7l8N5q5J08j19O1kn1k5n6J90m6j64
16109a17J31M1j35J55K7m8j34R7q8Q7j2l2m4J7P9p1J02k5l0j45J28po9n1P1Rj2
$$ plain form
15920 -46 43 78 16 25 -36 -167 -52 -48 -112 34 125 6 21 -32 -27 -34 16 -76 -3 112 24 -81 -6 -140 -71 -54 21 23 109
15949 109 39 -86 1 34 18 72 82 1 78 23 47 37 -62 -20 143 25 95 26 104 18 -90 78 12 -173 -92 -4
15975 -4 73 73 100 -112 -18 93 -12 -59 9 3 -1 99 47 0 -18 26 1 120 -91 -16 31 -22 6 -24 112 39 -97 40
16003 40 4 89 72 -36 53 -21 -157 -109 12 -29 35 -26 -25 -42 24 59 -150 22 5 42 -19 -35 -122 -4 80 -3 -11 -83
16031 -83 -165 13 -59 -10 -102 13 70 -25 52 -52 -106 -55 65 9 -4 58 -36 -155 0 22 -126 -27 34 60 -12 -61
16057 -61 14 83 -76 -91 150 21 141 -80 69 -31 -42 28 154 -98 -124 -118 -62 109 -31 128 28 -17 -8 82
16081 82 -75 -82 -59 12 -26 17 -12 3 -19 9 -32 15 -48 102 55 17 72 -13 95 -24 37 35 -16 -41 -97 93 47 -117
16109 -117 14 55 -80 75 102 54 -80 17 -71 16 4 -28 -72 -55 24 -47 55 30 0 -145 -17 -24 -93 -144 -73 -64 -76
16136g6O7j9m1N2j9J9Q5j00m6L6K4J04qq0J08k4r1M9q2J66j35Q4j03M8J31k16
16162f7J07j9q9Q1Q7k7q5J9k4k3Q0o6nk5m8L0J22r2K1Q2Rj18J02q7QN4p2J4J8
16191a3Qj9lL7l2PJ18N4k26R2J8j14L6q7J02O2Jl5j56J09pJ60k00O7M1M6j50P5
16219iq3k0J60o9l0NLk0L0k0J23j25J22j50N2J1N3p2M1m7lL4L4P1j55K5l1JO9
16248@j7l0J3K4k9O4M0q6J28j72N2J05j31J22j20J52k00J12K1j0m2o0N2M0p1M1
16274bnl9P2l1p3M3%M9p6j9O9k1K0m1Ro0R2m6k7J33n7rj9R2o8P9J5m0qj9J3k36
16306b10K58j78J14O0P1j43N9Rn0n1Q9J28j95J20oj78R3K1o5R4k7L2j00nJ46j93
16332a07R8m2O7Qm2L4o5K4l5O0k7J50q4K6l5k9j9NJ7L5l6J6o3l5J46k3o5R0p2
$$ plain form
16136 -76 -9 -28 -69 -17 -36 -17 68 -32 -78 -42 -18 86 78 -2 106 82 -9 40 -42 124 -11 73 -30 18 149 -67
16162 -67 40 21 -68 13 100 73 -12 7 -17 -40 40 -26 -31 -56 -104 -74 48 -44 -23 59 68 -50 52 -35 -27 27 -45 -31 -13
16191 -13 -5 -24 -27 10 -22 -15 103 157 -69 23 41 -73 -37 -124 -22 40 41 6 -150 -41 -48 112 -88 -21 20 66 -84 -9
16219 -9 -92 -112 48 -21 -51 -46 -43 -63 -33 -53 70 -55 67 -83 -31 -20 33 -39 2 -45 -48 -14 20 91 -64 -39 -70 -69 0
16248 0 -17 -47 -34 -10 -39 25 65 -21 107 -65 -13 92 -39 83 -37 115 -85 27 48 38 -4 -64 -12 28 -43 -2
16274 -2 -7 -46 26 -5 -78 -35 -35 14 -62 -81 -12 -33 -13 -54 -45 -105 -13 -59 -86 47 -10 -19 -38 54 -14 65 80 40 32 13 26 -210
16306 -210 48 -130 -16 44 115 -28 31 40 -10 -61 28 156 -39 81 75 -103 -10 11 -54 40 13 45 -55 -60 86 -107
16332 -107 -9 -51 16 24 -18 16 -49 -25 -60 0 -27 123 39 65 30 1 -18 -13 4 39 3 19 -44 -79 67 44 -21 69 -3
16361cm3R7p5k5k2J87p6p8J26n4J4j08J16j15n2K31r6q8K3Q5L2n8
$$ plain form
16361 -3 -46 51 -24 -49 -71 116 40 -38 88 34 48 -60 56 -59 -111 120 24 -64 -41 44 76 18
16383A8
$$ Imaginary data points
##PAGE= N=2
##DATA TABLE= (X++(I..I)), XYDATA
0@%%%%%%l2O4l2L2o4P5j07J60k02K34l20M16m80N76p04Q64j024J184j408J662
26H94j918K211k563K945l364L844m373M957n611O323p104P967q918R963j1094
41e841J2337j3704J5185j6795J8565k0498K2606k4924K7464l0248L3323l6730
53a9260M0514m4744M9499n4893O1067o8205P6586q6582R8739j13918J33494j59832
65h7535J97391k55673L59211n98265K144322O51423m583726q86615K295837K884202
75B120572m76699k097304j145654J099770J129630J65282m40294N0585k57587
84A48301r22795p68209R37995J844344O52774j528907j717758J51949J690542
93D88236Q29498r34155j333730o0760Q97926O47868k4351p6978o238m13260q17148
$$ plain form
0 0 0 0 0 0 0 0 -32 32 0 32 -32 43 -64 96 -106 128 -192 224 -256 320 -384 480 -544 640 -768 894
26 894 -1024 1187 -1376 1569 -1795 2049 -2324 2633 -2978 3345 -3759 4208 -4710 5253 -5841
41 -5841 6496 -7208 7977 -8818 9747 -10751 11855 -13069 14395 -15853 17470 -19260
53 -19260 21254 -23490 26009 -28884 32183 -36022 40564 -46018 52721 -61197 72297 -87535
65 -87535 109856 -145817 213394 -384871 1759451 2410874 -2172852 -3059467 -763630 2120572
75 2120572 1643873 -453431 -1599085 -499315 630315 795597 355303 405888 148301
84 148301 -774494 -1542703 -604708 1239636 1892410 363503 -1354255 -1202306 488236
93 488236 1317734 383579 -950151 -1010911 -112985 534883 510532 433554 427316 14056 -803092
104h03092j83761R48060J029695k61552j173471m40027R12939R65096k98430j118402
114d22945m78216N37613N67607p4489j54882L37035L04443m57727p64375J5003
124e90933Q02916L78803o64784o96835M57652J089689J46781j052032p29793O07521
134b51015Q95058l27344j144120j37916J356678J086306p56019j637265l05099
143a220736J354081J027549p28745j391858r8064J282116R14453n18052j021151
152d00407j68262N62556K02125l98786j71707M54831L95610k78081m80785J23157
162a59749N50430L2194p09578n00126M53885Q09268R6431o06621l29641L88057
172B4550M03452k91456o04502l2800N73481L33238l09883l30420K43126M21965
$$ plain form
104 -803092 -986853 -38793 990902 729350 -444121 -884148 28791 993887 695457 -422945
114 -422945 -901161 -363548 204059 129570 -25312 311723 616166 158439 -605936 -590933
124 -590933 211983 590786 -73998 -770833 -313181 776508 923289 -128743 -858536 -251015
134 -251015 644043 316699 -827421 -965337 391341 1477647 721628 -915637 -1220736
143 -1220736 133345 1160894 432149 -959709 -1057773 224343 1138796 620744 -400407
152 -400407 -568669 -6113 196012 -202774 -374481 80350 475960 197879 -282906 -159749
162 -159749 390681 422875 -286703 -786829 -332944 476324 572755 -33866 -363507 24550
172 24550 428002 136546 -467956 -500756 72725 405963 96080 -234340 8786 430751
182D30751j38314n96170k39946M22533M38101j57801m12529O4122M98347J74187
192D83281m45553m60067R8357L90038P9114k34786k7743L18134J56693l23139
202C4329l44352J72785L96642r5744n58773j77965O21407O92681j71996q45428
212b76414m06784N25881O53152j48467o91665k29250N36789N57987j00608m96396
222g5775j99599K08632J28572j73753j14230K18099K50131q8831k53294J5194
232h4854K66098N1560l49025l07804J88369M54992J15599l16492k17633K02451
242C261K60641j41773l88929r1700L32502K80495j35308k63059P5978L11590L2721
253B76419l61330k81582J63008L48500N4038k49309j17451K16740K19643j20963
$$ plain form
182 430751 292437 -303733 -543679 -121146 316955 159154 -253375 -189253 309094 483281
192 483281 37728 -422339 -323982 66056 145170 -89616 -117359 200775 357468 34329
202 34329 -310023 -137238 259404 163660 -395113 -573078 48329 741010 569014 -276414
212 -276414 -683198 -157317 495835 347368 -344297 -573547 -36758 521229 420621 -75775
222 -75775 -275374 -66742 61830 -111923 -226153 -8054 242077 153246 -100048 -84854
232 -84854 181244 232804 -116221 -424025 -235656 219336 334935 18443 -199190 3261
242 3261 263902 122129 -266800 -358500 -25998 254497 119189 -143870 -67892 243698 276419
253 276419 -84911 -366493 -203485 145015 199053 -50256 -167707 49033 268676 147713
263A47713k99214q6902J62902J18059n2476k9830J31835J17366j17161k25544
273a33252j3302K05884P0618k25345j95615J77025L75599R5981l07980l07973
283b58360O6893K78318N6512k22906j29930J75939K32766j5262j89272p5611R2594
294A1681L4993j40325j12344J27104K30592L6221j71775j09153Q5480J01080p1081
305B2473j54915j3134J50317J04711n4653o5118O6300P3053j06593k00597k9204
316b07360J98610J70831p5311j89633j836K11936J20013j66369k49203k7036J88934
327b6424J44724l9061r4825R361P3170r581r3869m0568M7286J9158n3212p296
339g1137J16844J24007l5616j70627j03381P6580J20384j9291j14385j4045J27807
$$ plain form
263 147713 -151501 -238403 -75501 42558 -9918 -39748 92087 209453 92292 -133252
273 -133252 -146554 59330 129948 -95397 -291012 -113987 261612 357593 49613 -258360
283 -258360 -191467 86851 143363 -79543 -209473 -33534 199232 183970 -5302 -80913 11681
294 11681 46674 -93651 -205995 -78891 151701 187922 16147 -93006 -7526 93554 22473
305 22473 -132442 -145576 4741 109452 54799 -10319 55981 129034 22441 -178156 -207360
316 -207360 -8750 162081 86770 -102863 -104699 107237 227250 60881 -188322 -215358 -26424
327 -26424 118300 79239 -15586 -6225 66945 57364 -36505 -77073 -29787 -10629 -63841 -71137
339 -71137 45707 169714 134098 -36529 -139910 -63330 57054 37763 -76622 -90667 37140
350C7140J01145n0749j19941l7529N2026J6487o5129k7065J00638J20508j5734
361A11797j18981n5916N9278N3987n4431r7549K821J14674Q6469l0228o9119j1345
373h543J7024k7155n1561K789O7851N4541j6819l9148J9500N1680k0977j02456
385e3274o4146N1374R5282K6703m7647k7610M5091M7136m1397r3622k9519N9466
397c2163N8527r68j9195J6166L3427r812o1323m6178J6756L6193k884j6459K6950
410i63N5414J7187m3499n7119j7546K0741J4050o478J0113M1307K4159k7888m2232
423a2754o027K0727k225m2441l2620L8695Q9689M6424m3844p5291k9909K1594
435b7982L0401N734j6396j2371Q860K5099K8866J5391k7343p0725n3900K3645
$$ plain form
350 37140 138285 87536 -32405 -69934 -17908 -1421 -66550 -93615 7023 127531 111797
361 111797 -7184 -63100 -3822 50165 -4266 -101815 -98994 15680 102149 71921 2802 -8543
373 -8543 8481 -18674 -70235 -67446 405 54946 38127 -1021 18479 70159 49182 -53274
385 -53274 -117420 -66046 29236 55939 8292 -19318 25773 72909 31512 -62110 -91629 -32163
397 -32163 26364 25396 6201 22367 55794 45982 -15341 -61519 -44763 -8570 -11454 -27913 -963
410 -963 54451 71638 28139 -28980 -46526 -25785 -11735 -18213 -8100 33207 57366 29478 -12754
423 -12754 -18781 1946 -279 -42720 -75340 -36645 53044 99468 55624 -19667 -49576 -27982
435 -27982 2419 8153 -8243 -20614 -11754 13345 42211 57602 30259 -40466 -94366 -70721
447g0721P9063N5016j2899m9584k2727K7402L2597j4561m7934k8560J0497L1696
459a0715L3264K2878J426k4370m2311l4819P508M5467K9712j8091k8059J1923
471f187M3349K2070l1565n8801k8178K3657L4894Q632k800J1403J5194o431k9997
484d760k9817r54K7835K1159q818j4550J2752L0785J3136k4240m6730k9508J2346
497d1364L4000J9961L765K653m20j1767j5402n542Q559J0715r318k5245M16N0732
511B1743N5120r967q0451p5022J1720R0714O3283m5578r5670j4236R6903R4735
523A13294k5114j24680q6570M7701J19220M9642o0940p6825j018N7938L6640k4993
535B4295m9497j9018J2208J1550J4652M3432M2465k7282r4295o0834N4937J19186
$$ plain form
447 -70721 8342 63358 50459 875 -21852 5550 38147 23586 -24348 -52908 -42411 -10715
459 -10715 22549 45427 46853 22483 -19828 -54647 -47139 -1672 28040 9949 -18110 -6187
471 -6187 37162 59232 27667 -31134 -59312 -35655 -761 7871 5071 16474 31668 25237 -4760
484 -4760 -34577 -35531 -7696 13463 4645 -9905 2847 33632 46768 22528 -24202 -53710 -41364
497 -41364 -7364 12597 16362 19015 18595 6828 -8574 -14116 -5557 5158 -4160 -29405 -28989 21743
511 21743 76863 66896 -13555 -88577 -76857 13857 77140 31562 -64108 -78344 18559 113294
523 113294 88180 -36500 -123070 -75369 43851 93493 32553 -44272 -45290 12648 49288 24295
535 24295 -25202 -44220 -32012 -20462 -5810 37622 80087 52805 -41490 -102324 -47387 71799
547G1799L6604j07898j27613K3602J63109J09182p8896j79941q1279R9341J56367
558H4377L8513r8574r7425J1516Q0410M6729k3678n0723k8152l860K793K1659
570a6415N7510M8432l5644j06614o3332O1261J24269M3633r6237j25276N747J41317
582C8651J09096n5453j54205p4437P9675J23719J4323r5481n9241O0937Q6013
593G3597j8937j01649m2346P9881R5793k5815j20746m6111J07213J28236k1468
604A07648j50084r8307O2611J32752L9884p9848p2171K6512O1051k921m5547J483
616a6937N1380O726q0119o6387O8970J53879M3365j50712j78804Q889J88776J45366
628A74392o5316j90943q8024J11540J70147L7760j13021j24975k1252P1648P9128
$$ plain form
547 71799 108403 505 -127108 -103506 59603 168785 89889 -90052 -171331 -71990 84377
558 84377 122890 24316 -73109 -61593 18817 65546 41868 -8855 -37007 -40867 -38074 -16415
570 -16415 41095 89527 53883 -52731 -116063 -54802 69467 113100 16863 -108413 -102666 38651
582 38651 147747 92294 -61911 -136348 -56673 67046 81369 -14112 -73353 -12416 73597
593 73597 54660 -46989 -89335 -9454 86339 60524 -60222 -106333 880 129116 107648
604 107648 -42436 -140743 -78132 54620 94504 14656 -57515 -31003 30048 27127 -18420 -16937
616 -16937 34443 41169 -38950 -105337 -36367 117512 160877 10165 -168639 -159750 29026 174392
628 174392 109076 -81867 -169891 -58351 111796 149556 36535 -88440 -109692 -38044 41084
639D1084K8087j8774m0574m8715l1278K8666Q2570N2302n2130j16761n4529Q5743
651d4309J52688N4180j16782j66193l2917J32379J44635l075j39436j07635M8455
662g8010J35817N3848q0995j01078l497P2977M2369l0055l4066K8757M8250k1056
674C3261p7883k7465O7178P4386j9601r0931m2673O5701R0604k333q5166n2472
686f7394L5043N5358N28l4742n06M2342J5338n2163n5307K5131P8223K3215o8167
699c101p4187J4132Q9576O1928l4697q6007m1410L4476N8795K7741j3389l4454
711e97k7953j092K6043L3656J0994l1131n4186k2149M1722O8621K8099l8802o8220
724c4995l2978L6146O9748K9926m2206p0958k5106N1992Q0253J8809p0335q2815
$$ plain form
639 41084 69171 50397 9823 -38892 -70170 -41504 41066 93368 41238 -75523 -130052 -44309
651 -44309 108379 162559 45777 -120416 -153333 -20954 123681 120606 -18830 -126465 -78010
662 -78010 57807 111655 30660 -70418 -73915 -938 41431 11376 -22690 6067 54317 33261
674 33261 -44622 -72087 -4909 69477 49876 -41055 -83728 -18027 72577 70244 -14922 -67394
686 -67394 -32351 23007 23535 -11207 -11713 30629 45967 -6196 -61503 -36372 41851 65066 -3101
699 -3101 -77288 -63156 26420 88348 53651 -32356 -73766 -39290 19505 47246 33857 -597
711 -597 -28550 -29642 -3599 30057 41051 9920 -44266 -66415 -24693 43928 72027 33225 -34995
724 -34995 -67973 -31827 37921 67847 25641 -45317 -70423 -18431 61822 80631 10296 -72519
736g2519l565P2133O1371j1483n7324l0248K6671L9511K637k3674j2756K010k794
749a0030n736J0991K7255J3207k6079m3785q511L9680L6819j1770l8420j2938
761b9317K5565L0664J149k4141j8111J463N012p55P523J6354K179k0249j8315
774b0979P310K4087R301k0527k4065P096L0368J4959j3572j8391l913N636J728
787i62m789j716P982O938o019q605N170J1105j270j3159q347N387J3165P821l441
802I260n571j363l753p983J162J1443K945j2814r674J0617K2514P448k0662k6658
816b3089K148K7864J5353j4096j9884P8J7132J1646p749j8432p583O713P856L384
830A341L986K447n294o843J574Q119L881p931j3705m97J7734J4028q611j8142
$$ plain form
736 -72519 -76084 -3951 57420 45937 -11387 -41635 -14964 24547 27184 3510 -9246 -7236 -10030
749 -10030 -15766 -4775 22480 35687 9608 -34177 -42688 -3008 33811 22041 -16379 -29317
761 -29317 -3752 26912 28061 3920 -14191 -12728 -7716 -8471 -948 15406 17585 -2664 -20979
774 -20979 -13669 10418 19719 -808 -24873 -17777 12591 27550 13978 -4413 -8326 -2690 -962
787 -962 -5751 -7467 515 7453 1434 -7171 -2001 9104 7834 -5325 -13672 -8285 4880 12701 9260
802 9260 3689 2326 -1427 -9410 -8248 3195 6140 -6674 -16348 -5731 16783 24231 3569 -23089
816 -23089 -20941 6923 22276 8180 -11704 -11626 5506 17152 9403 -9029 -16612 -9899 -2043 1341
830 1341 5327 7774 2480 -4363 -2789 5330 9211 1280 -12425 -12922 4812 18840 10229 -7913
844g913m267R549O021n480p494L418J2644M659q984o168P300O538p264j2422k414
859a2277J0181J2252L70j1114p561L977M836j499k233P92P69O73L182M527L529
874A0404k728j1471r207N794J2226J615q292m396M313N742k55o104l042M350K884
889A833m649j354R938Q953m991j4254q043N644J1763K838j0632q870N470J1736
903E382L823m366o735n031L56N311N891M177o39q542q538M783J2536N84j4583
918e591j1960N116J7732J1333q090j6573k842J2422Q010m810q276k360M033O354
932D498K476k816l988m132n121K17R281P193m650q592l38R628R046l145j4235
947d678q575Q062J2329R93o966l505P09K98j407m27K953K960m443p217M674J5281
$$ plain form
844 -7913 -12180 -2631 3390 -2090 -9584 -6166 6478 11137 2153 -4015 3285 9823 2559 -9863 -12277
859 -12277 -2096 10156 10526 -588 -8149 -4172 664 -835 -3068 -2276 -1507 -834 2348 6875 10404
874 10404 7676 -3795 -13002 -7208 5018 6633 -1659 -6055 -1742 4000 3745 -2359 -5401 -1051 1833
889 1833 -2816 -4170 5768 14721 9730 -4524 -12567 -6923 4840 7678 -2954 -11824 -6354 5382
903 5382 9205 4839 -1896 -6927 -6571 -1260 4631 8808 8169 -373 -8911 -4128 8408 8992 -5591
918 -5591 -17551 -12435 5297 16630 8540 -8033 -10875 1547 9557 4747 -3529 -5889 -1856 4498
932 4498 6974 4158 170 -3962 -9083 -8866 415 7608 2958 -5634 -5972 3656 12702 9557 -4678
947 -4678 -13253 -5191 7138 8131 1165 -2340 -1631 -1333 -2740 -3167 -214 2746 -1697 -8914 -4240 11041
963A1041N958j1659j5679k322J1684J1429k928j2398m908P494O915j325l494j517
977a709j803j893J098N961Q556J523j0776j0709M132J1677J640r449o888K258
991f382P066L362k641j475K559j927q610j179J3018J1520n611j5359o295J0267
1005a687J4031j764j6891r568Q409J1962J164m244p87J143l065n600J303J2067
1019F473Q968j0466j9507K33K2068J4556j2734k5337q391J7556K1316m93j7352
1032c110q693P723R410J106k930k632k836k247l4N662P859k65j2138r258M726
1047g657J0048K199m442k975Q94K242O55J256M493J431j0196j2509N479J9599
1061A0517P039j5962j8358L511J9902Q569j6195j6832R801K1832j35k1146p451
$$ plain form
963 11041 16999 5340 -10339 -12661 -977 10452 7524 -4874 -9782 -2288 4627 3302 -192 -1709
977 -1709 -3512 -5405 -4307 1654 10210 11733 957 -9752 -5620 6057 7697 -1752 -8640 -6382
991 -6382 684 4046 1405 -70 2489 562 -8048 -9227 3791 15311 9700 -5659 -11954 -1687
1005 -1687 12344 10580 -6311 -15879 -7470 4492 5656 1412 625 1768 -1297 -6897 -5594 6473
1019 6473 15441 4975 -14532 -14299 7769 22325 9591 -15746 -24137 -6581 14735 14242 -3110
1032 -3110 -11803 -4080 5330 6436 3506 874 -1962 -4209 -4243 1419 9278 9013 -3125 -12383 -7657
1047 -7657 2391 4590 148 -2827 -1933 309 964 2220 6713 8144 -2052 -14561 -9082 10517
1061 10517 17556 1594 -16764 -13253 6649 15218 -977 -17809 -8008 13824 13689 -7457 -14908
1074a4908K0244J8692j3114l2148p015L1670K8900j5272l9120r590L0867K7846
1086B7052j0080l0679r274K1430J8768r294j6618O368J7056m418k4339r059K2721
1099c66K6592o941l6124j9271K5498L8730M094l2847k9480M554L1152K3736p167
1112B2160k7392j7174P577K0927J3298p358k1483j1413J0838J7988M164q989o331
1125c188K179J961n482m271J1616J8085m824l0713j7044K5576L8473j149m4554
1138a3335l2804K3954N1898J0621m3693l4854K2073M3421K085l9570k1572K7952
1150c824L6101j1790m5138j1238M2545L4980k4437n0884p818M5469L7211j8925
1162B2252m5598p573L6930K4324k0460k9403M814K7523N736k5629j8655J8976
$$ plain form
1074 -14908 5336 24028 10914 -21234 -28249 3421 32321 17049 -22071 -31661 -794 27052
1086 27052 16972 -13707 -22981 -1551 17217 7923 -8695 -2327 14729 10311 -14028 -23087 -366
1099 -366 26226 19285 -16839 -36110 -10612 28118 32212 -635 -30115 -25561 5591 29327 22160
1112 22160 -5232 -22406 -14829 6098 19396 12038 -9445 -20858 -10020 7968 12132 3143 -3188
1125 -3188 -1009 952 -4530 -8801 2815 20900 16076 -14637 -31681 -6105 32368 31219 -13335
1138 -13335 -46139 -22185 29713 40334 -3359 -38213 -16140 27281 29366 -10204 -31776 -3824
1150 -3824 32277 20487 -24651 -35889 6656 41636 17199 -33685 -41503 3966 41177 22252
1162 22252 -23346 -30919 6011 30335 9875 -19528 -14714 12809 18545 -7084 -25739 -6763
1174f763L2330k269l6853k1957K1348L6905Q957k6572k9452N41K7791K2130n594
1187B0542k4454j8990K970K2448J9352n652k4269j3917J1291K0330N221j2710
1199B162j1102N136R822m190r459P744J7689l913k8648j6814K3022L8668J488
1212C1605m3552l2516K5658N1361P253m5156l4373K0895M4221O865l5955k4360
1224b8054K0738L0009q481l2409m994K9671J8721k1227k9746O465L6487J4089
1236C1269l0165l0765J3132L6091P184k9017k1944J4177K7241J33k5990j2940
1248b1594J7342J9386o508j8607j821J5137R155p357j0928Q33Q054Q87o267P87
1262a501O582k265j0363j376J1404P928q269j4256Q70J7240R963j1977j5236M914
$$ plain form
1174 -6763 25567 23298 -13555 -35512 -14164 22741 31698 5126 -24326 -23785 4006 26136 20542
1187 20542 -3912 -22902 -19932 2516 21868 16216 -8053 -21970 -10679 9651 14872 2162
1199 2162 -8940 -3804 6018 1828 -7631 113 17802 13889 -14759 -31573 -8551 30117 31605
1212 31605 -11947 -44463 -18805 32556 39809 -5347 -39720 -18825 25396 32261 -3694 -28054
1224 -28054 -7316 22693 14212 -18197 -23191 6480 25201 3974 -25772 -19307 17180 31269
1236 31269 1104 -29661 -16529 19562 26746 -2271 -24215 -10038 17203 17336 -8654 -21594
1248 -21594 -4252 15134 8626 -9981 -11802 3335 12490 5133 -5795 -4962 3092 3979 -2288 -1501
1262 -1501 5081 2816 -7547 -8923 2481 10409 2140 -12116 -11246 5994 15957 3980 -11256 -6342
1276f342J5656P06j4539o262J1377J0772q505j6722K534K1125P309k0476j8449
1289b1816J2434K6421L299k3722j6890J3833K4175j216k4663j0686J7424J6045
1301A4638r657j7868K169J8749N639j7214j4101J2934K2566k825k4867r278K0781
1314A666J9428r579k4890n865K0420J6068j1925k0151K672J9514N333j4244r687
1327a1240R210J2690l754j4507j330J5409P568j3690j4616P095J6624P40j6154
1340e955r114J1280J5945k478j6580m391J4404R595r799j2402M157J3207J587
1353I456j3230q088J0082J2851n760j6479j262J6033R030r790j2355L628J3540
1366G656K939j2221q176R294J0960o503j3938J113J4931N314j2809j2899N975
$$ plain form
1276 -6342 9314 10020 -4519 -10781 596 11368 2863 -13859 -11325 9800 17109 -3367 -21816
1289 -21816 -9382 17039 20338 -3384 -20274 -6441 17734 16518 -8145 -18831 -1407 14638
1301 14638 4981 -12887 -10718 8031 13670 -3544 -17645 -4711 17855 15030 -9837 -19115 1666
1314 1666 21094 11515 -13375 -19240 1180 17248 5323 -14828 -12156 7358 12691 -1553 -11240
1327 -11240 -2030 10660 6906 -7601 -8931 6478 14046 356 -14260 -7165 9459 10199 -5955
1340 -5955 -15069 -3789 12156 9678 -6902 -11293 3111 12706 2907 -9495 -5338 7869 9456
1353 9456 -3774 -11862 -1780 11071 5311 -11168 -12430 3603 12633 2843 -9512 -5884 7656
1366 7656 10595 -1626 -9802 -508 10452 3949 -9989 -8876 6055 11369 -1440 -14339 -8364
1379h364J7649L913j5609j0818J0569J5232l216j4940m081J1536Q267q500j2708
1392a1070L107J5663L222j5147j0145J0201J5234j498j4105o132J0588J1388m734
1405F572j2627l49J0851K180j0282n987P810J0406l119j3061l826J2670J1517
1418A2755p037j4610MJ3611O449q285r932K291R574J016j0185m954R035Q161n862
1433B031j0117J902J1188M106q421q440M161J0497L94j0149l851Q119N738o684
1447D74q957K249J0201L468q967q352N995J2508K59j1624n185P642P929k956q869
1462d185j468P828M136p248p618M999R480j185r499k923Q266P977l234r717j532
1477e923Q803N104o968p562L410P768q43p695l052O395O801l731r109L79J0592
$$ plain form
1379 -8364 9285 13198 -2411 -13229 -2660 12572 9356 -5584 -9665 1871 10138 1638 -11070
1392 -11070 -7963 7700 10922 -4225 -14370 -4169 11065 9567 -4538 -10670 -82 11306 6572
1405 6572 -6055 -6404 4447 6627 -3655 -9642 -1832 8574 5455 -7606 -11432 1238 12755
1418 12755 5718 -8892 -8888 4723 11172 2887 -7045 -4754 4820 5836 -4349 -9303 -268 7893 2031
1433 2031 -8086 -6184 5004 9110 689 -7751 -3590 6907 7301 -2848 -6699 1420 7158 474
1447 474 -8483 -6234 3967 7435 -1532 -9884 -3889 8619 8878 -2746 -7931 -289 7640 4684 -4185
1462 -4185 -5653 2175 6311 -937 -8555 -3556 5924 4739 -4760 -7683 583 8560 5326 -4391 -5923
1477 -5923 2880 7984 1016 -6546 -3136 4632 3789 -3906 -6958 -563 6238 2507 -6602 -6223 4369
1492D369M745p942p949L632R225J367q951o841N119R224j373r429k322P684M952
1507E510m407n978J771P234J861o748m547N688P054l698r103j290P447N058m443
1522A409p372k2P765L932n072n212K957N605p44m360p34L729K330l613n123J133
1538c392O066N39o162k826N027M788j905m756J10N132K380m903m897M010O899
1553F110j699q454k650O172O105k879q107j690P700O138m264p519J785P640J680
1568F068o359m970L597P150k23q574m595O432P415k750p654j826N632N514j421
1583C436n091j063M332K169l254k400K206J662j944k795L74K768J461k343k930
1598c412J368L649L55k267J79J916j12k145m21K133J897k313n372o35O590M106
$$ plain form
1492 4369 9114 1172 -6777 -3145 6080 7447 -1504 -8345 -3226 5998 4625 -4804 -7126 558 5510
1507 5510 1103 -4875 -3104 4130 5991 -757 -5304 384 7438 3740 -5363 -6653 794 5852 1409
1522 1409 -5963 -5985 1780 5712 640 -4572 -1615 3990 3246 -1114 -1848 1881 4211 598 -4525 -3392
1538 -3392 2674 3213 -2949 -5775 -748 4040 2135 -2621 -2511 2621 5001 98 -4799 -789 6110
1553 6110 4411 -4043 -6693 -521 5584 2705 -5402 -7092 608 6746 2482 -5037 -3252 4388 6068
1568 6068 -291 -5261 -1664 5486 5263 -3311 -7906 -1474 5941 3191 -4463 -6289 -657 4857 3436
1583 3436 -1655 -2718 1614 3783 529 -1871 335 1997 53 -2742 -2368 400 1861 -482 -3412
1598 -3412 -2044 1605 1960 -307 -128 1788 1676 -469 -890 1243 3140 827 -4545 -5180 1410 5516
1614E516m999o861J411P632L765m944o883J680Q453K555p312o372M256P376o92
1629D581q011m627N221Q686l52r098m247O860P761j218p481l455M484O285m02
1644D987o761k985M035L943k332m259n19L485L353j115m167j166M149L992r52
1659C688m127l067J243M939K968m185o729q25N923N136k036o527k953N261O954
1674E663q40o992k200N517M526l066o406q28O751M595o038r169J566J1033M990
1689I102q154j0416J661J2489P383q094j2507P55J2174N964p798j0164N58R461
1703B414M777o575q354K375R465K567p514o026L941Q601K326p534p276K777Q833
1718D797K082p224o432J752O697L343m167n789M79O361L111l399m789L79M918
$$ plain form
1614 5516 517 -6344 -4933 2699 6464 1520 -5363 -3683 4770 7325 13 -6359 -2103 5273 4581
1629 4581 -3430 -8057 -2836 5850 5498 -3600 -7847 -987 6774 5556 -1925 -5380 -896 5389 4987
1644 4987 -1774 -4759 -724 3219 887 -3372 -3891 -406 2947 1832 -2335 -3501 648 4640 3688
1659 3688 -439 -3506 -2263 2676 5644 1459 -5270 -6095 -172 4964 2928 -3599 -6552 -1291 5663
1674 5663 4823 -2169 -4369 1148 5674 2608 -3798 -4626 2125 6720 682 -8487 -6921 4112 9102
1689 9102 948 -9468 -7807 4682 12065 3971 -8536 -7781 4393 10357 2559 -7605 -7047 2414
1703 2414 7191 616 -7738 -5363 4102 6669 -845 -6871 -2930 5671 7997 463 -6813 -4036 4797
1718 4797 6879 -345 -6777 -5025 1672 5015 848 -4941 -4462 1899 5010 1611 -3178 -2799 2119
1733B119L452k912o624j077O261M717l937p559j585O704O829j872q722l156P561
1748A99P581k691q299k580O373O159k836q729j766P968N490o006q711J464R709
1763C325N059o780r215J384J1298N175q327r549K173R594L379o776p649J610P916
1778B617K451o232m675L731N961j2m885k345L235M659q68n538j906L645L167j647
1794A358l532j065J772K563J28j760j129J112J531N24K78r33j858M07K507R9k780
1811g78k297J353K965R69l330l062K141N343L54n053k307L653M780p84n461k843
1827d357M233M887k735o623o38O317L591m089n622Q15O921L599n511o118K852
1842b478P346P85o499m118L147N395l98n730k869M404M709k253m970M43M869K309
$$ plain form
1733 2119 5571 2659 -3965 -5042 1219 5936 1999 -5560 -7145 -441 6388 4516 -4206 -7362 199
1748 199 7780 5089 -3210 -5790 583 6742 3906 -4823 -6589 1379 6869 863 -7848 -6384 3325
1763 3325 8384 1604 -7611 -6227 5071 10246 1919 -7630 -5457 4137 7516 740 -6909 -5299 2617
1778 2617 5068 -1164 -5839 -2108 3853 3841 -1044 -3389 -154 4505 3637 -1901 -3807 -162 3005 1358
1794 1358 -2174 -3239 -1467 1096 1224 -536 -1665 -553 978 1502 1780 847 -1011 -604 1903 2002 -778
1811 -778 -3075 -1722 1243 2212 -1118 -4180 -2039 3304 3658 -1395 -3702 -49 4731 3947 -1514 -4357
1827 -4357 -124 4763 2028 -4595 -5233 1084 4675 586 -5036 -4221 2700 6299 788 -5330 -2478
1842 -2478 4868 5653 -846 -4964 -1817 3578 3180 -2550 -5419 -1015 3694 1441 -3529 -3086 1783 4092
1858D092k873l516O18M333J190m182k828K222L031j194l182j27K118J436j235
1873i7j601J101K688k03k742p0K776N91k673j679J336K081m80l232j156L293K898
1890B831k565l603J377M672J204l588l088J913M435P2n108k963L817M177k197
1905A386n110m45M670L441k930m889N22O291K482m887m324K490M758M9m568l085
1921d149K563M332j047m581q99M341K441k485l015R40L519J523k452l136J182
1936i23L042l81k999r28J958Q71j422j123R22J905L93k261p42K794J956j930k713
1953a581R70K347j88k146j706J413K473j094l358k6M164J760l041l048J931M021
1969B891J128l762l406J932M441m24m866j826L192L154j688l580l49M074K731
$$ plain form
1858 4092 1219 -2297 -1679 2654 3844 -338 -3166 -944 2087 893 -2289 -2416 -298 1138 -97
1873 -97 -1698 -597 2091 1888 -854 -924 1852 2443 -230 -1909 -573 1508 1028 -2204 -3360 -67 2831
1890 2831 266 -3337 -1960 2712 3916 328 -2760 -847 3588 3660 -1448 -4411 -594 3583 1386
1905 1386 -3724 -4169 501 3942 1012 -3877 -3355 2936 5418 531 -3793 -1303 3455 3504 -1064 -4149
1921 -4149 -1586 2746 1699 -2882 -3781 560 3001 516 -2499 -1559 1960 3483 1031 -2105 -923
1936 -923 2119 1738 -1261 -2189 -231 640 -782 -1905 -983 922 1315 -946 -1688 1106 3062 1132 -1581
1953 -1581 -611 1736 1548 -598 -2304 -891 1582 488 -2870 -2896 1268 3028 -13 -3061 -1130 2891
1969 2891 4019 257 -3149 -1217 3224 2800 -2066 -3892 -700 2454 766 -2814 -3163 911 3642
1984C642k799m059J574M993P36m290k842J919L666r6l959k215K784L136j517l339
2000b666N96L198J262k009j878R07K994L45l013j898J987J938j357k157L9J706
2016fO84j358j322J597K505p34k710J04L114J162k407k494P78K314N48k839k146
2033c210K264K953j377l150L72L412J761k215l011O67M031J515l967l456K102
2048a309L842l93l741j903K206L196m79l251q20L677K281k426k834J143L086L27
2064B602k787k224J342K752l71l381p61K859J510j566j440O84J978Q46j786j324
2080a067J614J867j430k789M53K549q3k340j462J463K811j30l215j067L589K981
2096C744k271l646N88L643J479l127l938J125M526O84m558k782L391M059r81l785
$$ plain form
1984 3642 843 -3216 -1642 3351 4087 -203 -3045 -1126 2540 2444 -1515 -3730 -946 2190 673 -2666
2000 -2666 -2070 1128 2390 381 -1497 -590 2404 2749 -264 -2162 -175 1763 406 -1751 -1712 -6
2016 -6 678 -680 -2002 -405 2100 1366 -1344 -1240 1874 3036 629 -1865 -1087 1227 1775 -1064 -3210
2033 -3210 -946 2007 630 -2520 -2148 1264 3025 810 -2201 -1534 2497 4012 45 -3411 -1309
2048 -1309 2533 2140 -1601 -3504 -1298 1898 1419 -1832 -2652 1025 3306 880 -1954 -811 2275 2602
2064 2602 -185 -2409 -1067 1685 1314 -2067 -2828 31 1541 -25 -1465 -781 1197 2043 257 -1067
2080 -1067 547 2414 984 -1805 -1352 1197 1114 -1226 -2688 -1225 1586 1456 -1759 -2826 763 3744
2096 3744 1473 -2173 -1585 2058 3537 410 -3528 -2403 2123 2807 -1751 -4533 -1142 2917 1936 -1849
2112a849j330L529L714j385m646p45M069K402l115l438K17L228J510k241k937
2127c017J205L304N66k690r86J796J715l54j451n59P18N95q91r64M14O41r98n79
2145a535J302J138q25j178L87J858J167j573k305Q66K925J71l582j940K279K997
2161B152o70l767j719L443M174j269m966o17M798L174k710m625m56M409K732l371
2177G12m980Q78M949J427l578l070J576M194J322l218l075J845M032O4l351k211
2193b484J460K475J30k181k129R69K514K56j510p00O87J028R20j10j276p55J065
2210C59R11j54j512j449K29K227J096k379k410J508L195R54k529k485J200L920
2226B681J131l864l318K030M055k78l831k553K069M260K51m379k562L759M428
$$ plain form
2112 -1849 -3179 350 4064 2679 -1967 -2712 1357 3759 644 -2794 -2577 651 2161 -80 -3017
2127 -3017 -1812 1492 2058 -632 -1618 178 1893 1539 88 -471 247 842 -49 -1013 -599 42 -956 -1535
2145 -1535 -233 905 80 -1098 -711 1147 2314 741 -1564 -698 2227 2398 -1184 -3124 -845 2152
2161 2152 1482 -2285 -4004 -561 3613 2344 -2622 -3239 1559 4733 2023 -2602 -3058 1351 4083 712
2177 712 -4268 -3390 1559 2986 -592 -3662 -2086 2108 3430 212 -2863 -1018 3014 3078 -273 -2484
2193 -2484 -1024 1451 1581 -600 -2729 -1760 754 1010 -500 -1200 -513 515 1435 1325 49 -706 359
2210 359 1270 1116 -396 -1845 -1616 611 1707 -672 -3082 -1574 1621 2575 46 -2439 -1239 2681
2226 2681 3812 -52 -3370 -1340 2715 2437 -1394 -3947 -1878 2382 2633 -1746 -4308 -549 3879
2241C879q83m483j498L247L786j085m857j934L585L515j926m044p96L124K578
2256B208o44l147r58K987K675j311k689l91J562J632o22k323j260J455K005l80
2272G99k044o84J030J858R91j510k024P30K717O59j922k237R2K283J537k061l290
2289c076L77L474J581k514k564R25L448J854k578l399Q52M197P85l514k884J202
2305a834L378Q14l029k967J394M361L65l285j933K225L103N8k742j970J595K892
2321B425n07l313j330J890K114m05k009r57J069K514J23j779q39J190J277l8r55
2338D70j260J17J046M46j238j094L46Q59Q93k80j237l95J680J814q61j955j88
2355h37J422J357p93k420j039K101K100j429k660k59K453J961j026k186n15K913
$$ plain form
2241 3879 2996 -1487 -2985 262 4048 2963 -1894 -3828 -243 3272 1346 -2698 -3494 -370 2208
2256 2208 1564 -1583 -2541 446 3121 1810 -879 -1270 292 1924 1302 -1021 -2281 -826 1179 799
2272 799 -1245 -1929 -899 959 1950 440 -1584 -854 1863 2522 600 -1637 -1545 738 2275 214 -3076
2289 -3076 -2699 775 2356 -158 -2722 -1797 1651 3505 927 -2472 -1620 2577 3362 -152 -3036 -1834
2305 -1834 1544 2358 -671 -3638 -2244 2117 2482 -803 -2736 -511 2592 2650 -92 -2062 -467 2425
2321 2425 1918 -1395 -2725 -835 1279 874 -1135 -2092 -1023 1491 1614 -165 -1004 186 1463 1425 470
2338 470 -790 -673 373 819 -419 -1513 -1167 -308 585 305 -932 -1327 353 2167 1306 -649 -837
2355 -837 585 1942 1149 -1271 -2310 -209 1891 462 -2198 -2457 -4 1957 931 -1255 -1770 1143
2371A143J871j855k829L18K639P91j925k331J16K472J382k145k175J248K770K96
2387A786j669j178O85J949L62j966j411J127J420p27j308m33O07Q84J49o79m79
2404h81Q04Q45J4j23j2n87j43O61J69q97o92L8N24M36j19j282j72J904R43j009
2424D21j263O58J524M90j315j873L74K197M78k502j787J508K273j35k013j194
2440b159J669K632k12k690q65K369J724j489k198m01J618J475j208k359MK418
2456C28J104j508j405R52J601L71j005j180O30J507l96j751k24J042K13o35n98
2473i54K56M16L23k69p1P54M38p33k13Q87M07r45j016J45P83J91q12j372P02J671
2493E88K89j746n05J763J236m95j725m31J614J666j618k512K54K455M42j990j452
$$ plain form
2371 1143 3014 1159 -1670 -1352 1287 2078 153 -2178 -2062 410 1792 -353 -2528 -1280 1490 1786
2387 1786 117 -1061 -376 1573 1935 -31 -1442 -315 1105 378 -930 -1363 -756 128 277 -402 -881
2404 -881 -77 768 782 659 647 60 -83 578 747 -150 -842 -804 -280 156 37 -1245 -1417 487 1430 421
2424 421 -842 -184 1340 1830 515 -1358 -984 1213 1691 -811 -2598 -1090 1183 1048 -965 -2159
2440 -2159 -490 2142 1930 -760 -1625 744 2468 979 -1219 -1620 -2 1473 265 -2094 -2090 328
2456 328 1432 -76 -1481 -529 1072 1443 438 -742 -112 1395 999 -752 -976 66 279 -356 -954
2473 -954 -698 -282 41 -228 -299 455 893 160 -53 834 1241 296 -720 -575 208 399 -413 -1785 -1083 588
2493 588 877 -869 -1374 389 1625 1130 -595 -1026 588 2254 636 -1876 -1622 833 1275 -715 -2167
2510b167P38K287O08j901j319J680K380o18k394n01J783J135j085k012m18J978
2526A74J098j628j672J014J911Q6j272m88Q62J462l68j567l88J541O10j668j119
2543a412N37J279j51r43o11Q43J269k24j286M37J396Q3j253m21O42P53m65j257
2561g84o23J311R15j079j390Q18J508K76j031o63R33J375k89j711n17J559R66
2578A574j646j724M91J747N34j430j306N47K442M77k174p91J817J229p49j497
2594d59n62J307Q58j046j740J21K019L96j588o53R66J357L01j082q35R92J143
2611A495o88j464J38R79j11j022l70M89Q84l09r54Q3J310P56r15q10P07R81m26
2630G53j035k69P53O79r89j426J38J807N08j587p84J033J617K57j432j104J117
$$ plain form
2510 -2167 -1429 858 1466 -435 -1754 -74 2306 1688 -706 -1207 576 1711 626 -1386 -1804 174
2526 174 1272 -356 -2028 -1014 897 983 -289 -777 85 1547 1179 -388 -776 765 1375 -293 -1412
2543 -1412 -875 404 253 -690 -1301 -458 811 587 -699 -262 1134 1217 -36 -457 185 938 473 -784
2561 -784 -1407 -96 819 -260 -1650 -832 676 952 -79 -742 191 1566 1277 -434 -951 608 1574
2578 1574 -72 -1796 -1305 442 976 -454 -1760 -1213 1229 1706 -468 -1259 558 1787 1038 -459
2594 -459 -1021 286 1144 98 -1642 -1521 498 894 -694 -1347 -381 976 1277 195 -640 352 1495
2611 1495 807 -657 -519 460 349 -673 -1043 -554 330 21 -933 -850 460 1216 301 -509 198 1179 753
2630 753 -282 -551 202 881 -108 -1534 -1396 411 919 -668 -1452 -419 1198 1455 23 -1081 36
2647C6J794o03k218m84J790Q40j288j452Q7J553J237j158j604N24K198L77j368
2664B61q70O41J029p9j042j108O58J045m93r73n2P67M45j14j51j20N12M10j64
2683F02m07L20k22n32oN45k94o79m31L83J014K20q80p85J135J589o28j508j05
2702f69J527N71q66j687l83J912R28j409k122P65K183P43j358j631P47K276P13
2719B240j936j825J256J850m15j933j001R34J689p8j935p82J632J713l80j535
2735e06j68R80J031j93j188p51O44Q24o36p35n9J24N57K92l53m43L07Q44Q7k4
2755F34m62m37M23O96N9j475p08P84R76j42j207p07Q08K012k6j738q25J636J727
2774B028o96k010n54J225J582p09k448n01J962J490j169j836o3K250J439j084
$$ plain form
2647 36 1830 1227 -991 -1475 315 1155 -133 -1585 -1498 55 1292 134 -1470 -946 1252 1629 261
2664 261 -609 32 1061 982 -60 -1168 -510 535 42 -931 -983 -216 229 115 -36 -156 356 766 602
2683 602 195 515 293 -239 -245 300 6 -673 -1104 -721 293 513 -367 -1152 -17 1572 944 -564 -669
2702 -669 858 1429 563 -1124 -1507 405 1333 -76 -2198 -1433 750 1493 135 -1496 -749 1527 2240
2719 2240 304 -1521 -265 1585 1170 -763 -1764 -830 859 781 -1154 -1936 -304 1409 1029 -506
2735 -506 -674 306 1337 1144 -44 -795 -151 673 37 -698 -757 -633 -76 216 -137 -580 -273 571 658 634
2755 634 172 -265 158 854 913 -562 -1270 -486 490 348 -859 -1566 -758 1254 1228 -510 -1335 301 2028
2774 2028 1332 -678 -1232 -7 1575 866 -1582 -2083 -121 1369 200 -1636 -1699 551 1990 906
2790I06k153K15K278Q50j675j776L62J595O17j312j683M29J777N74j298r35Q89
2807c40J199K50p34q53M62R54N8j265m28L64L26n7j14m35j99O86M49q1j37p9P6
2828A02M32L65l60q67k13R15P3o91o79kR55N62o79j158P07J460L99j132q10M45
2848a76J159L24j246j243N95J265j55j323m82Q54J000j87q43l22J148R72n52j135
2866c47m0R17M26o95p98k45N76M60n08o24M02P49j89k07K42K88J31Kl10k73M08
2887C65M0o23k77M31r2m16o4K53M01J40k14l37N85Q47j52j034m8O00M17n14r13
2908f05m43O01Q56n91r50L10J322K46o61n14L58Q49N25r05j107M92P73l2r53n06
2928i35K14P12K17m75m45N28P43m5m26p7M50r2J12m21l59M7L06j37l33k1k78K84
$$ plain form
2790 906 -1247 -1032 1246 2096 421 -1355 -993 602 1219 -93 -1776 -1347 430 1004 -294 -1229 -340
2807 -340 859 1109 375 -478 -16 938 996 -269 -697 -333 -7 -64 -178 -613 -812 -126 323 242 105 26 102
2828 102 534 899 539 -328 -541 374 447 -244 -923 -925 30 592 -87 -1245 -538 922 1321 189 -621 -176
2848 -176 983 1307 61 -1182 -587 678 523 -800 -1282 -428 572 385 -458 -780 368 1340 788 -347
2866 -347 -387 530 956 261 -537 -782 -206 254 -254 -878 -476 273 84 -123 119 407 538 540 230 -43 365
2887 365 405 -218 -495 -64 -156 -572 -636 -383 18 158 -56 -393 192 1039 887 -147 -195 405 822 308 -605
2908 -605 -1048 -447 409 -182 -1132 -822 500 746 85 -429 -71 778 1303 398 -709 -217 556 524 -429 -935
2928 -935 -721 -9 208 -267 -712 -184 559 514 88 11 461 369 481 60 -299 -252 54 -83 -416 -437 -715 -431
2950d31N09L20l80l25L86N69J22k77p14n6O45M36q38j059L46Q96K11o40q52M56
2970f76J480M42j124j103J001J288j13j359q41N75J423j47j788q77J423J273l92
2987D85j400j51J252J107k98j428l99J363R47r69j355l2Q31N28n28r27k39J270
3005E7P57p86p22N46R22J08l30n92j28M58L21n41n90L5K7K37K36k78m74K53P92
3026C08K98k98m19J21M97M32n30j117P4Q98J90p17r49J60J148P14o91j132N28
3045d85J515L82j321q10N29J219J94j379j235O10J782l43j804m72J122J356j0
3062H50j266p13J194J414k80j483l29R96M95o62r52k31Q03P38o09j085K47J486
3080F13K28o72l98J82O00K73n10n75O9L14j57l56k8Rn0J75K90n4j03L45J3K57
$$ plain form
2950 -431 78 398 18 -307 79 648 770 493 -221 -277 368 804 -34 -1093 -747 149 360 -280 -1132 -676
2970 -676 804 1246 122 -981 20 1308 1195 -164 -1005 -430 993 846 -942 -1819 -396 877 485
2987 485 -915 -1066 186 1293 995 -433 -832 531 1478 509 -846 -878 -47 481 -47 -974 -1213 57
3005 57 814 28 -694 -148 774 882 552 -40 -168 290 611 70 -520 -485 -458 -221 15 -263 -737 -484 308
3026 308 606 308 -111 10 507 939 409 -708 -634 264 454 -263 -1212 -1052 96 810 119 -1013 -485
3045 -485 1030 1412 91 -719 -190 1029 1223 -156 -1391 -781 1001 658 -1146 -1618 -496 860 850
3062 850 -416 -1129 65 1479 1199 -284 -613 383 878 216 -736 -967 -164 574 -35 -1120 -873 613
3080 613 841 169 -229 -47 553 826 316 -259 -190 124 -33 -389 -417 -408 -458 -283 7 -47 -150 195 208 465
3102D65J69n06k80M63M57o61p72j35M79N92k17p76l08J033Q86n05r05L97J001
3121H77K11q19q99L29J076n4j261r45J029J167k11j281k43Q40J133K21j293o14
3139g37J141Q64p27j180J34P26L97o75j062K21J094M80r74p08P91J096p1n56n56
3158c02L03Q99j24j017m03N93J94l64k66j9R2N63P5l21P2K40J06q5K32qm53j72
3180a65K91J30l48l02j89K31N59j59n66J75Q02K78o38l16L57O87J21q91j120M68
3200e95J299m2j519n92Q79J202K6r68o29R53J163j31j354k32J039N09p69r91k77
3219a029J081P14q76j231L94J331N09q16o95L78R36L77p58q00L75O70j97m47n98
3238f82M9L60N02l71m34J20P10K72o2j68l61R3N18J72n34n68M2K87K18l39n94
$$ plain form
3102 465 634 128 -152 311 768 107 -665 -800 -321 271 54 -722 -1030 3 889 384 -521 -124 877
3121 877 1088 269 -630 -301 775 721 -540 -1485 -456 711 500 -781 -1024 -184 949 1170 -123 -737
3139 -737 404 1268 541 -639 -505 221 618 -57 -1119 -898 196 676 -298 -1006 -215 881 810 254 -302
3158 -302 1 900 776 -241 -644 -51 143 -221 -487 -506 -414 149 224 -97 -25 215 321 236 468 460 7 -165
3180 -165 126 256 -92 -394 -583 -352 207 48 -518 -343 459 737 99 -217 140 827 948 57 -1063 -595
3200 -595 704 662 -857 -1449 -570 632 658 -310 -939 14 1177 1046 -308 -540 499 1008 239 -752 -1029
3219 -1029 52 766 -110 -1341 -947 384 893 77 -618 -240 696 1073 315 -485 -110 560 363 -84 -682
3238 -682 -633 -273 229 -142 -576 -456 254 526 464 296 -65 28 546 718 184 -384 -342 -55 163 -176 -770
3259g70qQ94M86r70l62O41J026J40r35p47L16J171L01j504j164P68J204J36j229
3278f06o81N31J392L20j224o47J041J222m28j228m71P14R04l50j269n99J073R04
3296E98l76r94M5Q06P05Rq83k79P54O26n25q52k88M83M01P4r08m39N18R26J13
3317E14o84l74L68Q30L58m45r30J67O59J25o33o26j21P33M30o87p31M92J240K45
3337I30r79p01N52J226L55j099j356L63J464J36j277q18M02J077K36o98p72N60
3355c99J429r0j107k95P27N75j01j033o06O04P99k32j109l24Q94N86n5l40l19
3374c96N40O19k17n91j26O33R1m49m28k21K22N25k67l62k36M66M36J34L9m70r4
3395a52N19M55n24m76J36QOj26m82J31M45K39n48p3N16O25k25l83k57K08P55n6
$$ plain form
3259 -770 -778 116 602 -368 -730 -89 937 1077 142 -605 -289 882 1183 -321 -1485 -717 487 623 -606
3278 -606 -1287 -756 636 956 -268 -915 126 1348 920 -308 -779 -65 839 489 -780 -1379 -306 598
3296 598 222 -772 -727 79 784 793 -90 -369 385 1011 486 -366 -654 -171 230 304 -604 -1043 -525 401 514
3317 514 -170 -544 -176 654 1012 567 -363 -196 463 588 -45 -671 -792 -59 371 -316 -1047 -555 685 930
3337 930 -49 -750 -198 1028 1383 284 -1072 -709 755 891 -386 -1204 -802 275 511 -187 -959 -399
3355 -399 1030 940 -167 -462 265 840 739 -294 -900 -296 503 271 -838 -1162 -268 318 263 -77 -396
3374 -396 144 763 546 -45 -171 462 553 104 -324 -545 -323 202 -65 -427 -663 -197 239 373 412 -58 -152
3395 -152 367 822 298 -178 -42 -34 -28 -154 -636 -505 -60 179 -369 -442 74 699 474 91 -166 42 797 741
3417G41q77m90M12M72k32m96q5K34L30J74l22Q3N66N4m37k66M06J77o9m35m87
3438e47R2N38rn32j47N51K16j70j30J39K54M58k68n77J01M27j4n46k25j4J53J42
3460a08j44j94K27L86k8j57L08K8M0mo7m33%L04k9n13r4qL13K24N6k99j07M74
3484A75M55k03l58j30J41M03j94n84k76M50L20l88n06R1O46N12k27o99m9Q38O99
3505A116q21p21L73L99J98n34o52m3P95L20q52m55N57Q04J83o45m09L65P74Jo71
3526H2m43Q5L28k7k62k90J65K75J03k17q1L66K02q4L0J0j56K00n4j61m65n3J14
3549c33L69P4n25l42L72P66J29n35k95M11M94m2l49o22K86P92m86q48q5N85N59
3570C75l74o82j75R50R84m67j054m9J051L90o93o98j48O60M21o96q06M15R56Q2
$$ plain form
3417 741 -136 -626 -214 258 26 -470 -555 -321 9 183 -139 -56 510 564 127 -139 267 444 375 -60 -547
3438 -547 -455 83 74 -458 -605 -54 162 -8 -138 1 255 713 445 -132 -31 396 382 -164 -389 -403 -250 -108
3460 -108 -252 -446 -219 167 139 -18 290 318 358 354 287 -146 -146 158 129 -384 -478 -486 -173 51 107 -192 -299 175
3484 175 630 427 69 -61 80 483 289 -295 -571 -121 199 -189 -695 -604 42 554 327 -372 -421 417 1116
3505 1116 295 -426 -53 346 544 10 -642 -685 110 430 -422 -877 -320 484 667 22 -387 -22 752 753 82
3526 82 -361 -276 52 25 -237 -527 -362 -87 16 -201 -282 84 286 202 232 242 86 286 232 71 -394 -447 -333
3549 -333 36 110 -415 -757 -385 381 510 -25 -320 91 585 543 194 -428 -142 650 164 -684 -769 -184 375
3570 375 1 -681 -856 94 1078 611 -443 -492 559 949 256 -442 -590 70 491 -205 -1011 -596 360 442
3590D42p59j35K90N88L19m98m07J91M32Pn10j94o3L0JQ3j44K78K27l56N8M75O7
3613D22k73n5K23K3n00M4J23J74k53m42k58P25O50m79o46M7P35M44k32n24j67
3634b19N96K49o68o84M58O22m25n32k56M88Q27p8r67K0R38P67n64r48LO94J20
3655D41k82p67M2O11K03p55k36N99N30q3m10k16L49O95k68l98j72N17k60l72J20
3676a12N4o1q2l88K16M48L98l59n55O48M11r0l29k33O2J43r7m21o8N06j10n03
3698e22j95O75N25k22l40j12L11N88j60p75O0L80J03m16n52L76M42j46n57j08
3718f45O08N55j84p87K76Q47R0n79l76J08L75O7p41l30K98P28j86n61P3M30L35
3739D01j47l63J88M42Mm72m18M39M31l99o42k99N63O48k96o33J6Q36K76k36n10
$$ plain form
3590 442 -317 -452 -162 426 745 247 -160 31 463 470 -40 -234 -297 -267 -266 -183 -327 -49 178 -178 -120 355 422
3613 422 149 94 317 340 -160 -116 7 181 -72 -514 -772 -47 603 124 -522 -475 260 704 472 -52 -219
3634 -219 377 626 -42 -726 -268 354 -71 -603 -859 -371 456 378 -589 -569 369 1136 572 -376 -373 321 441
3655 441 159 -608 -566 45 248 -507 -743 -144 386 303 -107 -323 26 721 453 55 -117 400 140 -232 -112
3676 -112 -58 -119 -201 -589 -373 75 473 114 -441 207 618 528 199 -34 28 171 74 -347 -415 91 -19 -522
3698 -522 -717 -42 483 261 -79 -191 120 708 548 -227 -167 213 316 -100 -652 -276 166 20 -537 -645
3718 -645 -37 518 334 -453 -177 670 760 181 -195 -87 288 355 -386 -716 -418 310 124 -437 -364 66 401
3739 401 254 -109 79 521 525 53 -365 74 505 106 -536 -835 -272 376 80 -553 -537 299 575 339 -171
3760a71K58L01J23m60k94K83L30n31n30K38N89J50m35l67M46L40K38l91l6J42
3780B23K96l71m71L85K65l33o05k6M78M21k6q00M4Q80L84m79m83K53N50K6p25
3801a14m58K30Q40l51p68k17O48N68l15m89R0N63M27l76m89J22P40j97n57m58
3821e61M34M04j32n87k96N48N47j60m78N8O32k6j58j34M0J24M9l77k70K03P1l56
3843d25L9L10L9J2j22J58L07J81l09l49K76L55j22p07j39N13K31l69n97m0Q51
3864I3O10o37p08M54R16K65q26o93M13Q75l2j121n83M79Q56q1p99j77L62P49j27
3885B88n49N6O43L57n37p06L08O27j24o58l95J63O84J12m10m86L97M09K84k56
3905B07q7l7J31K22m10P5O2l30k45J71J66o4k18K49J31K0p4M7K48K31L6n94j15
$$ plain form
3760 -171 87 388 511 51 -243 40 370 -161 -691 -453 136 286 -149 -516 -70 270 508 117 81 223
3780 223 519 148 -323 62 327 -6 -611 -637 -159 262 236 -564 -520 360 744 265 -218 35 585 611 -114
3801 -114 -572 -342 498 147 -621 -838 -190 378 63 -426 -336 227 654 278 -211 -89 651 454 -103 -561
3821 -561 -127 277 145 -442 -738 -190 357 197 -281 -223 409 383 225 91 131 255 304 -73 -343 -140 -69 -425
3843 -425 -386 -76 -37 -25 -147 11 318 499 190 -159 117 472 350 -357 -496 17 248 -121 -718 -758 93
3864 93 703 66 -642 -188 728 993 167 -526 -113 762 730 -391 -974 -495 361 280 -519 -696 -334 415 288
3885 288 -261 -205 438 795 258 -448 -140 487 363 -295 -690 -527 157 269 -141 -627 -230 179 463 207
3905 207 120 83 214 436 26 101 163 -167 -412 -241 -75 -139 -357 -108 23 43 -31 16 264 495 531 -63 -178
3928a78M90J17l54o45o0M48N86l32n12r7Q27L63o82l41K50O92o1m51n40L08O35
3949D63k59p88k61N10O67j75n20k14N12O64k89n13J07N75K33o08n91K81M47m2
3969A99n07m81L86N95N2l48j56J92L29K33k01k60J72Q3k58k55M7J08j61R2j19
3990b58p7J02K34N4o5J01O3m8J32Q7j68k80l1J97o5j15j55j68L79J75k18k11K07
4013a28N48L3l58j40J66L34j18n09k53L32J34j87k78l5L13K83j73j04o1O29J66
4034E94m61l14J94M47j11m03m54P4M95N4m26k92K81N44J54l98j18J68L91J5l58
4055G6k00K12J03m49o6J37N7K9Q5l39J02L70J66j60l8r5J32K01j10j72k60J32
4077h7N6m9r6j31j6J55K92j0j40r6M47M7j54Jk77J63K00l63l20Q2K33K29m82K8
$$ plain form
3928 -178 312 429 75 -570 -630 -182 404 72 -440 -537 290 653 -29 -370 -120 572 511 60 -480 -172 463
3949 463 204 -584 -845 -335 332 157 -363 -577 -65 599 310 -203 -96 479 712 104 -487 -206 241 199
3969 199 -308 -789 -403 192 244 -104 -260 -68 261 494 293 33 205 288 30 -225 -178 -70 -231 -139 -258
3990 -258 -335 -233 1 55 -10 91 154 106 238 325 157 -123 -154 43 -22 -137 -292 -460 -81 94 -124 -335 -128
4013 -128 420 453 95 -45 121 455 337 -172 -425 -93 41 -146 -424 -459 -146 137 -36 -140 -201 428 594
4034 594 133 -181 13 460 349 -54 -508 -434 61 115 -311 -603 -322 222 376 -22 -140 28 419 434 76
4055 76 -124 88 191 -258 -324 -187 -130 -101 -16 -355 -253 117 283 123 85 -10 122 323 213 41 -219 -87
4077 -87 -31 -80 -176 -307 -323 -168 124 114 -26 -122 325 372 218 219 -58 105 305 -58 -378 -296 -63 166 -316 -288
4101b88P2K63K46k54k92J75O77K7o03k94K19J91K21m37n00J52M44J82m99j28J68
4122b58N22J65j62m39P4O33n6n19m50L09J71n0k57k33J27M88N0k52q6L06K73Q5
4144D41k96j23J7L74j30m08l04N0L90K3k25k65J33M32K11j50j22lK62L1m9m00
4166a11K5J18j70K8k95K58J90o8j65j71K15M29J87l72k13J89K57J19l89m24j46
4187e09M30L18l45l46m4L43M16r0k20q6M84Q6l58k42J88K70k08l02j90M4M16J55
4209B10m02l29L19N23o0k24j33Q2L87J36m58j89J00J65j96k37q0K23J65L0k01
4230a69k24N23K22k40n3m6K01l2l4k21l2M5j6q4k08K61l4K07p3N7j25J84J88N
4254C02j27j19j09M1R6n2k90n8J52j15J76jN3pL05L3k41O2K78k51P5k31o2Q2J2
$$ plain form
4101 -288 -216 47 293 39 -253 -78 599 626 23 -271 -52 139 360 -77 -577 -425 19 201 -298 -426 -258
4122 -258 264 429 267 -172 -98 535 479 -40 -490 -181 -10 -60 -317 -550 -423 65 115 -137 -223 83 356 441
4144 441 145 22 39 413 283 -125 -429 -379 11 34 -191 -456 -323 109 320 170 48 45 307 338 289 -111
4166 -111 -86 32 -138 -110 -405 -147 43 -25 -190 -361 -146 283 470 98 -115 74 331 450 61 -363 -509
4187 -509 -79 239 -106 -452 -496 -153 263 173 -47 -133 351 437 79 -163 25 295 87 -215 -405 -361 55 210
4209 210 -192 -521 -202 321 261 37 -96 -14 373 509 51 -138 -38 127 -69 -306 -386 -163 2 32 -169
4230 -169 -393 130 352 112 59 13 214 182 148 -73 -105 -60 -76 -160 -368 -107 -141 66 -7 50 -75 109 297 302
4254 302 175 56 -53 -12 84 32 -258 -316 -164 -279 -103 -104 -51 -58 247 280 39 101 379 128 203 -28 -90 -8 4
4279Dq5k59L3K29J26k14L2K44J11Mq9j23J75P2n0l19L3J56j90m4m3j03O2J42Q4
4304a2o1K21R9L7j54N7QJ73l51k20j10J41L20k46k25J9K28J27J78k66R0K03M3
4327B99k58j4K08L7l27j33M8J9k5Mk90L05L11O7j87j84K63L3J57j16q3n2j7O0
4351A25k75k7O6Nj34l4K66j2J00p5KJ64J62j49k97J86J76j63k08j79N4J57l4j81
4375c05Q8K63J55j64l3J90R7O3k72k11J9L28j43k44j83J66K13l9q1j43J35K52
4397A51J20k06j6J88Jk28N6j85J64j53j15j73P7M18j42j51l2K78J08j56J22mJ20
4420B42r3p0K9r4o2k46nQ8P2m0p5K4L38P9m9j29J42J95j0l03q4N5P4j31k77k1
4446c51J72K73j42j46M6L77J26l37K1n3K43J39l47l37OL86P0l89k07Q0M34Q7j44
$$ plain form
4279 4 -81 -340 -307 -78 48 -166 -134 110 221 225 136 13 188 260 210 -109 -76 80 -110 -154 -197 -300 -238 -96 -12
4304 -12 -73 148 247 284 130 187 195 368 17 -203 -313 -172 148 -98 -323 -304 -76 51 229 -37 53 256 299
4327 299 41 27 235 272 -55 -188 -140 -121 -146 -142 -432 -127 184 251 64 -120 143 176 333 217 134 82 65 125
4351 125 -150 -177 -111 -106 -240 -274 -8 -20 80 5 7 171 333 184 -113 73 249 86 -122 -301 -247 -90 -124 -305
4375 -305 -217 46 201 37 4 194 291 354 82 -129 -110 218 75 -169 -352 -186 27 -12 -93 -236 -101 151
4397 151 271 65 49 237 238 10 66 -119 45 -108 -223 -396 -319 99 -43 -194 -226 52 160 4 126 122 242
4420 242 149 79 108 14 -48 -294 -299 -211 -139 -179 -254 -230 108 187 138 9 151 346 336 33 -51 4 78 -53 -330 -351
4446 -351 -179 94 -48 -194 -148 229 355 18 39 -14 229 368 21 -316 -310 76 146 -243 -450 -370 64 151 7
4469Gj43J88K63j21r0k9J0N8k24m9m1J62P8k34j55J52K6J12N9o1Q8J17l1j9j3
4494A10J59k35l33J99%k9r4O9L0P4k6n8J04J58J74j32k37R6J23M7j67k67L4K47
4518D6o8j01j48J78K23O3k13k5K47Q5k2k89p1K76l8k77k98J95J09J41m0j33m2
4541b02J43K87r2j3L7Ol6L2j4j76Q4j72k33J81J19Q4j86O1N3L1R8J28j26P0Q8
4566B52j50k46J76k0j80o8O3P0k1Q2j44K40l6J60k61J72M5J51j31k01J32j35J03
4589E3j04k47O5P4J04j10n4Q2K18J11j42Kj2K44j17l03J20Q3l2j96p0l7J37J33
4613Bo2k5Q3N8O1R6m9j28o8J34j99j54J12J61j42j19J08J5J96k0o1m8K00Q3K0
4638B54j66P8j25M9p6p3j43K1J01N6p2k5J21L9O7K1L2o5R6o7o5j01m3M9k3j52
$$ plain form
4469 7 -136 52 315 194 104 75 85 143 -81 -130 -171 -9 69 -165 -320 -168 -142 -30 29 -32 56 173 142 123 110
4494 110 269 34 -299 -100 -100 -129 -223 -154 -124 -50 -76 -134 -30 128 302 170 -67 29 152 199 32 -235 -201 46
4518 46 -22 -123 -271 -93 130 193 -20 -45 202 287 265 -24 -95 181 143 -134 -432 -237 -128 13 -27 -160 -202
4541 -202 -59 228 136 123 160 166 130 162 148 -28 56 -116 -349 -168 -49 35 -151 -90 -37 -6 92 220 94 164 252
4566 252 102 -144 32 12 -168 -236 -173 -103 -124 -42 -186 54 18 178 -83 89 134 285 154 -47 85 -50 53
4589 53 -51 -298 -233 -159 -55 -165 -219 -137 81 192 50 52 40 284 167 -136 -16 67 35 -161 -231 -268 -131 2
4613 2 -60 -85 -2 56 117 213 164 36 -32 102 -97 -251 -139 22 -120 -239 -131 -116 80 60 -1 -49 151 234 254
4638 254 88 166 41 90 14 -59 -202 -181 -80 -24 -96 -121 0 39 106 127 159 94 190 123 58 -43 -86 -37 -60 -212
4664b12L5Q6O0j9j60K8K90J14J7k36p4J02J83L6l47p7M3J08O3j27m9j14L37Kj44
$$ plain form
4664 -212 -177 -91 -31 -50 -210 -182 108 222 239 3 -71 31 214 250 -97 -174 -131 -23 40 -87 -136 -250 87 89 -55
$$ [...]
16383B0
##END NTUPLES=NMR FID
##END=
