##TITLE=abcd
##JCAMPDX= 6.0         $$ Bruker NMR JCAMP-DX V2.0
##DATA TYPE= NMR SPECTRUM
##DATA CLASS= NTUPLES
##ORIGIN= UXNMR, Bruker Analytische Messtechnik GmbH
##OWNER= root
$$ XWIN-NMR		Version 3.5
$$ Tue Aug 26 11:09:52 2025 Russian Standard Time (UT+4h)  servis@DPX200
##.OBSERVE FREQUENCY= 200.131235884673
##.OBSERVE NUCLEUS= ^1H
##.ACQUISITION MODE= SIMULTANEOUS
##.ACQUISITION SCHEME= undefined
##.AVERAGES= 32
##.DIGITISER RES= 18
##SPECTROMETER/DATA SYSTEM= spect
##.PULSE SEQUENCE= zg
##.SOLVENT NAME= CDCl3
##.SHIFT REFERENCE= (INTERNAL, CDCl3, 0, 16.4885)
##AUDIT TRAIL= $$ (NUMBER, WHEN, WHO, WHERE, WHAT)
$$ ##TITLE= Audit trail, XWIN-NMR		Version 3.5
$$ ##JCAMPDX= 5.01
$$ ##ORIGIN= Bruker BioSpin GmbH
$$ ##OWNER= servis
$$ F:\spectra/data/av/nmr/H1/1/pdata/1/auditp.txt
$$ ##AUDIT TRAIL=  $$ (NUMBER, WHEN, WHO, WHERE, WHAT)
(   1,<2025-08-26 11:09:16.14 +0400>,<servis>,<DPX200>,
      <created by zg, POWCHK disabled, PULCHK disabled
       configuration hash MD5:
       00 E9 B6 7A A2 85 ED C7 34 08 36 98 17 FE 4E 26
       data hash MD5: 32K
       EA BD 2B F8 5C 4F 38 EF AF 91 58 8C 4E 35 9F 37>)
(   2,<2025-08-26 11:09:17.92 +0400>,<servis>,<DPX200>,
      <Start of raw data processing
       efp BC_mod = 2 LB = 0.05 FT_mod = 6 PKNL = 1 PHC0 = -275.9419 PHC1 = 0.101552 SI = 16K 
       data hash MD5: 16K
       6A F7 2D DA CE 59 F7 D0 79 5D AC EB B0 9D CE 5A>)
$$ ##END=
$$ 
$$ hash MD5
$$ 4B 0E EC DE E5 11 E3 6D 44 F5 36 DD 59 38 83 F2
##$RELAX= 
##$RELAX= 
##$RELAX= 
##$RELAX= 
##$RELAX= 
##$RELAX= 
##$RELAX= 
##$RELAX= 
$$ Bruker specific parameters
$$ --------------------------
##$DU= <F:\spectra>
##$EXPNO= 1
##$NAME= <H1>
##$PROCNO= 1
##$TYPE= <nmr>
##$USER= <av>
##$AMP= (0..31)
100 100 100 100 100 100 100 100 100 100 100 100 100 100 100 100 100 100 
100 100 100 100 100 100 100 100 100 100 100 100 100 100 
##$AQSEQ= 0
##$AQ_mod= 1
##$AUNM= <au_zg>
##$AUTOPOS= <>
##$BF1= 200.13
##$BF2= 200.13
##$BF3= 200.13
##$BF4= 200.13
##$BF5= 500.13
##$BF6= 500.13
##$BF7= 500.13
##$BF8= 500.13
##$BYTORDA= 1
##$CFDGTYP= 0
##$CFRGTYP= 5
##$CHEMSTR= <none>
##$CNST= (0..31)
1 1 145 1 1 1 1 1 1 1 1 1 1 1 1 1 1 1 1 1 1 1 1 1 1 1 1 1 1 1 1 1 
##$CPDPRG= <>
##$CPDPRG1= <>
##$CPDPRG2= <>
##$CPDPRG3= <>
##$CPDPRG4= <mlev>
##$CPDPRG5= <mlev>
##$CPDPRG6= <mlev>
##$CPDPRG7= <mlev>
##$CPDPRG8= <mlev>
##$CPDPRGB= <>
##$CPDPRGT= <>
##$D= (0..31)
0 2 0 0 0 0 0 0 0 0.06 0 0 0 0 0 0 0.0002 0 0 0 0 0 0 0 0 0 0 0 0 0 0 
0 
##$DATE= 1756192155
##$DBL= (0..7)
120 120 120 120 120 120 120 120 
##$DBP= (0..7)
150 150 150 150 150 150 150 150 
##$DBP07= 0
##$DBPNAM0= <>
##$DBPNAM1= <>
##$DBPNAM2= <>
##$DBPNAM3= <>
##$DBPNAM4= <>
##$DBPNAM5= <>
##$DBPNAM6= <>
##$DBPNAM7= <>
##$DBPOAL= (0..7)
0.5 0.5 0.5 0.5 0.5 0.5 0.5 0.5 
##$DBPOFFS= (0..7)
0 0 0 0 0 0 0 0 
##$DE= 6
##$DECBNUC= <off>
##$DECIM= 32
##$DECNUC= <off>
##$DECSTAT= 4
##$DIGMOD= 1
##$DIGTYP= 9
##$DL= (0..7)
0 120 120 120 120 120 120 120 
##$DP= (0..7)
150 150 150 150 150 150 150 150 
##$DP07= 0
##$DPNAME0= <>
$$ [...]
##$SUBNAM4= <"">
##$SUBNAM5= <"">
##$SUBNAM6= <"">
##$SUBNAM7= <"">
##$SUBNAM8= <"">
##$SUBNAM9= <"">
##$SW= 20.6817932712277
##$SWIBOX= (0..15)
0 0 3 0 0 0 0 0 0 0 0 0 0 0 0 0 
##$SW_h= 4139.07284768212
##$TD= 32768
##$TD0= 1
##$TE= 0
##$TE2= 300
##$TE3= 300
##$TEG= 300
##$TL= (0..7)
0 120 120 120 120 120 120 120 
##$TP= (0..7)
150 150 150 150 150 150 150 150 
##$TP07= 0
##$TPNAME0= <>
##$TPNAME1= <>
##$TPNAME2= <>
##$TPNAME3= <>
##$TPNAME4= <>
##$TPNAME5= <>
##$TPNAME6= <>
##$TPNAME7= <>
##$TPOAL= (0..7)
0.5 0.5 0.5 0.5 0.5 0.5 0.5 0.5 
##$TPOFFS= (0..7)
0 0 0 0 0 0 0 0 
##$TUNHIN= 0
##$TUNHOUT= 0
##$TUNXOUT= 0
##$USERA1= <user>
##$USERA2= <user>
##$USERA3= <user>
##$USERA4= <user>
##$USERA5= <user>
##$V9= 5
##$VALIST= <valist>
##$VCLIST= <CCCCCCCCCCCCCCC>
##$VD= 0
##$VDLIST= <DDDDDDDDDDDDDDD>
##$VPLIST= <PPPPPPPPPPPPPPP>
##$VTLIST= <TTTTTTTTTTTTTTT>
##$WBST= 1024
##$WBSW= 30
##$XGAIN= (0..3)
0 0 0 0 
##$XL= 0
##$YL= 0
##$YMAX_a= 1561350
##$YMIN_a= -1495199
##$ZGOPTNS= <>
##$ZL1= 120
##$ZL2= 120
##$ZL3= 120
##$ZL4= 120
##$ABSF1= 0
##$ABSF2= 0
##$ABSG= 0
##$ABSL= 0
##$ALPHA= 0
##$AQORDER= 0
##$ASSFAC= 0
##$ASSFACI= 0
##$ASSFACX= 0
##$ASSWID= 0
##$AUNMP= <proc_1d>
##$AZFE= 0.1
##$AZFW= 0.1
##$BCFW= 0
##$BC_mod= 2
##$BYTORDP= 0
##$COROFFS= 0
##$CY= 18.4799938201904
##$DATMOD= 1
##$DC= 0
##$DFILT= <>
##$DTYPP= 0
##$F1P= 9.9274215381318
##$F2P= -0.165520771350173
##$FCOR= 1
##$FTSIZE= 16384
##$FT_mod= 6
##$GAMMA= 0
##$GB= 0
##$INTBC= 1
##$INTSCL= 4.127829e-11
##$ISEN= 128
##$LB= 0.05
##$LEV0= 0
##$LPBIN= 0
##$MAXI= 10000
##$MC2= 0
##$MEAN= 0
##$ME_mod= 0
##$MI= 50
##$NCOEF= 0
##$NC_proc= -5
##$NLEV= 6
##$NOISF1= 3.799351
##$NOISF2= 2.8
##$NSP= 0
##$NTH_PI= 0
##$NZP= 0
##$OFFSET= 16.48848
##$PC= 4
##$PHC0= -275.9419
##$PHC1= 0.101552
##$PH_mod= 1
##$PKNL= yes
##$PPARMOD= 0
##$PSCAL= 4
##$PSIGN= 0
##$REVERSE= no
##$SF= 200.130005582386
##$SI= 16384
##$SIGF1= 3
##$SIGF2= 2
##$SINO= 400
##$SIOLD= 16384
##$SREGLST= <1H.CDCl3>
##$SSB= 0
##$STSI= 16384
##$STSR= 0
##$SW_p= 4139.07284768211
##$SYMM= 0
##$S_DEV= 0
##$TDeff= 32768
##$TDoff= 0
##$TI= <>
##$TILT= no
##$TM1= 0
##$TM2= 0
##$TOPLEV= 0
##$USERP1= <user>
##$USERP2= <user>
##$USERP3= <user>
##$USERP4= <user>
##$USERP5= <user>
##$WDW= 1
##$XDIM= 16384
##$YMAX_p= 340782413
##$YMIN_p= -2147521
$$ End of Bruker specific parameters
$$ ---------------------------------
##NTUPLES= NMR SPECTRUM
##VAR_NAME=  FREQUENCY,     SPECTRUM/REAL,   SPECTRUM/IMAG
##SYMBOL=    X,             R,               I
##VAR_TYPE=  INDEPENDENT,   DEPENDENT,       DEPENDENT
##VAR_FORM=  AFFN,          ASDF,            ASDF
##VAR_DIM=   16384,         16384,           16384
##UNITS=     HZ,            ARBITRARY UNITS, ARBITRARY UNITS
##FACTOR=    0.252644378177508, 1,           1
##FIRST=     3299.83951724647, 0,            0
##LAST=      -839.233330435636, 0,           0
##MIN=       -839.233330435636, -2147521,    0
##MAX=       3299.83951724647, 340782413,    0
$$ Real data points
##PAGE= N=1
##DATA TABLE= (X++(R..R)), XYDATA
$$ [...]
6792C22258p1673q6289k5104J8667Q1444k9966M1605k8453Q3306p2386p7L234
$$ 322258 250585 164296 139192 157859 239303 209337 250942 222489 305795 233409 233332 236566
6780B36566L3197l2977N5000n6118p8908J68437l4575M900m83K1608j35084J07381
$$ 236566 269763 236786 291786 235668 156760 325197 290622 295522 295039 316647 181563 288944
6768B88944m1881J4458n469j4424M7325n235n4284P7486n5140J6830q7797Q5084
$$ 288944 247063 261521 256052 241628 288953 283718 229434 306920 251780 268610 180813 265897
6756B65897n0586P2698k2514l8822N7162j95654L30190j52826r1780P6639N9867
$$ 265897 215311 288009 265495 226673 283835 88181 418371 265545 173765 250404 310271
6745C10271j7079L0819m6807M3454k1799o3253O8607j8786P4495j15552K2315
$$ 310271 293192 324011 277204 320658 298859 235606 304213 285427 359922 244370 266685
6734B66685J05712J07R68k5012o3450P4925r8381P0378O1129o0852J1726m4662
$$ 266685 372397 372504 373472 348460 285010 359935 261554 331932 393061 332209 343935 299273
6722B99273M2998n8067Q8449O8868j21824Q0930K1619j50299L6839J09806l2209
$$ 299273 342271 284204 372653 441521 319697 400627 422246 271947 308786 418592 386383
6711C86383J6299j5537p2K429k0462J1842K8008k7151R7640q2213N4251j30819
$$ 386383 402682 387145 387073 389502 369040 380882 408890 381739 479379 397166 451417 320598
6699C20598J8938P8382J8079r0400K3377j5224K0997n9479J3924K0234j5804k8218
$$ 320598 339536 417918 435997 345597 368974 353750 374747 315268 329192 349426 333622 305404
6687C05404m0516J4523L8396K7914l674M3037j06930R1215j36030P3661k6039
$$ 305404 264888 279411 317807 345721 342047 385084 278154 369369 233339 307000 280961
6676B80961l0380P3724k5761l6007L1970n5171Q2204Q770p4947j54968J66998
$$ 280961 250581 324305 298544 262537 294507 239336 321540 330310 255363 100395 267393
6665B67393l4958M4040j21885R1924N5673p2319p1256O8994M5657n4549N0398
$$ 267393 232435 276475 154590 246514 302187 229868 158612 227606 273263 218714 269112
6654B69112m8926Q0063j12571J76233q4687l0558p7984J17790j01496l586k0494
$$ 269112 220186 300249 187678 363911 279224 248666 170682 288472 186976 183390 162896
6643A62896P6034N6352l5079p8654R3630j58935P1242L5573n0003j9552J19318
$$ 162896 238930 295282 260203 181549 275179 116244 187486 223059 173056 153504 272822
6632B72822o4825m6525M0098j3863M6547p2665L0892J3439j8062P124p2280M2969
$$ 272822 207997 161472 201570 187707 234254 161589 192481 205920 187858 194982 122702 165671
6620A65671N3559j09647M3392N5857k4869K5033L4881q1965m208M0594o1172N8482
$$ 165671 219230 109583 152975 208832 183963 208996 243877 161912 157704 198298 137126 195608
6608A95608j33943J04416k8627K7604J59506j53288M8250j3366j5511m207L9704
$$ 195608 61665 166081 137454 165058 324564 171276 219526 206160 190649 186442 226146
6597B26146r9421P8377M2364n135r4466R772j0543o3834J16057n9423L3090p643
$$ 226146 126725 205102 247466 242331 147865 157637 147094 83260 199317 139894 172984 165341
6585A65341J3524j3908j5398Q8298q9332M1915J2401N998J5215p5283j3983N0102
$$ 165341 178865 164957 149559 237857 148525 190440 202841 208839 224054 148771 134788 184890
6573A84890p6299R3979j767j07794N7157l7736n5892J75487n8795l245M6454j02383
$$ 184890 108591 202570 200803 93009 150166 112430 56538 232025 173230 169985 216439 114056
6561A14056O0312M9458K7966o4986J8262L3520J5691m1898K0411p1470O3136o7310
$$ 114056 174368 223826 251792 186806 205068 238588 254279 212381 232792 161322 224458 157148
6549A57148P662K8647j61582J37105j13557O4876M2200l1861P4709l5103K1893
$$ 157148 164810 193457 31875 168980 55423 120299 162499 130638 205347 170244 192137
6538A92137o1962J6848j01944R8124r749N2463p158M8985q02n1593L0484Q8354
$$ 192137 130175 147023 45079 143203 133454 185917 178759 227744 226942 175349 205833 294187
6526B94187r1367o6603M636j2234J00649j7908L5245j37686J09158r2130M5002
$$ 294187 202820 136217 140853 128619 229268 211360 246605 108919 218077 125947 170949
6515A70949N788L7405N858o5789J3418m882j5152O1149j9514P5953j89934O9641
$$ 170949 176737 214142 220000 154211 167629 162747 147595 208744 189230 265183 75249 144890
6503A44890O9120l1567o2622q342O6489m5648N4967K4004L0352j57442M2811O8075
$$ 144890 214010 182443 119821 111479 177968 132320 187287 211291 241643 84201 127012 195087
6491A95087o4309K1163O62K8126j2280L7020j31139J13438N9921r5710o0063J71712
$$ 195087 130778 151941 152603 180729 168449 205469 74330 187768 247689 151979 91916 263628
6479B63628j69908J8481K3988O8758N9010j6706q5636p536J69683j18602j90391
$$ 263628 93720 112201 136189 204947 263957 247251 161615 154079 323762 205160 14769
6468A4769K16781m3466r4230Q5296M2857m2434n7173M7792k5127P4388o3678j472
$$ 14769 231550 188084 93854 179150 222007 179573 122400 170192 145065 219453 155775 154303
6456A54303L3194L6097K5109m288k316r9310l1080J86145j56713J9359N2147o7949
$$ 154303 187497 223594 248703 244415 242099 142789 111709 297854 141141 160500 212647 144698
6444A44698J02269r9176J7719K1252j1298J511j8019J2018Q382P8250p6290k1905
$$ 144698 246967 147791 165510 186762 175464 176975 158956 170974 179356 257606 181316 159411
6432A59411K7643q0889j3420L8079J07505n5279R019K1861K7889m7907k2143L2797
$$ 159411 187054 106165 92745 130824 238329 183050 192069 213930 241819 193912 171769 204566
6420B04566l4200J98R094O7344n9811m2271M1392P2778o5026J580L1134n4368
$$ 204566 170366 170564 179658 247002 187191 144920 186312 259090 194064 195644 226778 172410
6408A72410l2952l8169M1435P6575j27835M7230K6669L8239J6622O535N3j7570
$$ 172410 139458 101289 142724 219299 91464 138694 165363 203602 220224 226759 226812 209242
6396B09242k8720Q9157N320r4798L0474L954j12762J24821M5702k03438J27865
$$ 209242 180522 269679 274999 180201 210675 214629 101867 226688 272390 68952 196817
6385A96817j29996J29147M4216r2304O6991m7705M3469R1508q8900m94J4518p152
$$ 196817 66821 195968 240184 147880 214871 167166 210635 302143 213243 212749 227267 220115
6373B20115M3851o3836J5952j0610N3789p9160m1745N2511M3570J3615r9955L1971
$$ 220115 263966 200130 216082 205472 259261 180101 138356 190867 234437 248052 148097 180068
6361A80068L5261n6256K7516L1572m229P834l7648L3019l9603L3145k7500Q8377
$$ 180068 215329 159073 186589 218161 213932 221766 184118 217137 177534 210679 183179 271556
6349B71556r7394J00784q0174J7864J7609P1786r6115M5852M2675L8127n8129
$$ 271556 174162 274946 194772 212636 230245 302031 205916 251768 294443 332570 274441
6338B74441j07966J44288j13337J3818k3901P0110l0123m5192m5136Q3385j0909
$$ 274441 166475 310763 197426 211244 187343 257453 227330 182138 137002 220387 209478
6327B09478J5347L2743l3469O9416q4515k735l2384K7977l174O7503l9485o5111
$$ 209478 224825 257568 224099 293515 209000 206265 173881 201858 198684 266187 226702 161591
6315A61591J9238q1126J67092L1280p9375K5782o1408J6733R2395p7904k5462
$$ 161591 180829 99703 266795 298075 218700 244482 183074 199807 292202 214298 188836
6304A88836K3386p3207N3800J7803Q7953j8631J0190o3273j3404K6500p2942P1117
$$ 188836 212222 139015 192815 210618 298571 279940 290130 226857 213453 239953 167011 238128
6292B38128O1005m2935J5078L275m026n6443K7770j09149J38169l8711R8777p4505
$$ 238128 299133 256198 271276 274551 270525 214082 241852 132703 270872 232161 330938 256433
6280B56433j7738M8740L1773j34875Q0422M2692j29863P7479R6385j26843L0807
$$ 256433 238695 287435 319208 184333 264755 307447 177584 255063 351448 224605 255412
6269B55412l2677Q8409q8687j3788J27363q9625j4817N4581o0546O9238m9881
$$ 255412 222735 311144 222457 208669 336032 246407 231590 286171 225625 294863 244982
6258B44982Q1992n4751J05706j55570l8299J54145p4870j4770P990K4181j24916
$$ 244982 326974 272223 377929 222359 184060 338205 263335 248565 256555 280736 155820
6247A55820Q3150l0404j3335R405J04182m0158J9891n119l1058L6421q275Q104
$$ 155820 238970 208566 195231 204636 308818 268660 288551 283432 252374 288795 280520 288624
6235B88624m5661M9168n2058O0695k2330M321p5949J9072l5610R3607J7475l397
$$ 288624 242963 292131 240073 300768 278438 282759 206810 225882 190272 283879 301354 297957
6223B97957j11033M973J6676Q5923J835m1658o833l2414J819R9194j27812L0958
$$ 297957 186924 191897 208573 294496 296331 254673 247840 215426 217245 316439 188627 219585
6211B19585K9657O369M8651j82985J76872r6126J04824m3103l0400M5061r8056
$$ 219585 249242 255611 304262 121277 298149 202023 306847 263744 233344 278405 180349
6200A80349J55979l0606q1381J4876M9185m5016m8568P2200J9246l410l4798l4445
$$ 180349 336328 305722 224341 239217 288402 243386 194818 267018 286264 282854 248056 213611
6188B13611L5374M1872l7749P2533p3201l5856j0968J5197R5741J386k7524k3957
$$ 213611 248985 290857 253108 325641 252440 216584 205616 220813 316554 317940 290416 266459
6176B66459n2347J46K5779P871L8348M2945n2007J1866n1053O9039m6247J5323
$$ 266459 214112 214258 240037 247908 286256 329201 277194 289060 238007 307046 260799 276122
6164B76122N8315r776k0307n4947O704J2697J4187P580q8835J24775n1001L9284
$$ 276122 334437 324661 304354 249407 256111 268808 282995 290575 201740 326515 275514 314798
6152C14798r7862Q5657o1732M7064L2892K1090l5668m3358l5878k6952M3435P6736
$$ 314798 216936 302593 240861 287925 320817 341907 306239 262881 227003 200051 243486 320222
6140C20222j14039R5532m0667M3909m3285J4318j3518J05442r6725O4302m2723
$$ 320222 206183 301715 261048 304957 261672 275990 262472 367914 271189 335491 292768
6129B92768L0824k0749O730o6368P2307k5969L3840n8613L9394N2282q7751J3348
$$ 292768 323592 302843 309573 243205 315512 289543 323383 264770 304164 356446 268695 282043
6117B82043K8344N5669m0106p5385m8752R5210o8710O2157Q7049q5870j1613R0445
$$ 282043 310387 366056 325950 250565 201813 297023 228313 290470 377519 291649 280036 370481
6105C70481k7964K1019p8361O3394r7319J37317j25680L5322L4760q7766J19705
$$ 370481 342517 363536 285175 348569 251250 388567 262887 298209 332969 245203 364908
6094C64908j28121R4096p8694M2206j0171Q6078p6463k6127p538l1401J46814
$$ 364908 236787 330883 252189 294395 284224 370302 293839 267712 260174 228773 375587
6083C75587l8371l2380O337O381M8359o8981Q912k5824j0116R9508p6836O9562
$$ 375587 337216 304836 311173 317554 365913 296932 305844 280020 269904 369412 292576 362138
6071C62138n3576j7591J503q460O049J8188Q7478m7041r0434O7875P0892q8922
$$ 362138 308562 290971 292474 284014 290063 308251 395729 348688 258254 326129 397021 308099
6059C08099o0481O3673O6113N0524j03482j3648k09J8263N2365j02126N5406J922
$$ 308099 247618 311291 377404 427928 324446 310798 310589 328852 381217 279091 334497 336419
6047C36419k283M5722o3196K3732l1300O3607j01241O3318K5487j9778m3893J43647
$$ 336419 334136 379858 316662 340394 309094 372701 271460 334778 360265 340487 296594 440241
6035D40241o4198P3n7500J02499j14821p52J5456P517N0232n3311K5110K1948
$$ 440241 376043 376116 318616 421115 306294 305542 320998 328515 378747 325436 350546 372494
6023C72494o395N2502J6135j15321R3266l056q1851L4393M6747m5009M0866j01176
$$ 372494 366099 418601 434736 319415 412681 409625 327774 362167 408914 363905 404771 303595
6011C03595P1064O4362p6808M3087l3134N608Q793K7948M9344p2510p2921O1485
$$ 303595 374659 439021 362213 405300 372166 377774 386567 414515 463859 391349 318428 379913
5999C79913P564L3486l4353l9799L7360M9615o5760J461K4275M6988p2373l6946
$$ 379913 387477 420963 386610 346811 384171 433786 368026 369487 393762 440750 368377 331431
5987C31431m3097l491J81167n1778k5764j07101L8177J50450j06477R352l7867
$$ 331431 288334 284843 466010 414232 388468 281367 319544 469994 363517 372869 335002
5976C35002L9249l7146M9626p2265Q1843J651j11809J15508J1816J264j8155l0737
$$ 335002 374251 337105 386731 314466 396309 397960 286151 401659 413475 414739 396584 365847
5964C65847M9166O764J26040j04273k7221R706l0872O9691r6557P3870p4699N3588
$$ 365847 415013 421777 547817 443544 416323 426029 395157 464848 368291 442161 367462 421050
5952D21050Q5831j20700M0082l9661J11564q6468L1317J6778n0364l1760M9274
$$ 421050 506881 386181 426263 386602 498166 411698 443015 459793 409429 377669 426943
5941D26943p0378P538L0298N8418Q4262q9070m7694P5026o0081J00831j63182
$$ 426943 356565 364103 394401 452819 537081 448011 400317 475343 415262 516093 352911
5930C52911k5240O2389J10040j2793J129j23277Q1894J3202J1853p4036K7195
$$ 352911 327671 390060 500100 487307 488436 365159 447053 460255 472108 398072 425267
5919D25267J24256j10701q3116J17485J3506L6444k1551o4515J771R098o7430
$$ 425267 549523 438822 355706 473191 486697 523141 501590 437075 438846 447944 380514
5908C80514J07393q9837O6866J313M6837k3932N926O0747J6245j09220L5022l6777
$$ 380514 487907 398070 464936 466249 513086 489154 495080 555827 572072 462852 497874 461097
5896D61097R015L7294K1218n7211L4210j552O9083l6398j23424J13440L4004j19211
$$ 461097 470112 507406 528624 471413 505623 504071 573154 536756 413332 526772 560776 441565
5884D41565M7205Q8043j37804J54751j5092j9341K1540o0987P3538j02515J01246
$$ 441565 488770 576813 439009 593760 578668 559327 580867 519880 593418 490903 592149
5873E92149p7780O2241M5802j739p1441o320k679M3598k9084l709N5079J9343
$$ 592149 514369 576610 622412 620673 549232 542912 540233 583831 554747 551038 606117 625460
5861F25460p4752M7486K752R1072j76832Q0369O725R6949j39679J0197Q7572l5231
$$ 625460 550708 598194 600946 692018 515186 595555 602280 699229 559550 569747 657319 622088
5849F22088Q450Q4606p5035J38325P57j23665J4667N2307P0208p8866l6270m0944
$$ 622088 630538 715144 640109 778434 779191 655526 670193 722500 792708 713842 677572 636628
5837F36628O8801M1520l9490q597j0956o5074J15098M5146L1624n3957P4420k8789
$$ 636628 705429 746949 707459 698862 687906 622832 737930 783076 814700 760743 835163 806374
5825H06374K441P5127P6138q5709M0434q5156K4870K5677J7053m0888N8974J0264
$$ 806374 808815 883942 960080 874371 914805 829649 854519 880196 897249 856361 915335 925599
5813I25599M7585N9730q7705j8767L5852r8981J11775p4893O046j4673P7568p48
$$ 925599 973184 1032914 945209 926442 962294 863313 975088 900195 906241 891568 969136 968388
5801I68388k5069J0738l0200q8393O9078n9727j02558J82205j44304j084L1761
$$ 968388 943319 954057 923857 835464 904542 844815 742257 924462 780158 779074 810835
5790H10835q1778J8076K5737K782P6698j18371M3777L7180k7981j089k7559k6884
$$ 810835 729057 747133 772870 775652 852350 733979 777756 814936 786955 785866 758307 731423
5778G31423K4173q2379n371P9436o6401P3751k212k3021K7811k9153n8733o8413
$$ 731423 755596 673217 667846 747282 680881 754632 752420 729399 757210 728057 669324 600911
5766F00911J61636q7236o8153J5000K3902m455p7106P6756Q6667q1305M6932n4206
$$ 600911 762547 675311 607158 622158 646060 641605 564499 641255 727922 646617 693549 639343
5754F39343j8362R449j16495J46802K8594n3878k9317O604N5531m1513K0895N2293
$$ 639343 620981 630430 513935 660737 689331 635453 606136 612740 668271 626758 647653 699946
5742F99946j13071j6463k7420R8781k5538j3137k5978M6985j4295M5410p8542
$$ 699946 586875 570412 542992 641773 616235 603098 577120 624105 609810 655220 576678
5731E76678K3026j194o4698K07288j50423Q8427k2149q9570K9017M5590k6177
$$ 576678 599704 598510 533812 741100 590677 679104 656955 567385 596402 641992 615815
5720F15815N2317j4741r110J6393M334L425j7812L5152o6237q35K0643O5525j3962
$$ 615815 668132 653391 644281 660674 665008 668433 650621 685773 619536 618701 639344 704869 690907
5707F90907r0922j1392l542K7069J05146r7751J17476j92091J24131q472K4353
$$ 690907 599985 588593 585051 612120 717266 619515 736991 544900 669031 660559 684912
5696F84912J9148L0223l310K1569j0122P971o7405p2615N6695o0381K5929L3111
$$ 684912 704060 734283 730973 752542 742420 750391 682986 610371 667066 606685 632614 665725
5684F65725K1384q5994J85781k8069j06802J10327j09341P0970m5954J43129o4189
$$ 665725 687109 601115 786896 758827 652025 762352 653011 723981 678027 821156 756967
5673G56967o6298J0202N6442j47528J29025k4421K7347k6677O9713N259j12535
$$ 756967 690669 700871 757313 609785 738810 714389 741736 715059 784772 790031 677496
5662F77496P8022P2749Q017j18835L7484K1043J4669j4051q3295R0915r7962p29
$$ 677496 755518 828267 836284 717449 754933 775976 790645 776594 693299 784214 686252 685523
5650F85523J00663m1711N7164P5798j29213N2953k8889k4104J75377j40714J17473
$$ 685523 786186 744475 801639 877437 748224 801177 772288 748184 923561 782847 900320
5639I00320j53844R0565q1598L2643N2384k0168K9205q667j00758J00716j03775
$$ 900320 746476 837041 755443 788086 840470 820302 849507 840840 740082 840798 737023
5628G37023M3703m8562O9041n5841M4075K4753q8473J42466o9113M2803J85505
$$ 737023 780726 732164 801205 745364 789439 814192 725719 868185 799072 841875 1027380
5617A027380k70960J21166l0815p632J6065K0180M3259p2414K9963j9500k0958
$$ 1027380 756420 877586 846771 839139 855204 875384 918643 846229 876192 856692 835734
5606H35734Q4863o0998q6475N8922M0914K1496L3213K8777n3498l2199N879o3909
$$ 835734 920597 859599 773124 832046 872960 894456 927669 956446 902948 870749 876628 812719
5594H12719O5707N5139r7378Q3596Q2113m0721j9442j00854k1968J5468k896N4481
$$ 812719 878426 933565 836187 919783 1001896 961175 941733 840879 818911 834379 831483 885964
5582H85964j2953J00190J0931j04985k0984N5368O5581o6638P4725O2289j34390
$$ 885964 873011 973201 984132 879147 858163 913531 979112 912474 987199 1049488 915098
5571I15098J0699N9851n1377P8963n2461J0492n1857N2062o500m0725N7397M7630
$$ 915098 925797 985648 934271 1013234 960773 971265 919408 971470 964970 924245 981642 1029272
5559A029272p0301J6638n461Q797p3586J27652o2553N8781q2455N0944q7266R8348
$$ 1029272 958971 975609 970148 978945 905359 1033011 970458 1029239 946784 997728 910462 1008810
5547A008810j7444Q1274j15518J29580o9696k6683Q1377j135J11955p8197j627
$$ 1008810 991366 1072640 957122 1086702 1017006 990323 1071700 1070565 1182520 1104323 1102696
5536A102696p5601N0423k8851l5078Q5278j35613J49249r2119J03764n9141Q8665
$$ 1102696 1027095 1077518 1048667 1013589 1098867 963254 1112503 1020384 1124148 1065007 1153672
5525A153672k2906K0612j48525J38887l9065N0046J4744k8530m4938R6855k0063
$$ 1153672 1130766 1151378 1002853 1141740 1102675 1152721 1167465 1138935 1093997 1190852 1170789
5514A170789J9261K3635n1325l3125J5153M7069n8406j5960l8866O8118J44954
$$ 1170789 1190050 1213685 1162360 1129235 1144388 1191457 1133051 1117091 1078225 1146343 1291297
5503A291297j24205P1504m9595Q6706k9230l01J43557j17550K9551o592m5485
$$ 1291297 1167092 1238596 1189001 1275707 1246477 1246176 1389733 1272183 1301734 1295142 1249657
5492A249657R6352K5731n5149M9216m6340l1781O9851j14447R8620M0883n7041
$$ 1249657 1346009 1371740 1316591 1365807 1319467 1287686 1357537 1243090 1341710 1382593 1325552
5481A325552N2341j8433j5182Q728l9156O574J06861r3904j9742N3821P3218l7159
$$ 1325552 1377893 1359460 1344278 1353006 1313850 1320424 1427285 1333381 1313639 1367460 1440678 1403519
5469A403519L4847q320K9658l6000Q6914p6020Q7037m2075K8839N8446q784L517
$$ 1403519 1438366 1430046 1459704 1423704 1510618 1434598 1521635 1479560 1508399 1566845 1558061 1561578
5457A561578P698r8183L9217L2894m2108O1934K5386l0087P6814n7696L2074r9893
$$ 1561578 1569276 1471093 1510310 1543204 1501096 1563030 1588416 1558329 1635143 1577447 1609521 1509628
5445A509628P4622o0244J06911K3401q5113J41617J5482j9599O9459j31410l0903
$$ 1509628 1584250 1524006 1630917 1654318 1569205 1710822 1726304 1706705 1776164 1644754 1613851
5434A613851R6435M0693p0662M5212l1185K6438O6510k2400K2181O1314j7841
$$ 1613851 1710286 1750979 1680317 1725529 1694344 1720782 1787292 1764892 1787073 1848387 1830546
5423A830546J2082M5581J4327j3313m2984q4801J50294K4141J9212p9704P6806
$$ 1830546 1842628 1888209 1902536 1889223 1846239 1761438 1911732 1935873 1955085 1875381 1952187
5412A952187K2625m8433k260M2692N6640Q6217j00056k6115O5941l5574J49794
$$ 1952187 1974812 1926379 1924119 1966811 2023451 2109668 2009612 1983497 2049438 2013864 2163658
5401B163658q8151o600N5906J08619m6720j14270P2792N2675J8805K994J09J03646
$$ 2163658 2075507 2068907 2124813 2233432 2186712 2072442 2145234 2197909 2216714 2219708 2219817 2323463
5389B323463o2116M8239Q9909k1953L1466K8431J05060l4703J8531l0571O2133
$$ 2323463 2261347 2309586 2399495 2377542 2409008 2437439 2542499 2507796 2526327 2495756 2557889
5378B557889N6964K6279o4926J90258k8059P2031j01106M9499l526J53293l4746
$$ 2557889 2614853 2641132 2576206 2766464 2738405 2810436 2709330 2758829 2755303 2908596 2873850
5367B873850J6878L867J89544m8326n3313M8680K3416P608Q5261J25433k4588
$$ 2873850 2890728 2894595 3084139 3035813 2982500 3031180 3054596 3062204 3147465 3272898 3248310
5356C248310L0828O6196N0065N3910N9604N1872J2835J20204K2337M5896P8362
$$ 3248310 3279138 3345334 3395399 3449309 3508913 3560785 3573620 3693824 3716161 3762057 3840419
5345C840419R2195J6331J47789m6833P2910K5558J46859O4369P1509P2412J9875
$$ 3840419 3932614 3948945 4096734 4049901 4122811 4148369 4295228 4359597 4431106 4503518 4523393
5334D523393J3490L9712J29058J11183O5717N9130J66446r840J19199K71256k8732
$$ 4523393 4536883 4576595 4705653 4816836 4882553 4941683 5108129 5098289 5217488 5488744 5460012
5323E460012J79800O2793J38170R5105J17091K24390P1364R7852K12525J22570
$$ 5460012 5639812 5702605 5840775 5935880 6052971 6277361 6348725 6446577 6659102 6781672
5313F781672J36792J09185J50915N4677J62222J71101O3205P3486J6206K72197
$$ 6781672 6918464 7027649 7178564 7233241 7395463 7566564 7629769 7703255 7719461 7991658
5303G991658j570L7682m3249M0221K7424J05836P2652J23943k7497P2502J20366
$$ 7991658 7990088 8027770 7984521 8024742 8052166 8158002 8230654 8354597 8327100 8399602 8519968
5292H519968J31489J73336J01908J50777J17958K03142M4663K71979J26010K06959
$$ 8519968 8651457 8824793 8926701 9077478 9195436 9398578 9443241 9715220 9841230 10048189
5282A0048189K46831O3269L63937P0773L15507J08891K35681J81637J89775K89159
$$ 10048189 10295020 10358289 10722226 10792999 11108506 11217397 11453078 11634715 11824490 12113649
5272A2113649J0018K30365L41947J41283K51931J54279J69658J77406L6466P2152
$$ 12113649 12123667 12354032 12695979 12837262 13089193 13243472 13413130 13590536 13627002 13699154
5262A3699154P7181J12059J18686K1656M4421R2330Q3523J02627N9038K55276
$$ 13699154 13776335 13888394 14007080 14028736 14073157 14165487 14249010 14351637 14410675 14665951
5252A4665951J08898J80879K18517J30516K59314K03489L01920L29381K89991
$$ 14665951 14774849 14955728 15174245 15304761 15564075 15767564 16069484 16398865 16688856
5243A6688856K79137M84582N03272O55073N25492N95708O30711P01687O53640
$$ 16688856 16967993 17452575 17955847 18610920 19136412 19732120 20362831 21064518 21718158
5234B1718158Q55083P17706R38008R99452R23590J059434R89797R05709J020516
$$ 21718158 22573241 23290947 24228955 25228407 26151997 27211431 28201228 29106937 30127453
5225C0127453J006723Q15072R49167P19521O23175N32335K58525L26648J22454
$$ 30127453 31134176 31949248 32898415 33617936 34241111 34773446 35031971 35358619 35481073
5216C5481073J23639j31160k08005m41431l77440m47344q19760n80054q43801
$$ 35481073 35604712 35473552 35265547 34824116 34446676 33999332 33179572 32599518 31755717
5207C1755717q79975r47013j114781r98483j114287j117811r09531j061183j019153
$$ 31755717 30875742 29928729 28813948 27815465 26701178 25583367 24673836 23612653 22593500
5198B2593500q08730q18729q77048q38395o72334p33067o62670o73286o29240
$$ 22593500 21784770 20966041 20088993 19250598 18578264 17845197 17182527 16509241 15880001
5189A5880001n97954n80259m58288m09989n21376l19371n17123l78347l63739
$$ 15880001 15282047 14701788 14243500 13833511 13312135 12992764 12475641 12097294 11733555
5180A1733555l95194m17214k63130k38396l97433k45872j55548l20736k30695
$$ 11733555 11338361 10921147 10658017 10419621 10022188 9776316 9620768 9300032 9069337
5171I069337k86432l26851k39493j76315l28841j46940r9337l09651o6471j92571
$$ 9069337 8782905 8456054 8216561 8040246 7711405 7564465 7465128 7155477 7089006 6896435
5161F896435k18466j50459K8417l08946j12235j23800n3310j19258j52725j09041
$$ 6896435 6677969 6527510 6555927 6246981 6134746 6010946 5957636 5838378 5685653 5576612
5151E576612r1246j61409j29288r1280j97225k7898j56229l8895o5219j11337
$$ 5576612 5485366 5323957 5194669 5103389 4906164 4878266 4722037 4683142 4617923 4506586
5141D506586k3458j03114n3306m2227j39627m2738l7718q8592k9320P045r0472
$$ 4506586 4483128 4380014 4326708 4284481 4144854 4102116 4064398 3975806 3946486 3953531 3863059
5130C863059K6942j19754o1570p0448l3388J0104j11050k8250p8200M7952p6040
$$ 3863059 3890001 3770247 3708677 3638229 3604841 3614945 3503895 3475645 3397445 3445397 3369357
5119C369357o0485n910o7489p5899K0054K3151m3139o7110p5903K3111l9947l3007
$$ 3369357 3308872 3302962 3235473 3159574 3179628 3202779 3159640 3092530 3016627 3039738 2999791 2966784
5107B966784K7611j59605L2413j6979J4699o7998J1523o2326j1503n4098o3328
$$ 2966784 2994395 2834790 2867203 2850224 2864923 2796925 2808448 2746122 2734619 2680521 2617193
5096B617193O7611p7478r6516L7124m8094n0211l617m488j7334m3386l9064O347
$$ 2617193 2684804 2607326 2510810 2547934 2499840 2449629 2446012 2441524 2424190 2380804 2341740 2348087
5084B348087j18233J03386j54405K7953o4558M8569j8436O6501j03866j6835l1858
$$ 2348087 2229854 2333240 2178835 2206788 2142230 2190799 2172363 2238864 2134998 2118163 2086305
5073B086305l221o176q914n2892O0038n1721J41643j45546K209R873j15747M4518
$$ 2086305 2083084 2076908 2067994 2015102 2075140 2023419 2165062 2019516 2021725 2031598 1915851 1960369
5061A960369R588o8895K3912q2568n4704J109m8706J8438J6045j5195o8527p041
$$ 1960369 1969957 1901062 1924974 1842406 1787702 1788811 1740105 1758543 1774588 1759393 1690866 1683825
5049A683825P6463j11564K9070P5090l4325Q4088m6367j41307J4595M1803m0085
$$ 1683825 1760288 1648724 1677794 1752884 1718559 1802647 1756280 1614973 1629568 1671371 1631286
5038A631286P2584k4967J8027j1786n4805J6238J4471K911J9428o8230L4244j21887
$$ 1631286 1703870 1678903 1696930 1685144 1630339 1646577 1661048 1663959 1683387 1615157 1649401 1527514
5026A527514R5160K3590q5578N0393j29961J36604j34852P6832o1104M0335l4190
$$ 1527514 1622674 1646264 1560686 1611079 1481118 1617722 1482870 1559702 1498598 1538933 1504743
5015A504743O4868l4579l700p7733m6794N9025q8367J61545j52116L4606l0485
$$ 1504743 1569611 1535032 1531332 1453599 1406805 1465830 1377463 1539008 1386892 1421498 1391013
5004A391013K6547p8786J16412L8625q8215M3622p1059M2880Q5504p2986M414
$$ 1391013 1417560 1338774 1455186 1493811 1405596 1449218 1378159 1421039 1506543 1433557 1437971
4993A437971n6482N9871o392l0966L955n6498P256J32419j07714j3248j29363
$$ 1437971 1381489 1441360 1434968 1404002 1407957 1351459 1358715 1491134 1383420 1370172 1240809
4982A240809J49054l5749Q3068j10470M2084M8776j03320Q6558j21469P3857k5621
$$ 1240809 1389863 1354114 1437182 1326712 1368796 1417572 1314252 1400810 1279341 1353198 1327577
4971A327577M1533n0493N8621m7206Q6338q0945n842o1273L3054m7601K6831K4054
$$ 1327577 1369110 1318617 1377238 1330032 1416370 1335425 1329583 1268310 1301364 1253763 1280594 1304648
4959A304648n6666J17904j09764P2088r6129m6001l6492O7599O4392K2251j47365
$$ 1304648 1247982 1365886 1256122 1328210 1232081 1186080 1149588 1217187 1281579 1303830 1156465
4948A156465O207j5670J33143o091L2819N0747j19030Q9154k9692l8231N0667
$$ 1156465 1162672 1147002 1280145 1274054 1306873 1357620 1238590 1327744 1298052 1259821 1310488
4937A310488N0125o9678Q17k3799k3620J21920k19370K9224J70038q0687M8724
$$ 1310488 1360613 1290935 1291752 1267953 1244333 1366253 1146883 1176107 1346145 1265458 1314182
4926A314182q3284N7232n6730m9663K05398j80265J96M8925k4231J7668J6811
$$ 1314182 1230898 1288130 1231400 1181737 1387135 1206870 1207066 1255991 1231760 1249428 1266239
4915A266239q0296J25887k2868j5366q1990J31222K886j84628P4165J13556q0660
$$ 1266239 1185943 1311830 1288962 1273596 1191606 1322828 1325714 1141086 1215251 1328807 1248147
4904A248147o644L454P9014p6415r415P065L2055k729P0602r0127n258l6861m059
$$ 1248147 1241503 1244957 1323971 1247556 1238141 1245206 1277261 1274532 1345134 1255007 1249749 1212888 1208829
4891A208829J2019L8521n8206o622L5637j6483R8455j26581P1168k7997r8819
$$ 1208829 1220848 1259369 1201163 1194541 1230178 1213695 1312150 1185569 1256737 1228740 1129921
4880A129921J51681r1794J5380J8211M121O6239q7348j3196J3104k1761l1595
$$ 1129921 1281602 1189808 1205188 1223399 1227520 1293759 1206411 1193215 1206319 1184558 1152963
4869A152963J21725n3391J26299j74954k8332P0537L7149J7186l6691k5950K1775
$$ 1152963 1274688 1221297 1347596 1172642 1144310 1214847 1251996 1269182 1232491 1206541 1228316
4858A228316k841L5622j0202Q786k167j02891J13963j54319J89918m1706r1027
$$ 1228316 1225475 1261097 1250895 1259681 1257514 1154623 1268586 1114267 1304185 1262479 1171452
4847A171452Q2166j8671J11507m6517Q825j8367M4088J8665j832j00908M7777
$$ 1171452 1253618 1234947 1346454 1299937 1308762 1290395 1334483 1353148 1351316 1250408 1298185
4836A298185R69n7296J303L6679L278k5900m4719R4921p857n2837P9585j5087
$$ 1298185 1299154 1241858 1243161 1279840 1283118 1257218 1212499 1307420 1299563 1246726 1326311 1311224
4824A311224q6447Q5753L0463l6269q1268R7038j4257n1785K6715R7143q1695
$$ 1311224 1224777 1310530 1340993 1304724 1223456 1320494 1306237 1254452 1281167 1378310 1296615
4813A296615J08672k00218J76902k3321m0805j7037O8443o0850O4168m2672O2263
$$ 1296615 1405287 1205069 1381971 1358650 1317845 1300808 1369251 1308401 1372569 1329897 1392160
4802A392160n2616k0621m7421R2461O4509j31288J318L0460L5875l6867O5945
$$ 1392160 1339544 1318923 1271502 1363963 1428472 1297184 1298502 1328962 1364837 1327970 1393915
4791A393915k3028K2405m7841m7556Q0825M0432k1069o9812j685m4935J7662N0045
$$ 1393915 1370887 1393292 1345451 1297895 1378720 1419152 1398083 1328271 1326586 1281651 1299313 1349358
4779A349358J5651m6686r042k2373J06335j7258M5330m7510o8170L2613o7712
$$ 1349358 1365009 1318323 1309281 1286908 1393243 1375985 1421315 1373805 1305635 1338248 1270536
4768A270536J01068J291k6912n780M7603l8900m280p5990O0362j5940R6318m6397
$$ 1270536 1371604 1372895 1345983 1340203 1387806 1348906 1344626 1268636 1328998 1313058 1409376 1362979
4756A362979K1769r3439L9434o207K8142p909J9320o4095Q2560O178l2726N0250
$$ 1362979 1384748 1291309 1330743 1324536 1352678 1344769 1364089 1299994 1382554 1388732 1356006 1406256
4744A406256k5936m3240L861l1668P0121q9854J05312J5548p137M415K2302j48879
$$ 1406256 1380320 1337080 1340941 1309273 1379394 1289540 1394852 1410400 1403263 1407678 1429980 1281101
4732A281101P1251K2418r9684J65541n3299j14029K9569k2763J75120r1524L549
$$ 1281101 1352352 1374770 1275086 1440627 1387328 1273299 1302868 1280105 1455225 1363701 1367250
4721A367250K6381k1438K7060R8421j02437o0910Q2439k03K8864j16050P3866
$$ 1367250 1393631 1372193 1399253 1497674 1395237 1334327 1416766 1416563 1445427 1329377 1403243
4710A403243k3401J07437j10284J4687m6989N3188P3038j168o6250n3858J52628
$$ 1403243 1379842 1487279 1376995 1391682 1344693 1397881 1470919 1469751 1403501 1349643 1502271
4699A502271o1528R9384p1916L4757r9670q842N8014J4601M0436K2894m9238K9695
$$ 1502271 1440743 1540127 1468211 1502968 1403298 1394456 1452470 1467071 1507507 1530401 1481163 1510858
4687A510858n1609N2339N483n9228R4930j74832K28147l9692q5658m6794J05925
$$ 1510858 1459249 1511588 1517071 1457843 1552773 1377941 1606088 1566396 1480738 1433944 1539869
4676A539869l8389o4939k4046k7212J48912m3661k7865J9297P083m2607Q9632
$$ 1539869 1501480 1436541 1412495 1385283 1534195 1490534 1462669 1481966 1489049 1446442 1536074
4665A536074Q78Q228m1082J3729N495k5400P6511q0184K1964p0367R3839l8840
$$ 1536074 1536952 1545180 1504098 1517827 1523322 1497922 1574433 1494249 1516213 1445846 1539685 1500845
4653A500845q1319J58734J2869q6819L3355k3514N3367K6291N2121p5922q2444
$$ 1500845 1419526 1578260 1591129 1504310 1537665 1514151 1567518 1593809 1645930 1570008 1487564
4642A487564J12586O314n2196L5964j27961J46487L2742j25003O4158q686j8266
$$ 1487564 1600150 1606464 1554268 1590232 1462271 1608758 1641500 1516497 1580655 1571969 1553703
4631A553703Q825j1905R294J7439m0438J3461M9538N4420p7089P0468j3372K4612
$$ 1553703 1562528 1550623 1559917 1577356 1536918 1550379 1599917 1654337 1577248 1647716 1634344 1658956
4619A658956o8841K4815o284M7388k8893p0511N0073Q0733q9083K1017m0124J0680
$$ 1658956 1590115 1614930 1608646 1656034 1627141 1556630 1606703 1687436 1598353 1619370 1579246 1589926
4607A589926l2050j3282P910O7859R2005j17812O9167m4971N050O5767L5294l1383
$$ 1589926 1557876 1544594 1552504 1620363 1712368 1594556 1663723 1618752 1623802 1689569 1724863 1693480
4595A693480k1080j473J4249o5158R1713o1714J46539j7348p4521J359K4253j6330
$$ 1693480 1672400 1670927 1685176 1620018 1711731 1650017 1796556 1779208 1704687 1706046 1730299 1713969
4583A713969n1861J14799o2462M4972p2521J7853r2754J53864N1955j24724L0067
$$ 1713969 1662108 1776907 1714445 1759417 1686896 1704749 1611995 1765859 1817814 1693090 1723157
4572A723157k7435M7182k3921j0781J53810j09871j37223K13811j5150K3560m5272
$$ 1723157 1695722 1742904 1718983 1708202 1862012 1752141 1614918 1828729 1813579 1837139 1791867
4561A791867j2648j8374N7334p7804J0750M7613k9751J0126O1755o2436k5317
$$ 1791867 1779219 1760845 1818179 1740375 1751125 1798738 1768987 1779113 1840868 1778432 1753115
4550A753115L2975m0127M0559K846P3103r5039L1405M7400j09478R9217K539m6458
$$ 1753115 1786090 1745963 1786522 1789368 1862471 1767432 1798837 1846237 1736759 1835976 1838515 1792057
4538A792057J2867m8894K0917K0089n698k3790L9702O210P4094l7701m6793N1152
$$ 1792057 1804924 1756030 1776947 1797036 1791338 1767548 1807250 1813460 1887554 1849853 1803060 1854212
4526A854212o5790R7939j8433m8387M9418K900K3568j0245M054J6385K2001m2154
$$ 1854212 1788422 1886361 1867928 1819541 1868959 1871859 1895427 1885182 1889236 1905621 1927622 1885468
4514A885468j4258L8813k2510Q4864m6743k8507O4121j66922O5701O8039q233
$$ 1885468 1871210 1910023 1887513 1972377 1925634 1897127 1961248 1794326 1860027 1928066 1919833
4503A919833K8126J13008k7937m1856K1807J02512j42285k0223P0426m7720J3303
$$ 1919833 1947959 2060967 2033030 1991174 2012981 2115493 1973208 1952985 2023411 1975691 1988994
4492A988994r239M7711k1216m3310J3630R0458o3910N4876O0710p3164M4026J8561
$$ 1988994 1979755 2027466 2006250 1962940 1976570 2067028 2003118 2057994 2118704 2045540 2089566 2108127
4480B108127m6744O3542l1152M1721n6768O7675L8259j09953l6043P5810K1264
$$ 2108127 2061383 2124925 2093773 2135494 2078726 2146401 2184660 2074707 2038664 2114474 2135738
4469B135738P5961l7093J9995j55977K6605R0667r2584J06030M7244J2031j03105
$$ 2135738 2211699 2174606 2194601 2038624 2065229 2155896 2063312 2169342 2216586 2228617 2125512
4458B125512L3404k8558o1219J02229j1407j7877R9409j09087J70689q5067j7022
$$ 2125512 2158916 2130358 2069139 2171368 2159961 2142084 2241493 2132406 2303095 2218028 2201006
4447B201006Q2194j7278m3984Q1226J8061l482o1439L5119L5700j8039k3537l874
$$ 2201006 2283200 2265922 2221938 2303164 2321225 2317743 2256304 2291423 2327123 2309084 2285547 2281673
4435B281673Q4528j48244J9573k4249J30415j19853J49597j27899L4470r4529
$$ 2281673 2366201 2217957 2237530 2213281 2343696 2223843 2373440 2245541 2280011 2185482
4425B185482L5178J04410l1266Q7187o3494O1659K085m6831J11187O0345l7753
$$ 2185482 2220660 2325070 2293804 2380991 2317497 2379156 2381241 2334410 2445597 2505942 2468189
4414B468189j41605M9272L5872J32731p9385l336J4402q1495J76287j51922P3433
$$ 2468189 2326584 2375856 2411728 2544459 2465074 2461738 2476140 2394645 2570932 2419010 2492443
4403B492443l8279J437m7413L0180J6454m1498O4208K1828R32O1223n4843K7827
$$ 2492443 2454164 2455601 2408188 2438368 2454822 2413324 2477532 2499360 2500292 2561515 2506672 2534499
4391B534499k1351M2844k881O6973j38040O0861P2974K6878Q6Q7205p9720M0927
$$ 2534499 2513148 2555992 2553111 2620084 2482044 2542905 2615879 2642757 2642843 2730048 2650328 2691255
4379B691255k2573K8198l645k7186M4042j15411J75711l094q0505j1799P4693
$$ 2691255 2668682 2696880 2693235 2666049 2710091 2594680 2770391 2767297 2686792 2674993 2749686
4368B749686p6531j0912R9922N7726o4097O4421j02513K0881N325J28799j26963
$$ 2749686 2673155 2662243 2762165 2819891 2755794 2820215 2717702 2738583 2743908 2872707 2745744
4357B745744J03865j08333J6394J63484p6651L4358J9625p7083N1336l0176J01749
$$ 2745744 2849609 2741276 2757670 2921154 2844503 2878861 2898486 2821403 2872739 2842563 2944312
4346B944312k2415L7653m4724j070o7643K6695M2548P7249l6419P618M765k0696
$$ 2944312 2921897 2959550 2914826 2913756 2846113 2872808 2915356 2992605 2956186 2963804 2968569 2947873
4334B947873O0136r0635J76911j0016p3595N0302k7197j7123O9587O5568o5673
$$ 2947873 3008009 2917374 3094285 3084269 3010674 3060976 3033779 3016656 3086243 3151811 3086138
4323C086138K1489K1470r8362J50657j87594J23085L8781L10j0670L7984l0284
$$ 3086138 3107627 3129097 3030735 3181392 2993798 3116883 3155664 3155974 3145304 3183288 3153004
4312C153004J9164J721M8952M8868R7254j33474O146L3306P0626L8191j25056
$$ 3153004 3172168 3173889 3222841 3271709 3368963 3235489 3241635 3274941 3345567 3383758 3258702
4301C258702P9654j34521J60450R34j0779N1930J2222k7428j1982J40723q2090
$$ 3258702 3338356 3203835 3364285 3365219 3354440 3406370 3418592 3391164 3379182 3519905 3437815
4290C437815k152Q380p0469N7187J22091j18509O0622n6436L4097l0175R7907
$$ 3437815 3435663 3444043 3373574 3430761 3552852 3434343 3494965 3438529 3472626 3442451 3540358
4279C540358n2286J36878j16928O2350m523n392M7110L5646m9421P9380j40395
$$ 3540358 3488072 3624950 3508022 3570372 3565849 3560457 3607567 3643213 3593792 3673172 3532777
4268C532777J70720j03063R9486k8469N6750L1463m2542R4487j22994J52875j35880
$$ 3532777 3703497 3600434 3699920 3671451 3728201 3759664 3717122 3811609 3688615 3841490 3705610
4257C705610K9791N778k6772P8887M8623l3663J35139k3724j7344P482k2207Q7066
$$ 3705610 3735401 3741179 3714407 3793294 3841917 3808254 3943393 3919669 3902325 3909807 3887600 3974666
4245C974666R722J9923K5485J2362j19934J17056q9975J6665P5720n0354K5854
$$ 3974666 3984388 4004311 4029796 4042158 3922224 4039280 3949305 3965970 4041690 3991336 4017190
4234D017190J4392J1257O4883l2028R622q8443J24126J4516P2563r2597M4194
$$ 4017190 4031582 4042839 4107722 4075694 4085316 3996873 4120999 4135515 4208078 4115481 4159675
4223D159675j1970N1360O812P8411p963r5J08997m7955m9481J38703p5445N2302
$$ 4159675 4147705 4199065 4205877 4284288 4276325 4276230 4385227 4337272 4287791 4426494 4351049 4403351
4211D403351j04957P6461N3282J3662n9348J69835r1439K5577o3035J21765O217
$$ 4403351 4298394 4374855 4428137 4441799 4382451 4552286 4460847 4486424 4423389 4545154 4551371
4200D551371m2901l2951L7374J84058l8646q3146J5705J9979O1821Q8637m5977
$$ 4551371 4508470 4475519 4512893 4696951 4658305 4575159 4590864 4610843 4672664 4761301 4715324
4189D715324P822j9042L4323M2593M8580o7467J17375r1747P1686l1635N6045
$$ 4715324 4723146 4704104 4738427 4781020 4829600 4762133 4879508 4787761 4859447 4827812 4883857
4178D883857L7696m1336R7993m9118M6236m003m6483P3296O2546K7026l6002J21838
$$ 4883857 4921553 4880217 4978210 4929092 4975328 4971325 4924842 4998138 5060684 5087710 5051708 5173546
4166E173546J5643k8290l5265R5065P622J8484J3802N5466P84l1541M1586J8224
$$ 5173546 5189189 5160899 5125634 5220699 5228321 5246805 5260607 5316073 5316857 5285316 5326902 5345126
4154E345126J3774q6010J20867J79701q2056L8814L8783l8573P7407L8830p4713
$$ 5345126 5358900 5272890 5393757 5573458 5491402 5530216 5568999 5530426 5607833 5646663 5571950
4143E571950P7997L6237k679P1768m8394L8437P0583r8466J92349K7902k3265
$$ 5571950 5649947 5686184 5683505 5755273 5706879 5745316 5815899 5717433 5909782 5937684 5914419
4132E914419K8303R3594k3578M6121m5183K9880J25045j21075O2768R6618k9132
$$ 5914419 5942722 6036316 6012738 6058859 6013676 6043556 6168601 6047526 6110294 6206912 6177780
4121F177780K6312P0133l4520O9431J3864P9187o5507R4579p4830Q8716J22262
$$ 6177780 6204092 6274225 6239705 6309136 6323000 6402187 6336680 6431259 6356429 6445145 6567407
4110F567407q555M3037N5357Q4916p0875O7990L0942J02070q2076P9813O1179
$$ 6567407 6558852 6601889 6657246 6742162 6671287 6739277 6770219 6872289 6790213 6870026 6931205
4099F931205l5273J24407O3702j08781J46140k1523Q8688k1439p284L2903J27038
$$ 6931205 6895932 7020339 7084041 6975260 7121400 7099877 7188565 7167126 7159842 7192745 7319783
4088G319783q1006J31438l778J3142P8634L6893l8253K14244p7074J39851l3830
$$ 7319783 7238777 7370215 7366437 7379579 7458213 7495106 7456853 7671097 7594023 7733874 7700044
4077G700044J06197L5652K5093O1419J53924p0887N5646L2229K7065J22280Q6958
$$ 7700044 7806241 7841893 7866986 7928405 8082329 8011442 8067088 8099317 8126382 8248662 8335620
4066H335620J8506J57758r486o7900J02290J54928p3001R2638J35464R1315O9589
$$ 8335620 8354126 8511884 8502398 8434498 8536788 8691716 8618715 8711353 8846817 8938132 9007721
4055I007721O9969J9047J54565Q2618N3827r718J44122M9535J0559Q9676N087
$$ 9007721 9077690 9096737 9251302 9333920 9387747 9378029 9522151 9571686 9582245 9671921 9677008
4044I677008J60625L7302N8065R0898l8010R7279J64610o4176m441M4891R4212
$$ 9677008 9837633 9874935 9933000 10023898 9985888 10083167 10247777 10183601 10179160 10224051 10318263
4033A0318263l7531J85947J10756p3745J43907P2491P5009R1123k3548L68252
$$ 10318263 10280732 10466679 10577435 10503690 10647597 10720088 10795097 10886220 10862672 11230924
4023A1230924r3932K03004J1829J07621o974J63862N9031J26058J2785P6507J1736
$$ 11230924 11136992 11339996 11351825 11459446 11452472 11616334 11675365 11801423 11814208 11890715 11902451
4012A1902451M0845Q4016j9682J00707o5985J3108M566P770P1272l3032J9259
$$ 11902451 11943296 12027312 12007630 12108337 12042352 12055460 12060026 12067796 12139068 12106036 12125295
4001A2125295Q9778P8700k8555J46158j4306J16594R443J84533L6473p7296J76555
$$ 12125295 12215073 12293773 12265218 12411376 12397070 12513664 12523107 12707640 12744113 12666817 12843372
3990A2843372P1455N3741J04225O5215M4714L4207P6728J11816J10465j1218J48509
$$ 12843372 12914827 12968568 13072793 13138008 13182722 13216929 13293657 13405473 13515938 13504720 13653229
3979A3653229L6934R9324j46784J07282L491J7852N3063M329K34491p2558k571
$$ 13653229 13690163 13789487 13642703 13749985 13753476 13771328 13824391 13828720 14063211 13990653 13988082
3968A3988082J89334j01847O9579J65301M8310J73185m6045J51774R9269N0178
$$ 13988082 14177416 14075569 14145148 14310449 14358759 14531944 14485899 14637673 14736942 14787120
3958A4787120J18984J43080R4279J80660j4274J25674J86895M3468N0500J75011
$$ 14787120 14906104 15049184 15143463 15324123 15309849 15435523 15622418 15665886 15716386 15891397
3948A5891397J62532J17921K20037M8973J75589J21484J17367J77080J02516J58350
$$ 15891397 16053929 16171850 16391887 16440860 16616449 16737933 16855300 17032380 17134896 17293246
3938A7293246P8178J67434J53348N1347K42461K31360J83385J38467R9472K15417
$$ 17293246 17371424 17538858 17692206 17743553 17986014 18217374 18400759 18539226 18638698 18854115
3928A8854115K24595Q6194J79324K01950J43008J84037K63054J69420K18622J89724
$$ 18854115 19078710 19164904 19344228 19546178 19689186 19873223 20136277 20305697 20524319 20714043
3918B0714043K04216L06684J43618K04873L81632J94750K12267K76528K51142
$$ 20714043 20918259 21224943 21368561 21573434 21955066 22149816 22362083 22638611 22889753
3909B2889753K32196J98640K22601L05905J68555L54278K62613J38565L84075
$$ 22889753 23121949 23320589 23543190 23849095 24017650 24371928 24634541 24773106 25157181
3900B5157181L07187L52703L22805L65350K96880L98748L56768L39166N23774
$$ 25157181 25464368 25817071 26139876 26505226 26802106 27200854 27557622 27896788 28420562
3891B8420562L68438N74156M90693N53891N42108N97073N64434O42327O39349
$$ 28420562 28789000 29363156 29853849 30407740 30949848 31546921 32111355 32753682 33393031
3882C3393031M88193O60764O63902N34545N15657N73683M39430M98267M66813
$$ 33393031 33881224 34541988 35205890 35740435 36256092 36829775 37269205 37767472 38234285
3873C8234285N13771M54318M86417M22193N29101N15474N93357N85882O94425
$$ 38234285 38748056 39202374 39688791 40110984 40640085 41155559 41748916 42334798 43029223
3864D3029223O68161O79851Q94104P95709R77073R15883J025692J260025J261280
$$ 43029223 43697384 44377235 45271339 46067048 47044121 47960004 48985696 50245721 51507001
3855E1507001J222636J363259J527399J479317J591930J702853J701554J521219
$$ 51507001 52729637 54092896 55620295 57099612 58691542 60394395 62095949 63617168
3847F3617168J608592J415427J416596J309074J261217J152356J077375R51586
$$ 63617168 65225760 66641187 68057783 69366857 70628074 71780430 72857805 73809391
3839G3809391P90145O17205O99109N57847L73966N00042M61788N61068N02600
$$ 73809391 74599536 75216741 75915850 76473697 76847663 77347705 77809493 78370561 78873161
3830G8873161O98478Q31118Q79261J069859J163311J334895J720995J755266J960362
$$ 78873161 79571639 80402757 81282018 82351877 83515188 84850083 86571078 88326344 90286706
3821I0286706K209504K428867K520352K741710K900746K948518K957732L315631
$$ 90286706 92496210 94925077 97445429 100187139 103087885 106036403 108994135 112309766
3813A12309766L097098L101946L121636L193145K913896L000507L060599L072488
$$ 112309766 115406864 118508810 121630446 124823591 127737487 130737994 133798593 136871081
3805A36871081L646821L802461M378702M770925N197881N525134N805879O007009
$$ 136871081 140517902 144320363 148699065 153469990 158667871 164193005 169998884 176005893
3797A76005893O020734N889349N703526N181616N020136M463786M250862L875500
$$ 176005893 182026627 187915976 193619502 198801118 203821254 208285040 212535902 216411402
3789B16411402L616398L521227L360749L466059L215484K669567J906424J234215
$$ 216411402 220027800 223549027 226909776 230375835 233591319 236260886 238167310 239401525
3781B39401525N22942J46386k14835m90767l33846N24451J454817K640215L731852
$$ 239401525 239924467 240070853 239856018 239365251 239031405 239555856 241010673 243650888 247382740
3772B47382740M960741O401826P347940Q408724R410786R776371R059914Q339834
$$ 247382740 252343481 258745307 266093247 274501971 283912757 293689128 302749042 311088876
3764C11088876P484938O119063M419020L020275K165145J503072J404202J272959
$$ 311088876 318573814 324692877 329111897 332132172 334297317 335800389 337204591 338477550
3756C38477550J112349Q75297L17217j988463m552999o531686q624689j0101860
$$ 338477550 339589899 340465196 340782413 338793950 334240951 327709265 319084576 308982716
3748C08982716j0680005j0641548r953594q581946p390061n907160m556646l088526
$$ 308982716 298302711 287661163 277707569 269125623 261735562 255828402 251271756 248183230
3740B48183230j403465Q2625J058556J984451J964453J870796J567299J189743
$$ 248183230 246779765 246862390 247920946 249905397 251869850 253740646 255307945 256497688
3732B56497688O0902n19688j035477j147730j279759j254339j094690j076340
$$ 256497688 256558590 256038902 255003425 253855695 252575936 251321597 250226907 249150567
3724B49150567j651838l170854m439968n472840o542453p949694q896327r304318
$$ 249150567 247498729 244327875 239887907 234415067 227872614 219922920 211026593 201722275
3716B01722275q551776q285826p366353o672148n908846n116486m028890l193954
$$ 201722275 193170499 184884673 177518320 170846172 164937326 159820840 155791950 152597996
3708A52597996k414386j639622j054891n60338j23295L56995P09656Q45119J054338
$$ 152597996 150183610 148543988 147489097 146928759 146805464 147162459 147872115 148717234 149771572
3699A49771572J126850J527592J480588J626220J773708J828685J993311K162988
$$ 149771572 150898422 152426014 153906602 155532822 157306530 159135215 161128526 163291514
3691A63291514K167390K277252K507643K340890K461341K295464K387482K290953
$$ 163291514 165458904 167736156 170243799 172584689 175046030 177341494 179728976 182019929
3683A82019929K468896K309324K054273K007180J734241J702982J378689J248177
$$ 182019929 184488825 186798149 188852422 190859602 192593843 194296825 195675514 196923691
3675A96923691P69045N94575K90949n2851k69253n13074r45610j434924j571861
$$ 196923691 197692736 198287311 198578260 198525409 198256156 197743082 196797472 195362548 193790687
3666A93790687j766270k205789k540722k917087k868696l133836l146536l342502
$$ 193790687 192024417 189818628 187277906 184360819 181492123 178358287 175211751 171869249
3658A71869249l361156l104726l045215l057032l070150k942547k809960k814574
$$ 171869249 168508093 165403367 162358152 159301120 156230970 153288423 150478463 147663889
3650A47663889k854795k810953k557909k542984k599922k482034k497932k624764
$$ 147663889 144809094 141998141 139440232 136897248 134297326 131815292 129317360 126692596
3642A26692596k617240k773888k738153k886729l091474l076497k962198l151339
$$ 126692596 124075356 121301468 118563315 115676586 112585112 109508615 106546417 103395078
3634A03395078k925166k761996k592736k443657k119715j933299j598078j425289
$$ 103395078 100469912 97707916 95115180 92671523 90551808 88618509 87020431 85595142
3626H5595142j306242r85460q95917q14084n91219m48316l33892j66238j46244
$$ 85595142 84288900 83303440 82407523 81593439 81002220 80553904 80220012 80053774 79907530
3617G9907530n9611K6331p5812K32716K21526K00494M03796K96919M74303N66917
$$ 79907530 79847919 79874250 79798438 80031154 80252680 80453174 80856970 81153889 81628192 82195109
3607H2195109O20074R07242J035324J192232J334809J651253J777853J778745
$$ 82195109 82815183 83722425 84757749 85949981 87284790 88936043 90713896 92492641
3599I2492641K175852K152959K265516K328255K197312K191813K238015K070259
$$ 92492641 94668493 96821452 99086968 101415223 103612535 105804348 108042363 110112622
3591A10112622K073132K146283K025391K237213K164491K373107K401008K362819
$$ 110112622 112185754 114332037 116357428 118594641 120759132 123132239 125533247 127896066
3583A27896066K441394K314580K436122K418819K524488K591917K667041K735129
$$ 127896066 130337460 132652040 135088162 137506981 140031469 142623386 145290427 148025556
3575A48025556K799379K996949K913273K970613K975683K773243K637593K297473
$$ 148025556 150824935 153821884 156735157 159705770 162681453 165454696 168092289 170389762
3567A70389762K033089J635440J407436J115864Q73004N03738K72609p7824l69348
$$ 170389762 172422851 174058291 175465727 176581591 177454595 177958333 178230942 178153118 177783770
3558A77783770p65651j167741j638074k118585k547525k837761k828544l302733
$$ 177783770 177018119 175850378 174212304 172093719 169546194 166708433 163879889 160577156
3550A60577156l536527l591399l669979l709170l692997l667774l700273l661618
$$ 160577156 157040629 153449230 149779251 146070081 142377084 138709310 135009037 131347419
3542A31347419l590895l615063l616911l548191l629713l818785l603759l739611
$$ 131347419 127756524 124141461 120524550 116976359 113346646 109527861 105924102 102184491
3534A02184491l945917l851694m086070l856917l827405l719366l530234l456034
$$ 102184491 98238574 94386880 90300810 86443893 82616488 78897122 75366888 71910854
3526G1910854l147728k932370k888859k607947k538478k157560k133417j852032
$$ 71910854 68763126 65830756 62941897 60333950 57795472 55637912 53504495 51652463
3518E1652463j778854j711485j490234j300525j195235j322351r83748j088675
$$ 51652463 49873609 48162124 46671890 45371365 44176130 42853779 41870031 40781356
3510D0781356r16862q72322p61878p17728p06456o46945o81446m79952n22407
$$ 40781356 39864494 38992172 38230294 37512566 36806110 36159165 35477719 34997767 34475360
3501C4475360m90627l47441n35168m82515l97439l31146k74755l71317k23107
$$ 34475360 33984733 33637292 33102124 32619609 32222170 31891024 31616269 31244952 31021845
3492C1021845l85013j33200k93623k79745j64713k66301q2203j20404k78485M2118
$$ 31021845 30636832 30503632 30210009 29930264 29765551 29499250 29417047 29296643 29018158 29060276
3482B9060276j40821j66643k371Q8957j8672m2181J08546K5566J41284P0719p0053
$$ 29060276 28919455 28752812 28750441 28839398 28820726 28778545 28887091 28912657 29053941 29124660 29054607
3471B9054607K17208J9522Q9605J04206J16271J05436R1705J33613K22307R0108
$$ 29054607 29271815 29291337 29380942 29485148 29601419 29706855 29798560 29932173 30154480 30244588
3461C0244588O7447j2137J41786N0396p7207R7534L8347r3173R624q6956O1827
$$ 30244588 30312035 30299898 30441684 30492080 30414873 30512407 30550754 30457581 30467205 30380249 30442076
3450C0442076n8435j25118o2280j06073k13400m7961j84280k20157j63466j87347
$$ 30442076 30383641 30258523 30196243 30090170 29876770 29828809 29644529 29424372 29260906 29073559
3440B9073559l25020k43398j57835l39506l12408k80077l20243m36201k76052
$$ 29073559 28748539 28505141 28347306 28007800 27695392 27415315 27095072 26658871 26382819
3431B6382819l67167k60197n07354l68473k87609m49040l70554l97388m77160
$$ 26382819 26015652 25755455 25248101 24879628 24592019 24142979 23772425 23375037 22897877
3422B2897877k62387l06032l43920m17205n47251k73816l86115k51652m62296
$$ 22897877 22635490 22329458 21985538 21568333 21021082 20747266 20361151 20109499 19647203
3413A9647203l07435l39151l65724l26636k66739l41397k90600l88510l12407
$$ 19647203 19339768 19000617 18634893 18308257 18041518 17700121 17409521 17021011 16708604
3404A6708604k83642k74095k54096k93225k93849k59028k42657l01359k54587
$$ 16708604 16424962 16150867 15896771 15603546 15309697 15050669 14808012 14506653 14252066
3395A4252066j57539k71592k29166r5417k46422k31245j73275j77276j09134j35554
$$ 14252066 14094527 13822935 13593769 13498352 13251930 13020685 12847410 12670134 12561000 12425446
3385A2425446j25680k25102j96814j04986k21530p6853l40594l5108j15624o1395
$$ 12425446 12299766 12074664 11877850 11772864 11551334 11474481 11133887 11098779 10983155 10921760
3375A0921760j97471j45017j12448o5880k1558k26229p1489j75622m0745j23751
$$ 10921760 10724289 10579272 10466824 10400944 10379386 10153157 10081668 9906046 9865301 9741550
3365I741550r2692r6518p0199k7739j11050j26380J3051j86421J18362j46154
$$ 9741550 9648858 9552340 9482141 9454402 9343352 9216972 9230023 9043602 9161964 9015810
3355I015810k8395K9586p0446q0436O5051j95865O3513k9805j22585j5588l6361
$$ 9015810 8987415 9017001 8946555 8866119 8931170 8735305 8798818 8769013 8646428 8630840 8594479
3344H594479R5090p474k12989l8605P8898p441j49068q8369K4548r6125N9516
$$ 8594479 8689569 8682095 8469106 8430501 8509399 8501958 8352890 8264521 8289069 8192944 8252460
3333H252460M6402n6025j9192m0990Q7155m3394m6086L2182J22571m9162o9776
$$ 8252460 8298862 8242837 8223645 8182655 8269810 8226416 8180330 8212512 8335083 8285921 8216145
3322H216145o4369N1160M4972m0294j6194N0723q2443J5725J8876N2824o875j1886
$$ 8216145 8151776 8202936 8247908 8207614 8191420 8242143 8159700 8175425 8194301 8247125 8240250 8228364
3310H228364j28324K1027p9145P3752m8725k2940n3211M4851k0732J9796m6868
$$ 8228364 8100040 8121067 8041922 8115674 8066949 8044009 7990798 8035649 8014917 8034713 7987845
3299G987845l4978J13091q9563l979r641n8375n2169R8435j34103J54729J7301
$$ 7987845 7952867 8065958 7976395 7972416 7962775 7904400 7852231 7950666 7816563 7971292 7988593
3288G988593j0229p4976P4361m0793N8647m0393l5991O8547M8897k1066M9269
$$ 7988593 7978364 7903388 7977749 7936956 7995603 7955210 7919219 7987766 8036663 8015597 8064866
3277H064866m0213p944P9002K654J31683K9906q145N9467P8868l9670R6164K2074
$$ 8064866 8024653 8016709 8095711 8098365 8230048 8259954 8251809 8311276 8390144 8350474 8446638 8468712
3265H468712Q5216P7411N8375N0129K16544j32681K49356j7911J75926O6245J68711
$$ 8468712 8553928 8631339 8689714 8739843 8956387 8823706 9073062 9055151 9231077 9297322 9466033
3254I466033n7684Q7958J72553J53599O8061K61712l3956J98084K10412J42663
$$ 9466033 9408349 9496307 9668860 9822459 9890520 10152232 10118276 10316360 10526772 10669435
3244A0669435K11891J53719K26360J89009J36630K23282P3698J75910J24858R1371
$$ 10669435 10881326 11035045 11261405 11450414 11587044 11810326 11884024 12059934 12184792 12276163
3234A2276163R3747J09368J82726L3217J80000K55439K82713J17560K48364J56513
$$ 12276163 12369910 12479278 12662004 12695221 12875221 13130660 13413373 13530933 13779297 13935810
3224A3935810K18744K39359K61099K35425L01033L20813L31841K77630L84513
$$ 13935810 14154554 14393913 14655012 14890437 15191470 15512283 15844124 16121754 16506267
3215A6506267L47512M96445L49746N29928N26175M30809N05891M85436K56019
$$ 16506267 16853779 17350224 17699970 18229898 18756073 19186882 19692773 20178209 20434228
3206B0434228L89790M03349L17323L01336L56949L50185L94671K06154J27392
$$ 20434228 20824018 21227367 21544690 21846026 22202975 22553160 22947831 23153985 23281377
3197B3281377N1692L46979L8893K35392K39184L38623L35938K95583M55743N02922
$$ 23281377 23333069 23680048 23718941 23954333 24193517 24532140 24868078 25163661 25619404 26122326
3187B6122326L85089O27515O15168N98574P02938Q15351Q85326R50582R85402
$$ 26122326 26507415 27134930 27750098 28348672 29051610 29866961 30752287 31702869 32688271
3178C2688271R01176Q49447Q63621Q43340R27251Q33375Q22412J057515Q00930
$$ 32688271 33589447 34438894 35302515 36145855 37073106 37906481 38728893 39786408 40587338
3169D0587338N66974L36517K84866L82409N14782O09763Q51154J058836J235568
$$ 40587338 41154312 41490829 41775695 42158104 42672886 43282649 44133803 45192639 46428207
3160D6428207J567332J684130J834901J956971J868668J636557J459340Q74730
$$ 46428207 47995539 49679669 51514570 53471541 55340209 56976766 58436106 59310836
3152E9310836O02237O68352O15362Q69182J409041J814392K232565K529723K528481
$$ 59310836 59913073 60581425 61196787 62065969 63475010 65289402 67521967 70051690 72580171
3143G2580171J555485J054103L5437q63066q46423l80880k79312K19713P68584
$$ 72580171 74135656 75189759 75225196 74362130 73515707 73134827 72855515 73075228 73843812
3134G3843812J515036K055189K707793L227998L646495L819339M084063M028213
$$ 73843812 75358848 77414037 80121830 83349828 86996323 90815662 94899725 98927938
3126I8927938L973688L586948K488285J137064L06048J69159m38934R1428R44683
$$ 98927938 102901626 106488574 108976859 110113923 110419971 110589130 110150196 110241624 111186307
3117A11186307K243168K448870K213833K097387K416374J243836j733555n208992
$$ 111186307 113429475 115878345 118092178 120189565 122605939 123849775 122116220 116907228
3109A16907228n716519m681531l157638k169633q39980J62147J135827K285531
$$ 116907228 111190709 106509178 103351540 101181907 100341927 100504074 101639901 103925432
3101A03925432K670759L159342L689575M332406M509971M422902L236974J740780
$$ 103925432 106596191 109755533 113445108 117777514 122287485 126710387 129947361 131688141
3093A31688141Q77503n06050j962180j637145q96125k25923l66502Q00259J924246
$$ 131688141 132565644 132059594 130097414 128460269 127564144 127338221 126971719 127771978 129696224
3084A29696224K828277K357019j934361n370546o667687q068697p605538o160226
$$ 129696224 132524501 134881520 132947159 127576613 120908926 112840229 105234691 99074465
3076I9074465m683431l512125k623337j579029o22044L51510R29103J672526K085287
$$ 99074465 94391034 90878909 88255572 86676543 86054499 86406009 87335112 89007638 91092925
3067I1092925K138407J714202J060690k77618j432406k113407k423616k556318
$$ 91092925 93231332 94945534 96006224 95728606 94296200 92182793 89759177 87202859
3059H7202859j989962p34872L35810J539350J835005O06530o26510k637412m506706
$$ 87202859 85212897 84478025 84813835 86353185 88188190 88794720 88168210 85530798 81024092
3050H1024092n953770n985448m884361m356363l543509k853225k354376j924264
$$ 81024092 75070322 69084874 64200513 59844150 56300641 53447416 51093040 49168776
3042D9168776j459797j075144p51252m25325j38758o4314m58886n11395n40988
$$ 49168776 47708979 46633835 45882583 45457258 45318500 45254186 44795300 44283905 43742917
3033D3742917j099548j201628j031568j220798r10351o30881k29671L2335K77623
$$ 43742917 42643369 41441741 40410173 39189375 38279024 37648143 37418472 37450807 37728430
3024C7728430J93759m78409p82898j344797j989559j641624j404820j218401r98629
$$ 37728430 37922189 37443780 36660882 35316085 33326526 31684902 30280082 29061681 28063052
3015B8063052q95302p61440n72386o19872n60893k71304l53924l57967k39088
$$ 28063052 27167750 26406310 25833924 25214052 24653159 24381855 24027931 23669964 23430876
3006B3430876j49672j35910j92620n4157j84984K9028j48567m7626J24903m564
$$ 23430876 23281204 23145294 22952674 22898517 22713533 22742561 22593994 22546368 22671271 22666707
2996B2666707R0728K3620P8294K16695o871J33550K06541K29255Q1132K81226
$$ 22666707 22757435 22781055 22859349 23076044 23069173 23202723 23409264 23638519 23719651 24000877
2986B4000877K09152J55438K65832J69730K66310K68797L00714L76909K79148
$$ 24000877 24210029 24365467 24631299 24801029 25067339 25336136 25636850 26013759 26292907
2977B6292907L57565M76870M33358L46590N24733L77657M68276O10911N67721
$$ 26292907 26650472 27127342 27560700 27907290 28432023 28809680 29277956 29888867 30456588
2968C0456588M85807M95988N30989O33071O42784M49378N72312P34673N33983
$$ 30456588 30942395 31438383 31969372 32602443 33245227 33694605 34266917 35001590 35535573
2959C5535573O05475O53341N53979Q25075N48028R29348Q65188P34089P89910
$$ 35535573 36141048 36794389 37348368 38173443 38721471 39650819 40516007 41250096 42040006
2950D2040006P03083O94700M78860Q48242O74104Q96598Q32827R71173J081320
$$ 42040006 42743089 43437789 43916649 44764891 45438995 46335593 47168420 48139593 49220913
2941D9220913Q68876J173918J118607R98413J130306J077679J173051J047798
$$ 49220913 50089789 51263707 52382314 53380727 54511033 55588712 56761763 57809561
2933E7809561J205686J165832J364946J324783J390286J531595J628073J574821
$$ 57809561 59015247 60181079 61546025 62870808 64261094 65792689 67420762 68995583
2925F8995583J594959J490680J512426J406420J459630J623215J626423J808151
$$ 68995583 70590542 72081222 73593648 75000068 76459698 78082913 79709336 81517487
2917H1517487J957494K144574K362262K476758K149852J818339J518947J495303
$$ 81517487 83474981 85619555 87981817 90458575 92608427 94426766 95945713 97441016
2909I7441016J660466J646179K003553J971176K193697K269615K283038J944104
$$ 97441016 99101482 100747661 102751214 104722390 106916087 109185702 111468740 113412844
2901A13412844J741609J425208J569074J555264J505847J557716J691775K086649
$$ 113412844 115154453 116579661 118148735 119703999 121209846 122767562 124459337 126545986
2893A26545986K086119K241776K344655K758477L099260L585724L574914L809321
$$ 126545986 128632105 130873881 133218536 135977013 139076273 142661997 146236911 150046232
2885A50046232L764854M050170M233766M454776M634008M608474M475517M254238
$$ 150046232 153811086 157861256 162095022 166549798 171183806 175792280 180267797 184522035
2877A84522035M277142M473555N039394N822797O447287P435430P691487P930330
$$ 184522035 188799177 193272732 198312126 204134923 210582210 218017640 225709127 233639457
2869B33639457P585202O389467M716943L860704L059089K074788K239287L784651
$$ 233639457 241224659 247614126 252331069 256191773 259250862 261325650 263564937 267349588
2861B67349588N236340O582492Q579076J0169084J0986875R779580M524844p69909
$$ 267349588 272585928 279168420 287747496 297916580 308903455 318683035 323207879 322437970
2853C22437970k941388k986443k588698j936441j319575o99605K69197J423813
$$ 322437970 319496582 316510139 313921441 311985000 310665425 309965820 310235017 311658830
2845C11658830J348041J048216m3626j362628l870633o575518q913960j1208355
$$ 311658830 313006871 314055087 314011461 312648833 308778200 302202682 293288722 282080367
2837B82080367j1855717j0675297r207205p745648n875006l908010k158489j340228
$$ 282080367 270224650 259549353 250342148 242596500 236721494 232813484 230654995 229314767
2829B29314767l355314q865194j1169118j0662007r509668q478215p659124p056844
$$ 229314767 225959453 217094259 205925141 195263134 185753466 177275251 169616127 162559283
2821A62559283o652431o073865n595638n310467n280622n428059n440317n763299
$$ 162559283 155906852 149832987 144237349 138926882 133646260 128218201 122777884 117014585
2813A17014585n918516o173287n676514n075332m684135m205416l984375l701095
$$ 117014585 111096069 104922782 99246268 94170936 89486801 85281385 81297010 77595915
2805G7595915l525689l486282l169542k935424k716449k430546k300786k252156
$$ 77595915 74070226 70583944 67414402 64478978 61762529 59331983 57031197 54779041
2797E4779041k027939j734678j674799j495176j549813j710609j546251j901512
$$ 54779041 52751102 51016424 49341625 47846449 46296636 44586027 43039776 41138264
2789D1138264j682200j683537j390372j245281j163303j237498j308732j407049
$$ 41138264 39456064 37772527 36382155 35136874 33973571 32736073 31427341 30020292
2781C0020292j542075j408556j037692j257010r57551p98466q58252p84593q03048
$$ 30020292 28478217 27069661 26031969 24774959 23817408 23018942 22160690 21376097 20573049
2772B0573049p17202r89773p85118q49153n91792o30659o14209n08034n39292
$$ 20573049 19855847 18866074 18080956 17231803 16640011 16009352 15395143 14887109 14347817
2763A4347817m42138m68902l62479m11005m75780l61613m71218j92540m29207
$$ 14347817 13905679 13436777 13074298 12663293 12187513 11825900 11354682 11162142 10732935
2754A0732935j73054l90420j70539l48671k81819j45532k71821k30461k10936
$$ 10732935 10559881 10169461 9998922 9650251 9368432 9222900 8951079 8720618 8509682
2745H509682k10945k09306k59462j53731k95295j55828o6491k17141k37050j69331
$$ 8509682 8298737 8089431 7829969 7676238 7380943 7225115 7158624 6941483 6704433 6535102
2735F535102j43637k21860j58472j20632m9835k05621j77225o1784j67635q3259
$$ 6535102 6391465 6169605 6011133 5890501 5840666 5635045 5457820 5396036 5228401 5145142
2725E145142j32276j30975k17692j11686j47609j48236q4326j71489l1816j40712
$$ 5145142 5012866 4881891 4664199 4552513 4404904 4256668 4172342 4000853 3969037 3828325
2715C828325n0726j50498j68664j00808j19923j83452q5428j26288o8778o4663
$$ 3828325 3777599 3627101 3458437 3357629 3237706 3054254 2968826 2842538 2773760 2709097
2705B709097r4983j50950o0727r5841j34287p0215j05673r0410j43825P527j50497
$$ 2709097 2614114 2463164 2402437 2306596 2172309 2102094 1996421 1906011 1762186 1769713 1619216
2694A619216L1347j43300l5355j14350o2511l2640l3125j44022M7627j47529j7991
$$ 1619216 1650563 1507263 1471908 1357558 1295047 1262407 1229282 1085260 1132887 985358 967367
2683I67367p0284j20743p4037J5745l8527J1445l5711p6436k2336j32375J6765
$$ 967367 897083 776340 702303 718048 679521 690966 655255 578819 556483 424108 440873
2672D40873J1258n5242L5236j09442o8884n990K6135r8582Q6082p6461j17838
$$ 440873 452131 396889 432125 322683 253799 247809 273944 175362 261444 184983 67145
2661F7145M5343p1044N6131m3060N0475p7597q3182j9964k5171O583j4041M9475
$$ 67145 112488 41444 97575 54515 104990 27393 -55789 -75753 -100924 -94341 -108382 -58907
2649e8907j66474J16352j14103J14302K8384j56613k4407J5651l9784N9156K205
$$ -58907 -225381 -109029 -223132 -108830 -80446 -237059 -261466 -245815 -285599 -226443 -224238
2638b24238m0204O1641N2812j30226J5594K014m3062o016j2407K899M1443j2137
$$ -224238 -264442 -202801 -149989 -280215 -264621 -262607 -305669 -311685 -324092 -321193 -279750 -291887
2626b91887R7901q5704L8754M955Q245N0532M5525j31674j1567q0959J34043j13054
$$ -291887 -193986 -279690 -240936 -235981 -227736 -177204 -131679 -263353 -274920 -355879 -221836 -334890
2614c34890J11311j7804J7396K486M5147M160q3706J0843j8811L3121J7886k34763
$$ -334890 -223579 -241383 -223987 -221501 -176354 -172194 -255900 -245057 -263868 -230747 -212861 -447624
2602d47624K55955n7569J445M1754j923k4095o1751L2283p3042q7251M5774J759
$$ -447624 -191669 -249238 -247793 -206039 -207962 -232057 -293808 -261525 -334567 -421818 -376044 -374285
2590c74285p7559O0446j02396Q0943k9335j11014J6730R1689j74534J4232P8181
$$ -374285 -451844 -391398 -493794 -412851 -442186 -553200 -536470 -444781 -619315 -605083 -526902
2579e26902r1948n4676P4838J8382j17960N2150j7587n5463m4592L196l0393p3978
$$ -526902 -618850 -673526 -598688 -580306 -698266 -646116 -663703 -719166 -763758 -760562 -790955 -864933
2567h64933j8033j5692O9273l4081o5362L2815j02516R928j02528J20125j24566
$$ -864933 -882966 -898658 -829385 -863466 -928828 -896013 -998529 -988601 -1091129 -971004 -1095570
2556a095570L0512J6854Q943q5553J9672P2519p1190N8395J4098j25814o477J1167
$$ -1095570 -1065058 -1048204 -1039261 -1124814 -1105142 -1032623 -1103813 -1045418 -1031320 -1157134 -1163611 -1152444
2544a152444m7832J07165j46552K1733L6436k6346p4792J8025L4058M021j10801
$$ -1152444 -1200276 -1093111 -1239663 -1217930 -1181494 -1207840 -1282632 -1264607 -1230549 -1226528 -1337329
2533a337329J61132j54207Q4326K514N332n6897J69686o7362j12209J08720m8906
$$ -1337329 -1176197 -1330404 -1246078 -1243564 -1238232 -1295129 -1125443 -1192805 -1305014 -1196294 -1245200
2522a245200k810M7465j1927o3233R4622M8740j04551Q1248J26297j12575M8211
$$ -1245200 -1248010 -1200545 -1212472 -1275705 -1181083 -1132343 -1236894 -1155646 -1029349 -1141924 -1093713
2511a093713N6839m8894k7050M8230K9534n9890J74249o4676R350Q0046J0983
$$ -1093713 -1036874 -1085768 -1112818 -1064588 -1035054 -1094944 -920695 -985371 -976021 -895975 -884992
2500h84992N9700j03998R0270k7839J66934n247J0368L7939O1731J2372K4314
$$ -884992 -825292 -929290 -839020 -866859 -699925 -705172 -694804 -656865 -595134 -582762 -558448
2489e58448Q7473P6700j0110l2227J81921j27312L2058J68423n1912n453J12733
$$ -558448 -470975 -394275 -404385 -436612 -254691 -382003 -349945 -181522 -233434 -238887 -126154
2478a26154J06728n0010J33205n5722J36707j80892J47083J15349j29296R8413
$$ -126154 -19426 -69436 63769 8047 144754 -36138 110945 226294 96998 195411
2468A95411J06061P4737K7190n1963L3396J54014l5639K34269O899q3675J24078
$$ 195411 301472 376209 403399 351436 384832 538846 503207 737476 744375 660700 784778
2457G84778J39970J6264J4877J94216l0102J96085j09770K23574J8167J5596J60105
$$ 784778 924748 941012 955889 1150105 1120003 1316088 1206318 1429892 1448059 1463655 1623760
2446A623760J05592R2119j951J10625R1156J19252l1811N9429N5465k5571O5891
$$ 1623760 1729352 1821471 1819520 1930145 2021301 2140553 2108742 2168171 2223636 2198065 2263956
2435B263956J02095K625j17924J11393q1293L7892Q2558k3650Q7608m13L3517
$$ 2263956 2366051 2368676 2250752 2362145 2280852 2318744 2401302 2377652 2465260 2464847 2498364
2424B498364J56340O3707J12505O8882J6324O8035J61068K6378K27827J33070
$$ 2498364 2654704 2718411 2830916 2899798 2916122 2984157 3145225 3171603 3399430 3532500
2414C532500J78181J88307J46330K81666L42612J95487K95090K57584L80622K74941
$$ 3532500 3710681 3898988 4045318 4326984 4669596 4865083 5160173 5417757 5798379 6073320
2404F073320K16124M16496M52899J19413K93005M69771K96498L66783L46639L77483
$$ 6073320 6289444 6705940 7158839 7278252 7571257 8041028 8337526 8704309 9050948 9428431
2394I428431J87632J02769j8062P589k77828k23698k59825j21634k17449j36260
$$ 9428431 9616063 9718832 9700770 9708359 9430531 9206833 8947008 8825374 8607925 8471665
2384H471665l9856j82024j31118m85016m88070p21248n31709n59917m31685n57324
$$ 8471665 8431809 8249785 8118667 7633651 7145581 6424333 5892624 5332707 4901022 4343698
2374D343698l82196l37585l80347j90288k47418k04513k86509k79954j13537k01257
$$ 4343698 3961502 3623917 3243570 3053282 2805864 2601351 2314842 2034888 1921351 1720094
2364A720094j96517j30576j89908j44159j45422m6156j51842j27389j18904j68162
$$ 1720094 1523577 1393001 1203093 1058934 913512 867356 715514 588125 469221 301059
2354C01059M9593j07552j52246q1081L9360j0719k25793l1585l7813j11184k0238
$$ 301059 350652 243100 90854 9773 49133 38414 -187379 -218964 -256777 -367961 -388199
2343c88199q5329N6099j81602p2474L2177k5524n7504j6451o1355m2753n782o4977
$$ -388199 -473528 -417429 -599031 -671505 -639328 -664852 -722356 -738807 -800162 -842915 -848697 -913674
2331i13674O2008j82128N6110o2116K6964k4799j26364J8107L1930p7747O3619
$$ -913674 -851666 -1033794 -977684 -1039800 -1012836 -1037635 -1163999 -1145892 -1113962 -1191709 -1128090
2320a128090P897j48857P1717m0310k138l7051j16443P5868n8562R0863o5418
$$ -1128090 -1120193 -1269050 -1197333 -1237643 -1239781 -1276832 -1393275 -1317407 -1375969 -1285106 -1350524
2309a350524R206o7894K1003o8653Q5290k9922l2944P764n2069N1794Q1882j30678
$$ -1350524 -1341318 -1409212 -1388209 -1456862 -1371572 -1401494 -1434438 -1426674 -1478743 -1426949 -1345067 -1475745
2297a475745J4791K9448j06785R5887n5513q4679M1053J5782j09819J12524N2886
$$ -1475745 -1460954 -1431506 -1538291 -1442404 -1497917 -1582596 -1541543 -1525761 -1635580 -1523056 -1470170
2286a470170o1673O2396j28334J29731m8423O1901K2572j17163L228K2470j10875
$$ -1470170 -1531843 -1469447 -1597781 -1468050 -1516473 -1454572 -1432000 -1549163 -1545935 -1523465 -1634340
2275a634340P2834J22423j83893M9454l3901Q4702m7297q6515k9098m6227J30661
$$ -1634340 -1561506 -1439083 -1622976 -1573522 -1607423 -1522721 -1570018 -1656533 -1685631 -1731858 -1601197
2264a601197o5508l7247m826N1796J3689l6731J2756N6890K4775p7896P007j8708
$$ -1601197 -1666705 -1703952 -1708778 -1656982 -1643293 -1680024 -1667268 -1610378 -1585603 -1663499 -1656492 -1675200
2252a675200L6873m1209Q8151q074k4221M4450n6068l5804q236O9532k8447J6354
$$ -1675200 -1638327 -1679536 -1591385 -1599459 -1623680 -1579230 -1635298 -1671102 -1679338 -1609806 -1638253 -1621899
2240a621899K1952l401m2545J5786R6176j46943N4902l3390L2270j556K5403J3405
$$ -1621899 -1599947 -1603348 -1645893 -1630107 -1533931 -1680874 -1625972 -1659362 -1627092 -1628648 -1603245 -1589840
2228a589840L3978l8182N3716r9212M0416J3019j7674L3896j27076K16718j26065
$$ -1589840 -1555862 -1594044 -1540328 -1639540 -1599124 -1586105 -1603779 -1569883 -1696959 -1480241 -1606306
2217a606306O4250l7261J01256J8551K5156l2234q0004k6777K31764j86758J23783
$$ -1606306 -1542056 -1579317 -1478061 -1459510 -1434354 -1466588 -1546592 -1573369 -1341605 -1528363 -1404580
2206a404580j6904p6846m345M740J30450q7128J8891J06765o6386O0246m6257
$$ -1404580 -1421484 -1498330 -1502675 -1497935 -1367485 -1454613 -1435722 -1328957 -1395343 -1335097 -1381354
2195a381354O2264J8179o0622Q9892o078j9317M9053p5945J07724P899L5436M4930
$$ -1381354 -1319090 -1300911 -1361533 -1271641 -1277719 -1297036 -1247983 -1323928 -1216204 -1208305 -1172869 -1127939
2183a127939p1304R3834l12K6633j08871Q9528M534N0426N5843O3252o189Q287
$$ -1127939 -1199243 -1105409 -1105721 -1079088 -1187959 -1098431 -1093897 -1043471 -987628 -924376 -930565 -922278
2171i22278l3994O4846J4434Q0350O248J3452j1624P2087j8012N1039m2140j9139
$$ -922278 -956272 -891426 -876992 -796642 -790394 -776942 -788566 -716479 -734491 -683452 -725592 -744731
2159g44731O4263Q92R6924j3800J4768P3592M0385k1679K0109o2765K31762j0462
$$ -744731 -680468 -679576 -582652 -596452 -581684 -508092 -467707 -489386 -469277 -532042 -300280 -310742
2147c10742K2886J24009r2926J9126m98K4572j26541J62609P1854J1144M0158
$$ -310742 -287856 -163847 -256773 -237647 -238145 -213573 -340114 -177505 -105651 -94507 -54349
2136e4349O2744K7940R9291n8255R7255L4017K31386P5081L8856L9417J02978
$$ -54349 8395 36335 135626 77371 174626 208643 440029 515110 553966 593383 696361
2125F96361O6276P4384P5449O0663N7346Q3932Q0121J8832J88372K370K6599J21626
$$ 696361 762637 837021 912470 973133 1030479 1114411 1194532 1213364 1401736 1404106 1430705 1552331
2113A552331m2420P8397o564M0985J08797J16960L4659J6088J42343K72253L538
$$ 1552331 1509911 1588308 1581744 1622729 1731526 1848486 1883145 1899233 2041576 2313829 2317367
2102B317367R3844J12331J54139o5645Q3972q7079m6767k56793K2542j2744P5566
$$ 2317367 2411211 2523542 2677681 2612036 2696008 2608929 2562162 2305369 2327911 2315167 2390733
2091B390733J11224j2198K11747j2646l25878j76161o6664j63290k00131r0221
$$ 2390733 2501957 2489759 2701506 2688860 2362982 2186821 2120157 1956867 1756736 1666515
2081A666515j63647k6454M3935p5921p8172j0170o2051n675p3152J267j82369
$$ 1666515 1502868 1476414 1520349 1444428 1366256 1356086 1294035 1288360 1215208 1216475 1034106
2070A034106Q9324p3980K95j23203p0909K902n7097m6505n3166n9207l2393j57533
$$ 1034106 1123430 1049450 1049745 926542 855633 858535 801438 754933 701767 642560 610167 452634
2058D52634l2924j91369p9955j22450j06844j56068J8469q1345o6274n0009j32397
$$ 452634 419710 228341 148386 25936 -80908 -236976 -218507 -299852 -366126 -416135 -548532
2047e48532l3770K756j61289O5868j52969o7632O5949j39901m9438n8696l8622
$$ -548532 -582302 -579546 -740835 -674967 -827936 -895568 -829619 -969520 -1018958 -1077654 -1116276
2036a116276m076p3964K7397q0171k2166O0585j33173J930o3001n8077P8184k5637
$$ -1116276 -1120352 -1194316 -1166919 -1247090 -1269256 -1208671 -1341844 -1339914 -1402915 -1460992 -1382808 -1408445
2024a408445n5792J5133l5208m842j14850L6113n710K5909o5866m081P5490r7230
$$ -1408445 -1464237 -1449104 -1484312 -1489154 -1604004 -1567891 -1573601 -1547692 -1613558 -1617639 -1542149 -1639379
2012a639379Q0329j36310J60797k6389j07170P6292j40438N1018o7533J6566r0704
$$ -1639379 -1559050 -1695360 -1534563 -1560952 -1668122 -1591830 -1732268 -1681250 -1748783 -1732217 -1822921
2001a822921P7348J3302k9071K7708j23701J16586r0187n5055L7769J5007m7981
$$ -1822921 -1745573 -1732271 -1761342 -1733634 -1857335 -1740749 -1830936 -1885991 -1848222 -1833215 -1881196
1990a881196M5044j407l9360Q2196j4414l9826j2053r2323L0304L5017K0127j2830
$$ -1881196 -1836152 -1837559 -1876919 -1794723 -1809137 -1848963 -1861016 -1953339 -1923035 -1888018 -1867891 -1880721
1978a880721J8016p3979R7585j39439J2510J47170n3791r872o6100J00826o3709
$$ -1880721 -1862705 -1936684 -1839099 -1978538 -1966028 -1818858 -1872649 -1882521 -1948621 -1847795 -1911504
1967a911504l0601N2405p6562R5761n6344K2983q0995J15967j18246M614P8752
$$ -1911504 -1942105 -1889700 -1966262 -1870501 -1926845 -1903862 -1984857 -1868890 -1987136 -1982522 -1903770
1956a903770n6844L3779o935K1780r9189P087R6764k4262P3997j14109K1817R1128
$$ -1903770 -1960614 -1926835 -1933770 -1911990 -2011179 -2004092 -1907328 -1931590 -1857593 -1971702 -1949885 -1858757
1944a858757j60456k782K2678p3114P7938m9271k4720K6943O0617K1498o8230
$$ -1858757 -2019213 -2021995 -1999317 -2072431 -1994493 -2043764 -2068484 -2041541 -1980924 -1959426 -2027656
1933b027656K6384j9103J9820k7664l131R609n1965N6436M7706j9320p3221K5230
$$ -2027656 -2001272 -2020375 -2000555 -2028219 -2031350 -2021741 -2073706 -2017270 -1969564 -1988884 -2062105 -2036875
1921b036875k3949M4606n6814J4250M8371p7401J52312q7519m4805p4692Q0762
$$ -2036875 -2060824 -2016218 -2073032 -2058782 -2010411 -2087812 -1935500 -2023019 -2067824 -2142516 -2061754
1910b061754L4159Q225N814M3219n8445J0886j00411N1701Q067m0864O1946M1760
$$ -2061754 -2027595 -2019370 -2013556 -1970337 -2028782 -2017896 -2118307 -2066606 -2058539 -2099403 -2037457 -1995697
1898a995697j23995P3102k6517J1214L8136M3595m7005K6338N6280N003m3697
$$ -1995697 -2119692 -2046590 -2073107 -2061893 -2023757 -1980162 -2027167 -2000829 -1944549 -1939546 -1983243
1887a983243r0219N7543j829j3162J3313j29924R8574o9822M0470k6627K3024
$$ -1983243 -2073462 -2015919 -2017748 -2030910 -2017597 -2147521 -2048947 -2118769 -2078299 -2104926 -2081902
1876b081902L4860L867J09777k6582o5071k9444k1122L5853J7063o3483O4073
$$ -2081902 -2047042 -2043175 -1933398 -1959980 -2025051 -2054495 -2075617 -2039764 -2022701 -2086184 -2022111
1865b022111k114K9035J4728l865n9116Q7873p9125r0367J53604j18579J05862
$$ -2022111 -2024225 -1995190 -1980462 -1984327 -2043443 -1955570 -2034695 -2125062 -1971458 -2090037 -1984175
1854a984175r7590Q4586M8989o3478k0773q569l8378R2171N5488j15493L5301
$$ -1984175 -2081765 -1997179 -1948190 -2011668 -2032441 -2041010 -2079388 -1987217 -1931729 -2047222 -2011921
1843b011921p383K0929k5252n603J7524J14349k23504M2073Q7770m0030q2210
$$ -2011921 -2019304 -1998375 -2023627 -2029230 -2011706 -1897357 -2120861 -2078788 -1991018 -2031048 -2113258
1832b113258J01815n2896P2872r4154Q6737P1047l9725o0675l1551K2577R8954
$$ -2113258 -2011443 -2064339 -1991467 -2085621 -1998884 -1927837 -1967562 -2028237 -2059788 -2037211 -1938257
1821a938257n0480j43004J38646k1949L7107Q8411r3091j4195O7101L371o9530
$$ -1938257 -1988737 -2131741 -1993095 -2015044 -1977937 -1889526 -1982617 -1996812 -1929711 -1926340 -1995870
1810a995870K7875l373q912P3731j68740O2221m9209L0148K0848P1559n9461J2808
$$ -1995870 -1967995 -1971368 -1980280 -1906549 -2075289 -2013068 -2062277 -2032129 -2011281 -1939722 -1999183 -1986375
1798a986375j620l0129k6194M0775m7809K5211J06759n9643M2038k6638p9935
$$ -1986375 -1987995 -2018124 -2044318 -2003543 -2051352 -2026141 -1919382 -1979025 -1936987 -1963625 -2043560
1787b043560J46399P57j20360k8207J07858o7761M6443Q4811j66278M1537P4497
$$ -2043560 -1897161 -1896404 -2016764 -2044971 -1937113 -2004874 -1958431 -1873620 -2039898 -1998361 -1923864
1776a923864J9710j14375l054O3676o0213R0443N441o3649P9924j40237o008R1930
$$ -1923864 -1904154 -2018529 -2021583 -1957907 -2018120 -1927677 -1922236 -1985885 -1905961 -2046198 -2052206 -1960276
1764a960276j4072O2836j46739R0477p6967P5707n7955N3633j03500J21527m8349
$$ -1960276 -1974348 -1911512 -2058251 -1967774 -2044741 -1969034 -2026989 -1973356 -2076856 -1955329 -2003678
1753b003678R8101j15161K2241k5431O1214K2905l8500O1369q112o5880K7288
$$ -2003678 -1905577 -2020738 -1998497 -2023928 -1962714 -1939809 -1978309 -1916940 -1925052 -1990932 -1963644
1742a963644J2646l8326m1420O5017m8732N3678m1643Q0400n178Q5625o6940J9846
$$ -1963644 -1950998 -1989324 -2030744 -1965727 -2014459 -1960781 -2002424 -1922024 -1927202 -1841577 -1908517 -1888671
1730a888671q1125M3554m1364n4456N8855L4047j08821J8252J31206n3905L9784
$$ -1888671 -1969796 -1926242 -1967606 -2022062 -1963207 -1929160 -2037981 -2019729 -1888523 -1942428 -1902644
1719a902644l8098K4692m638n8021l8946O8454Q6790n7595p9276L3555N0710m267
$$ -1902644 -1940742 -1916050 -1920688 -1978709 -2017655 -1949201 -1862411 -1920006 -1999282 -1965727 -1915017 -1919284
1707a919284m424n5243l542l2638Q7382L8900j1353m2467M6456O4224l4507o0485
$$ -1919284 -1923708 -1978951 -1982493 -2015131 -1927749 -1888849 -1900202 -1942669 -1896213 -1831989 -1866496 -1926981
1695a926981j00464O4993J141L8243Q3722o3810J9520K3067K160j7453k9490L9242
$$ -1926981 -2027445 -1962452 -1961311 -1923068 -1839346 -1903156 -1883636 -1860569 -1858409 -1875862 -1905352 -1866110
1683a866110j4932p4096J44102p4084O687Q1502m5321n9694J3109o2912M0519
$$ -1866110 -1881042 -1955138 -1811036 -1885120 -1878433 -1796931 -1842252 -1901946 -1888837 -1951749 -1911230
1672a911230L4354q4265o0634J93066m649j06947Q8705o9656l4821M6671P1272
$$ -1911230 -1876876 -1961141 -2021775 -1828709 -1833358 -1940305 -1851600 -1921256 -1956077 -1909406 -1838134
1661a838134K3666j16011j1294K1126p2023J41930Q408j45403K61771k01250Q3208
$$ -1838134 -1814468 -1930479 -1941773 -1920647 -1992670 -1850740 -1842332 -1987735 -1725964 -1927214 -1844006
1650a844006k8895N1291m9452n0032N0896N1732k9963M0027m2522L499L7026p2744
$$ -1844006 -1872901 -1821610 -1871062 -1921094 -1870198 -1818466 -1848429 -1808402 -1850924 -1847425 -1810399 -1883143
1638a883143O4435K775r9720O1207J3628n1380l7161K5179P6966p1220l5940J08546
$$ -1883143 -1818708 -1815933 -1915653 -1854446 -1840818 -1892198 -1929359 -1904180 -1827214 -1898434 -1934374 -1825828
1626a825828j6520k341m9014k8119O3007R3725j37762J69846k0877j20049N8472
$$ -1825828 -1842348 -1844689 -1893703 -1921822 -1858815 -1765090 -1902852 -1733006 -1753883 -1873932 -1815460
1615a815460o2167l5762Q7456L0929k4441r3006J82274j6844j10603N9618k2944
$$ -1815460 -1877627 -1913389 -1825933 -1795004 -1819445 -1912451 -1730177 -1747021 -1857624 -1798006 -1820950
1604a820950J8778m8837J7965j19727J37132o0707j6010p616O7809L8393Q337
$$ -1820950 -1802172 -1851009 -1833044 -1952771 -1815639 -1876346 -1892356 -1899972 -1832163 -1793770 -1785433
1593a785433k5559q6867k2728R7123n3266j5388M7414Q2686q5914J25920n6422
$$ -1785433 -1810992 -1897859 -1920587 -1823464 -1876730 -1892118 -1844704 -1762018 -1847932 -1722012 -1778434
1582a778434p7087J9067j23235J91203L6852r6717l3000O0456M8551r0761N4080
$$ -1778434 -1855521 -1836454 -1959689 -1768486 -1731634 -1828351 -1861351 -1800895 -1752344 -1843105 -1789025
1571a789025l3121R6559p9090k1008N7492n6113O4915l372N5320j04558K516J7516
$$ -1789025 -1822146 -1725587 -1804677 -1825685 -1768193 -1824306 -1759391 -1762763 -1707443 -1812001 -1809485 -1791969
1559a791969j3295J9117P9216m6621L2978k4571l9022J15794j4201j30878R2701
$$ -1791969 -1805264 -1786147 -1706931 -1753552 -1720574 -1745145 -1784167 -1668373 -1682574 -1813452 -1720751
1548a720751r2756M1968L2955O4135p1063R690k6812N9810r1062R4527r5243R6358
$$ -1720751 -1813507 -1771539 -1738584 -1674449 -1745512 -1735822 -1762634 -1702824 -1793886 -1699359 -1794602 -1698244
1536a698244O3942j18114R1251j2546J4508k8977n829k0830L154L115Q4105j26923
$$ -1698244 -1634302 -1752416 -1661165 -1673711 -1659203 -1688180 -1694009 -1714839 -1711685 -1708570 -1624465 -1751388
1524a751388M0179k3545J15499q4625o5558J69819m0563k1137J4055m8391J20423
$$ -1751388 -1711209 -1734754 -1619255 -1703880 -1769438 -1599619 -1640182 -1661319 -1647264 -1695655 -1575232
1513a575232R087R293j21195M8885n2017K5895O2323r8472P8476R2457p5460R685
$$ -1575232 -1566145 -1556852 -1678047 -1629162 -1681179 -1655284 -1592961 -1691433 -1612957 -1520500 -1595960 -1586275
1501a586275m0763J50482j69206m8994j0345j0058R6516J5279m8341J2004L5894
$$ -1586275 -1627038 -1476556 -1645762 -1694756 -1705101 -1715159 -1618643 -1603364 -1651705 -1639701 -1603807
1490a603807N2110p6970k0185P6884J17323p8141j0548m6285M1598J7663M0469
$$ -1603807 -1551697 -1628667 -1648852 -1571968 -1454645 -1532786 -1543334 -1589619 -1548021 -1530358 -1489889
1479a489889n5970k5815J28457j3193J24037q9875J12827J39561n4627O9718k5354
$$ -1489889 -1545859 -1571674 -1443217 -1456410 -1332373 -1422248 -1309421 -1169860 -1224487 -1154769 -1180123
1468a180123J65303M8135K0285j0148o0369j11034j6318J5076J3149J54574p4491
$$ -1180123 -1014820 -966685 -946400 -956548 -1016917 -1127951 -1144269 -1129193 -1116044 -961470 -1035961
1457a035961J27536k1816J11180k45333r9771j11015n8529p3320L7281m6196j8198
$$ -1035961 -908425 -930241 -819061 -1064394 -1164165 -1275180 -1333709 -1407029 -1369748 -1415944 -1434142
1446a434142p8510m8639l215p0258J03932k120N889m5173Q327q1877P8089k9321
$$ -1434142 -1512652 -1561291 -1564506 -1634764 -1530832 -1532952 -1527063 -1572236 -1563909 -1645786 -1567697 -1597018
1434a597018O4688j33800L3109Q960o4639Q2802M4530o28p5048K451N3483m2580
$$ -1597018 -1532330 -1666130 -1633021 -1624061 -1688700 -1605898 -1561368 -1561996 -1637044 -1634593 -1581110 -1623690
1422a623690J44n0825m1792P6966Q802q6570J41988r1410N5649p4257L2046M563
$$ -1623690 -1623546 -1674371 -1716163 -1639197 -1630395 -1716965 -1574977 -1666387 -1610738 -1684995 -1652949 -1648386
1410a648386k9170o675j3536j3864k9294l2600Q4884n6191L8102J29K809J7033
$$ -1648386 -1677556 -1684231 -1697767 -1711631 -1740925 -1773525 -1688641 -1744832 -1706730 -1706601 -1703792 -1686759
1398a686759J2554L1540j00574N3393l7092M6015l7303J50261j56794O0674o6241
$$ -1686759 -1674205 -1642665 -1743239 -1689846 -1726938 -1680923 -1718226 -1567965 -1724759 -1664085 -1730326
1387a730326n63M9695j57679K34041m2867J2902K2463j69970J44533m10m3859
$$ -1730326 -1730889 -1681194 -1838873 -1604832 -1647699 -1634797 -1612334 -1782304 -1637771 -1638181 -1682040
1376a682040l8763O4579k6880J14223j14752L8255m6513M2026o5267O3891p3169
$$ -1682040 -1720803 -1656224 -1683104 -1568881 -1683633 -1645378 -1691891 -1649865 -1715132 -1651241 -1724410
1365a724410Q0829k1173j19020J29560m2478L1440K5755k4392K2753q4300R5765
$$ -1724410 -1643581 -1664754 -1783774 -1654214 -1696692 -1665252 -1639497 -1663889 -1641136 -1725436 -1629671
1354a629671r5135l4210K5602q840M0696N2654n7159J5090p2972K0990j9891J61263
$$ -1629671 -1724806 -1759016 -1733414 -1742254 -1701558 -1648904 -1706063 -1690973 -1763945 -1742955 -1762846 -1601583
1342a601583j22463j8272K3362N2208j10852L7227L7367J46557j66192k7004O4160
$$ -1601583 -1724046 -1742318 -1718956 -1666748 -1777600 -1740373 -1703006 -1556449 -1722641 -1749645 -1685485
1331a685485k4393J20934q2380K6452J4240M7631o3522J4814q4389m93o1437J51646
$$ -1685485 -1709878 -1588944 -1671324 -1644872 -1630632 -1583001 -1646523 -1631709 -1716098 -1716591 -1778028 -1626382
1319a626382m4192M699j4180n1865J20696o7374J17236q0019K3491r2956M7709
$$ -1626382 -1670574 -1665875 -1680055 -1731920 -1611224 -1678598 -1561362 -1641381 -1617890 -1710846 -1663137
1308a663137J01349q4173m2074q7154Q4113K215J8753k0874m6442Q4981N1200
$$ -1663137 -1561788 -1645961 -1688035 -1775189 -1691076 -1688861 -1670108 -1690982 -1737424 -1652443 -1601243
1297a601243j6095m9873j6609o303N3181m5530J44549q9474o7111J8671p0686
$$ -1601243 -1617338 -1667211 -1683820 -1690123 -1636942 -1682472 -1537923 -1627397 -1694508 -1675837 -1746523
1286a746523M3694P8497r4211R804O7474l4072N8154r0242P1916p585m0691P4170
$$ -1746523 -1702829 -1624332 -1718543 -1708739 -1641265 -1675337 -1617183 -1707425 -1635509 -1643094 -1683785 -1609615
1274a609615q041p8000J10754l8497J14149q7682j01310O3717o2035J39454j6241
$$ -1609615 -1617656 -1695656 -1584902 -1623399 -1509250 -1596932 -1698242 -1634525 -1696560 -1557106 -1573347
1263a573347j5802K0066n1519q036P202L0984l1349r675m3595P8866l1226k040
$$ -1573347 -1589149 -1569083 -1620602 -1628638 -1621436 -1590452 -1621801 -1631476 -1675071 -1596205 -1627431 -1629471
1251a629471K0760K3703L2054p1385m1719J17782j26862Q6990N291j787l1672
$$ -1629471 -1608711 -1585008 -1552954 -1624339 -1666058 -1548276 -1675138 -1588148 -1582857 -1584644 -1616316
1240a616316K7619j07806j202k256O9690j6712L860R988n4583O0109M471K5627
$$ -1616316 -1588697 -1696503 -1697705 -1699961 -1630271 -1646983 -1643123 -1633135 -1687718 -1627609 -1623138 -1597511
1228a597511n1921k6807N5452M4430k9333K6851k5031j07242J22970m552K1896
$$ -1597511 -1649432 -1676239 -1620787 -1576357 -1605690 -1578839 -1603870 -1711112 -1588142 -1592694 -1570798
1217a570798q4242J17515q7116R428l6500k005L0514P723q535J08803q2921n5187
$$ -1570798 -1655040 -1537525 -1624641 -1615213 -1651713 -1653718 -1623204 -1615481 -1624016 -1515213 -1598134 -1653321
1205a653321O9923m0622Q8952o7028L650k4221J2731M2433m9152P8894j22311
$$ -1653321 -1583398 -1624020 -1535068 -1602096 -1598446 -1622667 -1609936 -1567503 -1616655 -1537761 -1660072
1194a660072j4515J08837m4852l8705O2285Q6991K8708l6765l3805j16214j042
$$ -1660072 -1674587 -1565750 -1610602 -1649307 -1587022 -1500031 -1471323 -1508088 -1541893 -1658107 -1659149
1183a659149N5576r9620J79902n403p6217K8343J7549r557N3816l7050m0593K7273
$$ -1659149 -1603573 -1703193 -1523291 -1528694 -1604911 -1576568 -1559019 -1568576 -1514760 -1551810 -1592403 -1565130
1171a565130j0159n1585M1143J0017j2149M178R835J7039L2033q5807J2150J9507
$$ -1565130 -1575289 -1626874 -1585731 -1575714 -1587863 -1583685 -1573850 -1556811 -1524778 -1610585 -1598435 -1578928
1159a578928l1153L8124r0159J10703L6990j12157Q0823M8846L416j56294N1071
$$ -1578928 -1610081 -1571957 -1662116 -1551413 -1514423 -1626580 -1545757 -1496911 -1493495 -1649789 -1598718
1148a598718L0945j4249J2456K8623K4145q5611Q2689n8367o6701M7210L8318
$$ -1598718 -1567773 -1582022 -1569566 -1540943 -1516798 -1602409 -1519720 -1578087 -1644788 -1597578 -1559260
1137a559260n9991J3990l3498J29951o1776K3591J8393p2314r142M6250m2876
$$ -1559260 -1619251 -1605261 -1638759 -1508808 -1570584 -1546993 -1528600 -1600914 -1610056 -1563806 -1606682
1126a606682J3698N8541p6146R885L538J02383p8901l7412j1954J8676M4415M0535
$$ -1606682 -1592984 -1534443 -1610589 -1600704 -1597166 -1494783 -1573684 -1611096 -1623050 -1604374 -1559959 -1519424
1114a519424q8802N8299n7194K5197K9817r7999Q9219p0824L6165L9743L7695
$$ -1519424 -1608226 -1549927 -1607121 -1581924 -1552107 -1650106 -1560887 -1631711 -1595546 -1555803 -1518108
1103a518108l3992L834j2390p238R4857n7552O5434j38621j421l2928M9640J2245
$$ -1518108 -1552100 -1548266 -1560656 -1567894 -1473037 -1530589 -1465155 -1603776 -1605197 -1638125 -1588485 -1576240
1091a576240P0111j04782O1489l0498P1928Q117k6706j41592J11869O6438k7439
$$ -1576240 -1506129 -1610911 -1549422 -1579920 -1507992 -1499875 -1526581 -1668173 -1556304 -1489866 -1517305
1080a517305j26156N2971l2588N0305P0806j02975M5821k2151j6786J33750j18392
$$ -1517305 -1643461 -1590490 -1623078 -1572773 -1501967 -1604942 -1559121 -1581272 -1598058 -1464308 -1582700
1069a582700R6561K741j26891J47444m1967j4520q6886R1814J4671o8456N1646
$$ -1582700 -1486139 -1483398 -1610289 -1462845 -1504812 -1519332 -1606218 -1514404 -1499733 -1568189 -1516543
1058a516543o2731P0386j7813N0614j19168J02588j35192Q6526P022j11810R4312
$$ -1516543 -1579274 -1508888 -1526701 -1476087 -1595255 -1492667 -1627859 -1541333 -1534311 -1646121 -1551809
1047a551809J7065K7821J6573j14706O1373M7794q6593j2153K1248k7763J31935
$$ -1551809 -1534744 -1506923 -1490350 -1605056 -1543683 -1495889 -1582482 -1594635 -1573387 -1601150 -1469215
1036a469215k3855J6298l2571k6393n3627R5461j0940R5371o6271n772r8595J50880
$$ -1469215 -1493070 -1476772 -1509343 -1535736 -1589363 -1493902 -1504842 -1409471 -1475742 -1481514 -1580109 -1429229
1024a429229j94008R8454q279q5255O6524P3189j27002m6522J80764M2745j28673
$$ -1429229 -1623237 -1524783 -1533062 -1618317 -1551793 -1478604 -1605606 -1652128 -1471364 -1428619 -1557292
1013a557292P5550j22852N8521j1227K9841N3725j09709J31027r5405P0909p350
$$ -1557292 -1481742 -1604594 -1546073 -1557300 -1527459 -1473734 -1583443 -1452416 -1547821 -1476912 -1484262
1002a484262L0360p0619l0506P8785P268k6066k4752p098L0981M3532m9343J3596
$$ -1484262 -1453902 -1524521 -1555027 -1476242 -1468974 -1495040 -1519792 -1526890 -1495909 -1452377 -1501720 -1488124
990a488124j2097n405q015L2101J0815l7411k9143m0380K9696O0998L1590k4166
$$ -1488124 -1500221 -1505626 -1513641 -1481540 -1470725 -1508136 -1537279 -1577659 -1547963 -1486965 -1455375 -1479541
978a479541O911l7282P6055K4263m0464n169J1031k9892j6915l5401O9170L4066
$$ -1479541 -1472630 -1509912 -1433857 -1409594 -1450058 -1455227 -1444196 -1474088 -1491003 -1526404 -1457234 -1423168
966a423168j18966O6889o9751K7945q456N8814j8535J2027q2757Q7747O968K2262
$$ -1423168 -1542134 -1475245 -1544996 -1517051 -1525507 -1466693 -1485228 -1473201 -1555958 -1468211 -1461243 -1438981
954a438981m6784p228J2876k8404r5724R5072O7418m8239J24686m6264j0817k2490
$$ -1438981 -1485765 -1492993 -1480117 -1508521 -1604245 -1509173 -1441755 -1489994 -1365308 -1411572 -1422389 -1444879
942a444879K9000q9308M6438M5413o5604m9570n5364k407J10105n5003K7410l5731
$$ -1444879 -1415879 -1505187 -1458749 -1413336 -1478940 -1528510 -1583874 -1586281 -1476176 -1531179 -1503769 -1539500
930a539500K0330m7061Q4860J1558q2115J32571p2637L8974r6862J79184m6784
$$ -1539500 -1519170 -1566231 -1481371 -1469813 -1551928 -1419357 -1491994 -1453020 -1549882 -1370698 -1417482
$$ [...]
##END NTUPLES=NMR SPECTRUM
##END=
