##TITLE=abcd
##JCAMPDX= 6.0         $$ Bruker NMR JCAMP-DX V2.0
##DATA TYPE= NMR FID
##DATA CLASS= NTUPLES
##ORIGIN= UXNMR, Bruker Analytische Messtechnik GmbH
##OWNER= root
$$ XWIN-NMR		Version 3.5
$$ Wed May 21 12:42:29 2025 Russian Standard Time (UT+4h)  servis@DPX200
##.OBSERVE FREQUENCY= 200.131235884673
##.OBSERVE NUCLEUS= ^1H
##.DELAY= (6, 6)
##.ACQUISITION MODE= SIMULTANEOUS
##.ACQUISITION SCHEME= undefined
##.AVERAGES= 128
##.DIGITISER RES= 18
##SPECTROMETER/DATA SYSTEM= spect
##.PULSE SEQUENCE= zg
##.SOLVENT NAME= CDCl3
##.SHIFT REFERENCE= (INTERNAL, CDCl3, 0, 16.5164)
##AUDIT TRAIL= $$ (NUMBER, WHEN, WHO, WHERE, WHAT)
$$ ##TITLE= Audit trail, XWIN-NMR		Version 3.5
$$ ##JCAMPDX= 5.01
$$ ##ORIGIN= Bruker BioSpin GmbH
$$ ##OWNER= servis
$$ F:\spectra/data/av/nmr/H1/1/audita.txt
$$ ##AUDIT TRAIL=  $$ (NUMBER, WHEN, WHO, WHERE, WHAT)
(   1,<2025-05-21 12:41:25.78 +0400>,<servis>,<DPX200>,
      <created by zg, POWCHK disabled, PULCHK disabled
       configuration hash MD5:
       00 E9 B6 7A A2 85 ED C7 34 08 36 98 17 FE 4E 26
       data hash MD5: 32K
       5D 24 C3 21 73 ED EA B1 EE 4B CF 0D 41 C0 93 74>)
$$ ##END=
$$ 
$$ hash MD5
$$ 2E 44 3F 1E EB C1 4C 3D 31 88 1B A5 BD 3E 11 53
##$RELAX= 
##$RELAX= 
##$RELAX= 
##$RELAX= 
##$RELAX= 
##$RELAX= 
##$RELAX= 
##$RELAX= 
$$ Bruker specific parameters
$$ --------------------------
##$DU= <F:\spectra>
##$EXPNO= 1
##$NAME= <H1>
##$PROCNO= 1
##$TYPE= <nmr>
##$USER= <av>
##$AMP= (0..31)
100 100 100 100 100 100 100 100 100 100 100 100 100 100 100 100 100 100 
100 100 100 100 100 100 100 100 100 100 100 100 100 100 
##$AQSEQ= 0
##$AQ_mod= 1
##$AUNM= <au_zg>
##$AUTOPOS= <>
##$BF1= 200.13
##$BF2= 200.13
##$BF3= 200.13
##$BF4= 200.13
##$BF5= 500.13
##$BF6= 500.13
##$BF7= 500.13
##$BF8= 500.13
##$BYTORDA= 1
##$CFDGTYP= 0
##$CFRGTYP= 5
##$CHEMSTR= <none>
##$CNST= (0..31)
1 1 145 1 1 1 1 1 1 1 1 1 1 1 1 1 1 1 1 1 1 1 1 1 1 1 1 1 1 1 1 1 
##$CPDPRG= <>
##$CPDPRG1= <>
##$CPDPRG2= <>
##$CPDPRG3= <>
##$CPDPRG4= <mlev>
##$CPDPRG5= <mlev>
##$CPDPRG6= <mlev>
##$CPDPRG7= <mlev>
##$CPDPRG8= <mlev>
##$CPDPRGB= <>
##$CPDPRGT= <>
##$D= (0..31)
0 2 0 0 0 0 0 0 0 0.06 0 0 0 0 0 0 0.0002 0 0 0 0 0 0 0 0 0 0 0 0 0 0 
0 
##$DATE= 1747816885
##$DBL= (0..7)
120 120 120 120 120 120 120 120 
##$DBP= (0..7)
150 150 150 150 150 150 150 150 
##$DBP07= 0
##$DBPNAM0= <>
##$DBPNAM1= <>
##$DBPNAM2= <>
##$DBPNAM3= <>
##$DBPNAM4= <>
##$DBPNAM5= <>
##$DBPNAM6= <>
##$DBPNAM7= <>
##$DBPOAL= (0..7)
0.5 0.5 0.5 0.5 0.5 0.5 0.5 0.5 
##$DBPOFFS= (0..7)
0 0 0 0 0 0 0 0 
##$DE= 6
##$DECBNUC= <off>
##$DECIM= 32
##$DECNUC= <off>
##$DECSTAT= 4
##$DIGMOD= 1
##$DIGTYP= 9
##$DL= (0..7)
0 120 120 120 120 120 120 120 
##$DP= (0..7)
150 150 150 150 150 150 150 150 
##$DP07= 0
##$DPNAME0= <>
##$DPNAME1= <>
##$DPNAME2= <>
##$DPNAME3= <>
##$DPNAME4= <>
##$DPNAME5= <>
##$DPNAME6= <>
##$DPNAME7= <>
##$DPOAL= (0..7)
0.5 0.5 0.5 0.5 0.5 0.5 0.5 0.5 
##$DPOFFS= (0..7)
0 0 0 0 0 0 0 0 
##$DQDMODE= 0
##$DR= 18
##$DS= 0
##$DSLIST= <SSSSSSSSSSSSSSS>
$$ [...]
##$SUBNAM0= <"">
##$SUBNAM1= <"">
##$SUBNAM2= <"">
##$SUBNAM3= <"">
##$SUBNAM4= <"">
##$SUBNAM5= <"">
##$SUBNAM6= <"">
##$SUBNAM7= <"">
##$SUBNAM8= <"">
##$SUBNAM9= <"">
##$SW= 20.6817932712277
##$SWIBOX= (0..15)
0 0 3 0 0 0 0 0 0 0 0 0 0 0 0 0 
##$SW_h= 4139.07284768212
##$TD= 32768
##$TD0= 1
##$TE= 0
##$TE2= 300
##$TE3= 300
##$TEG= 300
##$TL= (0..7)
0 120 120 120 120 120 120 120 
##$TP= (0..7)
150 150 150 150 150 150 150 150 
##$TP07= 0
##$TPNAME0= <>
##$TPNAME1= <>
##$TPNAME2= <>
##$TPNAME3= <>
##$TPNAME4= <>
##$TPNAME5= <>
##$TPNAME6= <>
##$TPNAME7= <>
##$TPOAL= (0..7)
0.5 0.5 0.5 0.5 0.5 0.5 0.5 0.5 
##$TPOFFS= (0..7)
0 0 0 0 0 0 0 0 
##$TUNHIN= 0
##$TUNHOUT= 0
##$TUNXOUT= 0
##$USERA1= <user>
##$USERA2= <user>
##$USERA3= <user>
##$USERA4= <user>
##$USERA5= <user>
##$V9= 5
##$VALIST= <valist>
##$VCLIST= <CCCCCCCCCCCCCCC>
##$VD= 0
##$VDLIST= <DDDDDDDDDDDDDDD>
##$VPLIST= <PPPPPPPPPPPPPPP>
##$VTLIST= <TTTTTTTTTTTTTTT>
##$WBST= 1024
##$WBSW= 30
##$XGAIN= (0..3)
0 0 0 0 
##$XL= 0
##$YL= 0
##$YMAX_a= 1044636
##$YMIN_a= -1019973
##$ZGOPTNS= <>
##$ZL1= 120
##$ZL2= 120
##$ZL3= 120
##$ZL4= 120
##$ABSF1= 10
##$ABSF2= 0
##$ABSG= 5
##$ABSL= 3
##$ALPHA= 0
##$AQORDER= 0
##$ASSFAC= 0
##$ASSFACI= 0
##$ASSFACX= 0
##$ASSWID= 0
##$AUNMP= <proc_1d>
##$AZFE= 0.1
##$AZFW= 0.1
##$BCFW= 1
##$BC_mod= 2
##$BYTORDP= 0
##$COROFFS= 0
##$CY= 19
##$DATMOD= 1
##$DC= 2
##$DFILT= <>
##$DTYPP= 0
##$F1P= 11.0000007629395
##$F2P= -0.999999237060547
##$FCOR= 0.5
##$FTSIZE= 0
##$FT_mod= 4
##$GAMMA= 1
##$GB= 1
##$INTBC= 1
##$INTSCL= 1
##$ISEN= 128
##$LB= 0.05
##$LEV0= 0
##$LPBIN= 0
##$MAXI= 10000
##$MC2= 0
##$MEAN= 0
##$ME_mod= 0
##$MI= 0
##$NCOEF= 0
##$NC_proc= 0
##$NLEV= 6
##$NOISF1= 0
##$NOISF2= 0
##$NSP= 1
##$NTH_PI= 0
##$NZP= 0
##$OFFSET= 16.51637
##$PC= 1
##$PHC0= -185.6496
##$PHC1= -4.898466
##$PH_mod= 0
##$PKNL= yes
##$PPARMOD= 0
##$PSCAL= 4
##$PSIGN= 0
##$REVERSE= no
##$SF= 200.13
##$SI= 16384
##$SIGF1= 0
##$SIGF2= 0
##$SINO= 400
##$SIOLD= 16384
##$SREGLST= <1H.CDCl3>
##$SSB= 0
##$STSI= 0
##$STSR= 0
##$SW_p= 4139.07284768211
##$SYMM= 0
##$S_DEV= 0
##$TDeff= 0
##$TDoff= 0
##$TI= <>
##$TILT= no
##$TM1= 0
##$TM2= 0
##$TOPLEV= 0
##$USERP1= <user>
##$USERP2= <user>
##$USERP3= <user>
##$USERP4= <user>
##$USERP5= <user>
##$WDW= 1
##$XDIM= 8192
##$YMAX_p= 0
##$YMIN_p= 0
$$ End of Bruker specific parameters
$$ ---------------------------------
##NTUPLES= NMR FID
##VAR_NAME=  TIME,          FID/REAL,        FID/IMAG
##SYMBOL=    X,             R,               I
##VAR_TYPE=  INDEPENDENT,   DEPENDENT,       DEPENDENT
##VAR_FORM=  AFFN,          ASDF,            ASDF
##VAR_DIM=   16384,         16384,           16384
##UNITS=     SECONDS,       ARBITRARY UNITS, ARBITRARY UNITS
##FACTOR=    0.0002416,     1,               1
##FIRST=     0,             0,               0
##LAST=      3.9581328,     0,               0
##MIN=       0,             -1019973,        0
##MAX=       3.9581328,     1044636,         0
$$ Real data points
##PAGE= N=1
##DATA TABLE= (X++(R..R)), XYDATA
$$ [...]
7253 -271 -1642 -2677 -3334 -3507 -3186 -2374 -1212 127 1478 2566 3372 3593 3291 2534 1395 56 -1263
7270 -1263 -2493 -3285 -3553 -3347 -2610 -1503 -192 1199 2309 3138 3460 3299 2634 1551 200 -1098 -2266
7287 -2266 -3117 -3503 -3346 -2748 -1750 -422 926 2081 2987 3480 3397 2795 1817 590 -773 -2001 -2972 -3522
7305 -3522 -3457 -2941 -2043 -740 610 1893 2869 3439 3458 3043 2111 897 -425 -1760 -2784 -3356 -3482 -3061
7323 -3061 -2190 -1031 363 1622 2685 3321 3412 3065 2198 1095 -241 -1517 -2635 -3356 -3565 -3207 -2443
7340 -2443 -1298 -16 1309 2491 3244 3532 3283 2572 1452 152 -1227 -2367 -3192 -3514 -3294 -2612 -1563
7357 -1563 -233 1093 2313 3136 3512 3360 2722 1663 335 -973 -2174 -3033 -3463 -3368 -2775 -1768 -521
7374 -521 822 2005 2920 3429 3385 2842 1964 697 -690 -1915 -2924 -3461 -3521 -3054 -2088 -870 466 1777
7392 1777 2784 3406 3459 3061 2171 922 -411 -1685 -2744 -3401 -3434 -3058 -2263 -1023 286 1617 2617
7409 2617 3294 3510 3133 2328 1193 -93 -1389 -2499 -3246 -3533 -3222 -2494 -1342 -78 1237 2368 3154
7426 3154 3505 3313 2562 1519 203 -1172 -2330 -3159 -3525 -3309 -2692 -1599 -305 994 2163 3009 3426
7443 3426 3309 2712 1686 397 -845 -2099 -2972 -3395 -3371 -2750 -1827 -581 764 2003 2920 3491 3445 2895
7461 2895 2017 770 -532 -1861 -2815 -3341 -3474 -2991 -2117 -929 408 1659 2694 3346 3417 3011 2136 976
7479 976 -309 -1593 -2656 -3279 -3447 -3062 -2315 -1132 150 1453 2511 3177 3380 3163 2395 1285 -26
7496 -26 -1340 -2397 -3183 -3440 -3209 -2530 -1403 -107 1137 2338 3090 3483 3293 2661 1572 281 -998
7513 -998 -2183 -3019 -3421 -3303 -2701 -1649 -438 910 2087 2937 3339 3286 2724 1740 500 -797 -1983 -2877
7531 -2877 -3413 -3348 -2898 -1952 -739 611 1835 2786 3322 3402 2928 2024 848 -468 -1733 -2724 -3287 -3411
7549 -3411 -3012 -2156 -989 341 1642 2592 3235 3411 3035 2220 1105 -237 -1465 -2502 -3181 -3344 -3081
7566 -3081 -2326 -1230 61 1331 2356 3089 3415 3117 2409 1348 55 -1257 -2358 -3139 -3444 -3265 -2565
7583 -2565 -1539 -267 1003 2175 3037 3362 3285 2650 1553 356 -938 -2082 -2905 -3356 -3248 -2671 -1735
7600 -1735 -473 858 1931 2861 3326 3278 2770 1843 630 -665 -1837 -2789 -3249 -3306 -2868 -1967 -808 530
7618 530 1732 2689 3313 3331 2883 2101 906 -402 -1587 -2654 -3278 -3417 -3002 -2220 -1075 200 1459 2481
7636 2481 3182 3308 3030 2250 1150 -156 -1343 -2391 -3105 -3297 -3050 -2352 -1273 -41 1195 2306 3057
7653 3057 3322 3157 2450 1448 257 -1118 -2209 -3041 -3401 -3233 -2608 -1630 -348 922 2116 2943 3338
7670 3338 3215 2643 1644 421 -816 -1994 -2875 -3277 -3275 -2775 -1780 -604 686 1828 2703 3229 3271 2727 1846
7689 1846 667 -551 -1725 -2731 -3242 -3234 -2848 -2020 -827 430 1668 2676 3211 3365 3001 2138 1065
7706 1065 -251 -1506 -2471 -3177 -3381 -2988 -2260 -1163 99 1330 2368 3015 3276 2989 2300 1218 -35
7723 -35 -1236 -2342 -3030 -3350 -3096 -2403 -1416 -166 1086 2154 2951 3340 3134 2496 1497 276 -955 -2099
7741 -2099 -2935 -3342 -3216 -2645 -1669 -449 831 2033 2872 3301 3250 2679 1743 622 -749 -1828 -2721 -3220
7759 -3220 -3149 -2736 -1863 -666 574 1689 2687 3185 3235 2817 1950 781 -485 -1649 -2579 -3224 -3333 -2935
7777 -2935 -2140 -970 307 1521 2526 3185 3298 3004 2239 1105 -122 -1349 -2424 -3093 -3304 -3056 -2277
7794 -2277 -1200 19 1341 2300 2994 3261 2979 2340 1297 98 -1139 -2199 -2955 -3268 -3112 -2511 -1485
7811 -1485 -288 984 2088 2923 3243 3138 2527 1535 355 -900 -1992 -2876 -3309 -3214 -2750 -1781 -526 692
7829 692 1879 2748 3215 3235 2657 1794 617 -580 -1802 -2678 -3194 -3203 -2756 -1844 -789 487 1648 2589 3136
7848 3136 3231 2840 2080 904 -302 -1491 -2502 -3150 -3273 -2994 -2165 -1098 147 1380 2375 3029 3260 2983
7866 2983 2219 1130 -84 -1271 -2365 -3074 -3294 -3048 -2410 -1342 -82 1146 2158 2898 3192 3048 2357
7883 2357 1387 237 -1074 -2098 -2861 -3231 -3076 -2503 -1548 -371 884 2028 2851 3254 3163 2620 1653 453
7901 453 -769 -1931 -2838 -3266 -3229 -2769 -1806 -656 570 1756 2668 3154 3128 2677 1846 704 -528 -1689
7919 -1689 -2603 -3132 -3224 -2759 -2023 -881 324 1509 2502 3046 3181 2834 2102 1023 -190 -1405 -2423 -3074
7937 -3074 -3255 -2968 -2232 -1134 74 1301 2326 3011 3256 2996 2276 1195 24 -1174 -2240 -2979 -3229
7954 -3229 -3042 -2393 -1369 -251 996 2041 2804 3189 3000 2430 1449 280 -932 -2046 -2827 -3225 -3177 -2596
7972 -2596 -1624 -485 706 1833 2712 3159 3138 2630 1730 559 -684 -1806 -2696 -3152 -3124 -2677 -1842 -692
7990 -692 493 1675 2584 3144 3188 2713 1913 827 -402 -1486 -2505 -3089 -3144 -2808 -2034 -963 219 1396
8008 1396 2378 2994 3146 2873 2096 1079 -143 -1328 -2352 -3040 -3241 -3027 -2296 -1293 -53 1190 2233
8025 2233 2992 3177 3002 2332 1345 171 -1071 -2126 -2870 -3186 -2999 -2394 -1448 -284 911 1984 2794 3126
8043 3126 3039 2428 1571 370 -797 -1930 -2757 -3155 -3131 -2633 -1774 -585 622 1721 2628 3108 3085 2663 1815
8062 1815 682 -570 -1710 -2611 -3134 -3194 -2759 -1959 -806 384 1549 2514 3034 3121 2730 2056 950 -276
8080 -276 -1415 -2337 -3000 -3110 -2801 -2036 -1072 108 1332 2314 2932 3178 2934 2272 1202 38 -1183 -2232
8098 -2232 -2951 -3216 -2984 -2368 -1346 -169 1044 2058 2847 3128 3001 2364 1431 219 -978 -2045 -2771
8115 -2771 -3169 -3047 -2481 -1565 -404 769 1871 2635 3106 3012 2516 1639 519 -663 -1805 -2627 -3085 -3086 -2647
8134 -2647 -1782 -687 568 1682 2595 3082 3113 2702 1893 832 -394 -1568 -2513 -3036 -3120 -2769 -2028 -956
8152 -956 279 1387 2280 2939 3062 2706 2030 1016 -179 -1373 -2275 -2865 -3076 -2851 -2247 -1188 -23 1186
8170 1186 2153 2860 3135 2948 2338 1301 137 -1070 -2109 -2820 -3160 -3017 -2361 -1449 -210 930 1987
8187 1987 2776 3106 3012 2432 1616 410 -762 -1865 -2669 -3073 -3029 -2527 -1656 -600 643 1733 2587 2989
8205 2989 2993 2526 1732 649 -571 -1727 -2560 -3092 -3139 -2743 -1908 -785 382 1512 2506 3065 3170 2801 1932
8224 1932 929 -271 -1420 -2353 -2985 -3118 -2758 -2051 -1064 158 1309 2240 2890 3062 2786 2197 1158 14
8242 14 -1123 -2171 -2836 -3127 -2916 -2291 -1313 -189 1055 2102 2827 3138 2954 2383 1417 268 -951 -2015
8260 -2015 -2793 -3096 -3050 -2457 -1497 -419 765 1889 2677 3104 2998 2513 1653 558 -614 -1706 -2576 -3031
8278 -3031 -2985 -2577 -1769 -650 474 1642 2536 3009 3075 2682 1860 796 -423 -1555 -2440 -3044 -3099 -2734 -2010
8297 -2010 -935 205 1406 2321 2938 3098 2775 2096 996 -177 -1319 -2321 -2915 -3180 -2850 -2152 -1192
8314 -1192 -43 1146 2126 2817 3047 2874 2306 1294 131 -1000 -2099 -2792 -3093 -2946 -2370 -1391 -271
8331 -271 907 2017 2740 3093 3033 2453 1561 379 -838 -1849 -2678 -3064 -3059 -2505 -1632 -505 616 1754
8349 1754 2595 3003 3001 2559 1734 661 -504 -1640 -2517 -2997 -3067 -2665 -1895 -808 360 1480 2439 2980 3090
8368 3090 2790 2023 926 -244 -1381 -2387 -2951 -3096 -2850 -2073 -1030 122 1351 2271 2909 3184 2844
8385 2844 2159 1216 -28 -1166 -2173 -2882 -3138 -2895 -2290 -1303 -188 974 2022 2739 3055 2959 2375 1420
8403 1420 282 -909 -1971 -2749 -3147 -3010 -2492 -1556 -376 835 1861 2707 3119 3077 2546 1670 553 -614
8421 -614 -1799 -2614 -3042 -3038 -2574 -1729 -642 540 1670 2538 3025 3099 2680 1893 780 -418 -1481 -2464 -2991
8440 -2991 -3093 -2769 -1992 -924 247 1411 2377 2944 3110 2748 2041 1053 -151 -1341 -2300 -2952 -3165 -2860
8458 -2860 -2207 -1167 41 1170 2201 2892 3124 2923 2247 1286 136 -1033 -2052 -2793 -3119 -2936 -2353
8475 -2353 -1373 -253 937 1989 2761 3029 3008 2426 1490 385 -781 -1917 -2701 -3111 -3050 -2531 -1656 -541
8493 -541 720 1748 2612 3059 3030 2576 1754 616 -609 -1672 -2596 -3029 -3112 -2677 -1823 -747 403 1563
8511 1563 2476 3001 3111 2745 1941 923 -267 -1375 -2347 -2978 -3074 -2739 -2015 -1027 149 1332 2333 3002
8529 3002 3165 2833 2160 1104 -89 -1280 -2269 -2955 -3209 -2943 -2263 -1259 -62 1075 2096 2842 3076
8546 3076 2867 2281 1318 188 -946 -2003 -2824 -3137 -2987 -2404 -1549 -380 796 1867 2670 3082 2966 2510
8564 2510 1642 477 -740 -1853 -2641 -3139 -3101 -2624 -1708 -598 637 1669 2589 3086 3139 2668 1789 703
8582 703 -477 -1595 -2563 -3030 -3103 -2716 -1968 -867 281 1455 2338 2917 3071 2710 2036 963 -206 -1352
8600 -1352 -2306 -2916 -3131 -2867 -2141 -1073 72 1260 2244 2921 3195 2915 2242 1207 45 -1133 -2178
8617 -2178 -2904 -3177 -2978 -2344 -1326 -148 1064 2081 2834 3115 2913 2375 1456 300 -893 -1946 -2744
8634 -2744 -3074 -3032 -2512 -1648 -492 695 1791 2658 3057 3029 2550 1659 540 -702 -1744 -2629 -3107 -3126 -2638
8653 -2638 -1804 -707 494 1688 2571 3121 3159 2741 1960 838 -375 -1523 -2425 -2977 -3093 -2743 -1956 -944
8671 -944 227 1374 2351 2939 3139 2758 2132 1075 -75 -1248 -2267 -2970 -3136 -2882 -2295 -1227 -50
8688 -50 1108 2153 2831 3083 2947 2283 1266 149 -1064 -2136 -2831 -3165 -3004 -2399 -1476 -278 883 1969
8706 1969 2769 3064 3000 2429 1541 393 -743 -1879 -2618 -3045 -2981 -2524 -1698 -508 623 1741 2589 3089
8724 3089 3087 2637 1790 638 -548 -1736 -2563 -3081 -3153 -2723 -1912 -836 386 1499 2450 3008 3098 2738 1952
8743 1952 891 -289 -1485 -2410 -3010 -3149 -2798 -2096 -1050 106 1281 2232 2927 3115 2859 2166 1179 18
8761 18 -1173 -2181 -2865 -3109 -2911 -2335 -1338 -136 1112 2124 2848 3173 2957 2324 1362 260 -981 -2052
8779 -2052 -2796 -3159 -3040 -2455 -1555 -470 755 1820 2641 3035 2949 2447 1651 527 -678 -1773 -2638 -3097
8797 -3097 -3037 -2625 -1794 -691 498 1701 2547 3033 3066 2690 1854 817 -383 -1561 -2513 -3079 -3148 -2779 -1963
8816 -1963 -913 271 1440 2435 2969 3120 2790 2048 1037 -109 -1330 -2278 -2934 -3126 -2846 -2158 -1188 -26
8834 -26 1147 2140 2817 3121 2883 2236 1263 99 -1089 -2111 -2815 -3097 -2992 -2399 -1378 -260 922 2083
8852 2083 2796 3140 2970 2423 1569 371 -865 -1902 -2713 -3113 -2993 -2568 -1626 -538 605 1775 2596 3017
8870 3017 3018 2544 1748 625 -545 -1689 -2572 -3050 -3112 -2700 -1867 -819 409 1456 2455 3014 3068 2689 1906
8889 1906 826 -328 -1486 -2471 -2993 -3171 -2809 -2075 -1052 150 1323 2256 2942 3170 2800 2138 1161 -80
8907 -80 -1151 -2182 -2805 -3076 -2889 -2282 -1309 -155 1016 2064 2763 3091 2909 2315 1412 246 -945 -2015
8925 -2015 -2818 -3125 -3013 -2444 -1544 -343 813 1932 2691 3093 3050 2485 1592 459 -698 -1799 -2646 -3095
8943 -3095 -3082 -2601 -1776 -676 593 1623 2497 2973 3072 2624 1884 794 -404 -1542 -2499 -2981 -3121 -2699
8961 -2699 -1984 -949 283 1419 2385 3013 3138 2761 2010 1019 -210 -1345 -2331 -2987 -3192 -2889 -2216 -1157
8979 -1157 43 1171 2172 2823 3062 2879 2209 1259 107 -1084 -2091 -2806 -3098 -2949 -2353 -1441 -245
8996 -245 933 1981 2806 3114 3037 2447 1520 413 -819 -1914 -2710 -3099 -3045 -2490 -1666 -493 736 1851
9014 1851 2641 3086 3074 2560 1699 604 -597 -1672 -2644 -3113 -3102 -2706 -1876 -821 343 1511 2424 3003
9032 3003 3071 2692 1926 921 -274 -1446 -2325 -2984 -3138 -2796 -2073 -1002 183 1361 2326 2968 3143 2841
9050 2841 2106 1143 -71 -1224 -2212 -2881 -3101 -2921 -2257 -1299 -129 1041 2064 2824 3088 2901 2353 1397
9068 1397 271 -997 -2004 -2755 -3118 -3003 -2427 -1567 -358 744 1825 2674 3064 2970 2509 1612 462 -760
9086 -760 -1851 -2683 -3119 -3112 -2585 -1699 -616 617 1721 2585 3091 3069 2647 1849 748 -396 -1549 -2442 -2934
9105 -2934 -3135 -2694 -1977 -948 287 1378 2338 2951 3126 2773 2041 1008 -183 -1350 -2314 -2923 -3161 -2876
9123 -2876 -2195 -1163 44 1207 2163 2889 3118 2870 2230 1232 15 -1156 -2164 -2890 -3136 -2947 -2312 -1410
9141 -1410 -256 1009 1959 2745 3073 2987 2381 1496 372 -770 -1844 -2670 -3104 -3043 -2500 -1601 -496 667
9159 667 1833 2606 3081 3031 2552 1706 618 -628 -1743 -2623 -3094 -3116 -2661 -1850 -804 461 1587 2459
9177 2459 2990 3097 2670 1914 843 -335 -1436 -2315 -2924 -3092 -2782 -2033 -1000 132 1335 2306 2869 3119
9195 3119 2861 2155 1142 10 -1227 -2228 -2881 -3135 -2877 -2200 -1262 -116 1121 2083 2850 3081 2927 2319
9213 2319 1340 203 -993 -1999 -2812 -3143 -2931 -2439 -1543 -391 783 1846 2647 3005 2986 2439 1635 498
9231 498 -658 -1786 -2590 -3033 -2997 -2520 -1730 -667 567 1665 2525 3084 3069 2643 1829 722 -404 -1556
9249 -1556 -2480 -3018 -3071 -2687 -1913 -861 305 1443 2391 2923 3058 2712 2018 1020 -190 -1314 -2281 -2883
9267 -2883 -3061 -2821 -2162 -1151 -29 1141 2137 2806 3066 2816 2179 1232 59 -1097 -2088 -2813 -3105 -2933
9285 -2933 -2279 -1367 -214 998 1981 2774 3087 2938 2376 1497 327 -836 -1866 -2704 -3078 -3040 -2475 -1665
9303 -1665 -556 643 1689 2545 3016 2979 2555 1691 649 -527 -1645 -2565 -3022 -3050 -2662 -1858 -803 423
9321 423 1544 2466 2932 3050 2650 1856 843 -335 -1444 -2366 -2947 -3017 -2729 -2026 -1016 195 1325 2223
9339 2223 2908 3057 2862 2143 1165 28 -1148 -2152 -2806 -3040 -2885 -2244 -1274 -156 994 2031 2727 3033
9357 3033 2876 2287 1320 210 -921 -2006 -2728 -3104 -2972 -2410 -1471 -409 843 1878 2627 3036 2941 2434
9375 2434 1611 513 -683 -1721 -2554 -2998 -2934 -2552 -1762 -627 498 1602 2456 2949 3033 2652 1807 760
9393 760 -390 -1532 -2418 -2954 -3035 -2676 -1924 -881 327 1371 2320 2899 3072 2724 1996 971 -168 -1325
9411 -1325 -2296 -2855 -3047 -2805 -2125 -1200 -65 1138 2082 2788 3033 2795 2249 1304 168 -955 -2009 -2733
9429 -2733 -2987 -2914 -2335 -1402 -263 873 1928 2656 3053 2980 2371 1494 364 -802 -1832 -2635 -3068 -2958
9447 -2958 -2464 -1590 -496 676 1701 2538 3008 2981 2527 1706 690 -494 -1629 -2429 -2956 -3095 -2637 -1937
9465 -1937 -875 319 1395 2309 2908 2995 2683 1947 933 -250 -1350 -2271 -2874 -3054 -2781 -2009 -1052 133
9483 133 1300 2201 2812 3061 2809 2084 1200 26 -1127 -2043 -2805 -3035 -2834 -2225 -1300 -204 969 1962
9501 1962 2711 3002 2883 2316 1424 366 -845 -1845 -2633 -3020 -2911 -2451 -1547 -408 706 1764 2609 2953
9519 2953 2922 2438 1628 516 -663 -1691 -2563 -2991 -3003 -2562 -1764 -720 540 1580 2484 2986 3007 2634 1897
9538 1897 788 -289 -1436 -2334 -2881 -3005 -2675 -1967 -993 121 1291 2186 2734 2987 2714 2066 1086 -92
9556 -92 -1186 -2196 -2852 -3018 -2820 -2233 -1179 -64 1080 2060 2779 3032 2856 2217 1314 174 -975 -1976
9574 -1976 -2667 -2972 -2866 -2294 -1460 -370 816 1825 2640 2995 2929 2499 1579 517 -625 -1722 -2519 -2964
9592 -2964 -2935 -2475 -1682 -621 535 1621 2452 2948 3003 2529 1750 640 -457 -1542 -2453 -2966 -3000 -2639 -1870
9611 -1870 -853 285 1428 2280 2870 2980 2691 1995 972 -169 -1301 -2198 -2830 -2993 -2767 -2111 -1131 -1
9629 -1 1102 2134 2758 3025 2794 2162 1222 135 -1042 -2122 -2720 -3041 -2859 -2269 -1319 -252 914 1920
9647 1920 2699 3017 2852 2299 1408 359 -789 -1812 -2592 -3008 -2940 -2453 -1653 -528 630 1720 2478 2917
9665 2917 2968 2518 1696 664 -510 -1597 -2407 -2902 -2926 -2556 -1779 -754 413 1503 2391 2966 3004 2609 1910
9684 1910 847 -320 -1413 -2284 -2904 -2989 -2641 -1969 -984 161 1244 2159 2802 3002 2749 2079 1171 47
9702 47 -1073 -2098 -2750 -3044 -2806 -2158 -1247 -135 985 1946 2659 2988 2836 2249 1342 242 -880 -1901
9720 -1901 -2618 -3026 -2806 -2327 -1414 -344 851 1839 2623 2969 2911 2436 1560 514 -559 -1650 -2492 -2898
9738 -2898 -2887 -2457 -1703 -655 450 1495 2375 2889 2935 2580 1773 787 -365 -1435 -2338 -2818 -2912 -2584 -1849
9757 -1849 -869 226 1397 2250 2834 2989 2685 2022 1032 -139 -1247 -2174 -2788 -2970 -2798 -2069 -1135 20
9775 20 1092 2044 2673 2970 2781 2212 1330 218 -927 -1911 -2611 -2968 -2820 -2263 -1425 -298 800 1847
9793 1847 2567 2909 2822 2296 1431 352 -754 -1802 -2555 -2970 -2870 -2368 -1601 -513 614 1652 2467 2880
9811 2880 2881 2479 1687 684 -448 -1534 -2329 -2837 -2882 -2529 -1835 -789 343 1411 2274 2808 2910 2621 1875
9830 1875 886 -177 -1292 -2206 -2794 -2946 -2639 -1992 -1054 130 1214 2133 2664 2921 2644 2077 1093 44
9848 44 -1108 -2015 -2687 -2974 -2762 -2150 -1303 -176 916 1887 2602 2906 2797 2224 1374 368 -781 -1798
9866 -1798 -2500 -2891 -2820 -2309 -1489 -427 702 1731 2503 2916 2904 2417 1546 512 -573 -1659 -2400 -2848
9884 -2848 -2863 -2407 -1667 -665 456 1471 2303 2839 2861 2496 1773 810 -337 -1381 -2240 -2788 -2889 -2576 -1877
9903 -1877 -918 135 1230 2077 2659 2912 2633 1960 992 -54 -1175 -2089 -2701 -2869 -2658 -2057 -1066 -4
9921 -4 1111 2031 2669 2850 2732 2131 1230 198 -923 -1870 -2538 -2880 -2766 -2241 -1366 -315 800 1755 2536
9940 2536 2822 2813 2304 1482 425 -673 -1652 -2393 -2763 -2777 -2378 -1583 -557 567 1588 2352 2796 2821 2404
9959 2404 1623 662 -509 -1506 -2308 -2788 -2831 -2492 -1746 -756 308 1365 2191 2692 2872 2575 1889 973 -118
9978 -118 -1194 -2113 -2707 -2805 -2588 -1974 -1017 98 1108 2007 2606 2845 2620 2048 1130 32 -1055 -1961 -2585
9997 -2585 -2836 -2657 -2062 -1245 -127 911 1864 2559 2858 2684 2162 1343 281 -751 -1729 -2425 -2780 -2728 -2234
10016 -2234 -1485 -470 626 1635 2407 2784 2818 2346 1591 577 -547 -1501 -2327 -2742 -2789 -2383 -1670 -662
10034 -662 393 1416 2285 2722 2750 2400 1670 728 -298 -1350 -2171 -2669 -2834 -2480 -1847 -887 164 1172
10052 1172 2064 2656 2812 2542 1966 1049 1 -1022 -1987 -2580 -2785 -2653 -1967 -1137 -89 1020 1905 2486
10070 2486 2827 2609 2064 1214 158 -854 -1815 -2479 -2784 -2610 -2139 -1276 -301 745 1754 2426 2739 2716
10088 2716 2177 1391 483 -636 -1624 -2393 -2768 -2725 -2326 -1553 -606 473 1499 2262 2672 2741 2372 1655 708
10107 708 -361 -1380 -2186 -2656 -2717 -2383 -1664 -765 299 1317 2139 2661 2732 2471 1816 843 -170 -1223
10125 -1223 -2034 -2603 -2785 -2534 -1887 -1003 53 1051 1931 2534 2753 2486 2007 1183 97 -929 -1824 -2486
10143 -2486 -2776 -2579 -2067 -1230 -187 801 1766 2452 2694 2632 2055 1285 296 -778 -1715 -2350 -2734 -2607 -2143
10162 -2143 -1396 -392 676 1601 2352 2727 2662 2304 1557 554 -447 -1505 -2243 -2685 -2690 -2354 -1603 -766 345
10181 345 1354 2145 2629 2650 2384 1723 754 -239 -1284 -2087 -2592 -2718 -2446 -1782 -839 166 1178 2028 2526
10200 2526 2700 2428 1804 963 -73 -1033 -1940 -2540 -2684 -2518 -1992 -1128 -59 970 1796 2481 2743 2590
10218 2590 2035 1229 217 -822 -1718 -2371 -2693 -2590 -2138 -1299 -321 772 1647 2357 2646 2609 2137 1357 346
10237 346 -682 -1579 -2295 -2639 -2601 -2182 -1429 -538 535 1466 2237 2641 2638 2290 1620 681 -355 -1287 -2178 -2525
10257 -2525 -2636 -2340 -1670 -774 223 1220 2064 2527 2668 2410 1751 867 -156 -1120 -1989 -2521 -2687 -2464 -1850
10276 -1850 -926 77 1076 1917 2441 2662 2445 1902 1089 31 -956 -1796 -2426 -2700 -2578 -2065 -1192 -228 832
10295 832 1702 2352 2665 2524 2067 1285 335 -675 -1629 -2275 -2596 -2546 -2129 -1330 -401 614 1541 2238 2603
10314 2603 2585 2138 1457 505 -501 -1443 -2188 -2568 -2575 -2206 -1492 -575 359 1372 2148 2502 2635 2292 1680 769
10334 769 -203 -1222 -2020 -2513 -2609 -2367 -1741 -834 130 1154 1928 2450 2612 2383 1758 896 -65 -1043 -1890
10353 -1890 -2422 -2607 -2422 -1865 -1026 -45 941 1767 2404 2603 2450 1950 1158 156 -813 -1619 -2325 -2605 -2560
10372 -2560 -2093 -1250 -386 661 1532 2213 2519 2486 2075 1348 408 -555 -1499 -2199 -2571 -2506 -2175 -1415 -513 480
10392 480 1430 2111 2500 2547 2145 1502 612 -421 -1291 -2029 -2489 -2557 -2242 -1573 -709 272 1234 2020 2488 2604
10412 2604 2288 1658 923 -116 -1088 -1901 -2455 -2572 -2388 -1791 -962 35 989 1772 2342 2503 2308 1779 959
10431 959 -13 -931 -1759 -2352 -2550 -2437 -1876 -1112 -150 772 1669 2270 2562 2474 1946 1194 280 -697 -1555 -2178
10451 -2178 -2548 -2448 -2054 -1372 -381 579 1430 2165 2507 2479 2104 1391 491 -445 -1418 -2083 -2497 -2565 -2151 -1543
10471 -1543 -598 387 1321 1981 2401 2469 2153 1571 643 -304 -1218 -1949 -2427 -2560 -2287 -1692 -855 113 1055 1832
10491 1832 2358 2528 2287 1748 899 34 -995 -1732 -2267 -2489 -2280 -1823 -984 -88 888 1675 2248 2482 2331
10510 2331 1830 1083 169 -795 -1668 -2271 -2476 -2380 -1896 -1151 -277 708 1513 2162 2472 2399 2012 1315 409 -564
10530 -564 -1447 -2087 -2453 -2473 -2101 -1389 -538 386 1335 2018 2427 2427 2101 1422 538 -351 -1240 -1953 -2424 -2428 -2155
10551 -2155 -1522 -671 265 1164 1911 2317 2470 2161 1580 768 -140 -1079 -1807 -2344 -2489 -2242 -1728 -955 9
10570 9 938 1726 2261 2455 2290 1764 1004 95 -834 -1698 -2228 -2457 -2306 -1820 -1102 -172 752 1551 2166 2450
10590 2450 2322 1938 1173 282 -617 -1453 -2123 -2404 -2371 -1940 -1266 -414 576 1438 2065 2372 2394 2018 1407 543
10610 543 -437 -1290 -2005 -2437 -2411 -2084 -1481 -626 302 1145 1917 2323 2388 2074 1451 644 -278 -1181 -1884 -2269
10630 -2269 -2423 -2136 -1599 -803 157 1007 1742 2248 2442 2158 1671 865 -47 -896 -1712 -2222 -2411 -2313 -1734 -1047
10650 -1047 -126 831 1585 2183 2397 2311 1848 1084 203 -728 -1512 -2128 -2413 -2303 -1834 -1134 -276 657 1500 2047
10670 2047 2349 2260 1875 1235 361 -577 -1362 -2020 -2375 -2299 -2004 -1390 -478 433 1232 1925 2346 2371 2073 1443
10690 1443 628 -297 -1189 -1874 -2302 -2427 -2117 -1532 -737 237 1064 1764 2259 2378 2101 1540 737 -129 -1076
10709 -1076 -1758 -2212 -2399 -2145 -1592 -865 -1 879 1671 2189 2336 2214 1698 971 67 -771 -1586 -2189 -2357
10728 -2357 -2273 -1819 -1086 -255 674 1479 2061 2359 2300 1830 1168 319 -603 -1387 -2021 -2304 -2305 -1824 -1221 -356 559
10749 559 1327 1952 2325 2245 1917 1233 448 -389 -1279 -1890 -2308 -2400 -1997 -1398 -670 266 1104 1780 2254 2316 2047
10770 2047 1518 672 -235 -1095 -1779 -2188 -2323 -2136 -1577 -822 36 906 1666 2145 2308 2087 1598 870 -27
10789 -27 -932 -1627 -2174 -2280 -2139 -1683 -978 -100 795 1533 2034 2326 2243 1783 1096 271 -678 -1447 -2039 -2345
10809 -2345 -2230 -1847 -1155 -316 542 1349 1950 2284 2240 1904 1210 407 -490 -1302 -1908 -2289 -2318 -1893 -1265 -508
10829 -508 433 1215 1860 2252 2281 1969 1387 579 -280 -1109 -1816 -2226 -2291 -2010 -1473 -697 148 997 1708 2175
10849 2175 2281 2079 1603 794 -71 -941 -1666 -2156 -2311 -2110 -1662 -874 -29 861 1589 2055 2279 2093 1597
10868 1597 923 100 -787 -1570 -2067 -2315 -2186 -1744 -1055 -231 683 1465 1982 2260 2164 1819 1113 299 -597 -1371
10888 -1371 -1999 -2291 -2274 -1901 -1242 -443 469 1320 1893 2250 2264 1872 1274 447 -348 -1218 -1863 -2224 -2292 -2003
10908 -2003 -1409 -583 251 1103 1774 2161 2246 1983 1480 672 -189 -1072 -1741 -2150 -2266 -2107 -1523 -819 62 902
10928 902 1659 2136 2273 2082 1608 857 14 -839 -1579 -2104 -2296 -2191 -1675 -936 -108 760 1513 2035 2218 2090
10948 2090 1678 970 249 -687 -1463 -2031 -2268 -2188 -1833 -1201 -351 498 1328 1971 2250 2183 1800 1213 398 -479
10968 -479 -1279 -1900 -2270 -2271 -1929 -1335 -518 343 1161 1827 2194 2261 1957 1356 584 -291 -1163 -1765 -2120 -2202 -1960
10989 -1960 -1402 -627 184 1027 1732 2147 2252 2031 1524 775 -93 -933 -1637 -2147 -2279 -2102 -1658 -894 -90
11008 -90 811 1556 2077 2264 2133 1640 944 106 -757 -1476 -2028 -2322 -2173 -1743 -1077 -194 642 1413 1946 2237
11028 2237 2163 1720 1054 242 -567 -1351 -1937 -2225 -2214 -1868 -1256 -472 453 1232 1868 2220 2246 1920 1289 517
11048 517 -377 -1183 -1878 -2205 -2292 -1969 -1407 -584 270 1090 1718 2160 2208 2004 1423 654 -224 -1024 -1714 -2146
11068 -2146 -2206 -1976 -1496 -778 34 941 1639 2084 2243 2037 1578 904 7 -831 -1559 -2106 -2268 -2142 -1714 -1002
11088 -1002 -135 660 1437 1994 2244 2119 1729 1031 205 -634 -1425 -1997 -2252 -2203 -1805 -1105 -309 508 1277 1893
11108 1893 2144 2092 1850 1122 349 -455 -1289 -1903 -2219 -2240 -1884 -1323 -579 307 1184 1783 2163 2239 1959 1392
11128 1392 639 -282 -1073 -1748 -2169 -2293 -2055 -1459 -653 136 1010 1673 2065 2170 1954 1470 695 -80 -939
11147 -939 -1642 -2132 -2256 -2054 -1583 -903 -37 803 1516 2031 2227 2051 1636 943 141 -704 -1482 -1995 -2239 -2191
11167 -2191 -1740 -1084 -262 617 1335 1963 2227 2166 1782 1111 306 -486 -1279 -1925 -2167 -2172 -1818 -1122 -457 429
11187 429 1244 1806 2137 2143 1844 1286 464 -354 -1151 -1803 -2189 -2226 -1975 -1426 -670 177 1041 1713 2091 2211 1953
11208 1953 1427 718 -144 -957 -1641 -2137 -2199 -2004 -1515 -800 73 861 1571 2039 2196 2015 1545 862 28 -766
11228 -766 -1523 -2047 -2201 -2062 -1623 -956 -145 727 1427 1990 2217 2153 1738 1065 279 -644 -1366 -1970 -2223 -2161
11248 -2161 -1850 -1197 -348 479 1303 1863 2155 2151 1809 1213 479 -452 -1222 -1792 -2166 -2133 -1883 -1311 -517 343
11268 343 1116 1765 2149 2194 1937 1329 618 -222 -1085 -1764 -2084 -2248 -2045 -1496 -766 93 950 1610 2092 2208
11288 2208 2002 1520 768 -10 -879 -1603 -2073 -2236 -2090 -1586 -910 -71 747 1443 1995 2182 2033 1634 971
11307 971 173 -706 -1403 -1949 -2171 -2073 -1734 -1067 -262 564 1371 1919 2203 2130 1798 1186 402 -462 -1271 -1833
11327 -1833 -2200 -2172 -1848 -1257 -447 400 1170 1762 2138 2149 1846 1292 537 -263 -1125 -1719 -2106 -2193 -1932 -1381
11347 -1381 -672 212 1013 1680 2086 2213 1991 1508 745 -109 -929 -1606 -2041 -2234 -2056 -1592 -865 -30 888
11366 888 1566 2054 2246 2119 1654 943 127 -725 -1460 -1974 -2175 -2090 -1674 -998 -165 592 1386 1895 2150 2115
11386 2115 1730 1039 235 -604 -1311 -1895 -2151 -2180 -1790 -1235 -431 419 1184 1824 2191 2181 1842 1307 483 -356
11406 -356 -1170 -1781 -2145 -2170 -1871 -1321 -579 271 1057 1689 2104 2127 1922 1369 644 -221 -957 -1663 -2070 -2186
11426 -2186 -1959 -1503 -763 32 872 1580 2000 2187 1973 1518 842 33 -783 -1531 -2044 -2223 -2126 -1648 -997 -175
11446 -175 678 1447 1942 2185 2077 1641 1020 194 -583 -1348 -1878 -2121 -2130 -1696 -1090 -306 532 1308 1896 2145
11466 2145 2116 1788 1185 403 -423 -1210 -1827 -2141 -2145 -1859 -1304 -531 315 1101 1757 2146 2187 1935 1351 607 -272
11487 -272 -1054 -1702 -2093 -2236 -1927 -1443 -694 73 967 1657 2058 2184 1935 1441 765 -6 -870 -1550 -2030 -2158
11507 -2158 -2016 -1555 -889 -38 829 1477 1963 2174 2074 1649 957 143 -674 -1415 -1898 -2156 -2085 -1715 -1048 -238
11527 -238 561 1362 1884 2128 2136 1773 1151 316 -521 -1234 -1800 -2158 -2100 -1776 -1219 -480 371 1151 1751 2079 2113
11548 2113 1835 1257 510 -309 -1073 -1722 -2106 -2158 -1897 -1354 -648 172 997 1669 2073 2173 1972 1446 720 -83
11568 -83 -873 -1562 -1978 -2159 -1957 -1480 -802 5 815 1501 1961 2122 1970 1569 846 75 -710 -1422 -1932 -2111
11588 -2111 -2041 -1639 -1007 -258 663 1340 1910 2157 2025 1690 1038 255 -498 -1264 -1857 -2103 -2058 -1762 -1161 -373
11608 -373 442 1183 1769 2087 2102 1829 1223 504 -382 -1090 -1700 -2097 -2058 -1809 -1305 -533 256 1005 1632 2021
11628 2021 2116 1875 1372 677 -136 -956 -1606 -1989 -2132 -1912 -1449 -746 62 852 1551 2024 2121 1962 1522 820
11648 820 46 -747 -1403 -1935 -2091 -1992 -1576 -918 -107 724 1392 1877 2110 1994 1630 981 215 -600 -1309 -1834
11668 -1834 -2095 -2020 -1691 -1023 -353 456 1221 1783 2073 2041 1781 1140 403 -390 -1170 -1753 -2110 -2093 -1806 -1246
11688 -1246 -534 291 1080 1671 2033 2067 1802 1267 553 -196 -983 -1608 -1983 -2060 -1830 -1369 -648 137 896 1532
11708 1532 1936 2105 1919 1463 791 -1 -788 -1480 -1937 -2121 -1947 -1514 -894 -52 681 1400 1891 2113 1968
11727 1968 1595 969 164 -620 -1331 -1816 -2035 -2008 -1602 -976 -241 552 1208 1820 2027 2032 1693 1072 368 -415
11747 -415 -1215 -1684 -2029 -2037 -1713 -1157 -472 326 1097 1667 2015 2043 1789 1285 556 -262 -1037 -1664 -2031 -2063 -1844
11768 -1844 -1334 -662 153 927 1512 1916 2023 1897 1398 698 -81 -824 -1479 -1958 -2029 -1907 -1526 -837 -80 678
11788 678 1422 1835 2069 1939 1510 917 127 -686 -1358 -1855 -2069 -1995 -1599 -1013 -208 567 1282 1812 2049 1950
11808 1950 1655 1040 318 -434 -1224 -1748 -2010 -1968 -1689 -1156 -381 398 1104 1642 1927 1985 1724 1219 477 -282
11828 -282 -985 -1634 -1909 -2042 -1817 -1328 -610 167 970 1558 1946 2076 1803 1358 654 -139 -880 -1528 -1930 -2055
11848 -2055 -1872 -1423 -771 11 735 1440 1862 1990 1859 1474 854 142 -684 -1366 -1813 -2016 -1895 -1539 -958
11867 -958 -206 622 1212 1763 2038 1960 1574 1009 252 -485 -1200 -1773 -1993 -2028 -1615 -1091 -383 409 1145 1676
11887 1676 1993 1975 1711 1197 466 -308 -1030 -1603 -1937 -1928 -1716 -1240 -519 196 934 1567 1885 1972 1773 1289 672
11908 672 -81 -917 -1490 -1938 -1996 -1853 -1411 -759 17 759 1460 1866 1964 1900 1455 827 83 -733 -1361 -1787 -2032
11929 -2032 -1932 -1494 -938 -187 593 1234 1703 1949 1888 1570 952 247 -540 -1201 -1739 -1931 -1917 -1637 -1064 -348
11949 -348 388 1099 1637 1999 1939 1684 1151 426 -342 -1037 -1640 -1977 -1932 -1771 -1245 -514 208 944 1584 1921
11969 1921 1967 1759 1278 645 -170 -878 -1426 -1905 -1936 -1769 -1336 -682 78 796 1447 1842 1993 1820 1409 790
11989 790 34 -699 -1348 -1790 -1987 -1850 -1523 -890 -147 629 1326 1781 1977 1900 1546 908 198 -522 -1266 -1741
12009 -1741 -1918 -1889 -1622 -975 -315 434 1133 1623 1939 1893 1624 1103 411 -346 -1054 -1619 -1930 -1972 -1687 -1213
12029 -1213 -492 262 929 1578 1907 1974 1772 1275 602 -129 -926 -1511 -1937 -1918 -1750 -1328 -664 88 834 1426
12049 1426 1876 1944 1831 1379 779 53 -744 -1313 -1751 -1900 -1823 -1398 -832 -118 612 1317 1795 1936 1883 1510
12069 1510 937 204 -560 -1220 -1717 -1969 -1936 -1547 -1021 -297 466 1172 1673 1981 1882 1608 1049 371 -400 -1079
12089 -1079 -1609 -1893 -1882 -1629 -1130 -496 285 1004 1500 1837 1890 1696 1191 550 -204 -887 -1472 -1882 -1945 -1759
12109 -1759 -1286 -669 75 794 1436 1815 1943 1811 1318 717 -34 -740 -1378 -1764 -1987 -1856 -1428 -800 -49
12128 -49 654 1303 1742 1874 1782 1400 865 135 -531 -1178 -1682 -1880 -1829 -1471 -938 -281 451 1146 1643 1848 1903
12149 1903 1564 1053 342 -435 -1063 -1588 -1894 -1898 -1593 -1130 -448 298 1011 1553 1867 1905 1666 1176 525 -245
12169 -245 -943 -1482 -1794 -1869 -1688 -1212 -590 106 843 1355 1764 1895 1705 1311 697 -27 -752 -1377 -1759 -1931
12189 -1931 -1749 -1396 -752 -35 685 1313 1703 1900 1794 1464 840 113 -593 -1258 -1664 -1856 -1810 -1482 -952 -251
12209 -251 529 1170 1626 1855 1775 1532 950 344 -390 -1084 -1551 -1837 -1829 -1570 -1079 -391 342 1014 1528 1844 1877
12230 1877 1611 1155 515 -272 -953 -1461 -1823 -1848 -1618 -1177 -525 151 862 1414 1800 1861 1641 1262 616 -82
12250 -82 -769 -1311 -1707 -1805 -1649 -1291 -717 -7 681 1270 1687 1824 1696 1340 796 109 -572 -1171 -1642 -1901
12270 -1901 -1823 -1436 -906 -191 504 1157 1610 1885 1758 1479 935 260 -474 -1091 -1565 -1795 -1756 -1490 -1055 -376
12290 -376 392 970 1479 1756 1753 1530 1059 411 -273 -953 -1433 -1767 -1829 -1585 -1150 -520 188 872 1403 1777 1834
12311 1834 1675 1250 603 -67 -793 -1387 -1758 -1812 -1644 -1267 -689 33 669 1278 1672 1787 1696 1340 722 82
12331 82 -582 -1189 -1552 -1792 -1685 -1337 -819 -174 517 1166 1589 1754 1769 1442 921 232 -446 -1104 -1578 -1827
12351 -1827 -1789 -1505 -1019 -346 384 979 1523 1759 1769 1497 996 383 -282 -948 -1461 -1741 -1803 -1540 -1146 -473
12371 -473 157 865 1355 1657 1772 1576 1152 541 -113 -806 -1304 -1645 -1769 -1613 -1245 -653 16 668 1267 1610
12391 1610 1751 1647 1283 704 55 -689 -1250 -1625 -1784 -1663 -1322 -800 -151 536 1161 1572 1752 1635 1316
12410 1316 843 228 -438 -1067 -1512 -1734 -1719 -1392 -907 -302 405 1023 1483 1673 1736 1424 953 397 -335 -919
12430 -919 -1428 -1707 -1735 -1561 -1072 -429 207 878 1374 1715 1778 1488 1123 499 -171 -781 -1281 -1659 -1768 -1574
12450 -1574 -1166 -605 88 662 1246 1587 1702 1586 1166 656 11 -656 -1224 -1589 -1754 -1646 -1279 -734 -113
12469 -113 520 1151 1566 1688 1639 1272 778 203 -505 -1068 -1515 -1690 -1677 -1360 -891 -227 428 975 1450 1672
12489 1672 1630 1388 884 279 -287 -970 -1402 -1687 -1711 -1525 -1022 -441 158 847 1340 1601 1703 1481 990 477
12509 477 -210 -828 -1334 -1645 -1711 -1541 -1103 -578 101 663 1265 1584 1639 1550 1171 589 -17 -611 -1187 -1551 -1695
12530 -1695 -1565 -1235 -712 -105 560 1087 1472 1675 1595 1274 735 107 -515 -1096 -1481 -1656 -1607 -1341 -838 -272
12550 -272 410 1036 1408 1631 1645 1318 824 263 -357 -918 -1401 -1650 -1628 -1365 -951 -399 289 825 1287 1563
12570 1563 1642 1448 980 429 -185 -826 -1280 -1550 -1681 -1463 -1064 -506 127 719 1241 1573 1593 1469 1104 537
12590 537 -69 -711 -1238 -1575 -1720 -1556 -1173 -658 -53 616 1101 1462 1632 1476 1200 694 130 -492 -1084 -1427
12610 -1427 -1627 -1557 -1248 -795 -187 434 1033 1415 1609 1597 1243 851 209 -411 -954 -1407 -1649 -1582 -1328 -920
12630 -920 -333 312 891 1340 1572 1571 1388 968 391 -231 -833 -1271 -1529 -1629 -1367 -1006 -447 154 724 1200
12650 1200 1500 1602 1420 1055 546 -81 -688 -1196 -1489 -1614 -1471 -1117 -602 55 587 1088 1448 1635 1477
12669 1477 1165 669 77 -553 -1056 -1422 -1584 -1550 -1208 -727 -159 512 1000 1391 1628 1528 1202 805 213 -359
12689 -359 -903 -1380 -1596 -1551 -1290 -853 -302 339 833 1318 1515 1565 1326 903 355 -266 -820 -1238 -1512 -1587 -1357
12710 -1357 -1002 -404 261 756 1262 1482 1572 1414 1018 474 -124 -698 -1176 -1453 -1539 -1364 -1056 -543 37 592
12730 592 1122 1449 1495 1443 1101 625 21 -557 -1058 -1378 -1531 -1459 -1116 -704 -98 519 999 1410 1525 1520 1193
12751 1193 677 198 -468 -952 -1309 -1486 -1481 -1255 -794 -227 307 915 1269 1529 1508 1291 871 342 -259 -785
12771 -785 -1213 -1452 -1498 -1296 -929 -415 194 771 1172 1459 1554 1314 974 458 -185 -762 -1155 -1433 -1498 -1336 -975
12792 -975 -498 69 645 1120 1426 1570 1424 1106 595 70 -538 -1001 -1342 -1473 -1354 -1070 -615 -108 480 1001
12812 1001 1333 1496 1429 1123 754 124 -432 -920 -1279 -1479 -1413 -1191 -788 -214 372 895 1257 1491 1478 1198
12832 1198 807 257 -289 -843 -1250 -1450 -1437 -1235 -847 -355 246 765 1146 1453 1498 1272 904 413 -164 -674
12852 -674 -1133 -1362 -1486 -1317 -965 -505 60 617 1097 1360 1461 1328 1010 523 -33 -605 -1037 -1355 -1455 -1370
12872 -1370 -1066 -553 -68 519 931 1276 1467 1381 1121 672 108 -404 -941 -1268 -1389 -1360 -1108 -721 -227 378
12892 378 863 1226 1396 1387 1179 777 284 -314 -784 -1182 -1418 -1355 -1184 -806 -300 231 765 1171 1458 1449 1203
12913 1203 860 374 -173 -712 -1077 -1355 -1412 -1224 -967 -487 79 606 1018 1289 1422 1298 918 466 -40 -561
12933 -561 -976 -1329 -1419 -1315 -996 -571 -46 506 934 1321 1377 1288 1053 606 111 -420 -894 -1266 -1426 -1345 -1033
12954 -1033 -676 -152 388 846 1218 1400 1327 1120 772 241 -291 -713 -1125 -1349 -1336 -1168 -751 -302 216 751
12974 751 1128 1334 1367 1194 817 325 -210 -619 -1039 -1336 -1346 -1235 -910 -350 117 640 1043 1289 1399 1214
12994 1214 912 420 -105 -576 -997 -1297 -1331 -1258 -959 -518 -23 500 895 1234 1386 1243 997 591 69 -424
13014 -424 -881 -1176 -1301 -1297 -990 -685 -173 399 842 1170 1360 1244 1040 653 158 -322 -791 -1174 -1322 -1318 -1085
13035 -1085 -776 -299 245 681 1090 1316 1305 1143 793 332 -158 -625 -1017 -1265 -1319 -1176 -843 -408 113 614
13055 614 1047 1248 1321 1223 899 424 -42 -576 -1022 -1196 -1286 -1188 -925 -447 41 501 950 1183 1276 1195 952 572
13077 572 61 -462 -868 -1177 -1341 -1296 -966 -622 -179 356 780 1106 1263 1230 1008 673 182 -302 -776 -1070
13097 -1070 -1327 -1229 -1057 -717 -216 236 729 1073 1263 1266 1115 720 314 -218 -683 -1010 -1245 -1295 -1096 -801 -372
13118 -372 116 595 970 1208 1287 1127 823 401 -73 -529 -946 -1222 -1266 -1169 -839 -479 5 463 882 1153 1252
13139 1252 1178 930 528 12 -418 -886 -1130 -1270 -1204 -962 -568 -98 360 788 1062 1225 1175 960 624 172
13159 172 -296 -767 -1086 -1246 -1258 -1040 -673 -216 241 675 1045 1208 1220 1034 712 234 -206 -656 -978 -1203
13179 -1203 -1260 -1051 -768 -343 116 595 960 1145 1268 1095 817 352 -83 -518 -927 -1113 -1232 -1085 -859 -491
13199 -491 -7 528 846 1189 1220 1153 874 529 -8 -434 -835 -1108 -1215 -1158 -912 -563 -128 323 767 1073 1183
13220 1183 1161 961 547 95 -290 -732 -1111 -1212 -1186 -991 -646 -216 291 706 989 1188 1191 967 647 240 -195
13241 -195 -634 -987 -1183 -1207 -1034 -705 -323 121 589 947 1179 1157 1046 743 335 -107 -541 -908 -1127 -1186 -1113
13262 -1113 -799 -374 26 514 902 1105 1166 1079 769 449 -33 -474 -826 -1126 -1208 -1117 -874 -467 -70 327 745
13283 745 1034 1114 1115 858 514 110 -302 -724 -1036 -1150 -1138 -917 -604 -142 295 698 991 1131 1132 975 624 188
13305 188 -268 -674 -977 -1151 -1155 -993 -658 -265 158 604 930 1130 1151 992 731 331 -180 -591 -918 -1089 -1143
13326 -1143 -1041 -781 -424 62 461 822 1052 1133 1044 777 388 -29 -482 -852 -1053 -1155 -1067 -824 -428 -44
13346 -44 375 750 986 1117 1069 837 500 64 -409 -738 -977 -1163 -1076 -923 -577 -150 282 639 897 1124 1039
13367 1039 855 530 166 -277 -676 -1003 -1086 -1048 -914 -618 -254 220 613 922 1100 1108 938 617 238 -170 -574
13388 -574 -916 -1083 -1088 -978 -670 -329 106 468 811 1042 1129 981 710 385 -56 -492 -824 -1065 -1112 -1047 -762
13409 -762 -448 -7 368 731 983 1047 1044 730 383 12 -390 -792 -1003 -1127 -1075 -817 -476 -80 338 701 970
13430 970 1048 1012 808 504 151 -296 -639 -938 -1078 -1079 -882 -617 -201 211 587 859 1008 1062 896 636 218
13451 218 -178 -571 -857 -1072 -1064 -943 -702 -297 118 488 796 955 1034 907 624 286 -116 -499 -810 -992 -1094
13472 -1094 -939 -718 -400 -9 416 781 969 1049 945 727 462 12 -349 -746 -985 -1075 -993 -760 -463 -74
13492 -74 349 662 909 1050 987 761 426 45 -295 -668 -919 -1043 -1016 -832 -540 -140 223 600 816 987 996
13513 996 824 556 202 -187 -543 -824 -983 -1030 -863 -602 -285 93 524 798 996 1010 897 576 305 -57
13533 -57 -490 -762 -952 -1016 -887 -647 -347 61 402 753 960 1021 932 704 318 -50 -431 -764 -945 -1021 -945 -745
13555 -745 -460 -42 300 699 910 1014 971 734 489 71 -286 -633 -892 -1027 -980 -808 -437 -138 220 578
13575 578 853 950 937 820 523 180 -241 -572 -837 -1018 -983 -825 -551 -226 154 506 821 941 963 847 594
13596 594 291 -108 -517 -778 -949 -1005 -853 -650 -350 49 356 715 905 957 881 642 301 -63 -412 -693 -938
13617 -938 -956 -929 -644 -355 -28 354 684 894 956 906 715 405 59 -338 -667 -870 -969 -961 -733 -428 -95 242
13639 242 555 810 872 924 765 466 184 -211 -617 -815 -967 -951 -820 -536 -195 200 517 701 880 931 789
13660 789 510 174 -134 -495 -793 -945 -963 -831 -547 -264 81 398 749 865 938 823 599 301 -56 -395
13680 -395 -741 -894 -975 -862 -676 -373 -1 371 636 838 885 813 633 340 -11 -343 -636 -851 -942 -879 -678
13701 -678 -414 -44 269 582 827 891 895 702 480 114 -257 -518 -770 -921 -948 -712 -505 -209 189 484 785
13722 785 903 903 781 509 149 -147 -501 -751 -889 -920 -808 -539 -242 149 418 696 832 869 772 581 268
13743 268 -77 -417 -672 -893 -914 -847 -574 -300 3 364 639 806 925 793 620 310 -5 -354 -670 -819
13763 -819 -965 -833 -685 -381 -65 239 575 767 880 833 695 388 86 -326 -581 -784 -865 -874 -687 -448 -123
13784 -123 269 499 779 887 857 710 511 153 -195 -482 -709 -864 -868 -731 -556 -210 124 440 698 787 827
13805 827 738 544 211 -70 -393 -706 -823 -853 -770 -533 -276 25 362 648 800 884 765 537 266 -41 -349
13826 -349 -661 -811 -849 -803 -634 -362 -6 329 542 748 837 732 663 324 86 -280 -544 -803 -900 -817 -665 -430
13848 -430 -93 139 497 748 767 767 666 406 95 -218 -528 -719 -837 -843 -739 -490 -147 141 411 713 825
13869 825 777 711 526 184 -149 -403 -625 -803 -875 -750 -562 -288 86 380 588 767 783 719 515 233 -50
13890 -50 -369 -662 -813 -850 -753 -580 -314 -17 296 538 726 825 742 544 329 33 -272 -598 -735 -812 -762 -594
13912 -594 -379 -91 214 529 697 804 778 631 417 138 -228 -458 -700 -791 -820 -704 -431 -152 145 416 641
13933 641 721 759 656 411 103 -176 -466 -659 -806 -844 -703 -515 -238 96 350 606 757 829 704 519 212
13954 212 -22 -348 -571 -707 -768 -655 -555 -264 1 304 562 724 779 734 529 305 -9 -294 -505 -749 -741
13975 -741 -700 -576 -289 -51 245 532 696 764 687 612 354 57 -199 -498 -669 -796 -772 -660 -441 -114 160
13996 160 411 610 751 751 619 372 124 -186 -406 -645 -734 -808 -654 -462 -232 39 319 568 724 743 651 441
14018 441 156 -126 -438 -617 -722 -792 -697 -513 -265 30 286 548 678 702 627 476 234 -43 -301 -515 -685
14039 -685 -759 -700 -563 -355 -84 236 492 655 720 733 562 333 99 -254 -507 -672 -696 -694 -590 -333 -80 169
14061 169 425 624 699 709 603 403 143 -164 -423 -575 -700 -693 -622 -380 -161 108 330 555 694 705 604 429
14083 429 213 -82 -378 -592 -697 -731 -649 -488 -176 37 289 514 621 649 580 408 180 -83 -323 -544 -656
14104 -656 -733 -623 -518 -287 -36 201 469 595 693 651 511 295 43 -255 -462 -644 -752 -665 -559 -341 -83
14125 -83 155 369 546 602 568 520 319 74 -205 -435 -615 -673 -653 -580 -367 -164 103 392 528 636 615 566 359
14148 359 160 -132 -371 -549 -632 -691 -656 -427 -201 54 303 505 625 647 581 405 213 -15 -328 -482 -619
14169 -619 -658 -618 -520 -260 -19 292 468 624 636 602 391 234 -7 -249 -457 -632 -672 -622 -537 -320 -25 187
14191 187 384 573 635 600 555 324 76 -158 -425 -581 -691 -675 -549 -379 -97 125 386 559 659 585 494 287
14213 287 96 -119 -336 -525 -659 -643 -553 -441 -183 117 281 466 614 621 545 387 218 -107 -330 -530 -620 -668
14235 -668 -591 -494 -263 -8 179 420 597 632 556 443 189 8 -234 -466 -578 -645 -619 -441 -279 -19 204 419
14257 419 587 600 579 438 232 46 -227 -424 -546 -608 -638 -510 -371 -125 147 346 512 572 591 487 328 133
14279 133 -149 -390 -513 -618 -616 -537 -392 -122 66 346 468 616 590 515 357 173 -51 -334 -480 -616 -601 -570
14301 -570 -452 -229 30 274 439 600 644 556 420 199 -9 -237 -450 -576 -639 -589 -474 -242 -34 190 406
14322 406 513 562 549 456 203 26 -176 -432 -578 -636 -566 -490 -275 -66 174 365 480 546 606 462 297 43
14344 43 -160 -369 -546 -598 -643 -570 -350 -124 143 322 449 587 613 539 327 138 -114 -275 -473 -571 -613 -557 -395
14367 -395 -151 47 252 417 550 614 499 372 181 -85 -320 -466 -599 -641 -585 -453 -244 -6 238 403 568
14388 568 600 549 387 252 55 -210 -403 -506 -626 -585 -522 -263 -56 137 387 506 527 525 381 292 57 -166
14410 -166 -334 -509 -598 -613 -494 -335 -111 91 314 474 554 564 470 223 99 -146 -323 -514 -610 -599 -506 -373
14432 -373 -176 62 280 434 543 567 509 380 151 -85 -268 -464 -571 -546 -504 -420 -194 15 219 419 567
14453 567 593 531 384 216 -13 -237 -397 -546 -564 -560 -451 -240 -31 190 385 489 577 511 412 293 51 -200
14475 -200 -387 -534 -550 -575 -484 -284 -139 151 319 516 596 551 448 330 78 -144 -289 -457 -540 -550 -459 -304
14497 -304 -130 136 300 465 561 582 519 321 165 -64 -271 -449 -578 -606 -504 -415 -259 -5 161 394 519
14518 519 587 493 343 207 -31 -278 -428 -518 -543 -587 -382 -212 -12 180 384 468 533 497 405 236 16 -194 -404
14541 -404 -509 -575 -538 -511 -318 -51 127 283 464 560 524 430 333 77 -111 -349 -443 -556 -576 -482 -320 -150 70
14564 70 260 449 534 540 448 328 130 -142 -328 -446 -548 -553 -499 -388 -146 67 235 357 510 529 467 346 160
14587 160 -57 -266 -403 -532 -584 -498 -408 -232 -12 157 338 544 545 520 395 224 27 -176 -353 -471 -529 -526 -420
14610 -420 -245 -37 157 326 449 529 476 410 278 77 -182 -339 -474 -546 -578 -485 -345 -100 93 248 397 547
14632 547 493 470 349 127 -58 -293 -424 -509 -541 -421 -364 -170 53 253 406 464 530 471 305 129 -32 -249
14654 -249 -409 -532 -510 -480 -342 -185 23 260 353 459 590 511 358 241 -1 -187 -364 -499 -518 -513 -407 -264
14676 -264 -55 136 353 469 519 483 392 245 13 -127 -328 -470 -505 -493 -422 -308 -124 125 294 422 485 532
14698 532 432 303 112 -87 -290 -396 -483 -542 -419 -354 -136 5 219 412 497 503 453 300 145 -6 -225 -401
14720 -401 -484 -550 -480 -346 -165 37 207 356 479 501 447 351 201 8 -195 -427 -475 -530 -454 -390 -202 -37 155
14743 155 318 420 483 502 372 258 61 -146 -321 -445 -527 -538 -378 -299 -79 109 285 373 498 431 394 230
14765 230 63 -137 -265 -407 -539 -500 -422 -291 -173 81 221 414 503 496 441 307 95 -34 -251 -437 -470 -527
14787 -527 -470 -321 -159 -6 198 373 474 507 448 355 159 2 -213 -313 -426 -519 -422 -346 -182 -50 179 372
14809 372 465 505 449 361 203 45 -150 -285 -455 -521 -512 -382 -262 -49 129 298 399 499 459 415 258 76 -131
14832 -131 -258 -431 -493 -488 -424 -265 -136 90 249 354 487 429 385 236 88 -76 -283 -399 -498 -496 -440 -302 -170
14855 -170 -5 169 316 416 451 458 288 154 -2 -219 -339 -481 -476 -449 -334 -211 -34 171 329 410 462 405 318
14878 318 171 46 -142 -287 -388 -466 -445 -342 -228 -36 108 309 426 486 476 382 212 57 -113 -266 -402
14899 -402 -458 -475 -453 -292 -105 35 267 376 492 440 387 307 94 -64 -241 -325 -421 -416 -387 -306 -148 26 222 366
14923 366 376 440 392 304 119 -49 -207 -371 -413 -478 -444 -328 -185 1 132 301 425 438 460 348 172 -23 -155
14946 -155 -327 -399 -479 -442 -400 -225 -36 115 262 367 421 419 327 184 59 -87 -286 -415 -444 -485 -379 -224 -83
14969 -83 143 278 358 461 458 377 303 97 -99 -265 -357 -471 -444 -406 -277 -139 45 240 344 400 414 360 292 94
14993 94 -25 -219 -364 -460 -479 -398 -304 -156 11 165 301 381 401 358 242 145 -22 -163 -346 -394 -454 -439 -313 -232
15017 -232 -49 118 220 372 415 389 367 265 25 -141 -288 -310 -456 -422 -351 -238 -83 107 249 370 440 420
15039 420 290 208 56 -128 -243 -418 -410 -440 -412 -259 -124 66 243 342 424 415 328 184 140 -49 -233 -350 -461
15062 -461 -457 -425 -317 -186 22 150 308 378 406 398 254 150 27 -177 -292 -420 -416 -439 -310 -175 22 127 272
15085 272 360 387 402 310 126 -25 -189 -263 -406 -466 -459 -389 -240 -64 134 218 327 426 445 346 226 93 -93 -217
15109 -217 -327 -485 -440 -382 -255 -79 44 197 354 379 405 326 247 88 -86 -221 -364 -416 -437 -390 -289 -115 22
15132 22 187 343 353 455 387 295 156 -55 -185 -308 -418 -420 -439 -283 -188 -38 148 299 348 382 409 298 172
15155 172 37 -146 -290 -390 -402 -414 -356 -233 -12 172 290 326 415 371 322 185 0 -133 -220 -391 -440 -456 -333
15178 -333 -259 -151 67 229 344 363 414 353 219 113 -79 -215 -325 -401 -398 -374 -277 -139 8 184 290 400 362
15201 362 365 249 131 -60 -212 -300 -416 -401 -374 -301 -193 24 145 310 384 390 394 333 168 28 -125 -266 -347 -411
15225 -411 -410 -322 -163 -22 116 219 355 410 326 318 165 42 -112 -258 -311 -403 -325 -286 -243 -31 89 212 323 388
15249 388 402 326 217 78 -65 -218 -329 -409 -415 -346 -268 -123 54 153 364 312 411 350 246 138 -14 -162 -310
15272 -310 -395 -403 -397 -281 -164 0 125 225 353 376 347 306 115 -29 -137 -292 -380 -404 -393 -293 -170 -32 123
15295 123 217 377 392 378 306 222 22 -150 -226 -359 -340 -406 -350 -195 -53 63 203 330 371 389 316 225 97 -45
15319 -45 -209 -293 -378 -368 -322 -257 -117 4 164 338 368 381 328 228 131 -38 -208 -278 -327 -428 -410 -311 -174 2
15343 2 82 272 333 369 326 246 129 29 -154 -292 -368 -405 -395 -309 -169 -21 93 217 363 361 377 302 227 65 -116
15368 -116 -276 -368 -411 -382 -329 -263 -108 112 209 354 374 401 296 187 125 -115 -204 -323 -377 -426 -389 -255 -111 50
15392 50 156 307 396 361 300 197 146 -20 -178 -296 -369 -367 -357 -282 -173 -48 152 250 349 397 386 305 144 19 -118
15417 -118 -263 -350 -363 -401 -334 -204 -77 72 222 368 393 320 254 193 -7 -92 -218 -318 -392 -391 -310 -226 -83 77
15441 77 201 332 401 370 322 206 101 -77 -185 -264 -365 -392 -375 -270 -144 37 157 253 367 357 356 261 120 7
15465 7 -173 -311 -366 -360 -348 -247 -152 11 174 226 299 378 373 254 153 22 -150 -251 -384 -404 -376 -302 -221 -48 65
15490 65 260 287 372 357 278 155 19 -107 -205 -335 -421 -380 -358 -241 -74 64 188 298 337 358 315 168 54 -49
15514 -49 -227 -308 -414 -399 -351 -231 -135 3 130 265 332 376 353 191 89 -34 -177 -323 -399 -400 -360 -285 -170 1
15538 1 104 230 343 348 343 324 165 19 -151 -246 -327 -363 -375 -286 -192 -47 88 201 313 355 350 250 120 41 -103
15563 -103 -225 -285 -361 -391 -346 -184 -68 49 153 302 374 328 322 246 79 -37 -205 -299 -370 -412 -346 -278 -111 -22 139
15588 139 217 321 355 282 259 106 -57 -158 -217 -402 -410 -371 -285 -178 -36 168 210 302 385 376 278 184 -20 -113 -300
15613 -300 -354 -391 -359 -338 -220 -45 102 231 331 399 355 302 207 62 -110 -224 -316 -357 -371 -331 -210 -76 50 175
15637 175 292 328 333 305 201 95 -19 -208 -290 -363 -421 -355 -289 -126 -3 166 281 329 360 301 242 127 -36 -149
15661 -149 -227 -339 -376 -354 -255 -132 -5 106 273 324 351 344 239 161 -1 -152 -254 -323 -367 -349 -270 -176 -42 67
15685 67 231 314 387 381 266 191 67 -82 -228 -313 -344 -362 -307 -224 -74 69 155 299 363 333 302 214 90 -21 -149
15710 -149 -270 -341 -356 -321 -198 -128 63 143 294 353 380 294 267 117 -13 -153 -260 -330 -345 -340 -285 -152 -48 112
15734 112 277 302 329 333 260 127 8 -115 -233 -260 -364 -323 -271 -175 -33 91 215 235 320 316 219 155 6 -92 -235
15759 -235 -299 -389 -345 -311 -221 -102 31 138 276 355 350 296 192 91 -35 -160 -239 -345 -389 -363 -245 -151 13 136
15783 136 258 320 340 303 240 113 -19 -142 -234 -322 -343 -303 -243 -135 -10 135 232 280 339 291 199 127 -57 -114 -238
15808 -238 -327 -418 -366 -291 -212 -13 62 202 256 341 281 248 154 36 -72 -236 -326 -395 -320 -253 -242 -111 -13 147 216 287
15834 287 317 253 162 22 -116 -212 -298 -341 -381 -318 -246 -116 -13 91 229 305 320 305 157 89 -51 -215 -239 -346
15858 -346 -376 -336 -295 -131 -15 90 183 277 322 313 192 90 -21 -105 -211 -326 -334 -385 -299 -160 -65 62 156 222 357
15883 357 303 236 130 0 -134 -211 -307 -372 -385 -302 -183 -99 42 211 210 329 330 260 169 61 -40 -210 -299 -342 -318
15908 -318 -324 -213 -126 -28 142 225 230 307 282 189 80 -60 -197 -284 -352 -362 -373 -241 -151 -86 141 205 317 321 276 231 117
15935 117 5 -148 -256 -304 -315 -325 -273 -163 -78 72 158 288 301 317 214 124 11 -138 -230 -345 -279 -331 -304 -211
15959 -211 -92 46 180 257 240 278 237 151 52 -54 -198 -316 -393 -404 -285 -195 -75 44 106 241 290 334 253 185
15983 185 91 -25 -173 -262 -309 -312 -299 -264 -114 -42 148 252 270 318 277 191 150 4 -147 -223 -339 -372 -326 -325 -207 -63
16009 -63 54 195 259 319 299 252 110 7 -75 -224 -325 -315 -306 -260 -192 -74 20 188 256 314 304 264 170 78 -34 -205
16035 -205 -246 -337 -300 -279 -247 -100 17 129 235 311 302 263 217 102 -42 -150 -258 -342 -348 -318 -217 -135 0 95 210
16060 210 294 300 288 219 70 -1 -147 -229 -261 -309 -343 -243 -204 1 103 228 278 287 285 224 153 25 -110 -243 -287 -320
16086 -320 -336 -313 -157 -80 41 179 250 367 311 251 195 30 -81 -236 -299 -340 -374 -323 -231 -99 45 155 203 299
16110 299 330 269 163 77 -13 -169 -279 -317 -323 -312 -220 -123 -24 89 205 273 346 284 242 105 11 -165 -256 -313 -314 -279 -238
16137 -238 -165 -5 87 168 269 330 312 224 148 26 -136 -174 -285 -325 -324 -269 -191 -121 73 172 267 276 301 250 181 35 -96
16164 -96 -177 -269 -381 -347 -312 -232 -143 -14 135 226 313 284 282 186 115 -28 -188 -244 -304 -336 -287 -239 -124 -10 156 202
16190 202 259 271 245 223 109 -31 -147 -225 -351 -350 -323 -257 -119 -49 113 180 245 327 263 259 151 36 -105 -176 -313
16215 -313 -358 -386 -277 -144 -69 72 202 251 272 286 250 133 40 -97 -202 -268 -337 -335 -310 -221 -104 13 125 234
16239 234 282 347 286 197 29 -63 -202 -245 -333 -361 -308 -281 -147 4 86 204 256 312 283 183 79 -12 -184 -233 -372
16264 -372 -409 -356 -277 -177 -48 72 184 333 271 286 268 106 13 -85 -204 -287 -340 -339 -307 -179 -80 67 142 262 265
16289 265 279 247 196 62 -67 -177 -301 -347 -318 -316 -220 -75 8 131 201 289 300 259 150 46 -45 -158 -236 -303 -343
16314 -343 -323 -258 -121 -30 109 225 300 350 270 204 151 26 -125 -279 -309 -355 -328 -280 -147 -41 48 177 259 292 303
16339 303 190 122 -3 -75 -172 -304 -362 -336 -261 -191 -36 87 172 254 273 275 240 148 56 -94 -237 -245 -326 -365 -273 -235 -124
16366 -124 3 146 264 299 313 291 199 56 -55 -162 -222 -330 -343 -289 -192 -122 50
16383E0
$$ Imaginary data points
##PAGE= N=2
##DATA TABLE= (X++(I..I)), XYDATA
0 0 0 0 0 0 0 0 0 0 0 0 0 0 0 0 0 0 0 0 0 0 0 0 0 0 0 0 0 0 0 0 0 2 -6 66 -72 128 -128 128 -128 128 -129 129 -156 192
44 192 -201 248 -257 272 -316 326 -363 426 -450 477 -575 596 -701 753 -864 978 -1119 1300
62 1300 -1531 1840 -2288 2997 -4220 6731 -14323 87929 495366 762060 985609 1044636 918688
75 918688 701004 354226 -64194 -408517 -726630 -955090 -991657 -904887 -696210 -353425
85 -353425 -1311 362748 695281 883560 949503 892038 687333 388532 32024 -330551
95 -330551 -631377 -838442 -931550 -880798 -696208 -405625 -64840 274805 593110 813220
105 813220 901381 873102 696237 428635 115886 -247337 -553922 -754947 -875746 -852114
115 -852114 -691386 -458570 -133233 210633 479420 715183 846672 811422 695139 467670
125 467670 151648 -142827 -441073 -689028 -791093 -797767 -703909 -474637 -195656 106055
135 106055 419205 637866 766677 810659 703670 498199 233816 -79744 -370889 -606150
145 -606150 -763643 -797081 -706825 -525055 -265205 38050 331716 575375 727586 774810
155 774810 710163 538416 292974 -3325 -289225 -520001 -693488 -754779 -695093 -550088
165 -550088 -313369 -32044 235400 486973 667119 723634 694890 567171 333238 75217
175 75217 -201980 -465340 -628188 -716170 -711450 -573245 -364777 -111489 177046 424157 605187
186 605187 718111 703154 582088 398556 137373 -139888 -383169 -584348 -688984 -686315
196 -686315 -595940 -412910 -163088 99524 345181 544677 657472 674951 595292 422558
206 422558 191653 -62528 -308495 -513131 -636998 -662201 -599446 -441886 -218106 28116
216 28116 281938 490127 616017 664067 611632 458155 248207 1631 -255489 -459380
226 -459380 -601028 -664455 -608677 -474232 -278377 -25600 217743 425420 581735 639850
236 639850 601493 489187 294030 53682 -177044 -393117 -549669 -612937 -599581 -493155
246 -493155 -306969 -87857 145534 363417 520860 600282 597359 500146 329093 117072 -119754
257 -119754 -337911 -500011 -593321 -599211 -512389 -351503 -142248 92812 311204 477889 583338
268 583338 596411 516895 371480 165930 -64381 -276408 -451350 -561926 -580138 -517621 -385147
279 -385147 -184765 32946 240571 423877 533399 564129 520531 391555 205593 -1350
289 -1350 -214363 -397667 -512329 -559317 -524476 -402342 -231045 -24365 193120 373396 500382
300 500382 558542 527617 419033 254320 46979 -167145 -348795 -485677 -550008 -525435 -431486
311 -431486 -272503 -69752 135519 320750 462244 530286 518070 437173 286366 93325
321 93325 -103242 -292109 -435795 -508474 -513004 -440781 -298952 -118500 77104 268079 413573
332 413573 496232 513758 447154 315347 143533 -56772 -246428 -395484 -491301 -513757 -454996
343 -454996 -334126 -164750 34885 221467 375964 480563 505597 458752 348788 181592
353 181592 -8619 -192436 -352103 -458640 -491302 -457684 -356683 -197218 -18151 164663
363 164663 327700 434737 479935 457552 362959 215702 41835 -142466 -306254 -418428
373 -418428 -475671 -460894 -372587 -236260 -62338 123533 286225 408050 472810 462877 384540
384 384540 254801 81499 -101476 -263648 -394058 -462235 -458455 -393355 -267650 -100788 74436
395 74436 239124 372072 443487 450680 396482 276883 120816 -48200 -216327 -348132 -426532
406 -426532 -446346 -397827 -288397 -140739 27948 196312 330324 417593 446362 402830 303206
417 303206 159780 -10496 -177012 -316030 -410852 -444747 -408644 -316460 -177274 -8391 155047
428 155047 297631 398599 435212 409353 326007 191307 29935 -130043 -275522 -378940
438 -378940 -420650 -407540 -331723 -203135 -53094 107588 254679 358130 411816 406839 336124
449 336124 218804 72805 -90208 -236247 -345000 -409419 -407300 -345149 -236583 -87654 72262
460 72262 218941 336124 403578 408405 354819 249468 104435 -51335 -199818 -320814 -391219
471 -391219 -404226 -357832 -259679 -122514 30565 176877 300133 375022 394435 359846 267952
482 267952 137325 -8929 -156436 -281426 -360543 -390542 -362764 -275479 -154602 -9912 142174
493 142174 265524 353210 391481 364529 288915 171618 22593 -124594 -251426 -347501 -387046
504 -387046 -368116 -301159 -182398 -39665 102405 237245 333083 376592 369141 304247 194834
515 194834 60571 -84172 -216873 -313380 -365543 -364608 -307915 -207903 -75811 65622 195818
526 195818 299787 356933 363195 314916 217204 92467 -47838 -183935 -288923 -353004 -365768
537 -365768 -320392 -231499 -109045 35921 168871 276252 349728 363436 326486 245158 118777
548 118777 -16976 -147352 -264703 -336321 -356312 -330218 -249670 -133643 -5540 131655 246576
559 246576 317808 351296 328858 255663 151138 18552 -114436 -225970 -310009 -347224 -329616
570 -329616 -266150 -161923 -33448 96411 216831 304590 343047 334964 274705 174589 50508
581 50508 -85759 -204636 -292610 -341502 -335796 -282028 -187984 -62123 67219 184500 281851
592 281851 331880 330620 287641 195522 78200 -44468 -170979 -265471 -316223 -329920 -288878
603 -288878 -204367 -96101 33177 155246 247677 313119 330083 290965 217410 107118 -20601
614 -20601 -137317 -243003 -311113 -325781 -299651 -227370 -118442 3291 127675 233544 299269
625 299269 325555 304515 233453 132351 10643 -111951 -213685 -289977 -320490 -300376 -241013
636 -241013 -143230 -26696 90933 200880 277063 309002 301857 247009 153608 43315 -79161
647 -79161 -187787 -262646 -309029 -304957 -250420 -167444 -53694 67429 172433 261117 308345
658 308345 302631 260716 178465 64445 -50757 -163446 -253718 -296843 -305025 -268120 -183773 -80417
670 -80417 36020 149205 234493 289852 303129 265360 193274 94630 -21341 -130170 -221879
681 -221879 -281835 -294519 -268920 -203624 -104191 6042 118196 212161 271563 296497 274967
692 274967 209212 116753 5474 -107446 -201002 -269831 -297554 -274923 -219173 -128957 -15673
703 -15673 92342 192408 263394 288630 279314 227300 135994 32063 -77336 -178775 -247130
714 -247130 -283378 -280207 -226945 -147368 -48086 64553 161142 236272 279232 274176 233230 159601
726 159601 56838 -50627 -149730 -230094 -272981 -276790 -241951 -165648 -67795 37908 142077
737 142077 222007 271062 280359 243880 175555 80836 -27527 -129070 -212904 -265125 -275307 -248091
749 -248091 -184656 -90017 12616 113550 200627 252610 271692 250948 187473 102822 2838
760 2838 -101296 -185764 -244674 -269417 -249183 -195464 -115096 -11767 89200 175707 241355 266091
772 266091 252968 205327 121143 22598 -77305 -170111 -235254 -264979 -257583 -209406 -130676 -35981
784 -35981 66886 159146 225431 261044 255920 213748 141869 46607 -52584 -143596 -214591 -252139
796 -252139 -253869 -217878 -148445 -59141 38192 131527 203883 246153 253642 220442 156821 70982
808 70982 -29158 -121228 -196304 -244579 -252999 -225903 -166016 -78356 18514 111212 190981 240352
820 240352 252676 231166 171863 87956 -5139 -101334 -180715 -231510 -250857 -231469 -177686 -99846
832 -99846 -6534 87552 166694 222366 245745 230958 183858 109146 17990 -73709 -156075 -214925
844 -214925 -241426 -232794 -188779 -117571 -28524 64829 148182 210251 240696 235252 194937 125890
856 125890 37329 -55686 -139808 -205415 -238193 -236220 -200699 -132930 -47881 43404 129871 195575
868 195575 231893 235235 203147 140474 59565 -31017 -117060 -183488 -225138 -232749 -204747 -148539
880 -148539 -69431 19794 104799 175179 220028 231330 208424 155408 77929 -10231 -96175 -169679
892 -169679 -216751 -231589 -212807 -161363 -86338 1238 88061 162672 212626 230484 215599 167239
904 167239 95079 9980 -77076 -152092 -204498 -226425 -215645 -172197 -104018 -21958 64661 140037
916 140037 194925 221897 214761 176544 112554 31735 -53635 -130374 -188539 -219103 -215700 -181522
928 -181522 -120066 -39709 44825 123576 184731 217189 218056 186589 126701 48330 -36070 -115942
940 -115942 -178808 -213578 -218402 -190170 -133111 -58332 25623 105273 168964 207685 216020 192182
952 192182 139726 68385 -13979 -93361 -158215 -201221 -213099 -193847 -146188 -76797 3795 83558
964 83558 150729 196719 212233 196530 152207 83914 4221 -75951 -145763 -193530 -212269 -199846
976 -199846 -157531 -91316 -12621 67688 138962 188280 210242 201701 161885 99578 22958 -57229
988 -57229 -128125 -180101 -205643 -200935 -165739 -107454 -33345 46096 116911 172031 201190 200015
1000 200015 170079 114260 42163 -36400 -108992 -166276 -198766 -200963 -174255 -120582 -49386 28692
1012 28692 102943 161943 196982 202210 178053 126818 56779 -20216 -95243 -155844 -192488 -201818
1024 -201818 -180678 -132449 -66053 10118 84846 146129 186001 199285 181771 138109 75325 -193
1036 -193 -73647 -136402 -180508 -195917 -183310 -143553 -81960 -8727 65368 130533 176580 195095
1048 195095 186227 148323 88204 16492 -59385 -125269 -172885 -195272 -187926 -152979 -95210 -23741
1060 -23741 50858 117791 167596 192199 188258 157054 101969 33193 -40201 -108431 -159108 -186954
1072 -186954 -188032 -159530 -109082 -42815 30981 97947 151543 183595 186869 162939 115509 49747
1084 49747 -22627 -90466 -147707 -180823 -186888 -167393 -119952 -56316 15110 86072 142784 178279
1096 178279 188567 169908 125132 64100 -7796 -77963 -135014 -174815 -186738 -170885 -131499 -71488
1108 -71488 -2093 66867 127142 167413 182915 172697 135655 79007 11989 -58258 -118571 -161165
1120 -161165 -181876 -173654 -139379 -86497 -18431 50902 112055 159529 180289 174857 145013 91279
1132 91279 25135 -43855 -108189 -155371 -178059 -177747 -148280 -96359 -33866 37058 100376 147813
1144 147813 176732 176724 150371 104275 41635 -27206 -89765 -141354 -171364 -174059 -154560 -110042 -48932
1157 -48932 16838 82350 134641 166016 175456 156662 113863 56684 -10890 -76334 -129476 -165624
1169 -165624 -175456 -158312 -119902 -62179 5405 69646 126233 162792 173634 162682 123999 67583
1181 67583 4015 -62775 -118726 -156236 -173302 -163065 -126954 -76428 -12657 53941 108565 151403
1193 151403 169983 161437 133334 82685 19356 -43863 -102735 -146501 -166355 -164562 -136760 -86480
1205 -86480 -27327 37955 98560 141816 166809 166050 138075 93307 33094 -33527 -91896 -139129
1217 -139129 -165073 -165036 -143158 -98523 -38684 24246 84527 133105 159699 165562 145727 102190
1229 102190 48632 -15050 -76665 -123927 -156265 -163879 -145799 -109289 -55315 8683 67869 118807
1241 118807 153401 161733 149779 113780 58535 -808 -62657 -116269 -149536 -163383 -152168 -115607
1253 -115607 -65918 -5166 58606 109904 146814 162875 151906 121074 72447 10452 -49259 -102397
1265 -102397 -142595 -158511 -153654 -125293 -76910 -20713 40109 95722 135275 155955 154165 127125
1277 127125 83931 28248 -34606 -88211 -130870 -155078 -153347 -131517 -88813 -31614 27655 83779
1289 83779 129018 152684 155020 134719 91459 38492 -21301 -80250 -123428 -150269 -156033 -135473
1301 -135473 -97772 -45900 15595 70806 116423 147138 153111 137971 103111 51228 -6042 -61967
1313 -61967 -111279 -141620 -151500 -140740 -105777 -58186 -1633 57598 105093 138336 152025 141251
1325 141251 110103 63352 5331 -51949 -100716 -137436 -150853 -142825 -114257 -66672 -11854 45564
1337 45564 97366 132552 149105 144526 116546 73125 19520 -39144 -89125 -126415 -147275 -143812
1349 -143812 -119881 -79822 -25794 30173 80952 122366 143228 143455 123542 83249 32437 -23376
1361 -23376 -77106 -117883 -141045 -145076 -125443 -87174 -37994 19704 72413 114009 140990 144764
1373 144764 127539 91969 42239 -13306 -66310 -110263 -137450 -143634 -130065 -95885 -48582 5075
1385 5075 59589 103221 132194 142955 130894 100093 55580 1573 -51718 -96677 -128964 -141046
1397 -141046 -132000 -104267 -60266 -7540 45634 93166 125990 139656 134203 106609 64031 12782
1409 12782 -42199 -89241 -123171 -139859 -134887 -109311 -68956 -17948 36446 83348 119631 137700
1421 137700 134632 113081 73876 24667 -28112 -76902 -113726 -134030 -134813 -115457 -78780 -31609
1433 -31609 21141 70426 108384 131616 134670 117315 83226 36450 -16013 -65456 -105731 -129893
1445 -129893 -134760 -119763 -86318 -40722 11239 61604 102401 127849 134900 121552 89476 45975
1457 45975 -5662 -56094 -96959 -124957 -133713 -122748 -93986 -51697 -1628 48547 90710 120513
1469 120513 131703 123990 97860 57052 8683 -41879 -85363 -116366 -130478 -124914 -100607 -61537
1481 -61537 -13501 37138 81638 113974 129760 125885 103078 65272 17700 -32854 -77868 -111434
1493 -111434 -128500 -126785 -105651 -69399 -23405 26950 72068 106860 126027 126490 108293 74172
1505 74172 29899 -19725 -65352 -101442 -123091 -125868 -110725 -78659 -35649 13094 59739 96998
1517 96998 120518 125637 112478 82086 39897 -8368 -55792 -93997 -118741 -125908 -113888 -84920
1529 -84920 -43802 4232 51677 90681 116623 125488 115348 88107 48657 1363 -45773 -85458
1541 -85458 -113180 -123908 -116597 -91820 -54201 -8415 38759 79382 108863 121825 117197 94939
1553 94939 58747 14321 -33163 -74657 -105533 -120683 -117906 -97512 -62325 -18614 28948 71439
1565 71439 103125 119956 118617 99556 65678 22565 -24624 -67603 -100030 -118416 -118872 -101665
1577 -101665 -69853 -27751 18718 61724 95607 115590 118501 103963 74099 33935 -11868 -55429
1589 -55429 -90620 -112555 -117931 -106011 -77870 -39165 6141 50400 86511 110414 117368 107366
1601 107366 80672 42586 -2061 -46950 -83723 -108691 -117345 -108617 -83313 -46219 -2226 42813
1613 42813 80063 106124 116881 109504 86484 51046 7728 -36580 -74859 -102496 -114898 -110341
1625 -110341 -89805 -55929 -14114 29945 69490 98340 112849 111297 92118 59969 19415 -25398
1637 -25398 -65185 -95396 -111989 -111472 -94263 -63279 -22962 21578 61802 93272 110743 111575 96363
1650 96363 65900 26760 -17060 -58331 -89842 -108937 -111951 -97934 -69774 -32139 11319 52483
1662 52483 85083 106413 111200 99738 74245 37299 -4972 -46263 -80884 -103092 -110329 -101746
1674 -101746 -76905 -41608 -137 42411 77421 100888 110380 102494 79025 45461 3291 -39131
1686 -39131 -74167 -99843 -109627 -103304 -82167 -48249 -7617 34221 70832 96814 108213 104603
1698 104603 84547 52407 13852 -28809 -65697 -92378 -107089 -104727 -87180 -57782 -18909 22851
1710 22851 60129 89281 105064 104827 90070 60831 23084 -17723 -57011 -86691 -103182 -105856
1722 -105856 -91128 -63083 -27276 15044 53986 83713 102718 105577 92324 66661 30524 -10950
1734 -10950 -49004 -80894 -100667 -104709 -95009 -69803 -35067 3997 44074 76327 96998 104644
1746 104644 96110 72912 40780 1077 -39254 -71341 -94852 -103913 -96527 -76495 -43885 -4582
1758 -4582 34372 69115 93164 102704 98269 78011 46256 8966 -31645 -66686 -90317 -102576
1770 -102576 -98925 -79408 -50566 -12598 27817 61562 88110 101364 98622 82977 54223 17452
1782 17452 -20974 -57122 -84790 -98551 -99628 -85468 -57574 -23693 16012 53242 80101 97466
1794 97466 99897 86203 61472 26821 -12982 -48915 -78296 -96707 -99082 -88177 -63689 -29021
1806 -29021 8589 46267 76650 94087 99630 89807 65551 33969 -4402 -42445 -71687 -92238
1818 -92238 -99462 -90317 -69576 -38580 -397 35908 67664 90093 97351 92207 72825 41902 6539
1831 6539 -31620 -64763 -86444 -97125 -93481 -74123 -45778 -9979 29122 60879 84876 97267
1843 97267 92805 76231 48419 12044 -24804 -58375 -83643 -95112 -93810 -78713 -50832 -17026
1855 -17026 20229 55111 79495 93735 94979 80017 55289 22423 -15674 -49190 -76065 -92643
1867 -92643 -93929 -82480 -59106 -25924 10301 45219 73941 90021 93953 84490 60425 29459
1879 29459 -6860 -43360 -70707 -88970 -94789 -84435 -62956 -32632 4406 39450 68138 88120
1891 88120 93394 85679 66206 35438 628 -34633 -65352 -84606 -92729 -87873 -68268 -40197 -6250
1904 -6250 30302 60518 81863 92587 87992 70941 44670 9847 -25663 -56778 -80431 -90781
1916 -90781 -88498 -73399 -46239 -13144 22435 55056 77972 90003 89565 74096 48634 16722
1928 16722 -19846 -51673 -75496 -89685 -89073 -75989 -52603 -20195 14764 47167 72938 87252
1940 87252 89139 78700 55575 24973 -9076 -43161 -69160 -85060 -89886 -79710 -58447 -29490
1952 -29490 5818 39320 66194 84253 89107 80600 60980 31574 -2845 -36228 -64536 -82573
1964 -82573 -88450 -82065 -62272 -34064 -1009 33556 61574 80422 88502 82576 64633 38252 5091
1977 5091 -28943 -57485 -78335 -87467 -83455 -68160 -41965 -9950 23537 54036 75427 86094
1989 86094 84641 69674 45065 13983 -20379 -51019 -73101 -85525 -84695 -70770 -47601 -16310
2001 -16310 17748 48192 71788 84442 84635 72582 49589 19382 -13942 -45269 -69259 -82879
2013 -82879 -85029 -74179 -52482 -23826 9474 41173 65683 81402 84912 75801 56178 27955
2025 27955 -4753 -36642 -62753 -79495 -84603 -77293 -58563 -31049 924 33510 60375 77593
2037 77593 84390 77924 59917 33671 1509 -30875 -58014 -76335 -83793 -78477 -61781 -36222 -4705
2050 -4705 27366 55154 74541 82899 79626 64232 39840 9522 -22875 -51246 -71730 -81958
2062 -81958 -80334 -66633 -43483 -13823 18490 47604 69237 81008 80644 68408 46151 16889
2074 16889 -15196 -45068 -67399 -79959 -80853 -69415 -48045 -19371 12530 42504 65445 78739
2086 78739 80884 70455 50239 22472 -9185 -39114 -62956 -77294 -80770 -72171 -53157 -26555
2098 -26555 4598 34898 59757 75507 80619 73852 56090 30515 -176 -31076 -56671 -73702
2110 -73702 -80200 -74721 -58051 -33166 -2903 28272 54392 72209 79705 75087 59444 35184 5219
2123 5219 -25572 -52286 -70659 -79103 -75727 -61239 -38065 -8721 21850 49137 68469 78068 76505
2136 76505 63362 41519 13092 -17512 -45322 -66005 -76969 -77126 -65555 -44657 -17164 13532
2148 13532 41982 63708 75917 77267 66952 46856 19932 -10693 -39433 -61698 -74887 -77067
2160 -77067 -67733 -48574 -22100 7986 36956 59759 73593 76983 68751 50776 25150 -4398
2172 -4398 -33453 -57161 -71962 -76966 -70338 -53667 -29316 45 29148 53925 70134 76496 71655
2185 71655 56070 32760 3770 -25693 -51168 -68465 -75910 -72282 -57577 -34895 -6519 23278
2197 23278 48949 67038 75363 72509 58913 36942 8969 -20448 -46479 -65369 -74488 -72888 -60678
2210 -60678 -39485 -12474 16642 43512 63014 73472 73753 62600 42952 16696 -12555 -39723
2222 -39723 -60563 -72541 -74080 -64407 -45960 -20138 8948 36439 58501 71126 73859 65544 47412
2235 47412 22464 -6377 -34316 -56662 -70053 -73713 -66152 -48866 -24805 3968 31690 54325
2247 54325 69046 73357 67163 51449 27815 -26 -27833 -51708 -67148 -73001 -68663 -53898 -31462
2260 -31462 -4351 24174 48603 65082 72903 69464 55834 34800 7280 -20971 -45775 -63901
2272 -63901 -72016 -69693 -57370 -36439 -9632 18221 43951 62317 70893 70190 58262 38202 12557
2285 12557 -15917 -41399 -60189 -70532 -70372 -59736 -41185 -15779 12208 37724 58217 69481
2297 69481 70526 62141 44137 19504 -7714 -34661 -55710 -67811 -71119 -63304 -46199 -22896 4979
2310 4979 31899 53261 67073 70825 63538 48118 24680 -2940 -29063 -51976 -65928 -69913 -64765
2323 -64765 -49377 -26719 -404 26769 49553 64012 70098 65681 51110 30426 3835 -23359
2335 -23359 -46017 -62808 -69701 -66234 -54153 -33519 -7419 19115 43574 61101 68662 67460 55906
2348 55906 35648 10944 -16480 -41428 -58749 -68387 -67555 -56182 -37853 -12772 14598 38693
2360 38693 57659 67593 66950 57657 39654 14850 -11179 -36299 -56098 -66028 -67850 -59438 -41712
2373 -41712 -19115 7645 33253 52897 65399 68244 60462 45108 22576 -4486 -29432 -50829
2385 -50829 -64492 -67402 -62032 -47075 -24313 1092 27201 49247 62591 67609 62590 47646 26785
2398 26785 1060 -25378 -46645 -61529 -67359 -62286 -49531 -29175 -3138 21894 44470 60388
2410 60388 66199 63676 51879 31618 7399 -18367 -42038 -58056 -66137 -65055 -53285 -35153 -11250
2423 -11250 15667 38517 56356 65812 64556 55080 37449 12967 -12585 -36324 -55195 -64332 -64707
2436 -64707 -56138 -37996 -15377 10101 34915 52941 63624 65242 56354 40517 18292 -7808
2448 -7808 -31525 -50813 -62988 -64764 -58128 -43406 -21004 3699 27982 48968 61223 65205 60026
2461 60026 45076 24572 -128 -25733 -46195 -60063 -65337 -60161 -46895 -27056 -1618 22971
2473 22971 43968 59259 64233 60550 48380 27939 4110 -20454 -42668 -57341 -63775 -61456 -49212
2486 -49212 -30460 -7344 18171 39875 55506 63867 61765 51439 34045 10239 -14319 -36623
2498 -36623 -54240 -62779 -62516 -53600 -36081 -13605 10927 34593 52200 61754 63137 54144 37758
2511 37758 16069 -9360 -32267 -50268 -61374 -62497 -54819 -39461 -17540 6848 29709 48973
2523 48973 59926 62185 56178 40904 20212 -3398 -27503 -46556 -58650 -62859 -57154 -43408 -23842
2536 -23842 381 24180 43884 57822 62596 58228 45976 26285 2629 -20874 -42142 -56282
2548 -56282 -61825 -59115 -46749 -28006 -5137 19207 40053 54621 61466 58959 47554 29975 6909
2561 6909 -16968 -37647 -53560 -60845 -59206 -49463 -31997 -9965 13575 35354 51672 60008 60214
2574 60214 51260 34732 13653 -10410 -32578 -49439 -59589 -60530 -52482 -37259 -16004 7792 29880
2587 29880 48085 58560 60231 53443 38600 17894 -5335 -27969 -46282 -57194 -60095 -53796 -39571
2600 -39571 -20071 3272 25818 44173 56349 59840 54583 41703 22630 -249 -22738 -42051
2612 -42051 -55203 -59742 -56153 -44113 -25549 -3420 19778 39744 53623 59630 56906 45726 28049
2625 28049 5924 -17300 -37489 -52188 -59051 -56805 -46641 -29506 -7628 15155 35786 50876
2637 50876 58175 57075 47485 31108 9968 -12782 -33516 -49118 -57509 -57502 -48872 -33491 -12984 9784
2651 9784 30729 47358 56871 57969 50750 36082 16064 -6577 -28115 -45482 -56052 -58241 -51965
2664 -51965 -37926 -18471 4078 25956 43589 54934 57913 52271 39115 20064 -2081 -23861
2676 -23861 -41846 -53622 -57471 -52723 -40333 -21931 -174 21511 40016 52447 57365 53814 42276
2689 42276 24813 3379 -18549 -37612 -51104 -57170 -54885 -44391 -27563 -6515 15696 35247
2701 35247 49754 56691 55383 45770 29443 8764 -13473 -33299 -48173 -55909 -55269 -46493 -30766
2714 -30766 -10498 11411 31439 46592 55007 55216 47267 32414 12692 -8868 -29141 -44923 -54187
2727 -54187 -55551 -48655 -34776 -15595 5887 26574 43202 53464 56044 50223 37103 18584 -3021
2740 -3021 -23880 -41188 -52429 -55844 -51053 -38569 -20547 772 21888 39475 51238 55223 51263
2753 51263 39439 21960 1150 -19957 -37669 -49949 -54809 -51607 -40787 -23961 -3572 17445
2765 17445 35642 48670 54592 52430 42718 26638 6589 -14498 -33451 -47235 -54228 -53421 -44442
2778 -44442 -29104 -9342 11905 31198 45781 53659 53599 45509 30816 11389 -9733 -29122 -44298
2791 -44298 -52599 -53260 -46105 -31790 -13079 7704 27345 42611 51640 53200 46805 33457 15461
2804 15461 -5287 -25024 -40802 -50987 -53467 -48182 -35985 -18231 2202 22232 39102 50027
2816 50027 53675 49504 37879 20709 533 -19951 -37206 -48754 -53420 -49891 -38916 -22539 -2336
2829 -2336 17969 35403 47684 52691 49946 39914 23840 4259 -15796 -33622 -46240 -51936 -50425
2842 -50425 -41051 -25751 -6932 13542 31535 44792 51919 51081 42834 28465 9635 -10737 -29206
2855 -29206 -43601 -51483 -51576 -44588 -30514 -11965 7981 27260 42013 50331 51858 45080 31717
2868 31717 13978 -6274 -25393 -40217 -49552 -51377 -45238 -33017 -15436 4496 23127 38921
2880 38921 48627 51023 46495 34559 17715 -1504 -21006 -37126 -47460 -51414 -47616 -36516 -20663
2893 -20663 -1144 18614 34903 46769 51444 48275 38579 22650 3310 -16051 -33401 -45543
2905 -45543 -50647 -48847 -39325 -23904 -5531 14264 31751 43795 50115 48718 39749 25773 7188
2918 7188 -12427 -29467 -42763 -49503 -48709 -41355 -27574 -9406 9547 27600 41612 48823 49795
2931 49795 43097 29645 12638 -6975 -25600 -39598 -48516 -50154 -43866 -31830 -14694 5126 23184
2944 23184 38260 47757 49404 44601 32851 15713 -2812 -21506 -37000 -46190 -49332 -44974 -33461
2957 -33461 -17906 898 19821 34866 45363 49367 45420 35507 20296 1232 -16891 -33202
2969 -33202 -44698 -48894 -46788 -37517 -22204 -4359 14644 31732 43233 48932 47668 38441 24440
2982 24440 6522 -12979 -29365 -41967 -48512 -47042 -39392 -25723 -7688 10692 27685 40888
2994 40888 47171 47143 40273 26637 9886 -8516 -26360 -39037 -46684 -47819 -40993 -29013 -12568
3007 -12568 6572 23696 37672 46617 47905 42680 31377 14628 -3642 -21415 -36612 -45360 -47946
3020 -47946 -43801 -32145 -16671 1486 20105 34612 44334 47968 43616 33295 18365 -263 -17896
3033 -17896 -32790 -43559 -46898 -43890 -34636 -19476 -2099 15686 31680 42120 46765 45063 35826
3046 35826 21911 4786 -13844 -29593 -41053 -47249 -45539 -37619 -24550 -6842 11221 27515
3058 27515 40347 46309 45906 38963 25554 8887 -9027 -26154 -38580 -45246 -45993 -38986 -26549
3071 -26549 -10646 7851 24288 37008 45013 45570 39697 28365 12195 -5549 -22027 -35989 -44023
3084 -44023 -45703 -41249 -29948 -14562 2712 20422 34346 43198 46477 42093 31789 17133 -822
3097 -822 -18207 -32607 -42730 -46031 -42531 -33286 -18435 -992 16074 31427 41350 45170 42974
3110 42974 33662 19677 3050 -14579 -29531 -39899 -44974 -42958 -34460 -21602 -4730 12652 27648
3123 27648 39326 44684 43562 36542 23523 7206 -9958 -26128 -38049 -44241 -44476 -37769 -25385
3136 -25385 -9694 8059 24329 36540 43922 44452 38196 26895 11011 -6347 -22334 -35365 -42849
3149 -42849 -43832 -38788 -27699 -12471 4337 20755 33911 41714 43991 39396 28944 14698 -2370
3162 -2370 -18802 -32209 -41271 -44125 -40358 -30964 -16780 101 16631 30992 40645 44148 41598
3175 41598 32544 18611 2310 -14742 -29309 -39335 -43831 -41673 -33176 -20164 -3844 13035 27563
3188 27563 38146 43088 41428 33916 21304 5292 -11067 -26037 -37040 -42350 -41878 -34923 -22921
3201 -22921 -7587 9073 24320 35796 42208 42567 36308 25022 9930 -6926 -22420 -34669 -41820
3214 -41820 -42679 -37465 -26564 -11677 4941 20748 33442 40946 42629 37993 27482 13227 -3162
3227 -3162 -19058 -31785 -39907 -42169 -37994 -28405 -14575 1462 17227 30329 39014 41916 38696
3240 38696 29796 16455 564 -15312 -29076 -38286 -42060 -39794 -31396 -18642 -2862 13392 27419
3253 27419 37502 42031 40402 32689 20320 4802 -11486 -25778 -36303 -41238 -40301 -33265 -21335
3266 -21335 -6245 9887 24330 34982 40578 40201 33857 22526 7863 -7982 -22565 -33685 -40006
3279 -40006 -40404 -34821 -24206 -9863 5930 20883 32698 39632 40979 36144 25976 12029 -3892
3292 -3892 -19103 -31489 -39088 -41096 -36954 -27282 -13745 2091 17410 30091 38187 40564 37152
3305 37152 28096 15006 -467 -15657 -28436 -37036 -40096 -37257 -28896 -16283 -1248 14030 27115
3318 27115 36148 40059 37999 30345 18252 3360 -12038 -25658 -35386 -40035 -38793 -31839 -20179
3331 -20179 -5422 10136 24101 34434 39696 39152 32695 21474 7053 -8491 -22535 -33239 -38908
3344 -38908 -39021 -33075 -22452 -8536 6848 20962 31963 38086 38736 33715 23574 10106 -5023
3357 -5023 -19322 -30646 -37559 -38955 -34625 -25130 -11992 3073 17752 29619 37274 39440 35746
3370 35746 26905 13946 -1065 -15918 -28394 -36439 -39292 -36258 -27878 -15357 -547 14242 26940
3383 26940 35326 38688 36250 28463 16595 2074 -12684 -25330 -34297 -38118 -36410 -29289 -17893
3396 -17893 -3694 10904 23997 33486 37985 37156 30681 19710 5940 -9060 -22438 -32502 -37896
3409 -37896 -37699 -31802 -21391 -7590 7322 20967 31605 37477 37823 32642 22576 9142 -5468
3422 -5468 -19482 -30252 -36409 -37522 -32776 -23274 -10574 4100 17862 28838 35697 37344 33282
3435 33282 24531 12068 -2390 -16128 -27801 -35218 -37348 -34395 -25997 -13847 306 14684 26711
3448 26711 34661 37774 35267 27340 15731 1452 -13084 -25102 -33839 -37390 -35263 -28264 -16788
3461 -16788 -2718 11377 23959 32816 36602 35443 28752 17727 4453 -9789 -22516 -31449 -36208
3474 -36208 -35532 -29310 -19364 -6002 8236 20880 30805 36100 35944 30793 20913 7795 -6259 -19596
3488 -19596 -30083 -35649 -36549 -31855 -22192 -9734 4659 18275 28637 35203 36500 32041 23391 10965
3502 10965 -3234 -16412 -27359 -34271 -35700 -32374 -24042 -11877 1520 15081 26343 33198 35772
3515 35772 33038 24958 13852 215 -13640 -24865 -32870 -36070 -33599 -26594 -15607 -1760 11700
3528 11700 23794 32467 35739 34433 27769 16732 3670 -10242 -22648 -31117 -35415 -34592 -28095 -18020
3542 -18020 -5074 8931 20879 30044 34877 34082 28773 19090 6215 -7067 -19458 -29159 -34008
3555 -34008 -34366 -29653 -20079 -8026 5413 18496 28075 33981 35202 30486 21887 9951 -4028 -16718
3569 -16718 -27209 -33873 -34957 -31368 -23188 -11072 2204 15237 26253 32652 34742 31847 23469
3582 23469 12443 -694 -14079 -24558 -31701 -34473 -31570 -24391 -13740 -459 12408 23305 31306
3595 31306 34012 32162 25806 14909 2367 -10627 -22573 -30412 -34153 -33146 -26632 -16606 -4147
3608 -4147 9491 21085 29688 34360 33285 27586 18199 5287 -7781 -19633 -28969 -33271 -33138 -28268
3622 -28268 -18629 -6722 6166 18494 27472 32440 33215 28316 19617 8277 -5056 -17020 -26351
3635 -26351 -32400 -33083 -29177 -21284 -9510 3262 15504 25895 31944 33471 30442 22352 11221 -1417
3649 -1417 -14391 -24671 -31168 -33785 -30642 -23245 -12736 380 12886 23302 30631 33075 30665
3662 30665 24113 13539 1029 -11189 -22213 -29426 -32350 -31104 -24480 -14618 -2826 9992 20922
3675 20922 28584 32494 31345 25477 16288 4118 -8582 -19621 -28330 -32486 -31830 -26972 -17512 -5662
3689 -5662 6815 18692 27406 31987 32282 27435 18519 7262 -5565 -17267 -26016 -31363 -31823 -27425
3703 -27425 -19459 -8103 4257 15706 25180 30603 31516 28187 20269 9432 -2589 -14513 -24186
3716 -24186 -30009 -31921 -28862 -21318 -11186 1188 13254 23039 29845 32065 29449 22816 12487 243
3730 243 -11747 -22220 -29244 -31747 -29992 -23490 -13463 -1832 10437 20969 27993 31359 29847 23841
3744 23841 14635 2961 -9087 -19402 -27144 -30759 -29730 -24558 -15600 -4221 7543 18458 26554
3757 26554 30547 30426 25593 16890 5916 -6261 -17377 -25767 -30581 -30818 -26379 -18307 -7367 4856
3771 4856 15973 24911 30026 30583 26912 19089 8315 -3384 -14788 -23781 -29099 -30381 -27082 -19663
3785 -19663 -9555 2046 13489 22550 28426 30239 27432 20686 10843 -742 -12043 -21658 -28032
3798 -28032 -30217 -28187 -21777 -12151 -742 10878 20937 27550 30373 28804 22694 13521 2142 -9602
3812 -9602 -19630 -26840 -30035 -28848 -23355 -14451 -3361 8203 18356 25744 29303 28630 23755 15203
3826 15203 4554 -6825 -17196 -24806 -28870 -28774 -24360 -16379 -5910 5499 16077 24168 28777 29240
3840 29240 25289 17682 7301 -4092 -14923 -23499 -28485 -29432 -25967 -18594 -8558 2858 13728
3853 13728 22517 27862 29189 26220 19330 9705 -1552 -12429 -21290 -27012 -28758 -26302 -19959 -10658
3867 -10658 212 11093 20194 26335 28552 26680 20767 11781 1021 -9896 -19365 -25906 -28724 -27358
3881 -27358 -21859 -13191 -2410 8677 18484 25411 28675 27742 22654 14247 3718 -7343 -17274 -24511
3895 -24511 -28056 -27576 -22981 -15019 -4849 6116 16022 23469 27422 27500 23369 15878 5996 -4803 -14770
3910 -14770 -22632 -27030 -27569 -24049 -16887 -7257 3499 13775 21895 26810 27893 24820 17982 8572
3924 8572 -2295 -12756 -21167 -26520 -28024 -25346 -18939 -9630 1036 11447 20131 25699 27663 25412
3938 25412 19442 10644 218 -10167 -18930 -24781 -27110 -25449 -19921 -11584 -1368 8936 17929 24259
3952 24259 27001 25891 20878 12702 2668 -7870 -17137 -23831 -27086 -26437 -21788 -13910 -4011 6655
3966 6655 16145 23143 26873 26584 22320 14848 5087 -5376 -14989 -22248 -26199 -26355 -22648 -15576 -6133
3981 -6133 4081 13736 21278 25485 26243 22919 16314 7335 -2891 -12574 -20310 -25138 -26306 -23486 -17314
3996 -17314 -8444 1754 11622 19808 24991 26498 24322 18318 9617 -414 -10522 -18976 -24460 -26484
4010 -26484 -24601 -19040 -10735 -665 9352 17766 23622 26024 24444 19485 11505 1763 -8016 -16776
4024 -16776 -22792 -25452 -24639 -20014 -12335 -3000 6936 15795 22166 25497 25081 20740 13578 4166 -5880
4039 -5880 -14860 -21825 -25431 -25276 -21590 -14520 -5238 4697 14006 21133 24953 25419 22033 15191 6447
4054 6447 -3519 -12888 -19967 -24389 -25132 -22080 -16010 -7359 2393 11467 19058 23748 24822 22461 16659
4069 16659 8214 -1159 -10556 -18490 -23282 -25059 -23086 -17455 -9566 107 9735 17692 23144 25317 23533
4084 23533 18462 10613 970 -8445 -16813 -22590 -24767 -23699 -18990 -11191 -2147 7373 15802 21537 24365
4099 24365 23680 19189 12168 3293 -6298 -14569 -20812 -24084 -23523 -19847 -13110 -4183 5005 13699 20372
4114 20372 23749 23946 20660 13898 5397 -4018 -13106 -19725 -23742 -24442 -21065 -14894 -6535 3135 11861
4129 11861 18992 23401 24026 21428 15629 7314 -1806 -10667 -18098 -22430 -23752 -21623 -15921 -8264 684
4144 684 9775 17000 21828 23725 21756 16795 9368 150 -8673 -16321 -21763 -23636 -22338 -17767 -10166
4159 -10166 -1394 7632 15835 21146 23685 22841 18153 11209 2501 -6861 -14754 -20470 -23534 -22665 -18657
4174 -18657 -12103 -3298 5537 13576 19839 22690 22545 19186 12559 4389 -4334 -12839 -18911 -22265 -22750
4189 -22750 -19399 -13370 -5531 3631 11884 18319 22458 22878 20084 14493 6285 -2553 -10944 -18023 -22060
4204 -22060 -22938 -20720 -15051 -7321 1362 10106 16979 21323 22877 20614 15520 8306 -538 -8970 -15962
4219 -15962 -20857 -22365 -20741 -16258 -8962 -513 7761 15321 20173 22119 21258 16680 9849 1693 -7077
4234 -7077 -14552 -19736 -22419 -21517 -17372 -10980 -2499 6185 13723 19517 22215 21640 18124 11593 3398
4249 3398 -5007 -12999 -18721 -21631 -21721 -18296 -12242 -4602 4000 11866 17627 21204 21488 18436 13050 5331
4265 5331 -3100 -10785 -17227 -20863 -21441 -19129 -13671 -6229 1922 10146 16724 20593 21871 19626 14395
4280 14395 7298 -1179 -9381 -15931 -20413 -21722 -19799 -15141 -8026 230 8251 15206 19726 21323 19983
4295 19983 15501 8713 908 -7278 -14281 -18872 -21044 -20026 -15859 -9665 -1754 6333 13356 18516 20882
4310 20882 20175 16609 10398 2579 -5409 -12853 -18311 -20859 -20649 -17224 -11142 -3619 4630 12147 17642
4325 17642 20711 20716 17552 11940 4490 -3670 -11040 -16850 -20163 -20358 -17788 -12460 -5231 2539 10153 16093
4341 16093 19480 20286 18056 13014 6171 -1690 -9350 -15394 -19306 -20448 -18425 -13826 -7062 936 8491
4356 8491 14929 19106 20451 18934 14438 7761 33 -7737 -14358 -18691 -20369 -19162 -14881 -8552 -1004
4371 -1004 6812 13358 18026 20008 19033 15349 9316 1888 -5741 -12440 -17278 -19550 -19074 -15749 -9906
4386 -9906 -2786 4859 11814 16879 19558 19415 16217 10798 3580 -4086 -11176 -16545 -19537 -19596 -16776 -11531
4402 -11531 -4465 3261 10345 15995 19133 19546 17117 11999 5262 -2277 -9431 -15152 -18531 -19325 -17201
4417 -17201 -12549 -6090 1397 8541 14332 18093 19121 17492 13137 6779 -430 -7722 -13812 -17809 -19286
4432 -19286 -17827 -13750 -7499 -313 7105 13339 17559 19315 18145 14299 8347 1080 -6246 -12656 -17086
4447 -17086 -19043 -18235 -14716 -9002 -1989 5226 11716 16332 18517 18163 14979 9564 2848 -4369 -10893
4462 -10893 -15759 -18317 -18220 -15411 -10246 -3568 3598 10277 15398 18243 18434 15930 10965 4381 -2821
4477 -2821 -9652 -14957 -18093 -18563 -16261 -11562 -5091 2058 8876 14367 17669 18438 16450 12051 5845
4492 5845 -1149 -7931 -13542 -17061 -18144 -16648 -12564 -6696 220 7016 12797 16570 18063 16809 13035
4507 13035 7355 515 -6399 -12323 -16431 -18099 -17161 -13647 -7972 -1225 5757 11873 16157 18087 17403
4522 17403 14117 8701 2097 -4852 -11073 -15471 -17756 -17326 -14382 -9333 -2785 3994 10164 14842 17271
4537 17271 17261 14696 9873 3667 -3120 -9451 -14332 -17019 -17406 -15034 -10488 -4340 2457 8838 13933
4552 13933 16906 17512 15428 11024 5005 -1796 -8280 -13559 -16796 -17560 -15793 -11584 -5668 958 7525
4567 7525 12865 16267 17353 15887 12031 6482 -45 -6579 -12009 -15630 -17026 -15887 -12414 -7104 -654
4582 -654 5770 11448 15299 16966 16191 12951 7700 1381 -5195 -11033 -15050 -17024 -16512 -13441 -8426 -2118
4598 -2118 4556 10364 14717 16853 16554 13822 8964 2785 -3692 -9714 -14103 -16479 -16497 -14079 -9465 -3591
4614 -3591 2864 8878 13373 16099 16406 14265 10075 4314 -2098 -8062 -12932 -15892 -16424 -14593 -10602
4629 -10602 -4866 1394 7589 12728 15675 16653 15042 11059 5608 -769 -7019 -12138 -15516 -16633 -15247
4644 -15247 -11673 -6322 24 6101 11411 14939 16214 15314 11986 6803 846 -5330 -10730 -14364 -16007
4659 -16007 -15343 -12258 -7470 -1512 4719 10087 14055 16066 15503 12823 8141 2031 -3997 -9710 -13898
4674 -13898 -15869 -15756 -13205 -8523 -2810 3423 9216 13387 15747 15859 13437 9145 3526 -2746 -8318
4689 -8318 -12778 -15407 -15602 -13716 -9722 -4125 1794 7522 12245 14871 15522 13953 10022 4834 -1133
4704 -1133 -7075 -11671 -14734 -15706 -14114 -10583 -5413 704 6507 11404 14738 15683 14471 11141 5951
4719 5951 64 -5796 -10941 -14200 -15514 -14667 -11341 -6529 -827 5169 10170 13679 15319 14543 11753
4734 11753 7239 1418 -4303 -9400 -13290 -14990 -14617 -12184 -7645 -2203 3621 9063 12839 14933 14931 12429
4750 12429 8174 2794 -3272 -8598 -12598 -15029 -14972 -12800 -8823 -3228 2474 7915 12296 14603 14942
4765 14942 13145 9189 4016 -1651 -7265 -11522 -14086 -14860 -13128 -9539 -4690 1125 6487 10913 13933
4780 13933 14690 13358 10114 5149 -468 -5919 -10709 -13691 -14712 -13792 -10462 -5689 -251 5581 10250
4795 10250 13443 14822 13852 10820 6313 678 -4897 -9675 -13219 -14566 -13840 -11308 -6736 -1356 4059
4810 4059 9092 12548 14181 13963 11465 7249 2198 -3445 -8406 -11986 -14099 -13985 -11652 -7845 -2642
4825 -2642 2934 7843 11904 14005 14080 12214 8217 3120 -2328 -7541 -11594 -13791 -14273 -12443 -8667 -3807
4841 -3807 1774 6999 10946 13581 14109 12446 9147 4374 -1028 -6147 -10420 -13123 -13853 -12715 -9437
4856 -9437 -4834 252 5552 9961 12735 13922 12871 9810 5549 203 -5079 -9449 -12691 -13892 -12971
4871 -12971 -10263 -5906 -634 4546 9258 12487 13767 13266 10614 6330 1340 -4033 -8638 -11911 -13641
4886 -13641 -13206 -10812 -6946 -1917 3282 7855 11426 13261 13038 11163 7367 2445 -2624 -7368 -11073
4901 -11073 -13013 -13239 -11358 -7707 -3038 2192 7112 10764 13047 13433 11655 8238 3535 -1734 -6481
4916 -6481 -10465 -12807 -13265 -11895 -8542 -3976 1065 5961 10025 12402 13184 12001 8839 4621 -356
4931 -356 -5319 -9270 -12060 -13048 -12044 -9315 -5107 -162 4662 8885 11755 12915 12236 9619 5516 675
4947 675 -4302 -8645 -11583 -12957 -12453 -9910 -5952 -1128 3913 8178 11286 12855 12484 10201 6488 1733
4963 1733 -3173 -7575 -10881 -12515 -12385 -10467 -6860 -2384 2441 6993 10339 12274 12405 10586 7260
4978 7260 2886 -1972 -6482 -10004 -12136 -12437 -10855 -7672 -3310 1528 6115 9837 12010 12478 11113
4993 11113 7963 3747 -1077 -5695 -9384 -11771 -12423 -11204 -8375 -4238 503 5086 8850 11406 12272
5008 12272 11354 8669 4761 195 -4388 -8315 -10972 -12051 -11373 -8931 -5224 -654 3992 7945 10759
5023 10759 12079 11544 9248 5548 1028 -3561 -7592 -10586 -12093 -11667 -9587 -6001 -1523 3070 7235
5038 7235 10315 11813 11704 9740 6365 2104 -2469 -6633 -9774 -11547 -11596 -9939 -6760 -2626 1838 6005
5054 6005 9335 11282 11552 10167 7144 3134 -1340 -5604 -8992 -11130 -11600 -10303 -7443 -3495 1011
5069 1011 5316 8726 11056 11637 10509 7781 3908 -505 -4880 -8394 -10734 -11536 -10594 -8054 -4374 -78
5085 -78 4210 7862 10341 11314 10638 8399 4879 635 -3665 -7352 -10012 -11141 -10689 -8591 -5247 -1046
5101 -1046 3249 7055 9864 11168 10830 8857 5592 1439 -2872 -6693 -9568 -11045 -10906 -9089 -5896
5116 -5896 -1850 2444 6315 9257 10839 10896 9261 6291 2408 -1823 -5759 -8760 -10561 -10836 -9439 -6656
5132 -6656 -2920 1225 5188 8351 10294 10748 9530 6933 3299 -878 -4895 -8105 -10191 -10788 -9671
5147 -9671 -7195 -3576 539 4609 7914 10103 10754 9884 7469 4055 -38 -4029 -7398 -9738 -10621 -9894
5163 -9894 -7766 -4378 -478 3457 6946 9329 10382 9987 7978 4818 1035 -2941 -6503 -9031 -10319
5178 -10319 -10001 -8158 -5222 -1378 2616 6195 8883 10247 10063 8433 5534 1699 -2269 -5911 -8684
5193 -8684 -10115 -10126 -8540 -5736 -2136 1797 5482 8257 9933 10134 8719 6172 2687 -1254 -4894 -7799
5209 -7799 -9562 -9944 -8884 -6475 -2979 789 4469 7502 9336 9998 9005 6629 3408 -464 -4244 -7289
5225 -7289 -9310 -10004 -9120 -7006 -3715 138 3848 7043 9126 9914 9276 7147 4008 359 -3319 -6603
5241 -6603 -8758 -9752 -9280 -7359 -4447 -848 2941 6087 8406 9592 9238 7618 4819 1289 -2370 -5732
5257 -5732 -8240 -9407 -9294 -7838 -5033 -1578 2063 5568 7947 9396 9417 7907 5328 1923 -1821 -5149
5273 -5149 -7811 -9309 -9359 -8124 -5699 -2278 1294 4695 7401 8963 9287 8273 5864 2717 -757 -4259
5289 -4259 -6968 -8734 -9259 -8284 -6163 -3142 464 3830 6666 8628 9172 8460 6452 3328 -99 -3549
5305 -3549 -6573 -8440 -9172 -8595 -6583 -3684 -202 3372 6244 8220 9180 8533 6778 4034 562 -2850
5321 -2850 -5777 -8018 -8915 -8583 -7065 -4318 -1080 2292 5428 7590 8725 8667 7135 4644 1465 -2050
5337 -2050 -5047 -7363 -8743 -8595 -7310 -4930 -1678 1701 4815 7373 8667 8692 7537 5077 1978 -1354
5353 -1354 -4602 -7004 -8435 -8744 -7565 -5395 -2448 949 4097 6583 8259 8575 7661 5680 2750 -520
5369 -520 -3636 -6336 -7982 -8507 -7868 -5861 -3114 134 3376 6045 7811 8507 7838 5992 3360 32
5385 32 -3180 -5831 -7806 -8430 -7831 -6274 -3523 -352 2762 5640 7520 8344 8013 6445 3874 882
5401 882 -2363 -5166 -7116 -8242 -8011 -6575 -4301 -1206 1945 4685 6949 8050 7962 6751 4438 1458
5417 1458 -1622 -4603 -6815 -7952 -8096 -6894 -4660 -1821 1414 4358 6568 7883 7992 6942 4913
5432 4913 2033 -1094 -3985 -6373 -7721 -7930 -7143 -5133 -2384 646 3644 6023 7490 7969 7182 5326
5448 5326 2817 -267 -3194 -5591 -7306 -7847 -7209 -5623 -2993 11 2941 5528 7133 7726 7348 5684
5464 5684 3150 301 -2743 -5312 -7014 -7794 -7384 -5858 -3484 -554 2420 4937 6830 7668 7379 6046
5480 6046 3796 933 -1982 -4624 -6548 -7498 -7422 -6175 -4026 -1297 1635 4326 6273 7429 7444 6291
5496 6291 4254 1518 -1419 -4073 -6200 -7379 -7370 -6362 -4427 -1764 1120 3847 6002 7182 7405 6509
5512 6509 4565 2061 -848 -3572 -5695 -7116 -7416 -6603 -4887 -2392 398 3164 5363 6910 7315 6669
5528 6669 5086 2649 -64 -2844 -5146 -6678 -7241 -6695 -5191 -2914 -143 2669 4968 6587 7332 6796
5544 6796 5345 3068 352 -2384 -4768 -6483 -7132 -6843 -5527 -3273 -646 2085 4521 6205 7047 6885
5560 6885 5667 3596 1066 -1750 -4107 -5982 -6987 -6877 -5840 -3884 -1378 1366 3846 5757 6820
5575 6820 6859 5937 3966 1548 -1146 -3693 -5627 -6815 -6882 -5979 -4187 -1678 1013 3496 5502 6689
5591 6689 6947 6104 4371 2014 -636 -3163 -5150 -6482 -6826 -6217 -4582 -2352 264 2767 4899 6268
5607 6268 6752 6217 4728 2549 15 -2580 -4722 -6178 -6762 -6304 -4922 -2744 -225 2350 4547 6049
5623 6049 6694 6370 5010 2978 429 -2148 -4350 -5933 -6626 -6413 -5176 -3185 -700 1783 4075 5696
5639 5696 6546 6418 5362 3513 1109 -1397 -3701 -5425 -6399 -6347 -5481 -3660 -1330 1190 3492 5346
5655 5346 6378 6453 5537 3779 1518 -1008 -3347 -5208 -6316 -6427 -5651 -3976 -1702 730 3149 5021
5671 5021 6154 6403 5728 4153 1996 -423 -2870 -4769 -5986 -6342 -5718 -4327 -2271 151 2472 4480
5687 4480 5858 6319 5901 4597 2483 119 -2264 -4334 -5714 -6297 -5909 -4630 -2613 -282 2081 4161
5703 4161 5660 6253 5887 4768 2848 535 -1890 -3983 -5489 -6188 -6022 -4919 -3082 -801 1581 3697
5719 3697 5280 6083 5992 5025 3372 1147 -1258 -3394 -5083 -5972 -5960 -5097 -3511 -1324 1048 3244 4993
5736 4993 5936 6037 5263 3654 1483 -822 -3078 -4829 -5868 -6064 -5295 -3747 -1728 640 2844 4610
5752 4610 5781 5997 5399 3997 1967 -295 -2537 -4363 -5613 -5969 -5488 -4208 -2214 -14 2260 4125
5768 4125 5438 5912 5502 4314 2474 186 -2074 -3983 -5369 -5849 -5561 -4394 -2548 -326 1920 3910
5784 3910 5309 5886 5655 4550 2787 615 -1715 -3628 -5111 -5812 -5621 -4634 -2946 -871 1355 3396
5800 3396 4929 5715 5671 4841 3191 1172 -1074 -3142 -4728 -5609 -5662 -4897 -3369 -1342 903 2990 4651
5817 4651 5590 5688 4973 3478 1437 -731 -2835 -4566 -5496 -5668 -5068 -3603 -1659 546 2646 4375 5391
5834 5391 5708 5142 3851 2008 -203 -2263 -4041 -5258 -5584 -5218 -4036 -2159 -23 2031 3901 5099
5850 5099 5586 5298 4097 2356 214 -1961 -3783 -5045 -5614 -5309 -4244 -2486 -334 1721 3654 4983
5866 4983 5527 5361 4405 2642 659 -1476 -3384 -4793 -5446 -5385 -4445 -2867 -892 1268 3171 4614 5514
5883 5514 5398 4606 3152 1140 -924 -2914 -4528 -5316 -5366 -4728 -3200 -1305 816 2792 4347 5321 5457
5900 5457 4698 3323 1470 -674 -2604 -4257 -5227 -5400 -4810 -3554 -1651 419 2412 4101 5103 5379
5916 5379 4963 3697 1914 -75 -2156 -3862 -4969 -5372 -4936 -3834 -2158 -48 1972 3653 4965 5381
5932 5381 5063 4039 2216 239 -1761 -3559 -4809 -5340 -5069 -4012 -2365 -426 1619 3435 4699 5320
5948 5320 5118 4117 2630 659 -1358 -3153 -4613 -5236 -5111 -4323 -2827 -877 1094 2955 4380 5175
5964 5175 5219 4450 3022 1137 -905 -2770 -4188 -5113 -5181 -4409 -3145 -1197 820 2664 4207 5131 5201
5981 5201 4597 3262 1480 -516 -2523 -4032 -4952 -5212 -4669 -3313 -1707 357 2307 3898 4893 5216
5997 5216 4647 3601 1865 -92 -1963 -3658 -4799 -5151 -4816 -3745 -2043 -126 1857 3516 4675 5179
6013 5179 4854 3825 2223 244 -1723 -3399 -4653 -5128 -4795 -3887 -2256 -385 1531 3364 4489 5057
6029 5057 4969 4022 2485 673 -1269 -3028 -4356 -5057 -4942 -4131 -2720 -867 1084 2791 4183 4937 4939
6046 4939 4275 2924 1059 -847 -2712 -4158 -4871 -5015 -4311 -2980 -1232 775 2593 3972 4901 4992 4359
6063 4359 3119 1344 -595 -2399 -3911 -4772 -4945 -4496 -3258 -1526 321 2230 3739 4681 5006 4518
6079 4518 3442 1834 -42 -1977 -3501 -4563 -4954 -4568 -3580 -1947 -91 1807 3383 4557 4944 4648
6095 4648 3621 2064 200 -1672 -3339 -4435 -4910 -4683 -3723 -2224 -353 1502 3111 4339 4900 4697
6111 4697 3880 2424 628 -1207 -2955 -4205 -4820 -4808 -3958 -2600 -885 992 2712 4057 4775 4773 4081
6128 4081 2739 989 -836 -2601 -3938 -4779 -4745 -4045 -2814 -1109 757 2523 3922 4663 4765 4153 2909
6145 2909 1255 -586 -2324 -3735 -4623 -4786 -4244 -3124 -1519 303 2098 3543 4508 4738 4357 3296
6161 3296 1739 -74 -1881 -3393 -4376 -4728 -4403 -3342 -1839 -1 1768 3269 4364 4750 4451 3438
6177 3438 1970 177 -1644 -3166 -4255 -4687 -4429 -3544 -2086 -357 1480 3022 4185 4681 4534 3692
$$ [...]
16383B97
##END NTUPLES=NMR FID
##END=
