##TITLE=C13cpd
##JCAMPDX= 6.0         $$ Bruker NMR JCAMP-DX V2.0
##DATA TYPE= NMR SPECTRUM
##DATA CLASS= NTUPLES
##ORIGIN= UXNMR, Bruker Analytische Messtechnik GmbH
##OWNER= root
$$ XWIN-NMR		Version 3.5
$$ Sat Jun 21 17:35:23 2025 Russian Standard Time (UT+4h)  servis@DPX200
##.OBSERVE FREQUENCY= 50.3277607988526
##.OBSERVE NUCLEUS= ^13C
##.ACQUISITION MODE= SIMULTANEOUS
##.ACQUISITION SCHEME= undefined
##.AVERAGES= 23780
##.DIGITISER RES= 17
##SPECTROMETER/DATA SYSTEM= spect
##.PULSE SEQUENCE= zgpg30
##.SOLVENT NAME= DMSO
##.SHIFT REFERENCE= (INTERNAL, DMSO, 0, 219.126)
##AUDIT TRAIL= $$ (NUMBER, WHEN, WHO, WHERE, WHAT)
$$ ##TITLE= Audit trail, XWIN-NMR		Version 3.5
$$ ##JCAMPDX= 5.01
$$ ##ORIGIN= Bruker BioSpin GmbH
$$ ##OWNER= servis
$$ F:\spectra/data/av/nmr/C13cpd/1/pdata/1/auditp.txt
$$ ##AUDIT TRAIL=  $$ (NUMBER, WHEN, WHO, WHERE, WHAT)
(   1,<2025-06-21 17:30:49.17 +0400>,<servis>,<DPX200>,
      <created by zg, POWCHK disabled, PULCHK disabled
       terminated by command 'halt'
       configuration hash MD5:
       00 E9 B6 7A A2 85 ED C7 34 08 36 98 17 FE 4E 26
       data hash MD5: 32K
       C0 84 C4 B5 05 D2 E4 C0 C0 15 15 9A 9C 0C D7 80>)
(   2,<2025-06-21 17:33:59.87 +0400>,<servis>,<DPX200>,
      <Start of raw data processing
       efp BC_mod = 2 LB = 2 FT_mod = 6 PKNL = 1 PHC0 = -404.3621 PHC1 = 31.66493 SI = 32K 
       data hash MD5: 32K
       89 FA C1 03 3B 17 6A AB 0F B7 36 D0 62 05 36 EC>)
(   3,<2025-06-21 17:34:35.15 +0400>,<servis>,<DPX200>,
      <abs ABSG = 5 
       data hash MD5: 32K
       24 A4 71 A5 FA 36 24 CA 03 35 91 62 4F 04 5A AC>)
$$ ##END=
$$ 
$$ hash MD5
$$ 13 F8 42 6D 5F 1A 1D A1 CA BD 27 FF 8F 2C 53 01
##$RELAX= 
##$RELAX= 
##$RELAX= 
##$RELAX= 
##$RELAX= 
##$RELAX= 
##$RELAX= 
##$RELAX= 
$$ Bruker specific parameters
$$ --------------------------
##$DU= <F:\spectra>
##$EXPNO= 1
##$NAME= <C13cpd>
##$PROCNO= 1
##$TYPE= <nmr>
##$USER= <av>
##$AMP= (0..31)
100 100 100 100 100 100 100 100 100 100 100 100 100 100 100 100 100 100 
100 100 100 100 100 100 100 100 100 100 100 100 100 100 
##$AQSEQ= 0
##$AQ_mod= 1
##$AUNM= <au_zg>
##$AUTOPOS= <>
##$BF1= 50.322729
##$BF2= 200.13
##$BF3= 50.322729
##$BF4= 50.322729
##$BF5= 500.13
##$BF6= 500.13
##$BF7= 500.13
##$BF8= 500.13
##$BYTORDA= 1
##$CFDGTYP= 0
##$CFRGTYP= 5
##$CHEMSTR= <none>
##$CNST= (0..31)
1 1 145 1 1 1 1 1 1 1 1 1 1 1 1 1 1 1 1 1 1 1 1 1 1 1 1 1 1 1 1 1 
##$CPDPRG= <waltz16>
##$CPDPRG1= <>
##$CPDPRG2= <waltz16>
##$CPDPRG3= <>
##$CPDPRG4= <mlev>
##$CPDPRG5= <mlev>
##$CPDPRG6= <mlev>
##$CPDPRG7= <mlev>
##$CPDPRG8= <mlev>
##$CPDPRGB= <>
##$CPDPRGT= <>
##$D= (0..31)
0 2 0.00345 0 0 0 0 0 0 0.06 0 0.03 2e-05 3e-06 0 0 0.0002 0 0 0 0 0 0 
0 0 0 0 0 0 0 0 0 
##$DATE= 1750512648
##$DBL= (0..7)
120 120 120 120 120 120 120 120 
##$DBP= (0..7)
150 150 150 150 150 150 150 150 
##$DBP07= 0
##$DBPNAM0= <>
##$DBPNAM1= <>
##$DBPNAM2= <>
##$DBPNAM3= <>
##$DBPNAM4= <>
##$DBPNAM5= <>
##$DBPNAM6= <>
##$DBPNAM7= <>
##$DBPOAL= (0..7)
0.5 0.5 0.5 0.5 0.5 0.5 0.5 0.5 
$$ [...]
##$SUBNAM3= <"">
##$SUBNAM4= <"">
##$SUBNAM5= <"">
##$SUBNAM6= <"">
##$SUBNAM7= <"">
##$SUBNAM8= <"">
##$SUBNAM9= <"">
##$SW= 238.246396889851
##$SWIBOX= (0..15)
0 1 3 0 0 0 0 0 0 0 0 0 0 0 0 0 
##$SW_h= 11990.4076738609
##$TD= 32768
##$TD0= 1
##$TE= 0
##$TE2= 300
##$TE3= 300
##$TEG= 300
##$TL= (0..7)
0 120 120 120 120 120 120 120 
##$TP= (0..7)
150 150 150 150 150 150 150 150 
##$TP07= 0
##$TPNAME0= <>
##$TPNAME1= <>
##$TPNAME2= <>
##$TPNAME3= <>
##$TPNAME4= <>
##$TPNAME5= <>
##$TPNAME6= <>
##$TPNAME7= <>
##$TPOAL= (0..7)
0.5 0.5 0.5 0.5 0.5 0.5 0.5 0.5 
##$TPOFFS= (0..7)
0 0 0 0 0 0 0 0 
##$TUNHIN= 0
##$TUNHOUT= 0
##$TUNXOUT= 0
##$USERA1= <user>
##$USERA2= <user>
##$USERA3= <user>
##$USERA4= <user>
##$USERA5= <user>
##$V9= 5
##$VALIST= <valist>
##$VCLIST= <CCCCCCCCCCCCCCC>
##$VD= 0
##$VDLIST= <DDDDDDDDDDDDDDD>
##$VPLIST= <PPPPPPPPPPPPPPP>
##$VTLIST= <TTTTTTTTTTTTTTT>
##$WBST= 1024
##$WBSW= 20
##$XGAIN= (0..3)
0 0 0 0 
##$XL= 0
##$YL= 0
##$YMAX_a= 10255383
##$YMIN_a= -19247186
##$ZGOPTNS= <>
##$ZL1= 120
##$ZL2= 120
##$ZL3= 120
##$ZL4= 120
##$ABSF1= 219.1257
##$ABSF2= -19.14452
##$ABSG= 5
##$ABSL= 3
##$ALPHA= 0
##$AQORDER= 0
##$ASSFAC= 0
##$ASSFACI= 0
##$ASSFACX= 0
##$ASSWID= 0
##$AUNMP= <proc_1d>
##$AZFE= 0.1
##$AZFW= 0.5
##$BCFW= 0
##$BC_mod= 2
##$BYTORDP= 0
##$COROFFS= 0
##$CY= 12.5
##$DATMOD= 1
##$DC= 0
##$DFILT= <>
##$DTYPP= 0
##$F1P= 99.9999945759776
##$F2P= -179.999992907048
##$FCOR= 0.5
##$FTSIZE= 32768
##$FT_mod= 6
##$GAMMA= 0
##$GB= 0
##$INTBC= 1
##$INTSCL= 0
##$ISEN= 30
##$LB= 2
##$LEV0= 0
##$LPBIN= 0
##$MAXI= 10000
##$MC2= 0
##$MEAN= 0
##$ME_mod= 0
##$MI= 0
##$NCOEF= 0
##$NC_proc= -4
##$NLEV= 6
##$NOISF1= 0
##$NOISF2= 0
##$NSP= 0
##$NTH_PI= 0
##$NZP= 0
##$OFFSET= 219.1257
##$PC= 1.4
##$PHC0= -404.3621
##$PHC1= 31.66493
##$PH_mod= 1
##$PKNL= yes
##$PPARMOD= 0
##$PSCAL= 4
##$PSIGN= 0
##$REVERSE= no
##$SF= 50.322729
##$SI= 32768
##$SIGF1= 0
##$SIGF2= 0
##$SINO= 80
##$SIOLD= 32768
##$SREGLST= <13C.CDCl3>
##$SSB= 0
##$STSI= 32768
##$STSR= 0
##$SW_p= 11990.4076738609
##$SYMM= 0
##$S_DEV= 0
##$TDeff= 32768
##$TDoff= 0
##$TI= <>
##$TILT= no
##$TM1= 0
##$TM2= 0
##$TOPLEV= 0
##$USERP1= <user>
##$USERP2= <user>
##$USERP3= <user>
##$USERP4= <user>
##$USERP5= <user>
##$WDW= 1
##$XDIM= 32768
##$YMAX_p= 212198226
##$YMIN_p= -2306298
$$ End of Bruker specific parameters
$$ ---------------------------------
##NTUPLES= NMR SPECTRUM
##VAR_NAME=  FREQUENCY,     SPECTRUM/REAL,   SPECTRUM/IMAG
##SYMBOL=    X,             R,               I
##VAR_TYPE=  INDEPENDENT,   DEPENDENT,       DEPENDENT
##VAR_FORM=  AFFN,          ASDF,            ASDF
##VAR_DIM=   32768,         32768,           32768
##UNITS=     HZ,            ARBITRARY UNITS, ARBITRARY UNITS
##FACTOR=    0.365929370215793, 1,           1
##FIRST=     11027.0033138647, 0,            0
##LAST=      -963.404359996184, 0,           0
##MIN=       -963.404359996184, -2306298,    0
##MAX=       11027.0033138647, 212198226,    0
$$ Real data points
##PAGE= N=1
##DATA TABLE= (X++(R..R)), XYDATA
$$ [...]
##PAGE= N=2
##DATA TABLE= (X++(I..I)), XYDATA
18234b30771292j31779j15795p648J12308K24335K77503K17759Q5542p2474j63543
18224b30345084j51753r7406q3762r3932o6935m4036m9035n6773p4524q0776n7646
18213b31201662m0244k6960j2336k2900j0185Q8392J71825J36041P3148Q0001
18203b30764880J05264J03652J13739J91552K65716K25812J18659N7958M0725
18194b29541803N4403R4203M7683p3501j68898j91763j53050p7480J4834O0432
18184b29934940R4986K02292K71838K38249J60291J02559J7684j58754k90953
18175b29296748k82453j93837j04161m1707l9911j19652j40259l9027M1828O1333
18165b30154594O0650J12497J91965K00069J52520J39405J02698k7690j44377
$$ y = [-230771292, -230903071, -231018866, -231026514, -230914206, -230689871, -230412368, -230194609, -230109067, -230181541, -230345084, -230496837, -230594243, -230678005, -230771937, -230838872, -230882908, -230931943, -230988716, -231063240, -231144016, -231201662, -231241906, -231268866, -231281202, -231304102, -231314287, -231225895, -231054070, -230918029, -230844881, -230764880, -230659616, -230555964, -230442225, -230250673, -229984957, -229759145, -229640486, -229582528, -229541803, -229487400, -229393197, -229345514, -229419015, -229587913, -229779676, -229932726, -230010206, -229995372, -229934940, -229839954, -229637662, -229365824, -229127575, -228967284, -228864725, -228847041, -229005795, -229296748, -229579201, -229773038, -229877199, -229918906, -229958817, -230078469, -230218728, -230257755, -230215927, -230154594, -230093944, -229981447, -229789482, -229589413, -229436893, -229297488, -229194790, -229222480, -229366857]
18156b29366857j42153l9377L5369N1607M2792l3090j06031q5824m5469j08921
18146b29797954k14840k20147j22619m5150l6312j3072M8162P3485J05038J48054
18136b30075355J27912O4559k3599j10986j76964k02872j60407l4092J32134K29366
18126b30230304K17054J36226O3344L6425J5473m391L18N1729J11644J92864K52571
18115b29157047J88415N0510n1581n0478k686M1924J13580J25396O2897k4792
18105b28703862j09016j64799j54941o5907N639j6248j03865j54270r9563M0553
18095b29526279J40534J23917P2413N3115J5194j2013K5395P6818O2067Q909j4643
18084b28974573K574L4712N0401J4602n5879n0577K6005J06217J19914O7535J9926
$$ y = [-229366857, -229509010, -229548387, -229513018, -229461411, -229418619, -229451709, -229557740, -229643564, -229689033, -229797954, -230012794, -230232941, -230355560, -230400710, -230437022, -230450094, -230401932, -230328447, -230223409, -230075355, -229947443, -229882884, -229906483, -230017469, -230194433, -230397305, -230557712, -230591804, -230459670, -230230304, -230013250, -229877024, -229813680, -229777255, -229761782, -229766173, -229765855, -229714126, -229602482, -229409618, -229157047, -228968632, -228918122, -228969703, -229020181, -229022867, -228980943, -228867363, -228741967, -228679070, -228703862, -228812878, -228977677, -229132618, -229198525, -229192886, -229209134, -229312999, -229467269, -229566832, -229526279, -229385745, -229261828, -229189415, -229136300, -229121106, -229133119, -229107724, -229030906, -228968839, -228959930, -228974573, -228971999, -228937287, -228886886, -228872284, -228928163, -228978740, -228952735, -228846518, -228726604, -228659069, -228639143]
18073b28639143J7594J9283K193n3443j22350j29715j24927j16469q8834p9229
18063b29315040p5163l5659K9913P1098Q8755J48759J85425J46173O5251m865
18053b28695353J4455M0080K3586L2988L3266Q354n095m5283j30461j47706j01029
18042b28972198p8280p5664m142J50663K74941K86821J60125J2911l3046j8771
18032b28296640j7056l0941p4165j32360j57002j28584m2206P1507J39433O7640
18022b28600374j01536j80554j00595J2972P7600J13775J24402N3183o2707r3367
18012b28757201o9953r3801j21291q0124k5777J7365O7353J02865J25087J57802
18002b28677675J76777J06770O3869J40727J89949R4454o7239j70846j95870j93927
$$ y = [-228639143, -228621549, -228602266, -228600073, -228653516, -228775866, -228905581, -229030508, -229146977, -229235811, -229315040, -229390203, -229425862, -229395949, -229324851, -229236096, -229087337, -228901912, -228755739, -228690488, -228695353, -228680898, -228640818, -228617232, -228584244, -228550978, -228542624, -228547719, -228593002, -228723463, -228871169, -228972198, -229050478, -229126142, -229130284, -228979621, -228704680, -228417859, -228257734, -228244823, -228277869, -228296640, -228313696, -228344637, -228418802, -228551162, -228708164, -228836748, -228878954, -228807447, -228668014, -228600374, -228701910, -228882464, -228983059, -228970087, -228892487, -228778712, -228654310, -228601127, -228663834, -228757201, -228827154, -228920955, -229042246, -229122370, -229148147, -229130782, -229063429, -228960564, -228835477, -228677675, -228500898, -228394128, -228330259, -228189532, -227999583, -227905129, -227972368, -228143214, -228339084, -228533011]
17992b28533011j63673o0330N5015R8407J01850J32709J32586N5500k5589r6987
17982b28303523j69481k18476k51232k26612j14345K1318J36336K00217J89901
17973b28735897J33616M7102n580M9994J29046J12155K4461n6067j12877j01816
17963b28515863j4232P0052Q5690P6798N1038k9940j08751j23440p3492k2388
17953b28604528l2602q6554j30342j75913k10779j37201L9021K02321K58923J74032
17943b28703622N9199j1490p0863j30575j70421j51943m5992J47740L04353L13059
17933b28460555J93648O5286J4951N0481N1361n585m513O5915J62308K04064J39891
17922b27522748K3590k5776r02m3361j21375j34055r6951p7153q2200q4778j32468
$$ y = [-228533011, -228696684, -228757014, -228701999, -228603592, -228501742, -228369033, -228236447, -228180947, -228206536, -228303523, -228473004, -228691480, -228942712, -229169324, -229283669, -229262351, -229126015, -228925798, -228735897, -228602281, -228555179, -228560759, -228510765, -228381719, -228269564, -228245103, -228301170, -228414047, -228515863, -228530095, -228460043, -228374353, -228297555, -228246517, -228276457, -228385208, -228508648, -228582140, -228604528, -228637130, -228723684, -228854026, -229029939, -229240718, -229377919, -229338898, -229136577, -228877654, -228703622, -228644423, -228655913, -228726776, -228857351, -229027772, -229179715, -229225707, -229077967, -228773614, -228460555, -228266907, -228201621, -228186670, -228136189, -228084828, -228090413, -228094926, -228029011, -227866703, -227662639, -227522748, -227499158, -227524934, -227525836, -227569197, -227690572, -227824627, -227921578, -227998731, -228080931, -228165709, -228298177]
17911b28298177j69686j11378l5007Q153Q7909J47294J08293N2213P1908J04979
17901b28033499N4235k6986n82J17857K06315K54591K47268J24515k905l2116
17891b27091307k1748l8035o7199r2834j32389j66855j07018K6657R5459J11923
17881b27483346J20612R3416K9153m8386j16100j47438j19937j14851r6656m8990
17871b27932523n9070r9975j00757o7787o0460n8721j1902O6195J03827O6274
17861b28154899o606k195J15198K37325K53458J60328M0802j6799J1417M7983
17851b27313988j17q2565n8796O4128J96641K70041J58535m0961j38293j46142
17841b27091517j21996r0598p6821j18137k41483l27969k49796r7722j1032r24
$$ y = [-228298177, -228467863, -228579241, -228614248, -228606095, -228518186, -228370892, -228262599, -228210386, -228138478, -228033499, -227979264, -228006250, -228006832, -227888975, -227682660, -227428069, -227180801, -227056286, -227059191, -227091307, -227113055, -227151090, -227218289, -227311123, -227443512, -227610367, -227717385, -227690728, -227595269, -227483346, -227362734, -227269318, -227240165, -227288551, -227404651, -227552089, -227672026, -227786877, -227883533, -227932523, -227991593, -228091568, -228192325, -228260112, -228320572, -228379293, -228391195, -228325000, -228221173, -228154899, -228161505, -228163700, -228048502, -227811177, -227557719, -227397391, -227356589, -227373388, -227361971, -227313988, -227314105, -227396670, -227455466, -227391338, -227194697, -226924656, -226766121, -226807082, -226945375, -227091517, -227213513, -227304111, -227380932, -227499069, -227740552, -228068521, -228318317, -228416039, -228427071, -228427995]
17831b28427995J1736O6551J12422J25064J09083Q1018Q4250J15872J34866J70656
17821b27416477K20269K35927J78569M9548o7186q6815k8055J5159k8131j30884
17811b27058076j99737j83309q1817K1817L7028k121j7828k6466Q985J06383J65889
17800b27229252J44334K9864j45273k51244j68204K7904J89209K04366J52347
17791b27045949J32605P1754p5105k17380k32512j37596j4796M1332J5656l6314
17781b27498305r5156j22434q3950Q857J38199K56643K55092J40958Q4254J48946
17771b26766896J69945L6036j49036k59441k06051n5540O0564J01811R4383L3333
17761b26940892q7935j99574k26676k35235k65992j77805J4442P7446L891o1838
$$ y = [-228427995, -228416259, -228349708, -228237286, -228112222, -228003139, -227922121, -227837871, -227721999, -227587133, -227416477, -227196208, -226960281, -226781712, -226732164, -226799350, -226886165, -226914220, -226899061, -226927192, -227058076, -227257813, -227441122, -227522939, -227501122, -227464094, -227466215, -227484043, -227510509, -227501524, -227395141, -227229252, -227084918, -227055054, -227200327, -227451571, -227619775, -227591871, -227402662, -227198296, -227045949, -226913344, -226841590, -226916695, -227134075, -227366587, -227504183, -227518979, -227477647, -227461991, -227498305, -227593461, -227715895, -227799845, -227790988, -227652789, -227396146, -227141054, -227000096, -226915842, -226766896, -226596951, -226560915, -226709951, -226969392, -227175443, -227230983, -227170419, -227068608, -226974225, -226940892, -227028827, -227228401, -227455077, -227690312, -227956304, -228134109, -228119667, -228042221, -228038330, -228100168]
17751b28100168p9766q6286m6559N5870J53529K48148K99463K18874Q1006J7797
17741b27238092l9220j65807k73064k54777q0527J58670K82696J80042J1019r5428
17731b27514488j29927j20798r6287j03933j72134k02045j26967M8J04607J64755
17721b28197169K10690K67210L01581K88230K37937J40016L9539J237K2454L8901
17711b26649374M5506N3406q607j29970j53577j9675J43323K04848J32618K0630
17701b26360872j8788m328J5040J2587k3546p7810j23668j58400j87853j69779
17691b27097417q4744M341M8370N0494J9165l9070n6169K6494J42361J92489J76181
17680b26617505J74627J86047J20421l0471j69748j92283r8603j678J3202o0884
$$ y = [-228100168, -228179934, -228266220, -228312779, -228256909, -228103380, -227855232, -227555769, -227336895, -227255889, -227238092, -227277312, -227443119, -227716183, -227970960, -228051487, -227892817, -227610121, -227430079, -227419060, -227514488, -227644415, -227765213, -227861500, -227965433, -228137567, -228339612, -228466579, -228466531, -228361924, -228197169, -227986479, -227719269, -227417688, -227129458, -226891521, -226751505, -226711966, -226710729, -226688275, -226649374, -226603868, -226550462, -226559069, -226689039, -226842616, -226862291, -226718968, -226514120, -226381502, -226360872, -226379660, -226383988, -226368948, -226356361, -226379907, -226457717, -226581385, -226739785, -226927638, -227097417, -227182161, -227177820, -227129450, -227078956, -227059791, -227098861, -227155030, -227128536, -226986175, -226793686, -226617505, -226442878, -226256831, -226136410, -226166881, -226336629, -226528912, -226627515, -226629193, -226615991, -226676875]
17670b26676875j30144j10073l5009l7801q5186o7945l76N1810N9920Q707n1997
17659b27074969o4070j5113L4438n420n2401j1177N5841J07737J55368J26247
17649b26743519K8476k5435L895L6994K7993Q4954J81990J54253j0894j20106
17639b26381399q4013m4965k5043Q061J8613M2159J02638J08029L409j45216k39070
17628b26636797k41404j88645p7326J1530J7397k9761j15177j62609j24444m4914
17618b27592150K56n8697j13744q749J39836J83390J71695J41634O5507j6591
17608b27087613j1164Q9670J58397J38851N9904m7772j06984j15080j02098k6595
17598b27050484R1260J25587N3111n5392j33780q5529Q9686K15451J87531Q5831
$$ y = [-226676875, -226807019, -226917092, -226952101, -226989902, -227075088, -227143033, -227143409, -227091599, -227031679, -227022972, -227074969, -227139039, -227154152, -227119714, -227125134, -227177535, -227188712, -227132871, -227025134, -226869766, -226743519, -226715043, -226740478, -226736583, -226699589, -226671596, -226586642, -226404652, -226250399, -226261293, -226381399, -226465412, -226510377, -226535420, -226527359, -226508746, -226466587, -226363949, -226255920, -226252511, -226397727, -226636797, -226878201, -227066846, -227144172, -227132642, -227115245, -227145006, -227260183, -227422792, -227547236, -227592150, -227591894, -227650591, -227764335, -227773084, -227633248, -227449858, -227278163, -227136529, -227071022, -227087613, -227098777, -227009107, -226850710, -226711859, -226651955, -226699727, -226806711, -226921791, -227023889, -227050484, -226959224, -226833637, -226780526, -226835918, -226969698, -227055227, -226965541, -226750090, -226562559, -226476728]
17588b26476728K1006J1225K2603J1954m9813j23706j33484q3037l2942k0565
17578b26853487n1378o7181n1801j6939j6351l4045J194M2701K259j01340j86274
17567b27332642j68629o2051N0228J19701J35689J05121L8432n4538q1672p268
17557b27257629L1273O470m2842o3118l6455j538k0745n8256j6304Q0817J62820
17546b27215507K06500K04251R6539m2767q0049p9109j05957p4069L1477J47312
17536b26911379J88723J37723M1285k2173j3479l8328j00409j02105m2318j4657
17526b26877117o8434p8567K555M9873P2430J16030J34545O5152j6882M4352J88765
17515b26367298K28081J77588J20279M8845j9260m2757J050L5390Q482j7939j4797
$$ y = [-226476728, -226455722, -226444497, -226421894, -226409940, -226459753, -226583459, -226716943, -226799980, -226832922, -226853487, -226904865, -226972046, -227023847, -227040786, -227057137, -227091182, -227089988, -227047287, -227045028, -227146368, -227332642, -227501271, -227563322, -227513094, -227393393, -227257704, -227152583, -227114151, -227168689, -227250361, -227257629, -227226356, -227219886, -227262728, -227325846, -227362301, -227363839, -227384584, -227442840, -227459144, -227378327, -227215507, -227009007, -226804756, -226708217, -226750984, -226831033, -226910142, -227016099, -227090168, -227058691, -226911379, -226722656, -226584933, -226543648, -226565821, -226579300, -226617628, -226718037, -226820142, -226862460, -226877117, -226945551, -227024118, -227021563, -226971690, -226899260, -226783230, -226648685, -226583533, -226600415, -226556063, -226367298, -226139217, -225961629, -225841350, -225792505, -225811765, -225854522, -225853472, -225818082, -225809600, -225827539, -225842336]
17504b25842336j0294m441k3351p0866m6332O1483J27819J21305R8946N7257m3334
17493b25574144j62059k14145k00117j61681n3787P8035J12368O1210m1711j16099
17483b26272130j16426l6483P7681J35728J03045J9504m3970j2648R2846J76129
17473b25876724J48566M8336m5056q1474l0659M6042K8114n6257q4878l9750L8011
17462b25905729J12770J00915O794q1758j00372l0497O6010J23747J15259N9420
17452b25533441m5271j75619k33336k09751j89542j73587q3178K4897M9784M5614
17442b26523430P9656R8402K8809r7956j62109j16816n7086o392Q4609J63716
17432b26508597J47596J23336J83102K26027J53268n988j11648o1368P0420J63375
$$ y = [-225842336, -225852630, -225857071, -225880422, -225951288, -225997620, -225936137, -225808318, -225687013, -225588067, -225530810, -225574144, -225736203, -225950348, -226150465, -226312146, -226365933, -226287898, -226175530, -226114320, -226156031, -226272130, -226388556, -226425039, -226347358, -226211630, -226108585, -226089081, -226133051, -226145699, -226052853, -225876724, -225728158, -225679822, -225724878, -225806352, -225837011, -225790969, -225762855, -225819112, -225903990, -225943740, -225905729, -225792959, -225692044, -225685250, -225767008, -225867380, -225897877, -225831867, -225708120, -225592861, -225533441, -225578712, -225754331, -225987667, -226197418, -226386960, -226560547, -226643725, -226618828, -226569044, -226523430, -226443774, -226345372, -226316563, -226414519, -226576628, -226693444, -226750530, -226756922, -226672313, -226508597, -226361001, -226237665, -226054563, -225828536, -225675268, -225681256, -225792904, -225854272, -225783852, -225620477]
17422b25620477J93429J81571J17776K6521o3604j29253j58911j24256n7069P502
17412b25626771J1369m9002j04116j52152j78560j11622M8673J64445J44426R5317
17402b25757993P5266J6014m2556r984N9574N6333J2409n5419j16385j09462l9429
17391b25911632J4787j685n0351r4845r6943k5054M1486K5895l7240p1880k4050
17380b26231512M4494Q2742J67258L37095M69577M26295K49400O12k34304l26542
17370b25014885l08621k75914j90348r956J95888L09464K47213N9839j54947l36060
17360b25478327l78590k06505K3392O0849q2434k25457k45005j52063o2679j5428
17350b26762247Q581N3354J28440K17403K61140K01616Q8944l802m7242j11277
$$ y = [-225620477, -225427048, -225245477, -225127701, -225101180, -225164784, -225294037, -225452948, -225577204, -225634273, -225626771, -225615402, -225664404, -225768520, -225920672, -226099232, -226210854, -226162181, -225997736, -225853310, -225757993, -225682727, -225666713, -225709269, -225719253, -225659679, -225603346, -225590937, -225646356, -225762741, -225872203, -225911632, -225896845, -225898530, -225948881, -226043726, -226140669, -226165723, -226124237, -226098342, -226135582, -226207462, -226231512, -226187018, -226104276, -225937018, -225599923, -225130346, -224704051, -224454651, -224454039, -224688343, -225014885, -225323506, -225599420, -225789768, -225799724, -225603836, -225294372, -225047159, -224987320, -225142267, -225478327, -225856917, -226063422, -226040030, -225979181, -226061615, -226287072, -226532077, -226684140, -226746819, -226762247, -226753666, -226700312, -226571872, -226354469, -226093329, -225891713, -225802769, -225806571, -225853813, -225965090]
17340b25965090k16925k62004k02571r1239k2749R630M0457Q0346J31873J66243
17330b26332029J26061L7629n5512j29038j09762k0465M8472K0666m3642n3969
17320b26511589O130J24660J58086M8085r1729j15979k062J46273K17066J52091
17310b25868968K6921l3997n1348o1148m4488l8416n3476o8157j3798Q7184J23696
17299b25995995J29778J10932N9674K6578k2114j07402j29718J3406K14933K31837
17289b25468091P8433k7634l337M3424M1544L1691L9291K7501l8049j56208k61211
17278b25692646k14622l3906Q6507Q2497R7957K05434J90499M804j78321k31473
17268b25683270j65102p6708r243J5847o649M073O2628R5317J30966K04039K09211
$$ y = [-225965090, -226182015, -226444019, -226646590, -226737829, -226760578, -226750948, -226710491, -226630145, -226498272, -226332029, -226205968, -226168339, -226223851, -226352889, -226462651, -226483116, -226434644, -226413978, -226457620, -226511589, -226505459, -226380799, -226222713, -226174628, -226266357, -226382336, -226384398, -226238125, -226021059, -225868968, -225842047, -225876044, -225927392, -225988540, -226033028, -226071444, -226124920, -226193077, -226206875, -226119691, -225995995, -225866217, -225755285, -225695611, -225669033, -225691147, -225798549, -225928267, -225914861, -225699928, -225468091, -225389658, -225417292, -225420629, -225377205, -225335661, -225303970, -225264679, -225237178, -225275227, -225431435, -225692646, -225907268, -225941174, -225854667, -225772170, -225674213, -225468779, -225278280, -225273476, -225451797, -225683270, -225848372, -225925080, -225934323, -225918476, -225925125, -225921052, -225858424, -225763107, -225632141, -225428102, -225218891]
17257b25218891O6310o5284m6225M0027O2566M101p8823j51790j86807j88645
17247b25763461j71788j11768L880J34822K55326L24342K67831J44837O2137K2362
17237b24831480k2174p3889j08585j09465j06439j32746j49341j36154j41008
17228b25811281j54679j55994j38614p2157K3018N6471L7959O4836J09866J03227
17218b25937348Q4073J16148J54048J66087J50664R4433N1629J1160j3250M7142
17208b25075214J32966J80805J85933J40382M6231n4790q2208l6020J4831K3952
17198b24523132J546m352K3870L9093K3648k8987r2351o0673K2756M4297r124
17187b24563409m0284k0610r083j4847J8913O1074N4508K3176n410q045K2056
$$ y = [-225218891, -225152581, -225217865, -225264090, -225224063, -225161497, -225157396, -225236219, -225388009, -225574816, -225763461, -225935249, -226047017, -226043137, -225908315, -225652989, -225328647, -225060816, -224915979, -224853842, -224831480, -224853654, -224927543, -225036128, -225145593, -225252032, -225384778, -225534119, -225670273, -225811281, -225965960, -226121954, -226260568, -226332725, -226309707, -226253236, -226215277, -226150441, -226040575, -225937348, -225853275, -225737127, -225583079, -225416992, -225266328, -225171895, -225120266, -225109106, -225122356, -225075214, -224942248, -224761443, -224575510, -224435128, -224388897, -224443687, -224525895, -224561915, -224547084, -224523132, -224521586, -224525938, -224502068, -224462975, -224439327, -224468314, -224560665, -224621338, -224598582, -224554285, -224563409, -224603693, -224624303, -224633386, -224648233, -224629320, -224568246, -224513738, -224490562, -224495972, -224504017, -224481961]
17176b24481961M6482L401n5381n0305n544j2751q4689j38366j19114o5552l3423
17165b24997203l8901p3983j25342j12906k6871M7182R6938J80150K72284L14472
17155b24464180K61583R3226j08487k27477k38786j69783q1377j2047L0329O2817
17145b24854182N4274L1069N3741Q9898R1793Q4322O6524J9660P246R313j6116
17134b24362458m5701j732J06799J58206J07501K6860O719L0061P982j16308k35772
17123b24317843k68577k32460j47031k3714J10916K32614L14567K82644J30981
17114b23917903o7209k39932k94374k09691q1760j4169J4475P2141J35732J30870
17104b24471820r941j83177j84533m5462P9800J23551Q5411M059q5220j42531
$$ y = [-224481961, -224435479, -224432078, -224487459, -224537764, -224543308, -224556059, -224640748, -224779114, -224898228, -224963780, -224997203, -225036104, -225110087, -225235429, -225348335, -225375206, -225328024, -225231086, -225050936, -224778652, -224464180, -224202597, -224109371, -224217858, -224445335, -224684121, -224853904, -224935281, -224947328, -224916999, -224854182, -224799908, -224768839, -224715098, -224625200, -224533407, -224449085, -224382561, -224362901, -224355655, -224346342, -224362458, -224408159, -224409891, -224303092, -224144886, -224037385, -224010525, -224003806, -223973745, -223965763, -224082071, -224317843, -224586420, -224818880, -224965911, -224989625, -224878709, -224646095, -224331528, -224048884, -223917903, -223985112, -224225044, -224519418, -224729109, -224810869, -224825038, -224810563, -224738422, -224602690, -224471820, -224481761, -224664938, -224849471, -224894933, -224815133, -224691582, -224606171, -224602112, -224687332, -224829863]
17094b24829863j04539J4565J23837J15215k7468j46831j53775j11348n1287J0066
17084b25161428K6778K251J4506R8863J76707J54517Q1744M1241L8617M1289j5012
17073b24499927r3470j31436j38507p3831N0535J43767J14806L2387o502o2560
17063b24664738j68465k40535j92016o0288L7572N5006N0137J06547J79693J62042
17053b24735045J07223O3591J388m4155k6864r917j839P6012J80581K13201J49895
17042b24025929O1405L6312p27r6548j49060j26120j11084j49263j86426j27171
17032b24874611j4026N9656J33466K02269K12779J49506j63j77575k60179k28312
17022b24797190j27618M6282J92518J80590P6641K1883P816j3153n0709p5959
$$ y = [-224829863, -224934402, -224919837, -224796000, -224680785, -224708253, -224855084, -225008859, -225120207, -225171494, -225161428, -225134650, -225132399, -225117893, -225019030, -224842323, -224687806, -224606062, -224564821, -224526204, -224484915, -224499927, -224593397, -224724833, -224863340, -224937171, -224886636, -224742869, -224628063, -224595676, -224602178, -224664738, -224833203, -225073738, -225265754, -225326042, -225288470, -225233464, -225183327, -225076780, -224897087, -224735045, -224627822, -224564231, -224562843, -224606998, -224633862, -224643779, -224645618, -224569606, -224389025, -224175824, -224025929, -223964524, -223928212, -223928939, -224025487, -224174547, -224300667, -224411751, -224561014, -224747440, -224874611, -224888637, -224828981, -224695515, -224493246, -224280467, -224130961, -224131124, -224308699, -224568878, -224797190, -224924808, -224878526, -224686008, -224505418, -224428777, -224406894, -224399078, -224412231, -224462940, -224538899]
17012b24538899o9194l5612M8669R8561N7794j0595l7828j8211k8755k3811j1574
17001b24569455p1493j50203j33675k7759M5537K4280l3976k4030P1006J51248
16991b24718520J86110K10145K02659J54981Q0509m6075k05225k81532k21432
16982b24638380j25640p1562j9413M9028O9426L4629j3616n4986k3677P3095J30509
16971b24590587J22270O2860P110p237j3001k2086j3165k148k5595m4593n6007
16960b24582179o9108j6527P2051J04027K8465j00822j55463j29602j36395j31974
16950b25117527n1997L7928R7624J55506J63153O6423l4112m2937j4551N384M4216
16939b24690890J08804J44050Q5894L3587R4889J74982J57433Q2150L8774r236
$$ y = [-224538899, -224608093, -224643705, -224595036, -224496475, -224438681, -224449276, -224487104, -224505315, -224534070, -224557881, -224569455, -224640948, -224791151, -224924826, -224952585, -224907048, -224882768, -224916744, -224940774, -224869768, -224718520, -224532410, -224322265, -224119606, -223964625, -223884116, -223930191, -224135416, -224416948, -224638380, -224764020, -224835582, -224854995, -224805967, -224736541, -224701912, -224715528, -224770514, -224794191, -224721096, -224590587, -224468317, -224405457, -224398347, -224405584, -224418585, -224440671, -224453836, -224455984, -224481579, -224526172, -224582179, -224651287, -224667814, -224595763, -224491736, -224463271, -224564093, -224719556, -224849158, -224985553, -225117527, -225169524, -225131596, -225033972, -224878466, -224715313, -224648890, -224683002, -224725939, -224740490, -224735106, -224690890, -224582086, -224438036, -224352142, -224318555, -224223666, -224048684, -223891251, -223809101, -223770327, -223779563]
16929b23779563o5409j16470j77897j95312j73343j77660k31969k75027k60217
16920b25452867k03187j08202M6464K51065L94542L82749K43916R1966N1714J23077
16910b24178763J20016j0904j32124j32653p5689j5815J4886J1162J8237J3981
16900b24367666k1873q2467j10491m1870K4352j9798o6284P450J65252K36380
16890b24277015J79140Q0383o155o4242q4425q4332j07426j57461j71835j04815
16880b24798183K6157J52590K02236J72825J19984M8986o2951j52367p5658P7894
16870b24288487J25205K2786j05993j36479r6242o677J89027L84714L72761J79733
16860b23359652K098r1918j02753j0790J18134J73657J47501J43761K28575K78562
$$ y = [-223779563, -223844972, -223961442, -224139339, -224334651, -224507994, -224685654, -224917623, -225192650, -225452867, -225656054, -225764256, -225717792, -225466727, -225072185, -224689436, -224445520, -224353554, -224301840, -224178763, -224058747, -224069651, -224201775, -224334428, -224410117, -224425932, -224411046, -224399884, -224381647, -224367666, -224389539, -224472006, -224582497, -224624367, -224600015, -224619813, -224686097, -224678647, -224513395, -224277015, -224097875, -224017492, -224023647, -224087889, -224172314, -224256646, -224364072, -224521533, -224693368, -224798183, -224772026, -224619436, -224417200, -224244375, -224124391, -224075405, -224138356, -224290723, -224366381, -224288487, -224163282, -224140496, -224246489, -224382968, -224479210, -224485887, -224296860, -223912146, -223539385, -223359652, -223357554, -223449472, -223552225, -223563015, -223444881, -223271224, -223123723, -222979962, -222751387, -222472825]
16850b22472825K28143J15647n3977k22901k84901j95811j15064j30761j23813
16841b23256263j5843R6303J02203J4273j00875j66548j88656j75201j08444n4928
16831b23853979q9154j67863j42194K119J09396J12962Q1913J11988J54868J43153
16821b23536791Q5846R796l9338m6141M994M8187K1474m2172q1057n1628L191
16810b23623639L3317L059p6353j51672j68516j21310j9973Q9200J29001L6894
16800b23869992q4942j06277n2853L5260J20830J95583K24203J71743Q4827L6526
16790b23245092l284o2141j04011q3004n7557p9232p6298J9629J04694J06117
16780b23480179M5727m0280j07527j33695j00525n0212m2563o6125m0980K8411
$$ y = [-222472825, -222244682, -222129035, -222183012, -222405913, -222690814, -222886625, -223001689, -223132450, -223256263, -223272106, -223175803, -223073600, -223059327, -223160202, -223326750, -223515406, -223690607, -223799051, -223853979, -223943133, -224110996, -224253190, -224251071, -224141675, -224028713, -223946800, -223834812, -223679944, -223536791, -223450945, -223441149, -223480487, -223526628, -223521634, -223473447, -223451973, -223494145, -223575202, -223626830, -223623639, -223590322, -223587263, -223663616, -223815288, -223983804, -224105114, -224125087, -224035887, -223906886, -223869992, -223954934, -224061211, -224114064, -224078804, -223957974, -223762391, -223538188, -223366445, -223281618, -223245092, -223248376, -223310517, -223414528, -223497532, -223555089, -223634321, -223710619, -223690990, -223586296, -223480179, -223434452, -223474732, -223582259, -223715954, -223816479, -223866691, -223909254, -223975379, -224016359, -223987948]
16770b23987948L5423k6579m2388R483L8326K8159N5789P3062K6281j7647k4214
16759b23832253k810K2058K9566M5394O4903P3715O4140Q898m1468n7775l3266
16748b23658898P0679J52676J25939L7469r1166k00813k10502j64479j48296j00732
16738b24188123Q3632K40808K12948J26136Q4805N7377k5560r7893k5382J54546
16728b23376706K28026J15081l0330n4172K4222O4961J1212m8835n0589l9162
16718b23156292k216Q1017J35607Q9570L4376P7220J95656L01524K80868J60287
16708b21802383M6875n6464j41917j81183j88702j71127j35326j16313j20906
16699b22867446q4610k6733j7443k5291j6576m4597j57071k95876l30649k04129
$$ y = [-223987948, -223952525, -223979104, -224021492, -224012009, -223973683, -223945524, -223889735, -223816673, -223790392, -223808039, -223832253, -223835063, -223813005, -223783439, -223738045, -223673142, -223599427, -223535287, -223526389, -223567857, -223625632, -223658898, -223588219, -223435543, -223309604, -223272135, -223363301, -223564114, -223774616, -223939095, -224087391, -224188123, -224104491, -223863683, -223650735, -223524599, -223439794, -223382417, -223407977, -223505870, -223531252, -223376706, -223148680, -223033599, -223063929, -223118101, -223093879, -223028918, -223017706, -223066541, -223117130, -223156292, -223158508, -223077491, -222941884, -222852314, -222817938, -222740718, -222545062, -222243538, -221962670, -221802383, -221755508, -221811972, -221953889, -222135072, -222323774, -222494901, -222630227, -222746540, -222867446, -222952056, -222978789, -222996232, -223021523, -223038099, -223082696, -223239767, -223535643, -223866292, -224070421]
16689b24070421J0175K04515K84235K27258J06746k0708j11653j23678q6574k9822
16679b23609927Q876K4261L7049J0254O773J01108J97893J78774R8584P2939O6342
16668b22807074L5147k0520j06348j48656j08572j081J26832J86830J17340n4726
16658b22780828j81585j59018j03322j07870j06002q4657o3773j3830M0889Q7589
16648b23472407J52718K36408K68361K20683J55234J10698R9741P6307m7703j98248
16638b22398208j95026o2755J24112K65459K27839P6941l5239q3169j16404j40867
16628b22337317j31276j12514o7636j6484m6154j67943k89910l46775k98445q1872
16618b23896326J62197K08976R6235K5421N4765J39484K11972J59153J4419o0893
$$ y = [-224070421, -224060246, -223855731, -223571496, -223344238, -223237492, -223258200, -223369853, -223493531, -223580105, -223609927, -223601051, -223576790, -223539741, -223529487, -223522714, -223421606, -223223713, -223044939, -222946355, -222873416, -222807074, -222771927, -222792447, -222898795, -223047451, -223156023, -223157104, -223030272, -222843442, -222726102, -222780828, -222962413, -223121431, -223224753, -223332623, -223438625, -223523282, -223587055, -223600885, -223559996, -223472407, -223319689, -223083281, -222814920, -222594237, -222439003, -222328305, -222228564, -222152257, -222199960, -222398208, -222593234, -222655989, -222531877, -222266418, -222038579, -221961638, -221996877, -222080046, -222196450, -222337317, -222468593, -222581107, -222648743, -222665227, -222711381, -222879324, -223169234, -223516009, -223814454, -223896326, -223734129, -223525153, -223428918, -223403497, -223348732, -223209248, -222997276, -222838123, -222823704, -222884597]
16608b22884597k1148J9544j2470o6333o7911R569J27029J73449J13506J8234
16598b22591128o2964q0868m1542l9100r8245j13465r2557n6961j1053P023K4651
16587b23156209P6468J74726K55156K37133J19097j9827q6123m5176N8205J50584
16577b22235966J54321P5127k273m7155o8502p5852j13440j39272p6763P144j2246
16566b22534877r9768j26140p1956j384O0722Q8815M0149m4948p7686L667J18891
16555b22644515J63752J47336N7226o7796r6289r277P5574R2803O2105j9466j11938
16544b22350485j44802j42106j24697o1028M7312J21321J13469M9645q322l007
16534b22502700O5592Q9413J6879m2573K2028J07970J11201Q5579N8465K6065
$$ y = [-222884597, -222905745, -222886201, -222898671, -222965004, -223032915, -223023346, -222896317, -222722868, -222609362, -222591128, -222654092, -222734960, -222776502, -222815602, -222913847, -223027312, -223119869, -223176830, -223187883, -223180860, -223156209, -223079741, -222905015, -222649859, -222412726, -222293629, -222313456, -222399579, -222444755, -222386550, -222235966, -222081645, -222006518, -222008791, -222055946, -222124448, -222200300, -222313740, -222453012, -222529775, -222522631, -222534877, -222634645, -222760785, -222832741, -222834125, -222773403, -222684588, -222644439, -222689387, -222767073, -222763406, -222644515, -222480763, -222333427, -222276201, -222343997, -222440286, -222449563, -222373989, -222281186, -222219081, -222238547, -222350485, -222495287, -222637393, -222762090, -222823118, -222775806, -222654485, -222541016, -222491371, -222499693, -222502700, -222437108, -222347695, -222330816, -222373389, -222351361, -222243391, -222132190, -222046611, -221988146, -221962081]
16524b21962081p660l3055o983L6578O525l8726l4053J0610P0519P1577K6166
16513b21860583N52k1693m0184n3714n9666j9573O9593J27054J24772O8550j1031
16502b21675923q2861j15552q3039n5190p2692n4292L6959J27247J32031N1708
16492b21791604k4244l5903m1496q3728j03503p7785n2961k8335K3706J31092
16482b22084761K38204K32621J24531J3426n6076m5213j3595k4845o4122n2419
16472b21732249K0828L9529j5669n1349l940R7739J66222J34473K2782q2575j31285
16461b21535494j21596j09195j22384j44866j58588j14072m5126k2537m4630r7918
16451b22516406r9289j0678R6830J64951J84029K15827K34836J91378J64030J37687
$$ y = [-221962081, -221969741, -222002796, -222009779, -221973201, -221966676, -222005402, -222039455, -222028845, -221958326, -221886749, -221860583, -221860031, -221881724, -221921908, -221975622, -222035288, -222054861, -221985268, -221858214, -221733442, -221664892, -221675923, -221758784, -221874336, -221957375, -222012565, -222085257, -222139549, -222102590, -221975343, -221843312, -221791604, -221815848, -221851751, -221893247, -221976975, -222080478, -222158263, -222211224, -222239559, -222215853, -222084761, -221846557, -221613936, -221489405, -221475979, -221532055, -221577268, -221590863, -221615708, -221679830, -221732249, -221711421, -221671892, -221687561, -221738910, -221742850, -221645111, -221478889, -221344416, -221321634, -221404209, -221535494, -221657090, -221766285, -221888669, -222033535, -222192123, -222306195, -222351321, -222373858, -222418488, -222516406, -222615695, -222626373, -222529543, -222364592, -222180563, -221964736, -221729900, -221538522, -221374492, -221236805]
16441b21236805R1736J44046K41994K06689M2635q4040j08581j24434j38898j12075
16431b21077733l9140O7895R7713O4274Q7543J29884Q8498j7235j05270j12849
16421b20816420n9033L0187J13088J13984M0576n2990r6098q7192m3858j9710
16411b20877466l3807l0528n7906j10160r7438o2603r0832j39425q3195M7229
16401b21536131J19117J63335K03869K03873J53024N8551m9731j31584j05822
16392b20921499L1476J82211K18038J72085P7924p7912j77693j74314j25287r4679
16382b20889650j29665j55901m2128J69338L28977L38232K07881Q0697K5148j5417
16372b20082488q7658j53670j58037j05831P45J10698J63535J53675J18648R2821
$$ y = [-221236805, -221145069, -221001023, -220759029, -220552340, -220509705, -220593745, -220702326, -220826760, -220965658, -221077733, -221116873, -221048978, -220951265, -220886991, -220799448, -220669564, -220581066, -220598301, -220703571, -220816420, -220875453, -220845266, -220732178, -220618194, -220577618, -220630608, -220726706, -220813898, -220857756, -220877466, -220911273, -220941801, -220999707, -221109867, -221207305, -221269908, -221360740, -221500165, -221583360, -221536131, -221417014, -221253679, -221049810, -220845937, -220692913, -220634362, -220684093, -220815677, -220921499, -220890023, -220707812, -220489774, -220317689, -220239765, -220317677, -220495370, -220669684, -220794971, -220889650, -221019315, -221175216, -221217344, -221048006, -220719029, -220380797, -220172916, -220092219, -220067071, -220082488, -220170146, -220323816, -220481853, -220587684, -220586939, -220476241, -220312706, -220159031, -220040383, -219947562]
16362b19947562N5114p039p0417j09791q2342m989Q8723J33955J24314P5301J1473
16351b19733260n3393q2157n8914q7981j36674j14289m3474O2367J89902K34050
16341b19823823J38016j5073j07537r7722p8100r8281j12231p2572j905N6465
16331b20212763J14177J32468O8395k7094o7355j2793L0112m9055j32420j23781
16321b20280109n0827P3717J60536J75108J34011M4635l6565j9977N9550J27964
16311b19611957J35597Q7127N2523M8744J1755k0444K8361O0594J956n6615n9295
16300b19321654k6423K9058M5957P327j084K6179P980l6966k6074N4708J37263
16289b19103729J69186J34999O7352k6850j24038j49150j24390r0804m3061j3693
$$ y = [-219947562, -219892448, -219899487, -219969904, -220079695, -220162037, -220167026, -220078303, -219944348, -219820034, -219744733, -219733260, -219786653, -219868810, -219927724, -220015705, -220152379, -220266668, -220310142, -220247775, -220057873, -219823823, -219685807, -219700880, -219808417, -219906139, -219984239, -220082520, -220194751, -220267323, -220269228, -220212763, -220098586, -219966118, -219897723, -219924817, -219992172, -220004965, -219974853, -220023908, -220156328, -220280109, -220330936, -220257219, -220096683, -219921575, -219787564, -219742929, -219779494, -219799471, -219739921, -219611957, -219476360, -219389233, -219336710, -219287966, -219276211, -219296655, -219268294, -219207700, -219205744, -219262359, -219321654, -219348077, -219319019, -219273062, -219265735, -219266819, -219240640, -219232660, -219269626, -219295700, -219240992, -219103729, -218934543, -218799544, -218732192, -218759042, -218883080, -219032230, -219156620, -219247424, -219290485, -219304178]
16279b19304178k3950p3181j08387j18968q4054m3031q7465j21116p4205l1340
16269b20069875j2072L7884R5330J38926J23934m669j49856j59769l4340N2079
16259b19982428J9687n6666j05014q9043n1056j2526m468l8847n6647l7007Q621
16248b20405394N4190Q0092R5718J15723J64355K25392K53124K34522J54627K9952
16238b18997699k6120J5581N7287J0117n0921m4540k9731l2151O09R9437J82604
16227b18815527K08406J95582J22983L4491n0368r9263p4333l9533k8684J4028
16217b18532218Q7644R5128K5265p6432j53447j36587r2847q6124r8560j37859
16207b19106037j65364j01968L2731J00861K2114q7162q2101J4041J01545J48667
$$ y = [-219304178, -219328128, -219401309, -219509696, -219628664, -219712718, -219755749, -219843214, -219964330, -220038535, -220069875, -220081947, -220044063, -219948733, -219809807, -219685873, -219690542, -219840398, -220000167, -220034507, -219982428, -219962741, -220019407, -220124421, -220213464, -220264520, -220277046, -220281514, -220320361, -220377008, -220414015, -220405394, -220351204, -220271112, -220175394, -220059671, -219895316, -219669924, -219416800, -219182278, -219027651, -218997699, -219023819, -219008238, -218950951, -218940834, -218991755, -219036295, -219066026, -219098177, -219097568, -218998131, -218815527, -218607121, -218411539, -218288556, -218254065, -218304433, -218403696, -218478029, -218517562, -218546246, -218532218, -218444574, -218349446, -218324181, -218400613, -218554060, -218690647, -218783494, -218869618, -218968178, -219106037, -219271401, -219373369, -219340638, -219239777, -219217663, -219304825, -219386926, -219372885, -219271340, -219122673]
16197b19122673J84203J70243O7356n7461o1436L3216R5458J46318J82230J41834
16187b18220712N1677l7701j37959k08378j60062m0763N6802J23893J68178J47919
16177b18257106R4058J11804K21629L41567L55001K41889J11980j2919j77258
16168b16969355k96647k92807k15225r5733L0276R4182Q1288J5583r0201j63982
16158b17902621j46459q6796r7167j56221j33964o9493p8626r2284j8747R3099
16148b18689279J79137K74017K84699K16133J77896J69995J38137R1177L7575
16139b17120513L046K8453R4573J22112O6230K0584l806m8610q6499q3731r9622
16128b17107783p4998M4319J01521L1985m7038p1093l9794K7154J11599J68685
$$ y = [-219122673, -218938470, -218768227, -218700871, -218758332, -218819768, -218786552, -218691094, -218544776, -218362546, -218220712, -218169035, -218206736, -218344695, -218553073, -218713135, -218753898, -218697096, -218573203, -218405025, -218257106, -218163048, -218051244, -217829615, -217488048, -217133047, -216891158, -216779178, -216792097, -216969355, -217266002, -217558809, -217774034, -217869767, -217839491, -217745309, -217664021, -217648438, -217738639, -217902621, -218049080, -218135876, -218233043, -218389264, -218523228, -218592721, -218671347, -218763631, -218782378, -218689279, -218510142, -218236125, -217951426, -217735293, -217557397, -217387402, -217249265, -217158088, -217120513, -217117467, -217089014, -216994441, -216872329, -216806099, -216785515, -216789321, -216837931, -216924430, -217008161, -217107783, -217182781, -217138462, -217036941, -217004956, -217051994, -217123087, -217162881, -217135727, -217024128, -216855443]
16118b16855443K00973J99779J39459J03089J15260R7249L2149m4978j36919k08580
16108b16357962j95817j08253m9117o6324o9867J0344M3049k6160j03681j37783
16098b17061571p0488N3770J22841J48140J97681K41596K20457J82937J95090
16089b15769547K22095J37353l8593j39345r2467Q409O1153J9179o8199j02089
16079b15762051n4618L8858J12962J15159M4556Q013K1572J491m9164q5100m2399
16068b15650721P1464J13382P6216J7971k0891L2222J49923K06702K00628J67461
16058b14635643J43354J36439J39747J59568J21447P7522P2736O6135P5205O7814
16048b13575676j5972r0889j4674J28371J49533M5124p4113r9399j7450O4708
$$ y = [-216855443, -216654470, -216454691, -216315232, -216212143, -216096883, -215999634, -215967485, -216012463, -216149382, -216357962, -216553779, -216662032, -216711149, -216777473, -216847340, -216836996, -216793947, -216820107, -216923788, -217061571, -217132059, -217078289, -216955448, -216807308, -216609627, -216368031, -216147574, -215964637, -215769547, -215547452, -215410099, -215448692, -215588037, -215680504, -215672095, -215610942, -215591763, -215659962, -215762051, -215816669, -215777811, -215664849, -215549690, -215505134, -215497121, -215475549, -215474058, -215523222, -215608322, -215650721, -215579257, -215465875, -215389659, -215371688, -215392579, -215360357, -215210434, -215003732, -214803104, -214635643, -214492289, -214355850, -214216103, -214056535, -213935088, -213857566, -213784830, -213718695, -213643490, -213575676, -213591648, -213682537, -213697211, -213568840, -213419307, -213374183, -213448296, -213547695, -213565145, -213500437]
16038b13500437N2983n9788j87775k11734q6633N9987J13864J29368R7871M098
16028b13588196k8042L2695Q4069J07874J50363J58806J03698K0515M790Q1346
16018b12872082J31382R2804K7527j3675L5032J32049J63684J52601J53626J52869
16008b11844183J15538P8998R1672J38244J38655M9536l321R0152K15651K77722
15998b10651336K87373K21849J07751J8982k0210K6854J07588J25327J07880J18590
15988b09549352J13426M8952j6082k0213j5237l6374k9209L9379J30828J91119
15978b09142763J73326J24528J03725M8399L7446J91365L86489M58097L56989
15969b07262399J97897J07204J39274K26441K36744J76594J42689J39609J74780
$$ y = [-213500437, -213447454, -213507242, -213695017, -213906751, -213993384, -213933397, -213819533, -213690165, -213592294, -213588196, -213616238, -213583543, -213499474, -213391600, -213241237, -213082431, -212978733, -212958218, -212953428, -212872082, -212740700, -212647896, -212620369, -212634044, -212599012, -212466963, -212303279, -212150678, -211997052, -211844183, -211728645, -211649647, -211557975, -211419731, -211281076, -211231540, -211234861, -211144709, -210929058, -210651336, -210363963, -210142114, -210034363, -210015381, -210035591, -210008737, -209901149, -209775822, -209667942, -209549352, -209435926, -209386974, -209403056, -209423269, -209438506, -209474880, -209504089, -209464710, -209333882, -209142763, -208969437, -208844909, -208741184, -208692785, -208655339, -208463974, -208077485, -207619388, -207262399, -207064502, -206957298, -206818024, -206591583, -206354839, -206178245, -206035556, -205895947, -205721167]
15960b05721167K57668L16284L19717K70817J56698L4581J7135K1718j5064p9500
15950b04421113j22408m2252J21378K01111K50312L58378L92629L45520L25793
15941b02590652L20626K97146K56855K38617K62337K69836K06806J00108R0791
15932b00547530K04640L30199L90298L86886M06351M55071N00036M70396K93169
15923a97110484J10999Q1751K38591M74497O52940P10416O57123O01718N95791
15914a92986658O41732O70778O32733N80413N69893O35178P29714P87037Q08597
15905a86930583P66850O50501N67821O20147P58664Q60274Q86498Q80969Q83977
15896a80054882R01464R75241J103670J213131J322565J490881J660210J747798
$$ y = [-205721167, -205463499, -205147215, -204827498, -204556681, -204399983, -204365402, -204348267, -204326549, -204341613, -204421113, -204543521, -204585773, -204464395, -204263284, -204012972, -203654594, -203261965, -202916445, -202590652, -202270026, -201972880, -201716025, -201477408, -201215071, -200945235, -200738429, -200638321, -200547530, -200342890, -200012691, -199622393, -199235507, -198829156, -198374085, -197874049, -197403653, -197110484, -196999485, -196917734, -196679143, -196204646, -195551706, -194841290, -194184167, -193582449, -192986658, -192344926, -191674148, -191041415, -190461002, -189891109, -189255931, -188526217, -187739180, -186930583, -186163733, -185513232, -184945411, -184325264, -183566600, -182706326, -181819828, -180938859, -180054882, -179153418, -178178177, -177074507, -175861376, -174538811, -173047930, -171387720, -169639922]
15888a69639922J766799J838348J948113K034384K150413K349516K526370K600015
15880a52425964K701390K887831L151415L447303L656538L765585L787630L690089
15872a25338183L398973K795784J904183Q45164l82198j844501l508706n219177
15864a27348661o867578q425400r720592j0582987j1016394j1241560j1611672
15857a96814844j2288795j3217425j4201426j4992075j5432620j5347593j4656275
15850b96951053j3318694j1235894q488600n394068k440427p1325J629085K776415
15842c33494561L529492M016934M197464M081476L850058L636186L433036L186316
15834c03563599K936537K779418K712810K721707K673434K503328K289800K115595
$$ y = [-169639922, -167873123, -166034775, -164086662, -162052278, -159901865, -157552349, -155025979, -152425964, -149724574, -146836743, -143685328, -140238025, -136581487, -132815902, -129028272, -125338183, -121939210, -119143426, -117239243, -116394079, -116776277, -118620778, -122129484, -127348661, -134216239, -142641639, -152362231, -162945218, -173961612, -185203172, -196814844, -209103639, -222321064, -236522490, -251514565, -266947185, -282294778, -296951053, -310269747, -321505641, -329994241, -335388309, -337828736, -337900061, -336270976, -333494561, -329965069, -325948135, -321750671, -317669195, -313819137, -310182951, -306749915, -303563599, -300627062, -297847644, -295134834, -292413127, -289739693, -287236365, -284946565, -282830970]
15826b82830970K064160K033871J910785J734063J575495J469555J403804J336480
15818b69302757J218799J117931J076173J053069J022654J021301J007141R08232
15810b60877457P64763O76759O80773P30488P82681P80714P07940O00792N29385
15801b54623162N11231N28069N18750M83036N10069N45204N07058M96496N09079
15792b50014170M55692L75347L48968M19772N25585N47965N06880M64608M09080
15783b45960273K81713J36838O7094P3492R3195J48164K45250K86049K91242L16864
15773b44020372L31032L81002M87829N47410N08683M02416K74382J66006P9813
15764b40841799k8761j10174k8455J81177L37654L58449L07446L24031M08438
$$ y = [-282830970, -280766810, -278732939, -276822154, -275088091, -273512596, -272043041, -270639237, -269302757, -268083958, -266966027, -265889854, -264836785, -263814131, -262792830, -261785689, -260877457, -260112694, -259435935, -258755162, -258024674, -257241993, -256461279, -255753339, -255152547, -254623162, -254111931, -253583862, -253065112, -252582076, -252072007, -251526803, -251019745, -250523249, -250014170, -249558478, -249183131, -248834163, -248414391, -247888806, -247340841, -246833961, -246369353, -245960273, -245678560, -245541722, -245474628, -245401136, -245307941, -245159777, -244914527, -244628478, -244337236, -244020372, -243689340, -243308338, -242820509, -242273099, -241764416, -241362000, -241087618, -240921612, -240841799, -240870560, -240980734, -241009189, -240828012, -240490358, -240131909, -239824463, -239500432, -239091994]
15755b39091994L99720K53884Q2625K3581J8852l5912m8022L3031R6422O9485
15745b38198328o233l2213O749Q8549J90586K59572K49444K09178J83893J84652
15735b36864151K11011K18209J89106J64860J77699J48189P9989P2479Q8454O1831
15725b35452324L4081N3542Q9205O9299j3082n1858J6652R7565R2521K7723K6277
15714b35010399O8545P6405R6785J09700J1337r0009k4763J30264K30891K19474
15704b34181770J60371J51456J63618J12478L7978N1125J24763J78012J24497
15695b33077472J0097M697J12152J74172J56052J43279J28353O7809N906L728
15685b32271227O3261J18933J39474J27198J28105J46600J43605J46125J47507
$$ y = [-239091994, -238692274, -238438390, -238355765, -238332184, -238313332, -238349244, -238397266, -238364235, -238267813, -238198328, -238204561, -238236774, -238230025, -238141476, -237950890, -237691318, -237441874, -237232696, -237048803, -236864151, -236653140, -236434931, -236245825, -236080965, -235903266, -235755077, -235675088, -235602609, -235514155, -235452324, -235418243, -235364701, -235275496, -235206197, -235219279, -235271137, -235254485, -235156920, -235064399, -235036676, -235010399, -234941854, -234865449, -234768664, -234658964, -234647627, -234737636, -234762399, -234632135, -234401244, -234181770, -234021399, -233869943, -233706325, -233593847, -233555869, -233504744, -233379981, -233201969, -233077472, -233067375, -233062678, -232950526, -232776354, -232620302, -232477023, -232348670, -232280861, -232274955, -232271227, -232207966, -232089033, -231949559, -231822361, -231694256, -231547656, -231404051, -231257926, -231110419]
15676b31110419J22046J20055J52935J50152M8422r9563j74230j34848m7640N4018
15666b30919072J06419O3397M9275M9631m8776j68463j97384j80668j41896j0174
15656b31397711J21854J55305J42261J15690Q6201J10426J73535K04177K37545
15647b30050717K78248K09790N6934k9472n2617r1783j71284k74099k52831j03973
15637b30481804N677L1600J437p0304j17815m9611J10490K32552K00960Q4298
15627b30052520m305l5338L1067J33164J15438k9152j56006j12894M2164J13215
15617b29955167P2411N6669O9907J9075n1477o3401k7169n942l4485m4055K9581
15606b29934053J47302J93603J17644M0268K3980j0494m8738l9787J8325J00498
$$ y = [-231110419, -230988373, -230868318, -230715383, -230565231, -230516809, -230616372, -230790602, -230925450, -230973090, -230919072, -230812653, -230749256, -230699981, -230650350, -230699126, -230867589, -231064973, -231245641, -231387537, -231397711, -231275857, -231120552, -230978291, -230862601, -230776400, -230665974, -230492439, -230288262, -230050717, -229772469, -229562679, -229505745, -229535217, -229587834, -229679617, -229850901, -230125000, -230377831, -230481804, -230476127, -230444527, -230443090, -230513394, -230631209, -230680820, -230570330, -230337778, -230136818, -230052520, -230056825, -230092163, -230061096, -229927932, -229812494, -229841646, -229997652, -230110546, -230068382, -229955167, -229882756, -229826087, -229756180, -229737105, -229788582, -229851983, -229879152, -229885094, -229919579, -229963634, -229934053, -229786751, -229593148, -229475504, -229435236, -229411256, -229421750, -229470488, -229510275, -229491950, -229391452]
15596b29391452J47377J45195J14126O6802k7429j61063j90823r7384j5894M2110
15586b29368435J31751K23109K67921K30334J35826R3455J16119J23229Q5489
15577b27961202M3225J5258l5448r0986j16922j18019q9702n4524k1689j6392
15567b28446401L301L7631O7034J91420L59202L46657J53802l6891j04080r7785
15557b27526110j02619o2690N8915J38953J07467P7671Q1780J7021q4536j50159
15547b27444307j36041K3285J68292J91344J59865P0636k8181j22520j98931k13132
15537b27529690j80499j37579q9703n5352j2039O0172R7440M8683m1593o4328
15527b27904488l2169N8950J72951K35374K31989J49090R3485J22075J59852J32554
$$ y = [-229391452, -229244075, -229098880, -228984754, -228917952, -228945381, -229106444, -229297267, -229394651, -229410545, -229368435, -229236684, -229013575, -228745654, -228515320, -228379494, -228286039, -228169920, -228046691, -227961202, -227917977, -227902719, -227938167, -228029153, -228146075, -228264094, -228353796, -228408320, -228430009, -228446401, -228443100, -228405469, -228338435, -228147015, -227787813, -227441156, -227287354, -227324245, -227428325, -227526110, -227628729, -227691419, -227632504, -227493551, -227386084, -227308413, -227226633, -227209612, -227294148, -227444307, -227580348, -227557063, -227388771, -227197427, -227037562, -226966926, -226995107, -227117627, -227316558, -227529690, -227710189, -227847768, -227937471, -227992823, -228004862, -227944690, -227847250, -227798567, -227840160, -227904488, -227936657, -227877707, -227704756, -227469382, -227237393, -227088303, -226994818, -226872743, -226712891, -226580337]
15517b26580337L4556m7041q6774j10451j18606o2292L4519J50209K20712J23654
15507b26441851R402K5052Q7842J38956J36030M0371p9807j18023r6975p4203
15497b26373206l4485m6864r3891q7175l8907J3066N5770J11196J30259M5268
15487b26318969k4688N2074J30566N2934n8040m7453j0602m5124p8633m9488k129
15476b26399552q901o4053r4583q2928m0525k0137N53J07239K14405J78701K2200
15465b26187581j08613j20668m624J65869K67721K05553O9724l9004j00840j15950
15455b25968413j25865j13126q4970o0333j8097K7171L6691m485j05753j79487
15445b26596667j52096q6943j4994M3290M4700N4145J19558J84830J77024P8908
$$ y = [-226580337, -226545781, -226592822, -226679596, -226790047, -226908653, -226970945, -226936426, -226786217, -226565505, -226441851, -226432449, -226407397, -226319555, -226180599, -226044569, -226004198, -226084005, -226202028, -226299003, -226373206, -226407691, -226454555, -226548446, -226635621, -226674528, -226661462, -226605692, -226494496, -226364237, -226318969, -226343657, -226291583, -226161017, -226108083, -226166123, -226213576, -226224178, -226269302, -226347935, -226397423, -226399552, -226408453, -226472506, -226567089, -226650017, -226690542, -226710679, -226710126, -226602887, -226388482, -226209781, -226187581, -226296194, -226416862, -226421486, -226255617, -225987896, -225782343, -225712619, -225751623, -225852463, -225968413, -226094278, -226207404, -226292374, -226352707, -226370804, -226343633, -226306942, -226311427, -226417180, -226596667, -226748763, -226835706, -226850700, -226807410, -226762710, -226708565, -226589007, -226404177, -226227153, -226148245]
15435b26148245k0765R547J29772J82257J54816Q1799k0536n2636r121J1664k2108
15424b25703556j16080j54027o0838O8489J62894K41845K58049J65394L5320p2557
15414b25175067j16638j22081j08013o7947k1150J1087Q1672J72595J85868P9837
15404b25079837n5047j15109j64304k30475k26542j73263j27286l8590R2291J79066
15394b25939096J79456J16328O3378N9202Q3995R9799O1721k1825j25629j80724
15384b25603395r0850J04351K07466J46960M1841k3206j07733j41762n8591M4458
15374b25480461J03481R6382Q4309J02135R9785N5327p300q2022j12543q0086
15364b25220993k8701M221K9820L9427j6367q5978k9132Q8450J26520J21330J55002
$$ y = [-226148245, -226169010, -226159463, -226029691, -225847434, -225692618, -225610819, -225631355, -225683991, -225693112, -225681448, -225703556, -225819636, -225973663, -226034501, -225966012, -225803118, -225561273, -225303224, -225137830, -225102510, -225175067, -225291705, -225413786, -225521799, -225589746, -225610896, -225599809, -225518137, -225345542, -225159674, -225079837, -225134884, -225249993, -225414297, -225644772, -225871314, -226044577, -226171863, -226210453, -226118162, -225939096, -225759640, -225643312, -225579934, -225520732, -225436737, -225336938, -225275217, -225297042, -225422671, -225603395, -225694245, -225589894, -225382428, -225235468, -225193627, -225216833, -225324566, -225466328, -225524919, -225480461, -225376980, -225280598, -225196289, -225094154, -224994369, -224939042, -224946342, -225028364, -225140907, -225220993, -225249694, -225245473, -225215653, -225176226, -225192593, -225278571, -225307703, -225219253, -225092733, -224971403, -224816401]
15353b24816401K26111K43680J44077K3401l0650l4542k2981n0331j17814j79810
15343b24615260j92900j95043j96258j15918k35O5904Q0952O5583K7099l4351
15333b25110427j1579R4768J51611J51655J26535R7612R3428O6029o4766j49323
15323b24554457o8922N6775J51409K19736J86352R0409p417p8803q6778o7037
15313b24158733k9414k9814q3170q0694L9372J68293J70494Q2923R959j4331J678
15302b23923437j8990p1186j27693j57064q5268L2821R5718J10956J00124K3461
15292b24020558p3997j24325q9837K438M7147N8271P9300Q0329O5147L8634R291
15281b23928160J7781j2450j32116k12955j51069m2340r233J3829L8591R085o707
$$ y = [-224816401, -224590290, -224346610, -224202533, -224179132, -224209782, -224244324, -224267305, -224317636, -224435450, -224615260, -224808160, -225003203, -225199461, -225315379, -225315614, -225249710, -225168758, -225103175, -225076076, -225110427, -225122006, -225027238, -224875627, -224723972, -224597437, -224499825, -224406397, -224340368, -224405134, -224554457, -224623379, -224566604, -224415195, -224195459, -224009107, -223918698, -223926115, -224004918, -224091696, -224158733, -224188147, -224217961, -224301131, -224381825, -224342453, -224174160, -224003666, -223920743, -223910784, -223925115, -223923437, -223942427, -224013613, -224141306, -224298370, -224383638, -224350817, -224255099, -224144143, -224044019, -224020558, -224094555, -224218880, -224308717, -224306279, -224259132, -224200861, -224121561, -224041232, -223976085, -223937451, -223928160, -223910379, -223922829, -224054945, -224267900, -224418969, -224461309, -224470542, -224456713, -224418122, -224409037, -224415744]
15270b24415744K4138N4195N5281p564m5650J946K1497l9169j06551r7170m6428
15259b24601219m3616l6258R8253K65957K90901K03680J67630J98647J81111P7367
15249b23197547p0704j97530j94388n8274P8338J16838Q0478J1956l9071n3051
15239b23522955r2419j11600n9519p993l5068m6660N4154J39888J17641M4676
15229b23519855k1972n4082n2207L756J10831K13085K00186L3049j31922j11796
15219b23330927O0818J78255J53887j2959j73266j77318q6632k1504J6666O6880
15209b23326100J30958J20936M8490p491q1964j62591j93326j74103j06161j8611
15199b23769963P1785J27813R9132K4411p501L2776R6950J34743J35087J07492
$$ y = [-224415744, -224391606, -224337411, -224282130, -224289694, -224335344, -224333398, -224311901, -224351070, -224457621, -224554791, -224601219, -224644835, -224681093, -224582840, -224316883, -224025982, -223822302, -223654672, -223456025, -223274914, -223197547, -223268251, -223465781, -223660169, -223718443, -223640105, -223523267, -223442789, -223430833, -223469904, -223522955, -223615374, -223726974, -223786493, -223794486, -223829554, -223876214, -223822060, -223682172, -223564531, -223519855, -223541827, -223595909, -223648116, -223644360, -223533529, -223320444, -223120258, -223087209, -223219131, -223330927, -223270109, -223091854, -222937967, -222950926, -223124192, -223301510, -223388142, -223409646, -223392980, -223326100, -223195142, -223074206, -223025716, -223033207, -223115171, -223277762, -223471088, -223645191, -223751352, -223769963, -223698178, -223570365, -223471233, -223446822, -223454323, -223421547, -223324597, -223189854, -223054767, -222947275]
15189b22947275K8243r2270j71312j31242j429Q9813L8887p0973q0547j2448L5019
15178b23315534M8542O1626Q6923Q9909M4444l0536q8392j16006q1334J239K5886
15167b23273233k4866p5923q4978q3026r4763m6182J03087J87920J46031P9675
15157b23166258N2352M4920L494r7810j81189j68908p0457M8107J06220Q9482
15147b23340047O2661j2627j20873j36787o3323L3998K7181j04662j70377q6673
15137b23911529K1870O5658P0281Q2505J43916K35388K64608K05314J13243j0632
15127b22719378j14302j10272l3595J0779k4432n5347l3542r46L1421P9372J04009
15116b22866233K8666j19169j66978j5679K03840L05400K39147L8174j86471l05261
$$ y = [-222947275, -222919032, -223011302, -223182614, -223313856, -223315285, -223225472, -223186585, -223257558, -223338105, -223350553, -223315534, -223266992, -223205366, -223118443, -223028534, -222984090, -223014626, -223103018, -223219024, -223300358, -223299119, -223273233, -223298099, -223374022, -223459000, -223542026, -223636789, -223682971, -223579884, -223391964, -223245933, -223166258, -223113906, -223068986, -223065492, -223163302, -223344491, -223513399, -223583856, -223535749, -223429529, -223340047, -223277386, -223290013, -223410886, -223547673, -223610996, -223576998, -223549817, -223654479, -223824856, -223911529, -223889659, -223824001, -223753720, -223671215, -223527299, -223291911, -223027303, -222821989, -222708746, -222719378, -222833680, -222943952, -222977547, -222966768, -222991200, -223046547, -223080089, -223081035, -223049614, -222970242, -222866233, -222837567, -222956736, -223123714, -223139393, -222935553, -222630153, -222391006, -222352832, -222539303, -222844564]
15106b22844564l01787k46486j83335j02045L3738J10247P8206O4987Q1402M3096
15096b23266541K1443M9777N7467K8864n6270j35526j20364m5262j5296n1463
15086b23533171j02975r9685j6969P2090J13723J04209K8212m1290l6229K5706
15076b23486379Q5300Q3354L8004J6329L7096L8456O9959J33324J79829J83946
15066b22620782J40050O2464k1824n9064m9472j9138L4221R1987R5056L2229r0278
15055b22404551k16204l35464l96445k93927j12454N4350J50988J55090J39756
15046b23258861J17526M9748l9390r3005r4351r6693j05485m5349R3393K35455
15036b23237012K84863K30831J23479J3679j9878M7700J26908J20977L4083l3272
$$ y = [-222844564, -223146351, -223392837, -223576172, -223678217, -223644479, -223534232, -223456026, -223391039, -223309637, -223266541, -223245098, -223195321, -223137854, -223108990, -223165260, -223300786, -223421150, -223466412, -223481708, -223533171, -223636146, -223735831, -223752800, -223680710, -223566987, -223462778, -223434566, -223475856, -223512085, -223486379, -223401079, -223317725, -223279721, -223263392, -223226296, -223187840, -223117881, -222984557, -222804728, -222620782, -222480732, -222418268, -222440092, -222499156, -222548628, -222567766, -222533545, -222441558, -222346502, -222314273, -222404551, -222620755, -222956219, -223352664, -223646591, -223759045, -223704695, -223553707, -223398617, -223258861, -223141335, -223091587, -223130977, -223223982, -223318333, -223415026, -223520511, -223565860, -223472467, -223237012, -222952149, -222721318, -222597839, -222584160, -222604038, -222556338, -222429430, -222308453, -222274370, -222307642]
15026b22307642p7323j19501j32070j27416j32985j10465m3588q453j9315j2340
15016b23091098J5554K7648L1896J2571j7606l1678n0911o5644r1512r0279o147
15005b23357206J44881K97997L61981K72107Q7613n3487j27405j82364k07396
14996b22763279j39702L6768J88117K05992J59111P4134n466o3379j28125j49044
14986b22584873r8659l9916J0162P7023J07882K4328p0963l3627L1873P604n6541
14975b22625707p9136q2089j03795j28919j43349j33599l8307R7081J31433N9313
14965b23047074l0162p8000j14762j38475p8621M1645J22812J59861J80237K49603
14955b22732936K98955K36454J24218R805o7737r0816q7080q2225j01848j35876
$$ y = [-222307642, -222384965, -222504466, -222636536, -222763952, -222896937, -223007402, -223050990, -223059443, -223078758, -223091098, -223075544, -223047896, -223016000, -223003429, -223021035, -223052713, -223103624, -223169268, -223260780, -223351059, -223357206, -223212325, -222914328, -222552347, -222280240, -222192627, -222246114, -222373519, -222555883, -222763279, -222902981, -222866213, -222678096, -222472104, -222312993, -222238859, -222244325, -222307704, -222435829, -222584873, -222683532, -222723448, -222713286, -222636263, -222528381, -222504053, -222575016, -222608643, -222576770, -222569166, -222625707, -222704843, -222786932, -222890727, -223019646, -223162995, -223296594, -223334901, -223237820, -223106387, -223047074, -223077236, -223155236, -223269998, -223408473, -223487094, -223445449, -223322637, -223162776, -222982539, -222732936, -222433981, -222197527, -222073309, -222063504, -222131241, -222222057, -222309137, -222391362, -222493210, -222629086]
14945b22629086j31290k7770P9648O4159l2430q0009O342J69210K62694K40312
14935b22078220J50825L4753q2924j43842j63388j88782j79116q0539O7661Q7182
14925b22576390n7256j71125j24309J8720P7459K3618k1572J1859L8833k1327
14915b22801490m4943K0516Q8341P7296l2517j20945n7060J07916K63404L61798
14905b22137684M36545M26173K08835m7339j65107j74543j47958j04836m7336
14896b21753250j4320j1925k4556n3225r5671j30995j03297k9048M8705J33373
14886b22034209K00131J97276P6191q3140j63011j13999j0217L6215K7461K2919
14876b21844383M5764N5320L2336L0985J06206J57831O5378q1547j34980q9217
$$ y = [-222629086, -222760376, -222788146, -222708498, -222644339, -222676769, -222756778, -222750436, -222581226, -222318532, -222078220, -221927395, -221892642, -221975566, -222119408, -222282796, -222471578, -222650694, -222731233, -222663572, -222576390, -222633646, -222804771, -222929080, -222910360, -222832901, -222809283, -222830855, -222818996, -222780163, -222801490, -222846433, -222825917, -222737576, -222660280, -222692797, -222813742, -222870802, -222762886, -222499482, -222137684, -221701139, -221274966, -221066131, -221113470, -221278577, -221453120, -221601078, -221705914, -221753250, -221767570, -221779495, -221804051, -221857276, -221952947, -222083942, -222187239, -222216287, -222167582, -222034209, -221834078, -221636802, -221560611, -221643751, -221806762, -221920761, -221930978, -221894763, -221867302, -221844383, -221798619, -221743299, -221710963, -221679978, -221573772, -221415941, -221350563, -221432110, -221567090, -221656307]
14866b21656307k5005K1583K0178j4384o1916q5705m6250K1173L3180J4223j0219
14855b21789449p5683j33531j26715n9775r792j2955n1076o9554m1436j4128K1672
14844b22362422M0967M1119M4947j3331j01951j71619j63632l1090R8801J24444
14834b22493767N3543j3525l113K6988N7265J15149J43601Q3875J6674k4613j03723
14823b22141646j73619j28551j5550Q1497J54127J71419J25684N4552j9737j15360
14813b22007184j71750j15673j3361P0052J13647R8097P2053R2940J34584J38697
14803b21587898R1339K4243l3780q4658q2524l1071j4539q4137j71920j64309
14793b22139254p2770K2551Q1870R8790O1061K0395k0453k7332O6140J56424J38615
$$ y = [-221656307, -221681312, -221659729, -221639551, -221653935, -221715851, -221801556, -221847806, -221826633, -221793453, -221779230, -221789449, -221865132, -221998663, -222125378, -222185153, -222194945, -222207900, -222258976, -222328530, -222369966, -222384094, -222362422, -222321455, -222280336, -222235389, -222248720, -222350671, -222522290, -222685922, -222717012, -222618211, -222493767, -222440224, -222453749, -222456862, -222429874, -222372609, -222257460, -222113859, -222029984, -222013310, -222037923, -222141646, -222315265, -222443816, -222459366, -222377869, -222223742, -222052323, -221926639, -221872087, -221891824, -222007184, -222178934, -222294607, -222307968, -222237916, -222124269, -222026172, -221954119, -221861179, -221726595, -221587898, -221496559, -221472316, -221506096, -221590754, -221673278, -221704349, -221718888, -221803025, -221974945, -222139254, -222212024, -222189473, -222107603, -222008813, -221947752, -221927357, -221947810, -221975142, -221909002, -221752578, -221613963]
14782b21613963O6659L4056M4469Q5914J21744J08662N8999K8651J3332M547m0941
14771b21087871j65690k14652j34951p9185m7128J1674R4619J69489J57762Q6319
14761b21209614O2403M5096j0838k3441R801K4782J4877k6404o2506l9577m9204
14750b21264625r6092r3957l1530M4895Q3220N3828L561k3438o7761j08203q9087
14739b21589189r748L3712k4339j24632j18043k4936L2751P4681J03745J14361
14729b21531637R3298Q0507R9210Q9040N0516q384n1355k1353M7777J02387J12964
14718b20937030K3180j39917k25442j86753j34995m1706J39760K89335K99293
14709b20914275K10372Q4084j3966K467M9490K1993j5409l4025p6645j54828j54619
$$ y = [-221613963, -221547304, -221513248, -221468779, -221382865, -221261121, -221152459, -221093460, -221064809, -221051477, -221046930, -221087871, -221253561, -221468213, -221603164, -221682349, -221729477, -221717803, -221623184, -221453695, -221295933, -221209614, -221147211, -221102115, -221112953, -221136394, -221126593, -221101811, -221086934, -221113338, -221175844, -221215421, -221264625, -221360717, -221454674, -221486204, -221441309, -221358089, -221304261, -221300700, -221324138, -221391899, -221500102, -221589189, -221598937, -221565225, -221589564, -221714196, -221832239, -221857175, -221824424, -221749743, -221645998, -221531637, -221438339, -221357832, -221258622, -221169582, -221119066, -221127450, -221178805, -221200158, -221152381, -221049994, -220937030, -220913850, -221053767, -221279209, -221465962, -221600957, -221642663, -221502903, -221213568, -220914275, -220703903, -220619819, -220633785, -220631318, -220581828, -220559835, -220575244, -220609269, -220685914, -220840742, -220995361]
14698b20995361m0957L4801K4147o6789j70541j78680o7999P4535J69849K04306
14688b21012689J56722R4930M6851l0159j16732j14408J4189J55429J84910J02355
14678b20518602K408n9301o6222o8036r5096j16241o1613M9327R6703M7606k3063
14667b20812130o0444o9051o2720m2869m861J04816J67663Q3374m0436j30794
14657b20867452j71012j06827J4662P9296O3391P7291J42068J49444Q5522j8899
14647b20552516j02742j10177o2041J4265R8508J04867J3189q0296r3513m4058
14637b20814514k1054o9715j19620q2390p285j0039m1970K9344J97368K85503
14627b20654372J80967K8162o3073j00898p1974m0730L0267J46411J56966L5922
$$ y = [-220995361, -221036318, -221001517, -220977370, -221044159, -221214700, -221393380, -221461379, -221386844, -221216995, -221012689, -220855967, -220761037, -220714186, -220744345, -220861077, -220975485, -220961296, -220805867, -220620957, -220518602, -220516194, -220575495, -220641717, -220709753, -220804849, -220921090, -220982703, -220933376, -220836673, -220789067, -220812130, -220872574, -220941625, -221004345, -221047214, -221052075, -220947259, -220779596, -220696222, -220736658, -220867452, -221038464, -221145291, -221130629, -221051333, -220987942, -220910651, -220768583, -220619139, -220533617, -220552516, -220655258, -220765435, -220827476, -220813211, -220714703, -220609836, -220596647, -220676943, -220770456, -220814514, -220835568, -220905283, -221024903, -221107293, -221114578, -221124617, -221166587, -221137243, -220939875, -220654372, -220473405, -220445243, -220508316, -220609214, -220681188, -220721918, -220691651, -220545240, -220388274, -220352352]
14617b20352352o1412p4747q6322j06008j16379q0542K6783J32539J22443K0520
14607b20575477o8204j14677r7907j1056N1521J6672j0725M5656J32758J39778
14597b20491661N2404p5349j35488j30943j34228j10499n2388K812J0898M8561
14587b21015881J40952J43878M7039m8753q6454k4499O8549Q5116N3174L8064
14577b20598815J5761k258J0097N555l1575q3814j14145j01718j4501R0987R3017
14566b20731409J1046m1456q054J4365k8231j04026j40519l2074J34352J91051
14556b20734955K11655K60188K57079J50782M3604N163r307R751P6127R5034j0860
14545b19645739j63515k50524j95933o4874K8936O9422N5888k7539j50700k18913
$$ y = [-220352352, -220413764, -220488511, -220574833, -220680841, -220797220, -220877762, -220850979, -220718440, -220595997, -220575477, -220643681, -220758358, -220856265, -220867321, -220815800, -220799128, -220809853, -220764197, -220631439, -220491661, -220439257, -220514606, -220650094, -220781037, -220915265, -221025764, -221078152, -221075340, -221064442, -221015881, -220874929, -220731051, -220684012, -220732765, -220819219, -220843718, -220775169, -220690053, -220636879, -220598815, -220583054, -220585312, -220575215, -220569660, -220601235, -220685049, -220799194, -220900912, -220915413, -220824426, -220731409, -220720363, -220761819, -220769873, -220755508, -220783739, -220887765, -221028284, -221060358, -220926006, -220734955, -220523300, -220263112, -220006033, -219855251, -219811647, -219806484, -219815791, -219806040, -219729913, -219634879, -219645739, -219809254, -220059778, -220255711, -220320585, -220291649, -220222227, -220166339, -220193878, -220344578, -220563491]
14535b20563491j56352o2895J3260J09617J44879Q0134n464m3362l4529m3237
14525b20561440r2139j26509j58571j98173j59525k7006J06107J85718K11240
14516b20820298J83847J11692M3465j2342p6574j38873j77305j57408p9296Q0000
14506b21043092K58089L06374K03982K2469j32059j79796j36754j6152J28828
14497b20588111J84427R8606o498r468J9246n218m9708m8484J4793J29133K02528
14486b20058754J64925J05417P4394K8557n4858j77545k86575k99463k12893j24457
14476b20841252r6976n7167N9174J63260J55780N8641J9858O1530Q6133N3427
14466b20337592L2996L0153j2532m0862l6803k1804K9190O4619K2273n1311r6246
$$ y = [-220563491, -220719843, -220782738, -220769478, -220659861, -220514982, -220434848, -220440312, -220483674, -220518203, -220561440, -220653579, -220780088, -220938659, -221136832, -221296357, -221323363, -221217256, -221031538, -220820298, -220636451, -220524759, -220481294, -220493636, -220570210, -220709083, -220886388, -221043796, -221123092, -221043092, -220785003, -220478629, -220274647, -220252178, -220384237, -220564033, -220700787, -220716939, -220588111, -220403684, -220305078, -220311576, -220321044, -220301798, -220307016, -220356724, -220405208, -220390415, -220261282, -220058754, -219893829, -219788412, -219714018, -219685461, -219740319, -219917864, -220204439, -220503902, -220716795, -220841252, -220938228, -220995395, -220936221, -220772961, -220617181, -220558540, -220538682, -220477152, -220391019, -220337592, -220304596, -220274443, -220286975, -220327837, -220364640, -220386444, -220357254, -220292635, -220270362, -220321673, -220417919]
14455b20417919q3549n9530p3946n8432m856L6445J9679l4105k3747N7700R2079
14444b20550181K7132m6477o6739o7672r0880p1155j1441N7078J63297K31002
14434b20426036J74097Q1345L2355k199n0414j04761j05298m3488O1023J77801
14424b20205575K29775J50030R492l3651M1870J30637J73241J90458J65225O1430
14414b19087068j6443o7493j54549k05873k15979j74801j37980j87758k33471
14405b20481415j74482r3108m7464K6068J16598K00670K40032J75404Q1553M2659
14395b19913485J0627m9684q1306j01561j42065k18894k77428k18308q0454J6742
14385b21055816P5001P9495q198l5946P4982J35464P1210k145n883j5145l1002
$$ y = [-220417919, -220501468, -220560998, -220634944, -220693376, -220698232, -220661787, -220642108, -220676213, -220699960, -220642260, -220550181, -220523049, -220569526, -220636265, -220703937, -220794817, -220865972, -220877413, -220820335, -220657038, -220426036, -220251939, -220170594, -220138239, -220140438, -220190852, -220295613, -220400911, -220444399, -220383376, -220205575, -219975800, -219825770, -219816278, -219849929, -219808059, -219677422, -219504181, -219313723, -219148498, -219087068, -219103511, -219171004, -219325553, -219531426, -219747405, -219922206, -220060186, -220247944, -220481415, -220655897, -220749005, -220796469, -220770401, -220653803, -220453133, -220213101, -220037697, -219956144, -219913485, -219902858, -219952542, -220033848, -220135409, -220277474, -220496368, -220773796, -220992104, -221072558, -221055816, -220980815, -220901320, -220909518, -220945464, -220870482, -220735018, -220663808, -220665953, -220671836, -220686981, -220717983]
14374b20717983J3020Q0039J56398J51238L5207k8594J8816Q2965N2046j04347
14364b20261195k30551j51775P2092K26699K40260J94307J49041N9397m4553p6693
14354b19822971m9386l9818q3599j14138n3081P2850J79058J81013J03702L7610
14344b19588760J822m9326q8757r5833q5760p1523l8379k4203n4551m9864l1259
14333b20176393k1328N1152J31377J06691J2618o6996q3018j1419N7763J8238
14323b19981315j15283j70694r8413L3353J36738J64582J80213K36430K63683
14314b19350706J94812P1658n0821j01041l0296O6069O8490j8743r8381o9885
14304b19318844K7255O1975k8111j38643j63899j52789j54238j28822n6325J7391
$$ y = [-220717983, -220704963, -220624924, -220468526, -220317288, -220282081, -220310675, -220291859, -220208894, -220156848, -220261195, -220491746, -220643521, -220571429, -220344730, -220104470, -219910163, -219761122, -219701725, -219746278, -219822971, -219872357, -219912175, -219995774, -220109912, -220162993, -220090143, -219911085, -219730072, -219626370, -219588760, -219586938, -219636264, -219725021, -219820854, -219906614, -219978137, -220016516, -220040719, -220095270, -220145134, -220176393, -220197721, -220146569, -220015192, -219908501, -219895883, -219962879, -220045897, -220057316, -219999553, -219981315, -220096598, -220267292, -220365705, -220332352, -220195614, -220031032, -219850819, -219614389, -219350706, -219155894, -219084236, -219135057, -219236098, -219266394, -219200325, -219131835, -219150578, -219248959, -219318844, -219291589, -219229614, -219257725, -219396368, -219560267, -219713056, -219867294, -219996116, -220052441, -220035050]
14294b20035050O7549Q1152P6811Q5991P4220M8248K9559R000l2847n7077O515
14283b19645929J29708J77031R2667l9224j00907j30101j75864j89458j53142
14274b20035219r4105o0674n9267l6699N2090J95447L23114K79966P5342q3166
14264b19443171r3955Q424Q2373N3316j6651j39970k52094j85938j4365N5107
14254b19946924k1764j25852j35470q772J29744K02159K19923J76808J27934J11051
14244b19271163Q6568P553r2751j55840j30053o5180n6041q0235o8174l7626l3271
14233b19896213j8194J5611L2759L2602O1705Q4143P5127Q6130Q2209L7845J9834
14222b19386442K207o6217j26282j44666r1578O225M9189O0691J57343K98066
$$ y = [-220035050, -219967501, -219886349, -219809538, -219723547, -219649327, -219601079, -219571520, -219562520, -219595367, -219652444, -219645929, -219516221, -219339190, -219246523, -219285747, -219386654, -219516755, -219692619, -219882077, -220035219, -220129324, -220189998, -220249265, -220285964, -220233874, -220038427, -219715313, -219435347, -219360005, -219443171, -219537126, -219528702, -219446329, -219393013, -219409664, -219549634, -219801728, -219987666, -220002031, -219946924, -219968688, -220094540, -220230010, -220238782, -220109038, -219906879, -219686956, -219510148, -219382214, -219271163, -219184595, -219177042, -219269793, -219425633, -219555686, -219620866, -219676907, -219757142, -219825316, -219862942, -219896213, -219914407, -219898796, -219866037, -219833435, -219771730, -219687587, -219612460, -219526330, -219444121, -219406276, -219386442, -219384235, -219450452, -219576734, -219721400, -219812978, -219806753, -219757564, -219696873, -219539530, -219241464]
14212b19241464L49729K74783J08742j9215r6917j82151k78393l37020k86132
14203b19708038j61909j0877J12591J28025L5938p7864j25584j39590j39514q5800
14193b20172622q870J4415k6408k9325J09868K85070L54870L41023K90071K12121
14183b18629787J15475O7622N5377n741j33763k41448k73680k34841j49903o8774
14173b19499463N222N2847N9104P8896J44096K40219L03331K70467J79628R0759
14163b18074894K0855m1231p6064r4449j12977j25670r5656l9150m5529q9524
14153b18774289p8714j7706p827k2355N305K1579n2360j59085j94312j54723l6739
14142b19471226R3966J52548J23718M3466r465n4408p5632p9352p6778k4386P8820
$$ y = [-219241464, -218891735, -218616952, -218508210, -218527425, -218624342, -218806493, -219084886, -219421906, -219708038, -219869947, -219880824, -219768233, -219640208, -219604270, -219682134, -219807718, -219947308, -220086822, -220172622, -220181492, -220167077, -220193485, -220222810, -220112942, -219827872, -219473002, -219131979, -218841908, -218629787, -218514312, -218446690, -218391313, -218397054, -218530817, -218772265, -219045945, -219280786, -219430689, -219499463, -219494241, -219441394, -219382290, -219303394, -219159298, -218919079, -218615748, -218345281, -218165653, -218074894, -218054039, -218095270, -218171334, -218265783, -218378760, -218504430, -218600086, -218639236, -218684765, -218774289, -218853003, -218870709, -218878536, -218900891, -218895586, -218874007, -218926367, -219085452, -219279764, -219434487, -219471226, -219377260, -219224712, -219100994, -219057528, -219066993, -219121401, -219197033, -219276385, -219353163, -219377549, -219298729]
14131b19298729J54677J77149J30774L5613J572L2415L8650k0517n1638o9522
14121b18869556r6427l9616Q7349J75332J37461j8734j43834j61449j22806j39612
14111b19191892j94280j53490j6699J10123J61121J15821K0852L363M7380Q2558
14101b19015143R3183Q0255N8416K6878r540O833O1734R8160R5842L5961p0816
14090b18538237k02866k93700k77679j84982q6733j5210o181l1215o9692q5508
14080b19792003m4626L5956J03603R6521M2573N0238J13941J87739K37782K27413
14070b18740863J60959Q1305J2877n1365j16914j19775q0439o9888l5854N2442
14060b18907515J51276K15953K07739J16325K3920r2326k47438l08109k53499
$$ y = [-219298729, -219144052, -218966903, -218836129, -218800516, -218798944, -218766529, -218727879, -218748396, -218800034, -218869556, -218965983, -219005599, -218918250, -218742918, -218605457, -218624191, -218768025, -218929474, -219052280, -219191892, -219386172, -219539662, -219556361, -219446238, -219285117, -219169296, -219148444, -219145081, -219097701, -219015143, -218921960, -218841705, -218783289, -218756411, -218765951, -218759118, -218697384, -218599224, -218503382, -218467421, -218538237, -218741103, -219034803, -219312482, -219497464, -219584197, -219599407, -219605588, -219636803, -219706495, -219792003, -219836629, -219800673, -219697070, -219600549, -219557976, -219507738, -219393797, -219206058, -218968276, -218740863, -218579904, -218498599, -218485722, -218537087, -218654001, -218773776, -218854215, -218924103, -218959957, -218907515, -218756239, -218540286, -218332547, -218216222, -218192302, -218284628, -218532066, -218840175, -219093674]
14051b19093674j37292K2955J88419K69365K79337K61764J90038P7418m0714j27293
14041b18109677j91785k39453k23705j87201k41165l11577k60984j12398N8022
14032b19819923J79790K20954J95967J72499J54087P8071m0547r9293m2137L9312
14022b18961220N5836N0923Q9438J58942J81774J07182Q722k5614K7987P1874
14012b18234156L4797o2616j70511k09722j89426j09039k95L7112O5726R9119
14002b18739011P8031L3531L2733Q7304J42701J03790j0728p0919k8161L4284
13992b18336445Q7519J75468K05734R6836j6187k2280J7116M5491K9915j5869
13982b17732702m8938n3497o9285j72260k52121j86437n6233j08q6371k35829
$$ y = [-219093674, -219230966, -219208011, -219019592, -218750227, -218470890, -218209126, -218019088, -217941670, -217982384, -218109677, -218301462, -218540915, -218764620, -218951821, -219192986, -219504563, -219765547, -219877945, -219819923, -219640133, -219419179, -219223212, -219050713, -218896626, -218818555, -218859102, -218958395, -219000532, -218961220, -218905384, -218854461, -218765023, -218606081, -218424307, -218317125, -218308403, -218334017, -218306030, -218234156, -218199359, -218261975, -218432486, -218642208, -218831634, -218940673, -218940968, -218903856, -218838130, -218739011, -218660980, -218627449, -218594716, -218507412, -218364711, -218260921, -218271649, -218342568, -218370729, -218336445, -218248926, -218073458, -217867724, -217770888, -217787075, -217809355, -217792239, -217746748, -217716833, -217732702, -217781640, -217835137, -217904422, -218076682, -218328803, -218515240, -218571473, -218571581, -218657952, -218893781]
13972b18893781k61351j22167N7188J84970K49523K23010J36625P5278L9971N97
13962b18310137J638O0353P2228n2774j92211j79071r7776k6934N2398P9356J04079
13951b18488851J61246J61877Q5630j0390j12514k03811k02608r2014K9332P3436
13941b18598667P1618N2703N4788O7153L3452j6268k5080J3229M3497K1699L127
13930b18278749L0576J00160J47594J41115J53098J27557l0151k15929k83592
13921b18108321k41095j62449r9951j01897j43132j23537l3030Q7088J83938K01540
13911b18540846J64827J55483J82608J54034N5843j4524l9843l2276l9587q9820
13901b18044101j12335j04165j26006j50851j01951l0201j3303k5608l4637o83
$$ y = [-218893781, -219155132, -219277299, -219220111, -219035141, -218785618, -218562608, -218425983, -218350705, -218310734, -218310137, -218308499, -218248146, -218175918, -218228692, -218420903, -218599974, -218697750, -218724684, -218672286, -218592930, -218488851, -218327605, -218165728, -218080098, -218090488, -218203002, -218406813, -218609421, -218701435, -218672103, -218598667, -218527049, -218474346, -218419558, -218352405, -218318953, -218335221, -218360301, -218347072, -218303575, -218281876, -218278749, -218248173, -218148013, -218000419, -217859304, -217706206, -217578649, -217608800, -217824729, -218108321, -218349416, -218511865, -218611816, -218713713, -218856845, -218980382, -219013412, -218926324, -218742386, -218540846, -218376019, -218220536, -218037928, -217883894, -217828051, -217842575, -217882418, -217914694, -217954281, -218044101, -218156436, -218260601, -218386607, -218537458, -218639409, -218669610, -218682913, -218708521, -218743158, -218743841]
13891b18743841N8363J11182J62227K20246K28460J88609J57675R1003o019p2146
13881b17604241j36919k16575k56111k21003j43809k8201J40195K69425K24016
13872b17973223Q9905J6499k6598j29756k70948l28901k62727j50117m9615L2548
13862b19052933Q9217J27289J71228K66001L14706J62683j24784l08861k77486
13853b18632940j82757j02536j0220L9892R462J6173R2003J30355J15978Q6256
13843b18438334O9284K7307l6907k0386Q6649J91284K47601K42736J31381m8304
13833b17547689j70842j41843m9792J2361R0357J16498L1781m5829n7319j05656
13823b17867973j66111k03230j98398j19815K320J64742K94243L11741K24785
$$ y = [-218743841, -218685478, -218574296, -218412069, -218191823, -217963363, -217774754, -217617079, -217526076, -217532095, -217604241, -217741160, -217957735, -218213846, -218434849, -218578658, -218606859, -218466664, -218197239, -217973223, -217883318, -217866819, -217893417, -218023173, -218294121, -218623022, -218885749, -219035866, -219085481, -219052933, -218963716, -218836427, -218665199, -218399198, -218084492, -217921809, -218046593, -218355454, -218632940, -218815697, -218918233, -218928453, -218888561, -218879099, -218862926, -218770923, -218640568, -218524590, -218438334, -218369050, -218341743, -218378650, -218399036, -218312387, -218121103, -217873502, -217630766, -217499385, -217547689, -217718531, -217860374, -217910166, -217897805, -217807448, -217690950, -217659169, -217704998, -217762317, -217867973, -218034084, -218237314, -218435712, -218555527, -218553207, -218388465, -218094222, -217782481, -217557696]
13814b17557696Q2293j13369k71067k45662j13865k5996k1348m7626o1632n0999
13804b18426967J4624R8880P4924k23J4576R6519J55995O5701o2336p9127p0674
13793b18118108m5196j7836l5779m1192j1638j4506l1701j6794J6985K7475j2833
13782b18301123l9315Q318R7410J41578R0231j4956p2934j7232N2170O6926M7898
13771b17941029R821n2925o8302L0123J05935P5909J720o9401j06172j28928j47172
13760b18290421r2931j8466K6093O8980j1074j51744q6076J52665K23746L7915
13750b18141313q9071K339J34353J84036J68918J31148J01093R5020N2094j1908
13740b17373291j4897O8368J03584J0280n3832o3002j11857j51758j53999j10995
$$ y = [-217557696, -217475403, -217588772, -217859839, -218105501, -218219366, -218245362, -218266710, -218314336, -218375968, -218426967, -218412343, -218313463, -218238539, -218238762, -218224186, -218127667, -217971672, -217905971, -217968307, -218047434, -218118108, -218163304, -218181140, -218216919, -218258111, -218269749, -218284255, -218315956, -218332750, -218315765, -218288290, -218301123, -218340438, -218332120, -218234710, -218093132, -218002901, -218017857, -218090791, -218108023, -218055853, -217988927, -217941029, -217931208, -217984133, -218052435, -218022312, -217916377, -217840468, -217838748, -217908149, -218014321, -218143249, -218290421, -218383352, -218401818, -218375725, -218306745, -218317819, -218469563, -218555639, -218402974, -218179228, -218141313, -218230384, -218228045, -218093692, -217909656, -217740738, -217609590, -217508497, -217413477, -217361383, -217373291, -217388188, -217319820, -217216236, -217205956, -217259788, -217322790, -217434647, -217586405, -217740404, -217851399]
13730b17851399k5452J5614R439L9325Q7173P8330N0824M6982j272n3147j0203
13719b17613786K7418L3777M6471J7287J1056P276m1526j10682j30096p3465k2660
13708b17848930L7982R5616J13296J38245J82059K02636J37564m8161k09921k56360
13698b17455974k51952k12069j68353j34625r4475m0706N7241J74327K41745J95958
13688b17688883O9772k7921k6201O4150J01601L6541m7401j03373j13773j16087
13678b17851575q2518M6606J59913J74573J66940J52334Q0600L3106K5700M468
13668b17089853k5362k4926O868O2123R4315N409j00993j10303j19384j46932
13658b17449038j02944j34P1613R3534N0547n097L607K9215M6624M0445L0178
$$ y = [-217851399, -217876851, -217861237, -217851798, -217812473, -217725300, -217646970, -217596146, -217549164, -217550436, -217603583, -217613786, -217586368, -217552591, -217506120, -217488833, -217477777, -217470501, -217512027, -217622709, -217752805, -217826270, -217848930, -217810948, -217715332, -217602036, -217463791, -217281732, -217079096, -216941532, -216989693, -217199614, -217455974, -217707926, -217919995, -218088348, -218222973, -218317448, -218358154, -218300913, -218126586, -217884841, -217688883, -217619111, -217647032, -217673233, -217609083, -217507482, -217470941, -217518342, -217621715, -217735488, -217851575, -217934093, -217887487, -217727574, -217553001, -217386061, -217233727, -217153127, -217120021, -217094321, -217089853, -217115215, -217140141, -217133273, -217071150, -216976835, -216971426, -217072419, -217182722, -217302106, -217449038, -217551982, -217552116, -217480503, -217386969, -217336422, -217341519, -217337912, -217308697, -217262073, -217221628, -217191450]
13647b17191450L9914L3907k1980q3980m8879O2968J09378N5976R260N6419J50189
13636b16828278J63448N7602p1601j61361k13136j92198j16565n5251q1085j14142
13626b17612567o0537K1632K5215n2332r0846p7389j7868O2908P8775K248p9888
13615b17800649r4534k0938Q6486J84036K41862K18489J92130K25844K10926J44761
13605b16411587R6651O9040L5880n4491j20286j19479j17839r3366m0786j4593
13595b16770856O009N4212J09812J19126O9996k1686j23650q0266R8097J91122
13585b16348084J56302O0743p4126j82039j81200j17941m0631J2277o129j04933
13575b16825761k19970k20374o4052R3572O1708o5520j38664j58325j04870M967
$$ y = [-217191450, -217151536, -217117629, -217139609, -217223589, -217272468, -217209500, -217100122, -217044146, -217034886, -216978467, -216828278, -216664830, -216607228, -216678829, -216840190, -217053326, -217245524, -217362089, -217417340, -217498425, -217612567, -217673104, -217651472, -217626257, -217678589, -217769435, -217846824, -217864692, -217801784, -217723009, -217720761, -217800649, -217895183, -217916121, -217829635, -217645599, -217403737, -217185248, -216993118, -216767274, -216556348, -216411587, -216314936, -216245896, -216210016, -216264507, -216384793, -216504272, -216622111, -216715477, -216756263, -216770856, -216764847, -216710635, -216600823, -216481697, -216411701, -216433387, -216557037, -216637303, -216539206, -216348084, -216191782, -216131039, -216205165, -216387204, -216568404, -216686345, -216726976, -216714699, -216720828, -216825761, -217045731, -217266105, -217330157, -217236585, -217174877, -217240397, -217379061, -217537386, -217642256, -217637289]
13565b17637289P5410J05627J09709K9907n4144p1641q5032j35852j61857j38628
13555b17963790j21436q3363j040N3497M3277j2669l4309n530k0524r6758j42395
13544b18385040j23206l3183R8054J38217Q1857K7896K7894J17517K37021K73328
13534b17539645K22170J10556k0036n4361p758M101j1503n8108j09085j16665
13524b17580334o6383K8814Q3759M4585j3959o3123j21651k05279k76358k66546
13514b18436475j43994L5922J45106J25632R7379J12119J18304J25331J81599
13505b17639077K29716J86221R8844N0400N8094Q2109Q1962N1487m0484j52835
13495b16993563j74334j00624q745M3693M1038K2873K9715K9618J5005j4637n5526
$$ y = [-217637289, -217561879, -217456252, -217346543, -217316636, -217370780, -217442421, -217527453, -217663305, -217825162, -217963790, -218085226, -218168589, -218169629, -218116132, -218072855, -218085524, -218119833, -218125363, -218145887, -218242645, -218385040, -218508246, -218541429, -218443375, -218305158, -218223301, -218195405, -218167511, -218049994, -217812973, -217539645, -217317475, -217206919, -217226955, -217281316, -217289074, -217284973, -217296476, -217354584, -217463669, -217580334, -217646717, -217617903, -217534144, -217489559, -217503518, -217566641, -217688292, -217893571, -218169929, -218436475, -218580469, -218544547, -218399441, -218273809, -218176430, -218064311, -217946007, -217820676, -217639077, -217409361, -217223140, -217124296, -217073896, -217015802, -216933693, -216851731, -216800244, -216840728, -216993563, -217167897, -217268521, -217277266, -217233573, -217192535, -217169662, -217139947, -217110329, -217095324, -217109961, -217165487]
13484b17165487l559J82003L23762K20812m681j48167j61773q7960j0171L9576
13474b16815645N4380O5101Q0187L8395L4289J01486J55838J56334R4195K8276
13464b16007164j4714m6327o3033o0031q7818j46294j52248j02510k9594J8353
13454b16691380K7477M5954P0661J29338J50087P990j92808k62379k34148j72844
13444b17122052n8090N9082J47584K04914J72784L5449r4507j34434j57175j62945
13434b17109390j00735k7527k3053o5807q5969o8806j0358P2321J24862J22858
$$ y = [-217165487, -217169046, -216987043, -216663281, -216442469, -216447150, -216595317, -216757090, -216845050, -216855221, -216815645, -216761265, -216696164, -216615977, -216577582, -216543293, -216441807, -216285969, -216129635, -216035440, -216007164, -216021878, -216068205, -216131238, -216191269, -216279087, -216425381, -216577629, -216680139, -216709733, -216691380, -216663903, -216617949, -216547288, -216417950, -216267863, -216259873, -216452681, -216715060, -216949208, -217122052, -217180142, -217121060, -216973476, -216768562, -216595778, -216560329, -216654836, -216789270, -216946445, -217109390, -217210125, -217237652, -217260705, -217326512, -217412481, -217481287, -217491645, -217419324, -217294462, -217171604]
$$ [...]
##END NTUPLES=NMR SPECTRUM
##END=
