##TITLE=H1
##JCAMPDX= 6.0         $$ Bruker NMR JCAMP-DX V2.0
##DATA TYPE= NMR FID
##DATA CLASS= NTUPLES
##ORIGIN= UXNMR, Bruker Analytische Messtechnik GmbH
##OWNER= root
$$ XWIN-NMR		Version 3.5
$$ Mon Feb 22 11:38:28 2016 Russian Standard Time (UT+4h)  servis@DPX200
##.OBSERVE FREQUENCY= 200.131235884673
##.OBSERVE NUCLEUS= ^1H
##.DELAY= (6, 6)
##.ACQUISITION MODE= SIMULTANEOUS
##.ACQUISITION SCHEME= undefined
##.AVERAGES= 16
##.DIGITISER RES= 18
##SPECTROMETER/DATA SYSTEM= spect
##.PULSE SEQUENCE= zg
##.SOLVENT NAME= DMSO
##.SHIFT REFERENCE= (INTERNAL, DMSO, 0, 16.5164)
##AUDIT TRAIL= $$ (NUMBER, WHEN, WHO, WHERE, WHAT)
$$ ##TITLE= Audit trail, XWIN-NMR		Version 3.5
$$ ##JCAMPDX= 5.01
$$ ##ORIGIN= Bruker BioSpin GmbH
$$ ##OWNER= servis
$$ F:/spectra/data/servis-vadim/nmr/H1/1/audita.txt
$$ ##AUDIT TRAIL=  $$ (NUMBER, WHEN, WHO, WHERE, WHAT)
(   1,<2016-02-22 11:37:52.09 +0400>,<servis>,<DPX200>,
      <created by zg, POWCHK disabled, PULCHK disabled
       configuration hash MD5:
       00 E9 B6 7A A2 85 ED C7 34 08 36 98 17 FE 4E 26
       data hash MD5: 16K
       24 E0 7D 52 4C 96 B1 42 37 98 32 41 5E 7D 85 42>)
$$ ##END=
$$ 
$$ hash MD5
$$ 66 B1 72 06 65 02 EB 15 17 2C 40 16 FA 59 A3 5B
##$RELAX= 
##$RELAX= 
##$RELAX= 
##$RELAX= 
##$RELAX= 
##$RELAX= 
$$ Bruker specific parameters
$$ --------------------------
##$DU= <F:/spectra>
##$EXPNO= 1
##$NAME= <H1>
##$PROCNO= 1
##$TYPE= <nmr>
##$USER= <servis-vadim>
##$AMP= (0..31)
100 100 100 100 100 100 100 100 100 100 100 100 100 100 100 100 100 100 
100 100 100 100 100 100 100 100 100 100 100 100 100 100 
##$AQSEQ= 0
##$AQ_mod= 1
##$AUNM= <au_zg>
##$AUTOPOS= <>
##$BF1= 200.13
##$BF2= 200.13
##$BF3= 200.13
##$BF4= 200.13
##$BF5= 500.13
##$BF6= 500.13
##$BF7= 500.13
##$BF8= 500.13
##$BYTORDA= 1
##$CFDGTYP= 0
##$CFRGTYP= 5
##$CHEMSTR= <none>
##$CNST= (0..31)
1 1 145 1 1 1 1 1 1 1 1 1 1 1 1 1 1 1 1 1 1 1 1 1 1 1 1 1 1 1 1 1 
##$CPDPRG= <>
##$CPDPRG1= <>
##$CPDPRG2= <>
##$CPDPRG3= <>
##$CPDPRG4= <mlev>
##$CPDPRG5= <mlev>
##$CPDPRG6= <mlev>
##$CPDPRG7= <mlev>
##$CPDPRG8= <mlev>
##$CPDPRGB= <>
##$CPDPRGT= <>
##$D= (0..31)
0 1 0 0 0 0 0 0 0 0.06 0 0 0 0 0 0 0.0002 0 0 0 0 0 0 0 0 0 0 0 0 0 0 
0 
##$DATE= 1456126671
##$DBL= (0..7)
120 120 120 120 120 120 120 120 
##$DBP= (0..7)
150 150 150 150 150 150 150 150 
##$DBP07= 0
##$DBPNAM0= <>
##$DBPNAM1= <>
##$DBPNAM2= <>
##$DBPNAM3= <>
##$DBPNAM4= <>
##$DBPNAM5= <>
##$DBPNAM6= <>
##$DBPNAM7= <>
##$DBPOAL= (0..7)
0.5 0.5 0.5 0.5 0.5 0.5 0.5 0.5 
##$DBPOFFS= (0..7)
0 0 0 0 0 0 0 0 
##$DE= 6
##$DECBNUC= <off>
##$DECIM= 32
##$DECNUC= <off>
##$DECSTAT= 4
##$DIGMOD= 1
##$DIGTYP= 9
##$DL= (0..7)
0 120 120 120 120 120 120 120 
##$DP= (0..7)
150 150 150 150 150 150 150 150 
##$DP07= 0
##$DPNAME0= <>
##$DPNAME1= <>
##$DPNAME2= <>
##$DPNAME3= <>
##$DPNAME4= <>
##$DPNAME5= <>
##$DPNAME6= <>
##$DPNAME7= <>
##$DPOAL= (0..7)
0.5 0.5 0.5 0.5 0.5 0.5 0.5 0.5 
##$DPOFFS= (0..7)
0 0 0 0 0 0 0 0 
##$DQDMODE= 0
##$DR= 18
##$DS= 0
##$DSLIST= <SSSSSSSSSSSSSSS>
##$DSPFIRM= 0
$$ [...]
##$SUBNAM0= <"">
##$SUBNAM1= <"">
##$SUBNAM2= <"">
##$SUBNAM3= <"">
##$SUBNAM4= <"">
##$SUBNAM5= <"">
##$SUBNAM6= <"">
##$SUBNAM7= <"">
##$SUBNAM8= <"">
##$SUBNAM9= <"">
##$SW= 20.6817932712277
##$SWIBOX= (0..15)
0 0 3 0 0 0 0 0 0 0 0 0 0 0 0 0 
##$SW_h= 4139.07284768212
##$TD= 16384
##$TD0= 1
##$TE= 0
##$TE2= 300
##$TE3= 300
##$TEG= 300
##$TL= (0..7)
0 120 120 120 120 120 120 120 
##$TP= (0..7)
150 150 150 150 150 150 150 150 
##$TP07= 0
##$TPNAME0= <>
##$TPNAME1= <>
##$TPNAME2= <>
##$TPNAME3= <>
##$TPNAME4= <>
##$TPNAME5= <>
##$TPNAME6= <>
##$TPNAME7= <>
##$TPOAL= (0..7)
0.5 0.5 0.5 0.5 0.5 0.5 0.5 0.5 
##$TPOFFS= (0..7)
0 0 0 0 0 0 0 0 
##$TUNHIN= 0
##$TUNHOUT= 0
##$TUNXOUT= 0
##$USERA1= <user>
##$USERA2= <user>
##$USERA3= <user>
##$USERA4= <user>
##$USERA5= <user>
##$V9= 5
##$VALIST= <valist>
##$VCLIST= <CCCCCCCCCCCCCCC>
##$VD= 0
##$VDLIST= <DDDDDDDDDDDDDDD>
##$VPLIST= <PPPPPPPPPPPPPPP>
##$VTLIST= <TTTTTTTTTTTTTTT>
##$WBST= 1024
##$WBSW= 4
##$XGAIN= (0..3)
0 0 0 0 
##$XL= 0
##$YL= 0
##$YMAX_a= 37210
##$YMIN_a= -51112
##$ZGOPTNS= <>
##$ZL1= 120
##$ZL2= 120
##$ZL3= 120
##$ZL4= 120
##$ABSF1= 10
##$ABSF2= 0
##$ABSG= 5
##$ABSL= 3
##$ALPHA= 0
##$AQORDER= 0
##$ASSFAC= 0
##$ASSFACI= 0
##$ASSFACX= 0
##$ASSWID= 0
##$AUNMP= <proc_1d>
##$AZFE= 0.1
##$AZFW= 0.1
##$BCFW= 1
##$BC_mod= 2
##$BYTORDP= 0
##$COROFFS= 0
##$CY= 12.5
##$DATMOD= 1
##$DC= 2
##$DFILT= <>
##$DTYPP= 0
##$F1P= 11.0000006437302
##$F2P= -0.999999642372123
##$FCOR= 0.5
##$FTSIZE= 0
##$FT_mod= 4
##$GAMMA= 1
##$GB= 0
##$INTBC= 1
##$INTSCL= 1
##$ISEN= 128
##$LB= 0.3
##$LEV0= 0
##$LPBIN= 0
##$MAXI= 10000
##$MC2= 0
##$MEAN= 0
##$ME_mod= 0
##$MI= 0
##$NCOEF= 0
##$NC_proc= 0
##$NLEV= 6
##$NOISF1= 0
##$NOISF2= 0
##$NSP= 1
##$NTH_PI= 0
##$NZP= 0
##$OFFSET= 16.51637
##$PC= 1
##$PHC0= -34.59516
##$PHC1= -0.3563094
##$PH_mod= 0
##$PKNL= yes
##$PPARMOD= 0
##$PSCAL= 4
##$PSIGN= 0
##$REVERSE= no
##$SF= 200.13
##$SI= 32768
##$SIGF1= 0
##$SIGF2= 0
##$SINO= 400
##$SIOLD= 32768
##$SREGLST= <1H.CDCl3>
##$SSB= 0
##$STSI= 0
##$STSR= 0
##$SW_p= 4139.07284768211
##$SYMM= 0
##$S_DEV= 0
##$TDeff= 0
##$TDoff= 0
##$TI= <>
##$TILT= no
##$TM1= 0
##$TM2= 0
##$TOPLEV= 0
##$USERP1= <user>
##$USERP2= <user>
##$USERP3= <user>
##$USERP4= <user>
##$USERP5= <user>
##$WDW= 1
##$XDIM= 8192
##$YMAX_p= 0
##$YMIN_p= 0
$$ End of Bruker specific parameters
$$ ---------------------------------
##NTUPLES= NMR FID
##VAR_NAME=  TIME,          FID/REAL,        FID/IMAG
##SYMBOL=    X,             R,               I
##VAR_TYPE=  INDEPENDENT,   DEPENDENT,       DEPENDENT
##VAR_FORM=  AFFN,          ASDF,            ASDF
##VAR_DIM=   8192,          8192,            8192
##UNITS=     SECONDS,       ARBITRARY UNITS, ARBITRARY UNITS
##FACTOR=    0.0002416,     1,               1
##FIRST=     0,             0,               0
##LAST=      1.9789456,     0,               0
##MIN=       0,             -51112,          0
##MAX=       1.9789456,     37210,           0
$$ Real data points
##PAGE= N=1
##DATA TABLE= (X++(R..R)), XYDATA
$$ plain form
0 0 0 0 0 0 0 0 0 0 0 0 0 0 0 0 0 0 0 0 0 0 0 0 0 0 -16 16 -16 16 -16 16 -16 32 -32 32 -32 44 -48 48 -62 64 -68 80
42 80 -85 96 -112 116 -128 144 -160 176 -192 211 -236 256 -286 316 -351 390 -436 492 -559 640
62 640 -736 872 -1053 1317 -1738 2517 -4473 20356 20857 -23732 -24691 -4022 27049 37210 28132
77 28132 2560 -13903 -11879 6570 17654 14824 4662 2705 5647 6448 -685 -8922 -12733 -5743
91 -5743 8490 19194 12628 -8116 -26663 -25460 -4660 19466 25340 7273 -19323 -31495 -21438
104 -21438 340 16671 17449 3462 -13636 -20374 -12327 678 6771 4625 1337 -543 -3592 -6813
118 -6813 -6197 -2679 398 4505 10460 10902 -543 -15494 -18188 -4844 12723 20685 13956 -2921
132 -2921 -18597 -20123 -4276 15357 20688 8271 -8550 -16348 -12708 -2955 6247 9378 5747 -436
$$ packed form
0@%%%%%%%%%%%%%%%%%%%%%%%%j6L2l2L2l2L2l2M8o4O4o4P6r2R6j10J26j32J48
42H0j65J81k08K28k44K72l04L36l68M03m47M92n42O02o67P41q26R28j051J199
62F40j376J608j925K370l055M255o990K4829N01m4589r59K0669L1071J0161r078
77B8132k5572j6463K024J8449J1084k830j0162j957K942Q01p133q237l811O990
91e743J4233J0704o566k0744j8547J203K0800K4126N874j8067k6596j2172J0057
104b1438K1778J6331P78j3987j7098o738Q047J3005O093k146l288j880l049l221
118f813O16L518L077M107N955M42j1445j4951k694J3344J7567P962o729j6877
132b921j5676j526J5847J9633N331j2417j6821p798L640R753R202L131l631o183
$$ plain form
146 -436 -4409 -5423 -5265 -4227 -1198 4058 8606 7693 -813 -11355 -14082 -4809 9743 17549 12306
161 12306 -2081 -15110 -16755 -4783 11351 17479 9281 -3516 -9503 -7444 -2174 3663 8070 8139
175 8139 3616 -1547 -3877 -4262 -3506 495 7340 11061 7006 -1897 -8394 -8665 -3487 5138 11984 10715
191 10715 387 -10738 -13140 -5613 5094 11000 8943 831 -7657 -10761 -7008 536 6597 7566
205 7566 3650 -2183 -6284 -6548 -3340 1402 5343 6234 3153 -2011 -5779 -6378 -3853 1565 7820 9771
221 9771 3856 -6219 -11469 -7692 1491 8872 9716 3932 -4977 -10206 -7499 616 6810 6958 3193
236 3193 -1224 -5019 -6841 -4786 348 4602 5228 2761 -1234 -5245 -7189 -4862 1204 6669 6933 1652
252 1652 -5228 -8650 -6389 183 6453 7700 3312 -3019 -6559 -5462 -1176 3221 5468 5156 2477
$$ packed form
146d36l973j014J58J038L029N256M548r13q506j0542k727R273J4552P806n243
161A2306j4387j3029j645J1972J6134O128q198j2797n987K059N270N837M407O9
175H139m523n163k330l85P56M001O845L721m055q903o497k71N178Q625O846j269
191A0715j0328j1125k402P527J0707N906k057q112q488l104L753P544O061R69
205G566l916n833m101k64L208M742L941Q91l081n164l768n99K525N418O255J951
221I771n915j0075n250L777R183P381Q44n784q909n229K707Q115O194J48l765
236C193m417l795j822K055N134M254O26k467l995m011j944K327O066N465K64n281
252A652o880l422K261O572O270J247m388o331l540J097M286M397K247l12k679
$$ plain form
267 2477 -1955 -5667 -5333 -291 5576 7728 4937 -562 -5167 -6086 -2570 3255 7020 5992 1368 -3051
283 -3051 -4913 -3955 -389 4192 6344 3939 -1041 -4542 -4658 -2339 1199 4408 5388 2868 -1960 -5538
299 -5538 -5261 -1556 2975 5584 4631 224 -4691 -6329 -3628 1142 4656 5054 2200 -2314 -5728 -5651
315 -5651 -1682 3603 6057 3712 -1349 -4912 -4886 -2025 1445 3501 3290 1242 -1364 -3180 -3424 -2011
331 -2011 714 3630 4717 2320 -2477 -5629 -4503 -198 3993 5509 3454 -1150 -5196 -5432 -1505
346 -1505 3484 5539 3460 -629 -3680 -4105 -2061 1089 3152 2918 1197 -626 -2087 -2969 -2434 88
362 88 3177 4294 2147 -1857 -4497 -3902 -653 2935 4552 3174 -436 -3734 -4375 -2053 1594 4080
378 4080 3904 1194 -2240 -4030 -2915 372 3324 3762 1857 -579 -2205 -2641 -1621 662 2924 3448
$$ packed form
267B477m432l712L34N042N867K152k791n499m605r19L516N825L765j028m624m419
283c051j862R58L566M581K152k405m980l501j16K319L538L209R80k520m828l578
299e538K77L705M531K609r53m407m915j638K701M770L514L98k854m514l414P7
315e651L969N285K454k345n061l563K6K861L470K056k11k048k606j816k44J413
331b011K725K916J087k397m797l152J126M305M191J516k055m604m046k36L927
346a505M989K055k079m089l051m25K044L150K063k34j721j823j461q82N35K522
362H8L089J117k147m004k640N95L249L588J617j378l610l298o41K322L647K486
378D080j76k710l434j790J115L287K952M38j905k436j626m36J020K283K262N24
$$ plain form
394 3448 1788 -939 -2933 -3014 -1169 1624 3614 3253 488 -2649 -3862 -2598 320 3161 3959 1783
410 1783 -2009 -4291 -3275 -45 2672 3028 1396 -727 -2134 -2396 -1582 -2 1516 2217 1707 -82
426 -82 -2311 -3327 -2061 837 3200 3225 810 -2189 -3587 -2593 24 2666 3539 1847 -1291 -3364 -2813
443 -2813 -336 2044 2849 1877 39 -1589 -2155 -1387 148 1497 2086 1732 312 -1705 -2763 -1782 660
460 660 2572 2600 969 -1181 -2589 -2434 -678 1724 3032 2197 -246 -2510 -3029 -1442 1225 2950 2493
477 2493 275 -1885 -2435 -1349 388 1556 1716 1145 18 -1248 -1884 -1322 175 1622 2044 1287 -291
494 -291 -1812 -2246 -1128 1033 2658 2433 505 -1748 -2791 -1872 575 2708 2728 636 -1663 -2395 -1468
511 -1468 66 1243 1608 1092 -78 -1282 -1758 -1262 -68 1151 1697 1079 -402 -1713 -1881 -903 555
$$ packed form
394C448j660k727j994q1J845K793J990l61k765l137j213J264K918K841P98k176
410A783l792k282J016L230K717L56j632k123j407k62Q14J580J518P01n10j789
426h2k229j016J266K898K363K5k415k999j398R94K617K642Q73j692l138k073N51
443b813K477K380Q05r72j838j628n66P68J535J349N89l54j420k017j058R81K442
460F60J912K8j631k150j408J55J756K402J308q35k443k264n19J587K667J725m57
477B493k218k160n50J086J737J168J60n71j127j266o36N62J497J447M22p57j578
494b91j521m34J118K161J625k25j928k253j043R19K447K133K0k092k299p32R27
511a468J534J177L65n16j170j204m76M96J194J219N46o18j481j311j68R78J458
$$ plain form
528 555 1703 1799 728 -938 -2108 -1891 -233 1750 2456 1321 -668 -1986 -1834 -494 1081 1914 1558
545 1558 256 -1173 -1725 -1080 177 1280 1659 1050 -302 -1413 -1409 -514 499 1142 1322 819 -349 -1552
563 -1552 -1784 -625 1038 1952 1438 -104 -1649 -2058 -973 710 1686 1365 263 -918 -1527 -1229 -192
580 -192 1002 1545 1058 -127 -1196 -1382 -655 403 1135 1247 694 -249 -1146 -1345 -556 759 1604 1360 242
599 242 -1036 -1626 -1034 363 1433 1385 503 -476 -1152 -1226 -513 690 1497 1187 38 -1076 -1330 -773 184
618 184 1024 1151 473 -434 -1006 -1045 -604 234 1068 1219 391 -808 -1462 -1114 -29 1015 1271 672 -324 -1096
638 -1096 -1157 -496 512 1219 1133 260 -779 -1196 -732 144 900 1073 592 -220 -778 -781 -428 127 815 1142 648
659 648 -443 -1223 -1028 -141 767 1124 782 -65 -929 -1140 -563 303 889 965 424 -492 -1186 -967 -48 799
$$ packed form
528E55J148R6j071j666j170K17J658J983P06j135j989j318J52J340J575Q33l56
545A558j302j429n52O45J257J103L79o09j352j111MQ95J013O43J80n03j168j203
563a552k32J159J663R14n14j542j545m09J085J683R76l21j102j181o09K98J037
580a92J194N43m87j185j069j86P27J058P32J12n53r43q97j99P89J315Q45k44j118
599B42j278n90N92J397J070m8q82r79o76p4P13J203Q07l10j149j114k54N57R57
618A84Q40J27o78r07n72l9M41Q38Q34J51q28j199o54L48J085J044K56n99r96p72
638a096o1O61J008P07q6q73j039m17M64Q76P56J73m81q12n58lL53N55O88L27m94
659F48j091p80J95Q87R08L57l42q47q64k11N77Q66N86P6n41r16o94K19R19Q47
$$ plain form
679 799 961 497 -194 -707 -793 -439 119 635 794 478 -184 -807 -892 -317 507 980 790 153 -567 -921 -641
700 -641 97 775 974 601 -193 -958 -1012 -257 714 1061 599 -158 -661 -726 -421 126 599 670 313 -187 -576
721 -576 -718 -449 231 772 668 105 -482 -711 -598 -143 450 825 611 -57 -734 -908 -443 340 928 808
741 808 95 -609 -779 -421 126 571 647 374 -120 -512 -602 -299 208 625 636 169 -359 -564 -435 -109 278
762 278 587 559 106 -490 -760 -504 99 649 771 308 -443 -856 -542 33 479 569 382 -10 -481 -637 -368
783 -368 184 561 533 183 -276 -550 -443 -63 306 468 394 153 -254 -561 -475 -34 500 695 393 -187 -642
804 -642 -587 -101 373 561 427 71 -359 -573 -437 43 491 541 217 -193 -515 -483 -120 282 438 299 54
825 54 -195 -417 -441 -136 326 570 372 -110 -499 -523 -230 234 511 443 77 -283 -445 -371 -47 346 540 340
$$ packed form
679G99J62m64o91n13q6L54N58N16J59l16o62o23q5N75Q24M73j90o37p20l54K80
700f41P38O78J99l73p94p65n4P55R71L47m62p57n03o5L05N47M73P1l57n00l89
721e76j42K69O80N41j04n63n87k29J13M55N93L75k14o68o77j74M65P83N88j20
741H08p13p04j70L58N47M45P6k73m94l92r0L03N07M17J1m67n28k05J29L26L87
762B78L09k8m53n96k70K56O03N50J22m63p51m13L14N75M46R0j87l92m71j56K69
783c68N52L77k8l50m59k74J07L80L69J62p4k41m07l07Q6M41N34J95l02n80m55
804f42N5M86M74J88j34l56m30k14J36M80M48N0l24m10l22L2L63M02J56j39k45
825E4k49k22k4L05M62K44j98m82l89k4K93M64K77o8l66l60j62P4L24L93J94k00
$$ plain form
847 340 -95 -461 -442 -125 222 419 325 96 -169 -336 -331 -126 204 451 391 9 -393 -484 -273 109 408 420 120
870 120 -238 -423 -347 -98 245 448 361 -19 -390 -453 -177 204 369 314 108 -135 -297 -266 -82 154 321 343
892 343 122 -245 -440 -284 70 357 381 166 -125 -343 -332 -140 164 396 348 50 -296 -451 -267 99 351
913 351 298 78 -166 -300 -259 -75 105 229 243 100 -157 -364 -291 -12 280 348 192 -58 -240 -300 -159 118
935 118 354 340 118 -189 -336 -280 39 337 381 147 -148 -280 -212 -63 109 216 226 98 -145 -263 -244 -54
957 -54 181 286 177 -49 -200 -265 -155 7 216 287 149 -86 -319 -319 -86 245 357 201 -92 -274 -247 -58
979 -58 103 220 216 115 -101 -230 -182 -27 176 256 210 5 -185 -216 -92 33 154 216 159 -29 -221 -284 -124 143
1003 143 300 199 -34 -238 -264 -138 64 190 171 62 -89 -202 -206 -66 106 223 167 -14 -166 -189 -93 30
$$ packed form
847C40m35l66J9L17L47J97r4k29k65j67NK05L30K47o0l82m02r1K11L82K99J2l00
870A20l58j85P6K49L43K03q7l80l71o3K76L81J65n5k06k43j62L1J84K36J67K2
892C43k21l67j95J56L54K87K4k15k91k18J1J92L04K32m8k98l46j55J84L66K52
913C51n3k20k44j34M1J84J80J24J4j43k57k07P3K79K92O8j56k50j82o0J41K77
935A18K36j4k22l07j47N6L19K98M4k34k95j32O8J49J72J07J0j28k43j18J9J90
957e4K35J05j09k26j51o5J10J62K09P1j38k35k33%K33L31J12j56k93j82K7J89
979e8J61J17mj01k16j29M8J55K03Q0m6k05j90l1J24J25J21O2n7j88j92o3J60K67
1003A43J57j01k33k04k6J26K02J26j9j09j51j13mJ40J72J17n6j81j52k3R6J23
$$ plain form
1025 30 143 181 131 16 -140 -223 -109 111 252 247 60 -144 -220 -126 74 204 212 94 -36 -127 -171 -81 109 221
1049 221 179 9 -131 -189 -120 11 112 149 88 -25 -136 -191 -145 -2 150 205 72 -133 -242 -165 6 153 178
1072 178 91 -24 -120 -164 -87 47 184 193 61 -103 -163 -85 22 130 151 97 3 -81 -115 -88 -4 136 198 120 -56 -191
1098 -191 -169 -11 132 143 103 -18 -147 -160 -86 12 122 127 68 -88 -173 -154 -7 99 119 63 -28 -74 -91 -78 -4 100
1124 100 150 110 -1 -121 -121 -38 121 166 134 55 -57 -111 -64 30 121 158 104 -14 -137 -149 -26 98 133 65 -21 -87
1150 -87 -75 -69 -42 56 85 53 -8 -100 -152 -100 29 118 80 -14 -77 -103 -90 -26 67 109 107 -11 -116 -124 -61 71 152 119 12
1179 12 -45 -69 -61 8 73 102 98 25 -53 -84 -64 35 111 110 22 -63 -83 -64 -28 28 76 94 16 -84 -125 -62 5 96 106 28 -81
1210 -81 -106 -58 17 47 58 69 24 -55 -101 -56 19 75 107 33 -45 -59 -57 13 62 72 87 29 -22 -66 -79 27 107 113 50 -31 -90
$$ packed form
1025C0J13L8n0j15j56q3J14K20J41nj87k04p6R4K00J30Qj18j30r1m4R0J90J12
1049B21m2j70j40n8O9J31J01L7o1j13j11n5M6J43J52N5j33k05j09P7J71J47K5
1072A78q7j15r6m4P7J34J37Rj32j64o0P8J07J08K1n4r4q4l4K7Q4J40O2p8j76j35
1098a91K2J58J43J1m0j21j29j3P4R8J10Nn9j56q5J9J47J06K0n6r1m6j7J3P4J04
1124A00N0m0j11j20%Q3J59M5l2p9j12n4M7R4R1L7n4j18j23j2J23J24L5o8q6o6
1150h7J2OK7R8K9l2o1r2n2N2J29Q9l8r4o3k6J3O4R3M2kj18j05qO3J32Q1l3j07
1179A2n7k4QO9O5K9mp3p8l1K0R9P6jq8q5k0J9L6N6M8J8p8j00m1O3O7R1J0p8j09
1210h1k5M8P5L0J1J1m5p9m6M5P5N6L2p4p8j4KP0M9J0J5n8n1m4j3J06Q0Oo3q1n9
$$ plain form
1241 -90 -62 -11 37 75 44 10 -37 -75 -90 -21 55 64 17 -38 -67 -100 -42 27 53 39 25 -36 -77 -85 -10 57 97 60 -31 -63 -72 -13
1273 -13 60 83 67 27 -6 -35 -57 19 76 104 69 3 -58 -29 -6 33 65 54 23 6 -42 -38 -29 22 75 68 -2 -77 -79 -42 0 39
1305 39 24 3 -40 -71 -54 -31 12 41 32 8 -57 -64 -20 51 41 57 44 -3 -37 -46 -11 29 75 83 22 -42 -62 -25 47 76 53 18
1337 18 -7 -35 -40 -5 25 65 56 8 -29 -68 -44 3 36 27 -5 -28 -40 -34 -41 -9 30 32 22 -29 -70 -45 -6 52 59 29 12 -30 -34 -11
1371 -11 35 66 71 43 6 -45 -18 33 60 76 16 -5 -12 0 -11 24 36 42 40 0 -58 -51 -14 26 36 16 -17 -45 -47 -41 -6 3 23 23 -26
1406 -26 -74 -67 -20 27 42 8 -36 -44 -31 -9 1 26 37 48 -2 -23 -24 7 46 59 49 21 4 -4 11 21 29 42 40 26 -27 -31 2 31
1440 31 42 30 -15 -40 -40 -19 4 12 12 9 -16 -47 -48 -24 15 25 33 -4 -20 -34 -11 3 16 21 41 16 -2 -20 -6 28 43 46 21 -21
1474 -21 -24 6 21 25 31 31 17 1 -9 -16 19 32 9 -13 -15 -28 -27 -8 -4 9 -14 -6 -26 -53 -39 -21 6 15 4 -46 -47 -24 -2 17 19 17 -1
$$ packed form
1241i0K8N1M8L8l1l4m7l8j5O9P6Rm7n5k9l3N8O9K6j4j4o1m1qP5O7M0l7r1l2rN9
1273a3P3K3j6m0l3k9k2P6N7K8l5o6o1K9K3L9L2j1l1j7m8MRN1N3pp0p5kL7M2L9
1305C9j5k1m3l1J7K3M3K9rk4o5pM4P1j0J6j3m7l4rL5M0M6Qo1o4k0L7P2K9k3l5
1337A8k5k8nL5L0M0rm8l7l9K4M7L3rl2k3j2OpL2L9Kj0n1m1K5L9N8Pl0j7m2mK3
1371a1M6L1Nk8l7n1K7N1K7J6o0k1pJ2j1L5J2Okm0n8PL7M0J0k0l3k8kOL5RK0%m9
1406b6m8PM7M7J5l4m4qJ3K2J0K5J1J1n0k1jL1L9J3j0k8j7qJ5J0QJ3kj4n3mL3K9
1440C1J1j2m5k5%K1K3Q%lk5l1jK4L9J0Ql7j6j4K3J4J3NK0k5j8j8J4L4J5Lk5m2
1474b1lL0J5MO%j4j6j0pL5J3k3k2kj3JJ9MJ3k3Qk0k7J4J8K7Rj1n0jK3K2J9Kkj8
$$ plain form
1511 -1 -6 -13 -9 22 32 38 9 -3 -19 11 20 35 44 35 18 10 -4 8 15 53 55 21 2 -24 -25 -10 14 19 26 1 -36 -34 -24 -22 2 10 14 -32 -31 -25
1551 -25 -1 -7 -5 2 4 -9 -19 -16 5 13 30 12 9 -10 -8 14 39 35 15 14 9 11 5 14 25 41 18 23 -3 -3 13 14 22 12 -12 -12 2 -9 -10 -14 18
1592 18 13 -20 -30 -35 -6 -18 18 3 -8 -26 -15 -26 -7 20 5 20 5 -15 0 5 38 23 31 9 6 22 18 14 28 30 44 50 8 12 11 17
1628 17 27 34 29 3 -15 7 -7 -14 -1 16 -3 -18 -32 -28 -6 16 -2 3 -31 -12 -21 -11 -1 6 13 13 -8 -13 -24 0 21 22 19 10 9 -5 23
1665 23 23 24 27 22 20 -12 2 8 47 27 27 7 0 1 19 12 15 10 16 -3 -27 -5 -4 7 17 -6 -25 -20 -13 -9 6 -10 -9 1 -9 -4 -14 -10 5 10 2
1706 2 15 -3 13 -2 23 35 33 33 23 15 8 15 21 28 22 15 -4 14 8 18 14 19 16 12 5 -13 -16 4 19 6 -7 -15 -13 -3 -10 -11 -2 -12 -14 -4 -13 -15 -11
1749 -11 3 -4 -8 -2 17 18 14 11 -3 21 18 4 25 7 27 21 36 11 8 0 13 14 14 25 1 7 5 -4 4 12 6 -4 -1 -4 -24 -7 -1 -9 -14 -26 -21 -13 -15
1792 -15 -24 -21 4 8 -13 -22 -23 -11 -10 21 -1 8 3 -2 -6 -10 21 2 32 17 8 17 2 28 22 16 9 14 4 6 2 -2 -4 10 10 -3 -17 -13 -20 -3 -6 -2 -25
$$ packed form
1511anpML1J0Ok9j2j6L0RJ5Rrj7qj4J2PL8Kl4j9k6jJ5K4NPk5l7KJ0KK4QMm6JO
1551b5K4oKPKj3j0LK1QJ7j8lj9KK2K5mk0jnKoRJ1J6k3Nk6%J6JQj0k4%J4j1jmL2
1592A8nl3j0nK9j2L6j5j1j8J1j1J9K7j5J5j5k0J5NL3j5Qk2lJ6mmJ4KJ4Om2MjO
1628A7J0Pnk6j8K2j4pJ3J7j9j5j4MK2K2j8Nl4J9rJ0J0PP%k1nj1K4K1Jlrjj4K8
1665B3%JLnkl2J4OL9k0%k0pJJ8pLnOj9k4K2JJ1J0k3j9NPMJ5j6JJ0j0Nj0MJ5Nq
1706BJ3j8J6j5K5J2k%j0qpPOPopj9J8oJ0mNlmpj8lK0J5j3j3qKJ0pjRj0kJ0rkM
1749a1J4pmOJ9Jmlj4K4lj4K1j8K0oJ5k5lqJ3J%J1k4OkrQQoj0Llk0J7Oqnj2NQk
1792a5rLK5Mk1rjJ2JL1k2RnnmmL1j9L0j5rRj5K6oopNj0KmmkJ4%j3j4MpJ7lMk3
$$ plain form
1835 -25 -8 -21 -10 -25 -12 -4 -5 -16 -24 -11 5 -5 -17 -4 0 12 7 10 30 9 11 27 14 2 9 15 35 33 22 17 28 7 19 23 20 26 19 17
1873 17 13 24 2 7 10 4 -1 -14 -20 -13 -28 -25 -17 -12 -20 -21 -17 -30 0 -11 -17 -7 -12 -6 -18 -3 9 12 7 8 -4 -2 2 9 8 23 8 -5 10 10 0 8 -4
1916 -4 31 3 7 1 2 12 21 8 -12 11 2 -1 -17 2 3 -18 -16 -18 -24 -36 -16 -9 -21 -14 -18 -22 -4 1 2 -4 -8 5 2 4 -5 16 29 18 24 32 19 32
1958 32 15 25 22 41 32 23 15 4 35 22 28 6 -8 17 -2 19 18 -10 1 -10 -14 -17 -2 -3 -6 9 -18 -27 -9 -16 -17 -3 -2 -16 -1 -8 -1 -7 -3
1997 -3 14 16 17 11 13 13 18 17 25 29 33 37 27 19 16 15 13 25 17 15 -3 8 13 12 18 -3 0 -3 -2 -12 -1 -2 -7 -17 -6 -10 -20 -17 -8 -21 -9 -10 6 -10 1
2042 1 -8 8 -4 7 16 3 14 23 25 11 16 16 21 7 14 26 24 35 23 23 17 21 13 3 12 19 11 8 -3 1 9 -13 -11 -4 -28 -30 -25 -14 -23 -5 -10 -24 -14
2085 -14 -20 -22 -14 0 3 5 -3 -8 -20 9 23 19 17 1 1 27 25 14 14 28 19 25 31 16 28 20 28 25 22 -3 14 19 24 3 25 20 8 5 -10 2 -19 -19
2127 -19 -3 -24 -15 -17 -30 -23 -17 4 -13 2 3 -18 -9 -4 3 18 -4 2 15 18 11 2 22 6 20 18 20 21 23 21 19 7 19 2 1 11 7 4 10 3 -1 -2 0
$$ packed form
1835b5J7j3J1j5J3Qjj1qJ3J6j0j2J3MJ2nLK0k1KJ6j3j2POK0kj1nJ1k1J2MlOpk
1873A7mJ1k2NLonj3oPj5LQNqjMj3L0j1oJ0nOj2J5J2LnJj2KMPjJ5j5j3J5%j0Qj2
1916dL5k8MoJJ0Rj3k0K3rlj6J9Jk1Kkoj2K0Pj2PmmJ8NJomJ3lKrK1J3j1OQj3J3
1958C2j7J0lJ9rrqj1L1j3Ok2j4K5j9K1jk8J1j1mlJ5jlJ5k7rJ8pjJ4Jj4J5pPoM
1997cJ7KJoK%NjQMMMj0qljkJ2qkj8J1NjOk1LlJj0J1jnj0J1mj0LRj3J2jJ6j6J1
2042ArJ6j2J1Rj3J1RKj4N%Nj4PJ2kJ1j2%oMqj0RPqlj1MQk2KPk4kNJ1rJ8nj4J0
2085a4okQJ4LKqnj2K9J4mkj6%K6kj1%J4rOOj5J2qQllk5J7NNk1K2nj2lj5J2k1%
2127a9J6k1Rkj3POK1j7J5Jk1RNPJ5k2OJ3LprK0j6J4kKJKkkj2J2j7jJ0mlOpmjK
$$ plain form
2170 0 -9 -12 -12 -5 -7 -22 -26 -14 -15 -14 -25 -22 -23 -16 -13 -24 -21 -7 -7 -24 -13 -5 9 5 23 8 12 10 23 29 27 22 34 23 34 22 21 15 15 16 28 15 9 20
2214 20 10 -3 -10 -7 2 -20 -21 -14 -16 -15 -6 -11 -7 -15 -4 -14 -23 -12 -6 3 -8 -15 -21 -4 -2 -12 3 17 16 12 14 10 30 40 20 10 29 22 33 17 15 7
2256 7 19 37 20 24 20 10 8 15 14 5 8 4 3 -20 -26 -1 -2 -6 -10 -18 -11 -7 -15 -18 -8 6 -4 0 -1 8 20 -3 12 19 8 12 20 23 18 14 21 17 5 24 13
2301 13 32 19 30 15 25 9 24 13 7 12 16 4 1 -5 -6 -2 -6 12 -5 -4 -19 -5 -27 -8 -29 -24 -18 -12 -34 -7 -23 -13 -1 -7 9 -5 -3
2338 -3 -7 16 10 13 23 23 13 30 21 51 14 30 26 7 5 1 15 8 26 20 6 23 5 -5 -4 6 -8 -18 -7 -9 9 -6 0 -12 -32 -22 -32
2375 -32 -8 -15 -21 -12 -17 -5 6 -7 -10 -2 2 -4 1 17 14 21 22 25 17 11 13 22 10 7 18 15 23 16 21 17 5 -1 6 -5 -7 3 -8 -14 -6 -6 4 -16 -15 -20 -23 -21 -12
2422 -12 -18 -15 -27 -15 -14 -26 -23 -10 -11 -2 3 -6 -10 11 10 5 14 6 13 18 15 15 17 25 26 22 27 13 28 13 16 24 2 8 4 5 -3 -8 7 -7 -12 -6 -16 -29 -18 -23
2468 -23 -14 -5 -21 -27 -31 -32 -13 -19 -18 -13 6 -7 -8 8 -10 -2 7 10 20 19 3 5 25 -5 8 4 3 26 29 27 17 10 9 8 7 18 5 8 2 2 -9 6 -6
$$ packed form
2170@rl%Pkj5mJ2jJj1LjPLj1LJ4%j7J1QJ4mJ8j5MkJ3OknJ2j1J1j2jo%JJ2j3oJ1
2214B0j0j3pLRk2jPkJRnMqJ1j0rJ1ORj1poJ7Kj0J5J4jmKmK0J0k0j0J9pJ1j6kq
2256GJ2J8j7Mmj0kPjrLmjk3oK5jmmqPMqlJ0J4j0MjRJ2k3J5Pj1MQLnmPmj2J9j1
2301A3J9j3J1j5J0j6J5j1oNMj2lojMmJ8j7Jj5J4k2J9k1NOOk2K7j6J0J2oJ6j4K
2338cmK3oLJ0%j0J7rL0l7J6mj9kmJ4pJ8oj4J7j8j0JJ0j4j0J1kJ8j5Oj2k0J0j0
2375c2K4poRnJ2J1j3lQMoNJ6lPJLqoKRj2lJ1lQpNmj2oPj1kJ0j1oQ%J0k0JnlKR
2422a2oLj2J2Jj2LJ3jRNrmK1jnRqPNl%KQJmNj4J5j5LQk2OmJqnJ5j4nOj0j3J1n
2468b3RRj6omjJ9oJNJ9j3jJ6j8QRLJ0jj6KK0l0J3mjK3Lkj0pjjjJ1j3Lo%j1J5j2
$$ plain form
2511 -6 7 -5 -14 -10 -17 -21 -20 -17 -14 -13 -8 -12 1 -16 -17 1 8 5 -3 -9 7 11 17 5 4 19 9 27 27 22 12 19 35 6 24 14 19 7 14 15 7 14 -7 -7
2555 -7 -3 -2 6 2 -15 -9 -12 -12 -10 -7 -23 -17 -19 -26 -21 -27 -16 -14 -18 -19 4 -7 -8 -7 7 4 6 10 5 23 10 8 14 10 30 41 28 21 16 23 18 20 9 7 10 1 -1 9
2603 9 6 10 0 3 -1 -2 -8 -11 -5 -17 -28 -26 -21 -16 -16 -19 -14 -13 -15 -8 -4 -10 -15 -7 -12 4 11 -5 9 22 2 8 21 9 18 15 5 19 12 28 12 21 9 4 25
2648 25 2 2 11 0 1 4 1 -14 -29 -4 -15 -11 -17 -13 -23 -13 -5 -3 -21 -14 -12 -4 -8 -8 -7 -14 -4 -9 2 -15 2 -1 -3 -1 18 4 12 19 13 19 12 22 17 33
2692 33 15 16 29 14 18 -2 10 18 23 -5 2 5 -1 -22 -19 0 -13 -26 -26 -13 -24 -27 -23 -21 -28 -24 -10 -16 -20 -22 -22 -16 -7 1 7 1 -2 -2 4 10 16 7 24 20 32
2737 32 29 8 18 4 2 3 16 7 20 13 2 1 -2 -15 -5 0 -10 -12 -7 -29 -22 -15 -25 -14 -6 -1 -9 -20 -26 -10 -17 -31 -16 -18 0 -9 -9 -11 -11 2 -6 2
2779 2 27 14 12 30 23 -4 20 36 24 6 9 6 9 6 0 -1 0 1 2 -6 -16 -6 -3 -16 -6 -24 -27 -24 -20 -23 -13 -12 -36 -24 -11 -35 -31 -18 -16 0 -4
2820 -4 -18 -14 7 -18 -14 -2 15 17 8 15 -4 18 10 12 2 31 14 8 2 23 11 -2 10 -5 2 8 2 3 10 -6 -16 -21 -16 -23 -14 -13 -16 -36 -17 -15 -9 -12
$$ packed form
2511fJ3j2rMpmJLLJNmJ3j7jJ8PlqoJ6MOj2jJ5j0J8%nj0PJ6k9J8j0Nj2PJqPk1%
2555gMJQmj7Ol%KLj6OkpNoJ1KmjK3j1jJJ4lKMnJ8j3kOmK0J1j3pnPnKj1kLrkJ0
2603IlMj0LmjolOj2j1KNN%lNJkPMonQnJ6Pj6J4J3k0OJ3j2Rlj0J4pJ6j6Rj2nK1
2648B5k3%Rj1JLlj5j5K5j1MoMj0J0QKj8PKQm%JpJ0nJ1j7J7lkKJ9j4QPoOpJ0nJ6
2692C3j8JJ3j5Mk0J2QNk8PLok1LJ9j3j3%J3j1lMKpMJ4omk%ORQOol%OOOrJ7mJ2
2737C2lk1J0j4kJJ3rJ3pj1jlj3J0Nj0kNk2PPj0J1QNqj1oJ6pj4J5kJ8r%k%J3qQ
2779BK5j3kJ8pk7K4J6j2j8LlLlojJJJqj0J0Lj3J0j8lLMlJ0Jk4J2J3k4MJ3KJ6m
2820dj4MK1k5MJ2J7KrPj9K2qKj0K9j7ooK1j2j3J2j5POoJPj6j0nNpRJlk0J9KOl
$$ plain form
2862 -12 -23 -19 -8 1 -5 10 -24 -1 15 5 9 10 -9 16 2 16 13 13 5 23 21 7 11 8 7 3 20 21 0 8 9 -3 2 -2 9 -1 -7 -9 -11 -19 -10 -25
2904 -25 -19 -18 -15 -31 -21 -8 -30 -28 -13 -18 -15 -3 1 -13 -6 0 3 0 16 -3 15 4 24 24 25 20 18 21 12 13 13 16 7 -2 -3 17 3 5 -1 -8 -7 -19 -10 -8 -7
2949 -7 -11 -4 -13 -27 -14 -25 -20 -32 -21 -31 -30 -17 -31 -36 -20 2 -7 -19 -21 -7 -8 -6 6 0 1 22 18 10 11 17 16 21 6 9 -3 20 22 11 4 1 -8 -11 -6
2992 -6 -15 -20 4 -10 -21 4 -17 -18 -17 -28 -13 -16 -13 -32 -16 -25 -12 -8 1 -21 -13 2 -5 -21 3 -8 18 4 9 23 11 28 25 17 25 3 33 26 31
3031 31 31 30 10 23 11 18 6 -5 3 3 -8 -15 -7 -22 -5 -10 -3 -29 -23 -15 -21 -27 -19 -36 -30 -15 -24 -21 -4 -6 -22 -15 -10 -11 4 -2 -5 2 13 5 17 16 7 9
3075 9 4 23 13 22 25 30 24 28 7 14 8 5 -4 12 2 2 -6 1 3 -4 -27 -38 -25 -24 -22 -16 -10 -15 -12 -15 -12 -11 -20 -3 -19 -13 -11 -3 -6 -8 8 0 -4 8 17 25 10 13
3123 13 22 13 22 -5 9 10 15 12 14 13 -4 2 20 3 7 -10 18 -2 -6 -9 7 -11 -23 -8 -3 -8 -17 -33 -17 -7 -25 -26 -29 -22 -5 -18 -15 -8 -6 -4 -13 -11
3165 -11 2 0 22 13 14 16 24 1 17 18 40 19 12 17 28 3 12 16 12 0 17 8 -2 -9 -8 3 -27 -15 -8 -3 -14 -17 -10 2 -13 -23 -18 -8 -26 -26
$$ packed form
2862a2j1MJ1RoJ5l4K3J6j0MJj9K5j4J4l%qJ8kj4MljmJ7Jk1QJj2NmJ1j0okkqRj5
2904b5OJLj6J0J3k2KJ5nLJ2Mj4POLlJ6j9J8j1K0%JnkLrJ%LrrjK0j4KopJj2RKJ
2949gmPrj4J3j1Nj2J1j0JJ3j4nJ6K2rj2kJ4jKJ2oJK1mqJOjNj5Lj2K3Kj1plrlN
2992frnK4j4j1K5k1jJj1J5lLj9J6rJ3MRk2QJ5pj6K4j1K6j4NJ4j2J7lqQk2L0pN
3031C1%jk0J3j2Pj2j1Q%j1pQj5J7nPk6OQooQj7OJ5rLJ7kj6PNjJ5olPJ1qJ2jrK
3075InJ9j0RLNoMk1PolrJ6j0%qPKpk3j1J3JKOOnLlLJrJ7j6OKQlkJ6qmJ2RQj5L
3123A3RrRk7J4JNlKjj7OJ8j7Mj7K8k0mlJ6j8j2J5Nnrj6J6J0j8jlPJ7j3LPKKrK
3165a1J3kK2rJKQk3J6JK2k1pNJ1k5RMmj2J7rj0pJJ1l0J2PNj1lPJ2j5j0NJ0j8%
$$ plain form
3205 -26 -22 -13 -25 -6 0 -10 -9 9 6 -1 20 7 15 14 15 11 19 27 25 29 24 11 12 18 20 5 10 -5 5 15 12 5 4 -14 -3 -8 -10 5 -19 -1 -12 -26
3247 -26 -3 -8 -17 4 -19 -14 -7 -19 5 -13 -7 8 28 18 12 3 -1 13 16 21 14 39 17 14 17 10 11 30 25 12 13 18 17 13 3 4 11 11 0 -10 -1 -15
3289 -15 -20 -21 -14 -22 -9 -23 -27 -19 -19 -15 -20 -5 -7 -15 5 7 -5 -16 0 11 9 17 16 14 21 14 9 18 4 16 5 16 20 21 19 27 24 6 23 19 15 19 16 -11 13
3334 13 9 7 -6 -20 -21 -8 -9 -21 -11 -19 -23 -9 8 -12 -3 -10 -3 -9 -15 -16 -2 -12 -8 7 10 3 36 22 26 23 14 26 24 18 41 19 17 20 23 22 8 20
3376 20 18 25 6 10 16 -3 10 -9 -4 -1 -9 -26 -8 -17 -20 -17 -20 -21 -19 -4 -27 -7 -17 -35 -7 -8 -16 -5 -1 -9 -3 2 7 10 18 14 17 21 26 27 35 19 22 15 25
3421 25 24 31 35 22 21 23 1 5 -5 -3 0 -7 -11 -6 2 3 -11 -20 -26 -23 -34 -13 10 -16 -13 -7 -18 -14 -20 5 0 -2 -7 2 8 -2 24 20 12 15 21 20 17 19 17 21 9
3468 9 28 12 10 24 15 18 10 3 9 -4 7 7 -8 13 -7 -7 -11 -29 -23 -18 -25 -15 -17 -4 -17 -13 -17 -2 -11 2 -9 12 -7 2 3 5 11 7 9 9 3 27 31
3511 31 20 8 15 26 29 22 9 29 11 17 21 10 22 19 5 6 8 -6 8 3 -3 -7 -15 -12 -17 -4 -11 -14 -20 -19 -16 -21 -14 0 -16 -5 -6 -26 14 -7 4
$$ packed form
3205b6MRj2J9Oj0JJ8lpK1j3QjJmQQkMnj3JOKj5Nj5J0J0lpjj8J1nkJ5k4J8j1j4
3247b6K3nrK1k3NPj2K4j8OJ5K0j0ormJ4LNpK5k2lLpJJ9nj3JNjmj0JP%j1j0Rj4
3289a5njPqJ3j4mQ%MnJ5kqK0Kj2j1J6J1kQjkPpnRj4J2j1J1MJkQlj8J7mmMlk7K4
3334A3mkj3j4jJ3jj2J0qmJ4J7k0RpPoojJ4j0MJ5LpL3j4MlrJ2koK3k2kLLjj4J2
3376B0kPj9MOj9J3j9NLqj7J8rlLljKJ5k3K0j0j8K8jqJ1MqONNLQmLMNJQj6LpJ0
3421B5jPMj3jKk2Mj0KLpmNQJj4roLj1K1K3k6LOj1MoK5nknROj0K6mqLOjlKkMj2
3468IJ9j6kJ4rLqpOj3J1%j5K1k0%mj8ONpJ0kJ3j3MmJ5rJ3j1K1j9RJKOmK%oK4M
3511C1j1j2PJ1Lpj3K0j8OMj1J2lj4JKj4J4nomqLnJ3ploJLnPJ4j6J1jk0M0k1J1
$$ plain form
3552 4 6 -2 9 27 3 7 16 13 21 27 28 -2 11 21 17 22 16 16 16 10 -2 2 -13 -14 10 3 4 -6 -8 -10 -19 -19 -9 -13 -24 -39 -26 -20 -25 -14 -20 -24 -22 -10 -20
3597 -20 -18 7 -3 11 1 9 13 4 12 22 9 32 19 25 38 26 6 23 16 30 11 24 7 5 -17 -3 11 2 3 -3 -14 -3 -14 -12 -16 -19 -28 -14
3635 -14 -23 -13 -10 -14 -32 -3 -15 -18 -9 -20 0 -10 0 3 9 -4 15 4 13 12 24 14 13 11 25 17 19 20 29 24 34 23 17 17 -3 11 11 -5 -7 -3 -15
3676 -15 -15 -20 -21 -14 -18 -6 -33 -21 -14 -8 -17 -8 -12 -19 -4 -2 -6 -8 10 -4 3 -3 15 9 5 8 15 11 2 22 15 12 13 12 13 7 17 -3 2 5 9 0 -2 2 -4 -4 -6 14 -8
3725 -8 -4 6 -6 -13 -23 -8 -9 -28 -6 -8 -27 -19 -23 -17 -17 -1 -22 -7 -4 -5 -12 -8 5 16 -6 31 19 18 22 29 25 9 22 12 17 26 10 14 2 8 22
3766 22 0 12 4 -2 -2 -2 -4 -22 -18 -16 -6 -7 -9 -25 -24 -10 -17 -7 -32 -12 -12 -29 -19 -23 -33 1 -4 -12 -12 -4 5 -3 14 1 11 -1 26 1 10 23
3806 23 18 5 16 13 6 19 -5 8 -7 13 -6 -9 -7 -24 -6 12 -13 -19 -21 -20 -12 -13 -20 -21 -19 -9 -28 -40 -16 -24 -18 -13 -11 -22 2 -12 -8 7 -17
3845 -17 -4 9 -2 19 11 7 4 9 5 13 7 27 9 20 17 35 2 4 22 15 2 -9 1 -13 -27 -13 -11 -17 -5 -24 -20 -18 -5 -25 -37 -24 -17 -21
$$ packed form
3552DKqJ1J8k4MRlQOJl0J3J0mNo%%oj2Mj5jK4pJj0kkr%J0mj1j5J3OnJ1omKJ2j0
3597b0KK5j0J4j0QMrQJ0j3K3j3OJ3j2k0J7pJ4j9J3j7kk2J4J4rJoj1J1j1KmlrJ4
3635a4rJ0Lmj8K9j2lRj1K0j0J0LOj3J9j1RjJ2j0jkJ4qKJRnJ0j1o%k0J4%j6kMj2
3676a5%njPmJ2k7J2POrRmpJ5KmkJ8j4PoJ8omLPmrK0plJjJoJ0k0NLMrkMo%kK0k2
3725hMJ0j2pj0J5jj9K2kj9QmO%J6k1J5LjpMJ3J1k2L7j2jMPmj6J3j0NRj6Mj2OJ4
3766B2k2J2qo%%kj8MKJ0jkj6JJ4pJ0k5K0%j7J0mj0L4nq%QRqJ7j3J0j2K7k5RJ3
3806B3nj3J1lpJ3k4J3j5K0j9lKj7J8J8k5okJQjpjKJ0j9j2K4qONKj1K4j4MJ5k4
3845a7J3J3j1K1qmlNmQoK0j8J1lJ8l3KJ8pj3j1J0j4j4J4KoJ2j9MKJ3k0j2J3Pm
$$ plain form
3883 -21 -19 -2 -31 -16 -7 -8 -7 -10 2 -16 10 6 11 18 7 2 11 17 2 20 24 29 8 33 10 14 14 16 22 13 -1 18 10 -3 0 -3 -12 -2 3 -2 -13 -19 -7
3926 -7 -19 -20 -32 -12 -19 -4 -1 -19 -10 -12 10 -6 -20 -4 -6 10 15 23 34 7 -12 3 18 6 10 18 17 5 16 19 23 -6 22 10 4 -5 4 -11 -10
3965 -10 -16 13 1 -4 -9 -4 -13 -18 -15 -13 -37 -17 -26 -25 -36 -29 -11 -24 -23 -6 -1 -15 2 -14 2 2 24 11 29 7 24 11 24 10 24 19 16 10 16
4004 16 12 8 -6 -5 7 8 3 -8 -2 -2 -10 -8 -21 -10 -22 -26 -10 -26 -13 -28 -19 -39 -26 -21 -14 -18 -28 -10 -13 -8 -11 -17 -3 -14 1 -1 7 4 10 2 28 12
4046 12 23 14 12 13 11 18 16 9 22 18 13 4 12 -7 -9 0 -11 -18 -25 -15 -18 -19 -36 -19 -28 -18 -30 -17 -21 -17 -31 -18 -16 -10 -25 -9 -10 -2 -10 -5 -6 -6 -7 18 6
4091 6 17 16 13 0 3 20 8 17 17 25 28 24 21 18 16 12 -2 6 -15 16 -13 -9 -4 -13 -15 -33 -9 -18 -12 -32 -22 -24 -22 -19 -24 -30 -18 -18 -20 -16 -1 -1 -11 -16 -8 -2
4137 -2 3 -4 3 12 8 19 10 17 -4 19 12 5 2 12 20 2 16 7 10 13 -4 -2 -7 -17 -17 -32 -15 -20 -14 -22 -18 -11 -7 -28 -38 -13 -21 -26 -27 -16 0 -5 -18 -8
4181 -8 -18 0 -5 -3 9 15 4 19 19 14 13 14 21 27 0 12 13 0 11 2 12 16 13 3 2 6 -16 -17 -19 -8 4 -28 -16 -3 -8 -19 -20 -5 -24 -37
$$ packed form
3883b1KJ7k9J5RjJlJ2j8K6mNPj1nROj5J8MNk1K5k3M%KOrj4J9qj3LlrJ0Nnj1oJ2
3926gj2jj2K0pJ5Lj8RkK2j6j4J6kJ6NQJ1k7j9J5J5j2MQjj2J1LMk9K8j2orRj5J
3965a0oK9j2nnNrnLKk4K0rJj1PJ8j3JJ7Nj4J7j6J6%K2j3J8k2J7j3J3j4J4nloO
4004A6mmj4JJ2Jnj1O%qKj3J1j2mJ6j6J3j5Rk0J3NPmj0J8lNloJ4j1J5kQlOqK6j6
4046A2J1rkJkPkpJ3mnrQj9kRj1ppJ0ljj7J7rJ0j2J3mMj4J3KOj5J6jQqNj%jK5j2
4091FJ1jlj3LJ7j2R%QLmllkmj4Qk1L1k9MNrkj8K4rOk0J0kKLnoJ2%kMJ5%j0nQO
4137bNpPRmJ1rPk1K3pplJ0Qj8J4rLLj7Knj0%j5J7nOqMPMk1j0K5qnjJ1J6nj3J0
4181hj0J8nKJ2Oj1J5%njJPOk7J2Jj3J1rJ0Mlj0jMk2jkJ1J2l2J2J3nj1jJ5j9j3
$$ plain form
4221 -37 -12 -16 -15 -7 -26 -19 -8 -11 3 -1 -3 -11 -2 11 2 -1 14 22 24 16 23 20 13 30 6 18 11 15 24 16 33 12 7 6 10 2 -22 -9 -5 -10 -2 -6 -23 -19 -11 7
4267 7 -22 -7 4 -9 -24 -4 2 -7 -6 8 7 -7 -1 12 -9 -7 11 0 13 14 11 16 -1 11 15 19 23 7 6 20 33 29 28 17 14 7 24 1 3 13
4307 13 0 -2 -17 -2 -26 -6 -15 -27 -23 -14 -27 -17 -6 -19 -31 0 -16 -3 -8 -13 1 -1 5 19 7 13 16 22 35 15 17 7 25 15 4 9 19
4344 19 18 24 37 4 25 5 12 6 8 13 4 -2 -12 -7 -17 -32 4 -18 -20 -23 -13 -26 -23 -18 -27 -14 -19 -9 -7 -2 -13 0 0 3 -1 7 7 -3 16 13 15 0
4386 0 18 24 7 4 18 14 32 18 15 16 10 2 6 6 4 -4 -6 0 3 -21 -10 -13 0 -18 -1 -15 -29 -14 -6 -18 -15 -14 -34 -6 -9 -1 -7 -13 -20 -2 11 1
4428 1 7 0 13 5 26 24 23 28 32 38 20 35 38 17 22 5 12 6 5 1 5 -1 -12 -12 -3 6 -2 -4 -19 -18 -22 -29 -22 -20 -3 -20 -17 -25 -23 -29 -1 -7 -13 -13 -21 -2 -6 -2 -1
4477 -1 15 8 1 9 17 10 19 16 8 14 28 26 20 25 10 19 20 10 16 14 12 -11 -4 -15 -1 1 -12 -10 -24 -30 -28 -21 -18 -10 -7 -8 -25 -17 -7 2 -18 -3 13 -7 10
4522 10 12 -4 1 7 3 -5 17 23 8 2 20 42 19 22 22 21 24 23 2 2 5 -1 8 17 3 -2 11 -8 -5 -7 -13 -17 -21 -23 -25 -24 -16 -30 -16 -16 -34 -19 -22 -14 -6 -6
$$ packed form
4221c7K5mJQj9PJ1lJ4mkqRJ3rlJ5QKqPlpJ7k4J2pMRqJ7k1njMqk4J3MnQmj7MQJ8
4267Gk9J5J1j3j5K0OrJJ4jj4OJ3k1KJ8j1J3JlNj7J2MMMj6jJ4J3mjj1lpJ7k3KJ0
4307A3j3kj5J5k4K0rj2MRj3J0J1j3j2L1j6J3nnJ4kOJ4j2OLOJ3k0Kj0J8j0j1NJ0
4344A9jOJ3l3K1k0PoKNroj0Nj0j5L6k2klJ0j3LNrJ3nJ0KNj1J3%LmQ%j0J9lKj5
4386@J8Oj7lJ4mJ8j4lJoqM%kqkOLk4J1lJ3j8J7j4j4J5Qj2LJk0K8lQoopJ8J3j0
4428AOpJ3qK1kjNMOj8J5Lk1Nj7PojmMoj1%RRqkj5JmpPKJ7j7LqKoK8oo%qJ9mMJ
4477aJ6ppQQpRlqOJ4koNj5RJj0Okkk3Pj1J4Kj3Kj4oKPLQLjj7QJ0Rk0J5J6k0J7
4522A0Kj6NOmqK2Oj5oJ8K2k3L%jLjk1%LoRRj4nJ3j9LkommkkJQj4J4%j8J5lQQ%
$$ plain form
4568 -6 -3 -3 0 3 -3 4 20 20 16 10 22 26 19 13 17 31 26 28 25 21 14 23 7 10 14 3 22 3 15 10 2 -13 -3 -13 -16 -6 -12 -4 -24 -17 -20 -20 -3 -2 1 -16
4614 -16 -9 -10 7 -2 -5 3 15 5 25 23 -4 18 22 20 14 24 17 22 22 18 20 19 18 23 21 6 12 4 5 -7 -3 -11 -10 3 5 -14 2 -20 -21 -23 -17 -22 -5 5 -20
4659 -20 -2 -5 -9 -6 -16 -10 -9 -5 2 6 5 3 16 14 21 31 18 37 22 25 22 33 23 24 16 12 48 28 24 19 -1 21 12 14 1 -1 11 -8 -11 -14 -22 -17 -19 -11
4703 -11 -17 -9 -27 -21 4 -4 -3 -14 -1 -17 -5 1 -1 14 -2 -10 11 -3 7 14 14 19 10 17 10 25 26 25 23 33 24 16 24 21 23 27 20 -7 16 14 0 4 -2 7
4747 7 -9 -11 -1 -1 -3 -20 -22 -17 -9 -2 -5 -1 -8 -2 -14 -2 -15 -1 12 2 17 7 32 21 19 19 18 19 29 20 30 12 3 22 26 23 12 7 32 12 3
4788 3 9 0 6 1 4 -18 1 -14 -5 -19 -21 -12 -32 -25 -35 -15 -19 -23 -20 -15 -16 -20 -19 -13 -20 -16 0 -10 -2 9 6 16 3 13 32 27 19 20 23 -2 25 28 14 26
4832 26 24 14 16 0 5 4 4 2 1 -9 2 0 -7 -13 -8 -18 -22 -11 -18 7 -8 -20 -2 -6 -8 -4 1 15 5 1 -1 8 15 11 25 12 -8 14 7 14 26 29 29
4875 29 31 19 16 10 31 17 11 13 3 2 10 -1 -15 -10 -5 -18 -18 -9 -24 -11 -33 -5 -32 -14 -19 -19 -22 -20 -10 -10 -19 -8 3 4 11 8 6 11 3 18 8 9
$$ packed form
4568fL%LLoPJ6%moJ2MpoMJ4nKlmpRj6LMj1J9j9J2nqj5J0j0lJ0oQk0Pl%J7JLj7
4614a6PjJ7rlQJ2j0K0kk7K2MkoJ0pN%mKjjNkj5OqJj2MqJJ3Kj9J6k2jkOnJ7J0k5
4659b0J8lmLj0OJMPMjkJ3kPJ0j3J9j5LlJ1j0JqmL6k0mnk0K2rKj3kJ2j9llqNkQ
4703a1oQj8OK5qJj1J3j6J2OkJ5j6qK1j4J0P%NrPpJ5JjkJ0rqQlKMpk7K3kj4MoR
4747Gj6kJ0%kj7kNQPlMpOj2J2j3J4J3j0J5j0K5j1k%jJJ0rJ0j8rJ9Mlj1nK5k0r
4788COrOnLk2J9j5Rj4kRk0Pj0K0mmLNjmJOpMJ6j0QJ1lJ0j3J0J9nqJLk5K7Lj4J2
4832B6kj0Kj6Nj%kjj0J1kpoNj0mJ1pK5j5j2J8mkMNJ4j0mkRPmJ4j3k0K2pPJ2L%
4875B9Kj2loK1j4oKj0jQj1j4NNj3%Rj5J3k2K8k7J8n%lKJ0%rJ1J1JPlkNqJ5j0J
$$ plain form
4917 9 22 13 22 16 29 26 36 23 25 31 21 27 1 9 29 10 10 -6 13 13 8 -22 -10 -6 -6 -15 -14 -25 -22 -23 -10 -14 -26 -19 -18 -3 -10 -12 -22 -4 3 -1 -1
4960 -1 4 0 -3 11 2 14 18 4 26 24 28 28 29 21 14 26 9 28 13 6 12 18 25 13 2 7 2 10 7 -4 11 -8 -22 -24 -5 -18 0 -33 -18 -17 -20 -27
5002 -27 -21 -11 -7 7 -3 -13 -13 1 17 10 14 4 19 27 4 34 22 12 15 21 22 10 24 27 31 13 5 -6 4 4 -3 14 -5 -7 -10 -13 8 -13 -29
5041 -29 -30 -13 -15 -15 -19 -13 -14 -7 -12 -3 -8 -4 -11 8 -5 5 -8 19 1 11 7 0 16 13 21 17 12 29 22 24 35 20 17 6 28 8 1 5 13 0 -5 -5 -2 -15
5085 -15 -9 -20 -10 -17 -22 -8 1 -12 -16 -9 -20 -17 -3 -20 11 1 14 14 -4 -16 6 15 10 12 19 13 4 2 15 14 20 24 16 34 16 16 25 10 16 24 26 26 13
5128 13 18 0 -8 1 -7 0 -12 -6 -22 -18 -2 -32 -14 -15 -19 -2 -23 -25 -29 -22 -11 -2 -12 -8 13 17 -7 21 21 10 23 23 31 24 47 28 33 15 22 19 20 28
5170 28 26 15 9 28 19 12 15 11 26 4 -9 2 15 6 4 -7 1 -18 -7 -6 -22 -6 -17 -14 -4 -16 -10 -15 -5 5 -4 11 5 -5 22 5 7 14 14
5209 14 19 27 31 23 27 18 10 23 18 25 24 8 14 17 19 13 4 22 13 3 0 -8 -7 -6 10 -13 -20 -3 -19 -14 -10 -9 -15 6 -20 -20 -13 -16 -12 -10 -15 -15 5 6 5 3 18 18
$$ packed form
4917IJ3rRoJ3lJ0j3KOj0Ok6QK0j9%j6J9%nl0J2M%rJj1LjJ3mj2PJJ5pkj0J8Pm%
4960aNmlJ4rJ2Mj4K2kM%JqpJ2j7J9j5pOOPj2j1NnQlj1J5j9j4kJ9j3J8l3J5Jlp
5002b7OJ0MJ4j0j0%J4J6pMj0J5Qk3L0j2j0LOJj2J4LMj8qj1J0%pJ7j9kllK1k1j6
5041b9jJ7k%mOjPnRnMpJ9j3J0j3K7j8J0mpJ6lQmnJ7pKJ1j5lj1K2k0pMQj3n%Lj3
5085a5Oj1J0pnJ4Rj3mPj1LJ4j7L1j0J3%j8j2K2RnKPorkJ3jOMqJ8j8%Rj5OQK%j3
5128A3Nj8qRqPj2Oj6MJ6l0J8jmJ7k1kmPJ1Rj0MK1Mk4K8%j1J3%QpK3j9Nj8PlJQ
5170B8kj1oJ9rpLmJ5k2j3J1J3rkj1Qj9J1Jj6J6j1LJ0j2OnJ0J0rJ5oj0K7j7KP%
5209A4NQMqMrqJ3nPjj6OLKorJ8rj0lqJJJ6k3pJ7j6NMJoK1k6%PlMKn%K0JjkJ5%
$$ plain form
5257 18 12 20 26 17 14 22 21 22 26 28 20 21 18 15 -4 8 14 16 9 0 -5 -16 -16 -15 -19 -8 -12 -6 -8 -19 -17 -14 -24 -10 -14 -10 -10 10 -3 6 -5 -1 15 11 11 7 12 8 25
5306 25 8 23 19 13 14 24 36 34 26 15 8 14 20 8 7 19 19 17 -11 6 -6 -2 6 -5 -7 4 -14 -16 -4 -12 -25 -34 -24 -7 -8 -13 -29 6 13 -12
5346 -12 3 -4 17 18 17 18 7 4 16 15 19 14 24 4 23 15 8 31 9 20 21 20 16 20 8 -7 16 7 1 2 1 -8 -10 -7 -11 -10 -9 -21 -10 -19 -7 -1 -23
5389 -23 -7 -10 -19 -11 -10 -11 0 0 6 21 26 15 6 17 21 27 23 28 23 38 30 19 27 21 30 11 28 8 10 7 2 12 11 1 3 9 -7 -5 -11 -11 -12 -13 -1 3 -8
5434 -8 -27 -11 -5 -8 -15 -9 -12 -4 -6 -11 -13 -5 7 2 -7 0 12 0 11 36 19 37 25 13 36 29 12 17 19 9 -1 21 4 7 6 9 -4 1 -2 -7 -10 -18 -15
5477 -15 -8 -8 -16 -18 -27 -22 -3 -3 -3 2 -15 -4 0 -10 -4 -2 8 14 -1 3 7 8 15 4 16 29 36 18 17 13 12 15 28 22 26 17 19 13 29 11 13 3 -5 2 -12
5522 -12 -7 -21 -4 -6 -10 -20 -24 -17 -20 -15 -12 -22 -24 -9 -19 -18 -13 -8 -8 5 3 1 7 -8 9 1 10 10 21 11 24 16 -6 25 23 9 37 6 22 7 2
5563 2 1 2 8 0 6 10 -8 -13 -5 -3 2 -16 -19 -34 -17 -21 -26 -23 -19 -39 -30 5 -4 -13 -7 -13 -14 -10 1 11 -9 19 23 4 12 22 23 17 30 6 19 33 10 10
$$ packed form
5257A8oQOrlQjJMKqJllj9J2OKprnj1%JmJ1mOkj1KLj0J4mM%K0j3Rj1MJ6m%mNmJ7
5306B5j7J5moJJ0J2kqj1pOOj2jJ2%kk8J7j2MQj1kJ1j8kJ2qj3rJ0J7jnj6L5Pk5
5346a2J5pK1JjJj1lJ2jMnJ0k0J9qpK3k2J1JjmMj2j5K3roJjrkLmJJj2J1rJ2Ok2
5389b3J6lrQJjJ1%OJ5Nj1rJ1MOmNnJ5qj1QoRj9J7k0KlnJ0jj0KOj6Ko%jjJ2Mj1
5434hj9J6OlpOlQknkQJ2nrPJ2j2J1K5j7J8j2j2K3pj7NKj0j0K2j7LjLj3NlnlqL
5477a5P%qkrNJ9%%Nj7J1Mj0OKJ0Oj5MMJPj1J2J3Pj8jmjLJ3oMrKoJ6j8Kj0qPj4
5522a2Nj4J7kmj0mPlNLj0kJ5j0JNN%J3kkOj5J7qR%J1j0J3qk2L1kj4K8l1J6j5n
5563BjJOqOMj8nQKNj8lj5J7mnLMk0RL5rrOojMJ1J0k0K8Mj9QJ0JoJ3k4J3J4k3%
$$ plain form
5607 10 18 11 12 5 5 -9 10 -8 8 -12 -12 -9 -12 -26 -16 -18 -12 -26 -26 -26 -20 -28 -24 -17 -18 -29 -17 -12 -9 -19 -21 -4 -10 3 -3 -1 2 23 -4 21 17 28 7
5650 7 11 19 23 7 15 21 11 9 3 -3 24 6 7 -3 -14 -17 -9 -18 -4 -2 -21 -20 -22 -11 -16 -18 -8 -11 -24 -23 -5 -7 -12 -10 -3 -1 8 11 16 7 3 16 6 16 20 25
5696 25 17 20 24 21 45 22 20 25 8 30 18 16 14 17 6 15 6 5 -13 -8 11 -3 -4 -3 -13 -29 -21 -21 -10 -10 -8 -5 -18 -20 -8 -8 -8 2 -1 0 -19 5 3
5739 3 2 6 25 10 11 15 18 17 24 23 20 13 19 26 9 14 19 13 31 10 18 11 0 11 2 -7 -19 7 -12 -9 -9 -19 -11 -13 -9 -22 -6 -28 -22 -5 -10 -7 -8 -2 0 -5
5785 -5 2 16 23 10 8 7 24 15 19 19 33 11 18 29 22 39 26 26 9 12 -1 14 7 -5 -3 -4 -9 -15 -8 -22 -8 -13 -37 -34 -24 -10 -7 -37 -24 -19 -21 -13
5827 -13 -12 -3 -10 -1 8 0 -2 -3 14 20 16 33 0 20 13 13 31 11 22 20 30 21 21 11 12 18 24 18 19 8 -8 0 -4 -1 -12 -8 -8 -5 -5 -27 -17 -24 -22 -28 -22 -33
5873 -33 -16 -4 -8 -24 -14 -28 -10 -2 0 9 -2 -7 -18 5 19 12 17 23 31 23 18 3 22 15 25 35 16 12 3 13 4 5 11 -11 18 -17 -12 -26 -4
5912 -4 -12 -17 -20 -37 -14 -17 -17 -11 -13 -15 -7 -30 -12 -24 -19 -1 7 10 -2 15 -4 5 3 12 35 4 23 18 11 31 6 25 13 10 25 21 18 17 12 11 3 9 13 2
$$ packed form
5607A0QpJp%j4J9j8J6k0%Llj4J0kOj4%%OqMPjj1J2NLj0kJ7oJ3oKLK1k7K5mJ1k1
5650GMQMj6QOj0kooK7j8Jj0j1lQrJ4Kj9JkJ1nkJ0lj3JJ8knKPKRLNrmJ3j0J0MN
5696B5qLMlK4k3kNj7K2j2kkLj1Rrjj8NJ9j4jJj0j6Q%J1%KLj3kJ2%%J0lJj9K4k
5739CjMJ9j5JMLjPjlpOPj7NNoJ8k1Qpj1J1rrj2K6j9L%j0QkMj3J6k2OJ7nLjOKn
5785ePJ4Pj3kjJ7rM%J4k2PJ1pJ7j3%j7Lj3J5pj2KjnoPj4J4nk4LJ0J4Ll0J3NkQ
5827a3JRpRRqkjJ7OmJ7l3K0p%J8k0J1kJ0r%j0JOOoJj1j6QmLj1M%L%k2J0pKoOj1
5873c3J7J2mj6J0j4J8QKRj1nj1K3J4pNOQqnj5J9pJ0J0j9mrJ0rJOk2K9l5Nj4K2
5912dqnlj7K3l%OkkQk3J8j2NJ8QLj2J7j9RkRK3l1J9npK0k5J9j2lJ5mljnjqOMj1
$$ plain form
5956 2 2 -11 -4 -5 -5 -6 -29 -33 -11 -11 -20 -28 -29 -35 -22 -14 -32 -6 -12 -23 -6 -12 -8 -16 6 14 2 8 11 10 9 20 8 16 19 16 11 5 32 21 19 19 25 15 22 9
6002 9 7 7 16 -4 3 -13 7 -17 -12 -10 -21 -13 -18 -20 4 -13 -32 -22 -15 -11 -17 -19 -13 -9 -22 3 10 -2 6 17 3 15 14 27 23 31 30 19 26 29 13 10 8
6045 8 -3 15 21 12 14 -1 3 -4 -19 7 -12 -1 -10 -16 -10 -15 -19 -26 -7 -21 -3 -14 -11 -19 -8 -17 -2 5 -2 15 8 -11 5 11 1 10 13 21 27 14 25 26
6087 26 27 17 35 23 15 17 19 28 20 28 16 9 15 1 3 -1 -12 -16 -3 -7 -23 -20 -29 -5 -21 -24 -26 -22 -11 -19 -23 -17 -25 -18 -12 -1 -18 -9 -3 -11 7 11 14 15 12 5
6133 5 4 24 14 3 12 13 15 28 24 25 31 8 13 5 4 8 4 11 -4 -2 -11 -16 -8 -14 5 -25 2 -29 5 1 -15 -22 6 -2 -9 -10 -21 -18 2 -1 -2 10 12 20 13
6178 13 25 29 20 23 11 7 16 24 27 20 17 16 12 33 6 32 12 22 16 8 2 -1 -3 -12 -2 -3 -19 -23 -16 -35 -27 -28 -29 -20 -19 -27 -28 -6 -15 -28 -23 -10 -20 2 13
6223 13 -7 12 -1 12 26 9 17 12 18 13 33 26 23 23 2 21 16 25 -3 16 -2 16 10 3 -12 -2 13 -17 -9 3 -4 -2 -22 -5 14 -16 -17 -9
6261 -9 -7 -13 -14 11 -4 -3 2 -3 11 -11 -4 3 -6 7 14 14 12 17 20 29 19 30 17 24 38 20 21 17 16 9 12 15 -2 4 -3 1 9 -9 2 -17 -18 -23 -22 -21 0 -17
$$ packed form
5956B%j3Pj%jk3mK2%rqjoJ3Qj8K6oj1J7oMqK2Qj2OLjjJ1j2QLlnoK7j1k%Oj0Pj3
6002Ik%Rk0Pj6K0k4NKj1QnkK4j7j9J0PMokOMj3K5Pj2QJ1j4J2jJ3mQjj1PLj6lk
6045Hj1J8OrKj5Mpj5K6j9J1roOnmpJ9j4J8j1LqJ1rJ5PpJ7pj9J6Oj0RLQOj3J1J
6087B6Jj0J8j2qKKRqQj2pOj4Kmj1mJ3mj6LrK4j6lkMJ1qmOqPOJ1j7ROqJ8MLJlp
6133EjK0j0j1RJKJ3mJOk3NqjMmPj5KrnQoJ9l0K7l1L4mj6pK8qpjj1LK0ljJ2KQp
6178A3J2MrLj2mRQLpljmK1k7K6k0J0oqolkrJ0jj6mPj9QjjRJqjK2rj3NJ3j0K2J1
6223A3k0J9j3J3J4j7QnOnK0pl%k1J9nRk8J9j8J8opj5J0J5l0QJ2pKk0J7J9l0jQ
6261iKojK5j5JNnJ4k2PPrJ3P%kNLRj0J1j3PJ4j8JmjpLLj7OpMQj8J1j9jnJJK1j7
$$ plain form
6307 -17 -18 -10 -19 2 -5 -14 -15 -10 -4 -3 -1 -8 6 2 1 17 11 -2 11 19 21 16 23 19 27 32 32 27 22 8 17 28 18 19 14 8 22 9 18 7 -1 -14 -20 -13 -15 -6 -17
6354 -17 -11 -21 -30 -14 -19 -21 -22 -16 -13 -2 -8 -7 2 13 -14 9 15 4 17 -6 0 19 10 12 -1 32 12 16 16 6 6 10 19 5 16 11 -1 1 10 -13 2
6395 2 -6 3 -4 6 -3 -20 -2 -5 1 -5 -16 -24 -18 -9 -9 -4 -11 -5 -7 0 10 -8 -7 11 13 10 30 14 16 22 31 24 23 33 19 27 13 37 16 13 20 7 15 0 1
6440 1 12 7 11 -7 4 -8 10 -18 -5 -14 -23 -7 -13 -3 -28 4 -10 -13 -7 -13 0 -7 -6 14 -16 -6 -3 -24 24 18 15 27 35 20 14 29 25 26 28 26
6480 26 28 16 17 17 33 20 11 9 11 3 2 4 -1 -2 8 -19 1 -19 -11 -16 -7 -4 -6 -9 6 -3 -11 -6 -1 -2 -3 3 7 15 2 -1 17 7 12 22 16 15 26 19 31 30
6526 30 22 19 10 26 19 32 17 30 13 4 14 -2 -10 6 8 -11 -7 -12 -15 -24 -4 -25 -29 -29 -24 -26 -22 5 -9 -19 -14 1 -14 -17 -3 2 -9 8 22 -2
6566 -2 22 12 17 13 16 21 17 32 19 26 35 17 22 26 30 26 21 12 20 24 21 22 15 17 9 -5 -9 8 -8 -8 -18 -4 -27 -18 -24 -11 -13 -12 -19 -13 -2 -4 -15 -7 2 16
6612 16 1 4 8 25 20 26 25 16 17 25 17 11 21 36 12 23 6 14 16 1 -4 9 17 -7 -4 -26 -5 1 -11 4 8 0 -22 -24 -13 -6 -21 -14 -25 -10 -20
$$ packed form
6307a7jQrK1prjNOJKpJ4mjJ6oj3J3QKnPmQN%nnj4RJ1j0JnoJ4j3Rj1qj3oPkRj1
6354a7Oj0rJ6nkjOLJ1oJRJ1k7K3Oj1J3k3OJ9rKj3L3k0M%j0%MRj4J1nj2KRk3J5
6395BqRpJ0rj7J8lOoj1qOR%NpOkPJ0j8JJ8KlK0j6KORpjJ0j4Qj4K4k1lPj3Qj5J
6440AJ1nMj8J1j2J8k8J3rrJ6oJ0k5L2j4lOoJ3pJK0l0J0Lk1M8olJ2Qj5oJ5mJKk
6480B6Kj2J%J6j3rkKqjKnjJ0k7K0k0QnRLklJ5rqNNjjOMQj3lJ8j0NJ0ojJ1pJ2j
6526C0qlrJ6pJ3j5J3j7rJ0j6qJ6Kj9MnlrK0k1m%NkMK7j4j0NJ5j5lJ4Nj1J7J4k4
6566bK4j0NmLNmJ5j3PRj8NMMmnrQMlJpKqj4mJ7j6%j0J4k3RoJ3kJpOJ1kj1QRJ4
6612A6j5LMJ7nOjrJQqoJ0J5k4J1j7QKj5nJ3Qk4Lk2K1Oj2J5Mqk2kJ1Pj5Pj1J5j0
$$ plain form
6653 -20 -19 -5 -28 -3 -12 -14 -7 5 3 3 18 6 14 13 4 20 21 32 24 33 38 20 24 10 20 23 9 18 17 12 7 -4 -2 -17 2 -26 0 1 -4 -27 -14
6694 -14 -26 -10 -20 -3 -7 -19 -19 -10 -4 -27 -11 7 9 -5 0 1 -4 -9 13 -1 20 13 16 11 19 7 18 22 19 25 27 25 15 10 13 15 3 12 6 11 3 -6 4
6737 4 -7 -12 -15 -7 -6 -12 -18 -2 -27 -24 -14 -2 -10 -9 -14 -7 -1 -14 1 -1 0 6 10 8 15 27 21 30 12 27 13 22 21 20 20 22 25 11 9 18 11 7 19 -3 1 -7 -2
6784 -2 -12 -19 -16 -21 -15 -2 -22 -8 -38 -8 -15 -28 -13 -24 -11 -15 -19 -14 -2 -8 2 3 -11 26 5 17 14 17 32 14 26 19 27 23 23 20 25 37 12 40
6824 40 27 14 19 20 6 9 7 9 14 -3 -1 -18 5 -14 1 -3 3 -14 -4 -13 -10 -15 -14 -5 -7 -17 -12 -21 -17 6 4 22 6 0 31 23 7 21 25 16 16 14 31
6867 31 23 23 27 13 25 21 13 14 23 1 11 2 6 -7 -8 -5 -16 -11 -9 -6 -8 0 -13 -25 -23 -23 -20 -25 -8 -17 -15 9 -1 -7 9 8 -7 -6 4 22 15 7 30 14
6911 14 11 35 26 26 27 21 20 23 16 21 23 14 19 23 16 1 7 -3 -1 -7 -12 -14 -13 -7 -13 -14 -16 -20 -5 -7 -11 -9 -12 -23 -12 -4 -13 14 7 -2 1 0 -8 12 6 -13 27 12 20
6960 20 16 25 13 15 8 23 23 37 8 15 5 20 12 6 13 17 13 1 -9 -19 -13 2 -10 -29 -4 -23 -17 -24 -15 -37 -25 -23 -7 3 -9 -11 0 -1 -4 22
$$ packed form
6653b0JJ4k3K5rkPJ2k%J5j2QjrJ6JJ1qRNj8Mj4J0Lj4Rjnnj1Kj5J9k8K6Jnk3J3
6694a4j2J6j0J7mj2%ROk3J6J8Kj4NJnnK2j4K1pLnQj2J1MlOKkj0nLKj2RoNqrJ0
6737Dj1nlQJooJ6k5LJ0J2qJnPOj3J5kJOMkPJ2oRj8J5j4Rjj%KLj4kRpmJ2k2MqN
6784bj0pLnOJ3k0J4l0L0pj3J5j1J3mmNJ2oJ0Jj4L7k1J2lLJ5j8J2pQm%lNJ2k5K8
6824D0j3j3NJj4LkKNj7Kj7K3j9J5mOj7J0rLnJRkj0NrMK3kJ8j6oL1qj6J4Mr%kJ7
6867C1q%Mj4J2mqJRk2J0rMj3jLj1NKLkQj3j2K%LnJ7rKK4j0oJ6jj5JJ0J8pqK3j6
6911A4lK4r%JojLpNKrNMpj5Oj0KonkJOojkmJ5kmKlj1J1QrK7prLjqK0oj9M0j5Q
6960B0mRj2KpJ5%J4k9Pj0J5qoPMmj2j0j0OJ5j2j9K5j9OpRk2J2KJ6J0j2kJ1jlK6
$$ plain form
7000 22 8 11 28 6 31 14 36 2 23 32 20 16 25 21 33 24 20 2 17 14 3 15 15 3 -2 1 6 10 -9 -14 16 -15 -21 -1 -23 -3 -12 0
7038 0 -21 -10 -20 -11 -8 -15 -10 -1 -3 -17 -1 -7 9 13 10 11 12 18 31 19 20 23 33 30 18 11 19 20 26 5 31 10 4 11 -1 4 0 -4 -3 -5 -19 -7 -24 -21
7082 -21 -21 -18 -6 -5 -3 -2 -8 7 -2 -10 -19 -8 5 -7 -7 -3 -3 12 18 11 8 4 -5 17 14 10 6 26 4 21 17 27 12 5 14 8 14 5 0 0 2 -3 -16 -21 -16 -23 -29
7129 -29 -14 -11 -33 -22 -6 -20 -23 -23 -27 -10 -7 -15 4 -8 3 3 12 3 -1 2 17 17 18 16 12 32 33 15 20 11 17 32 25 27 19 31 21 7 4 7 -1 -5 4 2
7173 2 3 -4 2 -7 -11 8 0 -10 -12 -25 -13 -8 -23 -18 -10 5 0 0 -18 -1 -3 13 11 9 22 11 12 28 15 10 24 32 17 19 12 34 25 16 16 23 10 2 8 18
7217 18 12 1 0 8 4 -1 11 -5 -13 -17 -10 -22 -16 -25 -21 -19 -10 -7 -7 -12 -11 1 -4 3 3 -6 1 13 14 2 12 34 9 19 23 31 19 24 16 8 20 26 12 25 19
7262 19 17 12 3 8 -14 17 -3 10 -17 -7 -4 -24 -8 2 -10 -30 -10 -18 -26 -31 -7 -19 -16 -11 -9 -12 -10 6 -6 -15 -6 8 1 3 20 16 10 25 25 20 36
7303 36 13 34 47 30 26 14 21 25 24 27 19 11 11 5 19 -1 -6 -9 11 -9 -13 -11 -20 -17 -17 -5 -9 -10 -3 -1 -9 0 1 -2 11 -9 -4 10 9 10 17 18 8 14 24
$$ packed form
7000B2j4LJ7k2K5j7K2l4K1Rj2mRmJ2rmj8J5lj1J2%j2nLNMj9nL0l1oK0k2K0rJ2
7038@k1J1j0RLpNRkj4J6oJ6MlJJOJ3j2JLJ0lj2pQJOk1K6k1oPj2NmmJkj4J2j7L
7082b1%LJ2JKJoJ5rqrJ1J3j2%M%J5OplmrK2lmmK0k2J7mJ0j5pRoOrn%Knj3nNpo
7129b9J5Lk2J1J6j4l%mJ7LqJ9j2J1%RrmLJ5%JkmK0Jj8NrOJ5pKqJ2j0j4lLqmRk
7173BJpOrmJ9qj0kj3J2Nj5NQJ5n%j8J7kJ6kkJ3j1JJ6j3nJ4Qj5KpK2rr%Pj3qOJ0
7217A8oj1jQmnJ2j6qmPj2OrMKRL%nJJ2nP%rPJ2Jj2J0K2k5J0MQj2NqqJ2Oj4J3o
7262A9knrNk2L1k0J3k7J0Lk0J6J0j2k0K0qqnK4j2LNKlKJ6j2rRJ4pKJ7moJ5%nJ6
7303C6k3K1J3j7mj2PMjLqq%oJ4k0nlK0k0mKrL%J2mjPKqRJlJ3k0NJ4jJPJj0OJ0
$$ plain form
7348 24 19 13 19 18 41 16 33 14 9 26 14 5 1 15 16 4 0 -6 2 -11 -19 -9 -10 -17 -32 -25 -7 -13 1 -35 -9 -14 -29 -33 -18 -12 -4 -3 10 6 2 3
7390 3 -5 2 4 20 17 23 10 28 25 17 20 41 17 10 21 26 12 5 14 14 6 19 5 -1 -1 -11 -7 12 -12 -6 -11 -1 -14 -13 -11 -14 -6 -4 -15 -10 -21 -6 -10 -27
7434 -27 -17 -21 -6 -7 1 -15 5 13 8 15 18 2 9 21 24 8 34 30 32 16 25 30 -2 10 17 8 -8 16 -3 -2 0 -15 -6 -8 -14 -15 2 -15 -18 -18 -14 -14 -7
7477 -7 -7 -24 -8 -8 -24 -1 -14 2 1 0 -1 -10 14 14 19 13 28 15 12 7 17 29 21 22 33 22 29 27 26 24 11 8 7 2 -7 -6 -4 -3 -6 -6 -25 -17 -24 -7 -3
7522 -3 -19 -15 -2 -7 -20 -20 -11 -13 -3 5 -1 10 -10 -3 11 16 15 17 20 40 -4 10 8 14 22 30 41 29 20 32 31 25 28 17 12 0 8 7 -3 -3 1 -6 -10 -10 -16
7567 -16 -32 -15 -27 -9 -7 -28 -13 -2 -8 -12 -9 -6 4 -18 -1 12 17 -2 5 16 8 24 15 18 16 22 20 14 23 10 17 19 13 16 23 18 16 9 16 5 5 -1 10
7610 10 -8 -2 -6 -16 -25 -2 -20 -30 -23 -16 -40 -8 -11 -7 -16 -24 -9 -12 -9 -8 -8 -1 0 12 12 -1 9 15 23 19 16 25 22 11 22 12 33 12 14 20 19 12 14 5
7654 5 7 9 4 4 -3 1 -12 -11 -2 -22 -9 -12 -16 -5 -11 -10 -17 -25 -25 -17 -14 -14 -16 -16 -16 -8 1 15 11 10 -4 23 20 0 21 7 33 5 19 16 16 12 16 16 11 14 26
$$ packed form
7348B4noOjK3k5J7j9nJ7j2rmJ4Jj2moQj3qJ0jpj5PJ8oJ4l6K6nj5mJ5OQJJ3mmJ
7390CqPKJ6lOj3J8lqLK1k4pJ1Nj4pR%qJ3j4o%j0MJ9k4OnJ0j3JKlQKj1Nj1J5mj7
7434b7J0mJ5jQj6K0QnPLj6PJ2Lj6K6mKj6RNl2J2Prj6K4j9JKj5RkojJ7j7l%M%P
7477g%j7J6%j6K3j3J6jjjrK4%NoJ5j3lnJ0J2qJJ1j1Pkjkj3ljnrJKJl%j9QpJ7M
7522cj6MJ3nj3%RkJ0QoJ1k0PJ4NjKLK0m4J4kOQQJ1j2rJ2joLj1nj2Qjj0%Mpm%o
7567a6j6J7j2J8Kk1J5J1omLLJ0k2J7J3Nj9PJ1qJ6rLkOkoRj3PKoLPnkpPj1%oJ1
7610A0j8Omj0rK3j8j0PPk4L2lMrqJ5lLJ%PJJ2%j3J0OQmlRlj1J1j0K1k1KOjpKr
7654EKKn%pMj3JRk0J3lmJ1oJpq%QL%k%%QRJ4mjj4K7lk0K1j4K6k8J4l%mM%nLJ2
$$ plain form
7701 26 16 4 0 -2 -1 -19 -7 -4 -5 -2 -15 -15 -15 -17 -4 -17 -16 -16 -14 -13 -13 -8 -17 -5 1 -7 5 1 8 4 21 16 6 26 8 23 28 12 19 31 39 22 18
7744 18 26 33 34 20 28 12 13 11 21 11 8 -6 0 -21 -6 -12 -29 -33 -17 -32 -19 -33 -21 -28 -15 -4 -27 -22 -12 -14 5 8 -9 -2 8 6 17 10 12
7783 12 11 31 22 14 19 23 -2 18 8 30 25 22 18 13 11 -6 7 8 5 11 6 2 -2 -13 -20 -21 -5 -25 -11 -25 -3 -6 -17 -20 -6 -12 -14 -15 -15 -18 -3 -19 5
7826 5 17 8 14 18 25 19 29 11 19 13 30 30 13 15 18 20 16 20 12 30 10 11 11 -2 1 -1 -12 -10 -5 -20 -18 -6 -27 -15 -20 -25 -17 -18 -16 -28 -12 -9 -14 -5 -19
7871 -19 -4 -13 -15 1 -19 6 8 -4 21 17 24 28 20 18 15 16 28 28 15 26 14 10 9 4 7 -2 -1 -12 -4 6 -11 -13 -17 -10 -30 -17 -14 -15 -29 -14 -21 -12 -19
7914 -19 -7 -13 -10 -7 -21 1 10 9 1 4 -10 -6 11 7 32 8 6 31 21 22 17 15 23 18 16 28 24 9 17 3 -1 5 -2 -2 -11 -4 0 -11 2 -12 -15 -26 -14
7957 -14 -23 -34 -21 -11 -24 -4 -3 -6 -12 -18 2 -27 -2 -17 4 3 9 -1 18 0 26 13 10 16 20 20 17 20 19 15 4 22 10 31 13 3 2 0 6
7996 6 5 18 -4 -1 8 -12 -19 -21 -3 -17 -20 -28 -29 -33 -30 -21 -30 -11 -22 -24 -18 -12 6 -20 3 -6 9 14 -4 11 8 15 9 -4 26 18 19 6 24 30 8 8 -3
$$ packed form
7701B6j0j2mkJj8J2LjLj3%%kJ3j3J%KJ%NrJ2OqJ2mPmJ7nj0K0j8J5Nj6PJ2Qj7m
7744A8QPJj4Qj6JkJ0j0lj4Ok1J5oj7mJ6j5J3j4J2pJ3J1k3NJ0kJ9Lj7PJ0kJ1pK
7783A2jK0rqNMk5K0j0K2nlmnkj7J3JlOnmmj1pjJ6k0J4j4K2lj1lJ4okj%lJ5j6K4
7826EJ2rOMPoJ0j8QoJ7%j7KLKmMqJ8k0J%j3Lkj1KNj5KJ2k1J2nnQjKj2J6LnRj4
7871a9J5rkJ6k0K5Kj2K5mPMqklJJ2%j3J1j2mjnLrJj1QJ0j7kmPk0J3Ljj4J5pRp
7914a9J2oLLj4K2RjqLj4MJ7mK5k4kK5j0JnkQnkJ2mj5Qj4mOp%rPMj1J3j4lj1J2
7957a4rj1J3J0j3K0JlooK0k9K5j5K1jOj0J9j8K6j3lOM%lLjmj1J8j2K1j8j0jkO
7996FjJ3k2LRk0pkJ8j4lqjmLRrJ9j1kOOJ8k6K3rJ5Nj8J5lPoj3L0qJj3J8Ok2%j1
$$ plain form
8039 -3 13 16 3 3 0 1 -1 -12 -12 -5 -16 -25 -28 -6 -21 -23 -22 -25 -22 -25 -15 -20 -11 -15 -27 -18 -3 3 -2 -7 6 15 20 17 26 16 15 27 24 33 31 15 17 24 35 20
8085 20 17 12 11 9 18 30 -12 1 5 1 1 -22 -9 3 -8 -21 -28 -24 -22 -21 -7 -10 -4 -23 -25 -24 -24 -2 -4 -13 -9 -8 -2 5 -3 14 -10 11 19 17 12 15 10 32 19
8130 19 23 19 41 10 16 19 9 26 -1 -1 -6 -20 -13 -6 -11 -10 -28 -17 -24 -22 -22 -26 -8 -22 -14 -6 -14 -2 -22 -8 -7 1 5 -2 5 6 7 6 8 3 22 20 28 13 16
8175 16 22 20 21 26 20 23 21 13 30 14 13 15 7 28 -2 2
$$ packed form
8039cJ6Lj3%lJkj1%Pj1rlK2j5kJlLlJ0nRmj2RJ5OnnJ3RNlRj0jJ2lRkj6KPJ1j5
8085B0lnjkRJ2m2J3Mm%k3J3J2j1j3pMKJJ4lOj9kJ%K2krMJOPqJ7k4K1QknLnK2j3
8130A9MmK2l1OLj0J7k7%nj4PPnJj8J1pK%mJ8j4QQqJ2k0J4JQMpPJJjKnJ9kQj5L
8175A6OkJNoLkqJ7j6jKqK1l0M
8191B
$$ Imaginary data points
##PAGE= N=2
##DATA TABLE= (X++(I..I)), XYDATA
$$ plain form
0 0 0 0 0 0 0 0 0 0 0 0 0 0 0 0 0 0 0 0 0 0 0 0 0 0 0 0 0 -16 16 -16 16 -16 16 -16 16 -18 32 -32 32 -32 46 -48 48 -56 64
45 64 -64 80 -80 96 -96 112 -124 134 -145 161 -182 204 -224 253 -284 327 -375 439 -520 633 -803
66 -803 1083 -1640 3151 -16111 -51112 -27876 8865 34643 29045 6652 -17471 -22691 -7958 14279
80 14279 21717 12857 1414 1645 7599 9178 3622 -803 1309 10446 19684 19838 5390 -13458 -19672
95 -19672 -4910 19304 32936 22751 -3824 -24816 -22462 -1055 19838 24267 11368 -8092 -20083
108 -20083 -16380 -1042 11800 12090 3460 -3675 -5895 -6961 -7607 -4668 399 3285 4355 5266 1599
123 1599 -8975 -16898 -10508 6755 18765 15048 -444 -16028 -20918 -10143 10041 23441 17471
136 17471 -2019 -16661 -15683 -4057 7257 11532 7873 -324 -6897 -7781 -4711 -1308 1226 3642
$$ packed form
0@%%%%%%%%%%%%%%%%%%%%%%%%%%%j6L2l2L2l2L2l2L2l4N0o4O4o4P8r4R6j04J20
45F4j28J44j60J76j92K08k36K58k79L06l43L86m28M77n37O11p02Q14r59J153j436
66h03J886k723M791j9262l5001K3236L6741K5778n598k2393k4123n220J4733K2237
80A4279P438q860j1443K31N954J579n556m425K112R137R238J54j4448j8848o214
95a9672J4762K4214J3632j0185k6575k0992K354K1407K0893M429j2899j9460j1991
108b0083L703J5338J2842K90q630p135k220j066o46K939N067K886J070R11l667
123A599j0574p923O390J7263J2010l717j5492j5584m890J0775K0184J3400n970
136A7471j9490j4642R78J1626J1314M275l659q197o573q84L070L403K534K416
$$ plain form
150 3642 5599 4981 -456 -9067 -14227 -9543 3441 14283 13348 995 -12924 -17774 -9718 5735
164 5735 16501 12988 -1808 -13885 -13609 -4798 3449 7340 7291 3370 -2909 -6854 -5964 -2720 429
179 429 4095 7689 6961 -100 -7793 -8974 -3236 4926 10827 11304 4351 -6718 -12634 -7646 4112
194 4112 12661 12043 4030 -5462 -10013 -7260 496 7584 9091 4839 -2009 -6906 -7276 -3500 1833 5692
210 5692 6325 3545 -1509 -5822 -6518 -3402 1324 5650 7686 4893 -2977 -9964 -9134 -388 8777 11045
226 11045 5754 -3102 -9570 -9183 -1817 6956 9658 5287 -1159 -4889 -5470 -3656 510 5049 6404
241 6404 3483 -1219 -4665 -5665 -3911 667 5780 7334 3248 -3898 -8505 -7403 -1569 5032 7611
256 7611 4213 -2682 -7698 -7438 -2767 2620 5193 4101 723 -3056 -5853 -6121 -2564 3257 6806 5062
$$ packed form
150C642J957o18n437q611n160M684J2984J0842r35j2353j3919m850Q056J5453
164E735J0766l513j4796j2077K76Q811Q247L891m9l921o279l945Q90L244L149
179D29L666L594p28p061p693j181N738Q162N901M77o953j1069n916M988J1758
194D112Q549o18q013r492m551K753P756P088J507m252o848m897l70L776N333L859
210E692O33k780n054m313o96L116M726M326K036k793p870o987Q30Q746R165K268
226A1045n291q856o468L87P366Q773K702m371o446l730n81J814M166M539J355
241F404k921m702l446j000J754M578N113J554m086p146m607J102N834O601K579
256G611l398o895n016K60M671N387K573j092l378l779k797k68L557N821L549j744
$$ plain form
272 5062 -483 -5539 -6774 -3702 1786 6213 6410 2052 -3443 -5814 -4174 -348 3626 6001 4905
287 4905 245 -4458 -5347 -2374 1697 4480 5122 3267 -734 -4462 -5023 -1655 3170 5958 5175 1341
303 1341 -3432 -5960 -4128 885 5188 5890 3019 -1435 -4831 -5202 -2104 2741 5982 4935 50 -4748
319 -4748 -5719 -2643 1630 4151 3836 1366 -1635 -3487 -3461 -1744 786 2942 3743 2350 -1307 -4920
335 -4920 -5199 -1380 3446 5487 3732 -463 -4509 -5692 -2785 2386 5739 4655 228 -3838 -4724 -2509
351 -2509 925 3401 3552 1419 -1242 -2628 -2585 -1714 -13 2348 3747 2562 -953 -4186 -4476 -1516
367 -1516 2388 4386 3381 69 -3397 -4655 -2750 960 3803 3961 1425 -2118 -4252 -3616 -618 2766
383 2766 4018 2312 -860 -2912 -2947 -1561 478 2467 3232 1991 -638 -2775 -2951 -1149 1517 3424
$$ packed form
272E062n545n056j235L072N488M427J97m358n495k371J640L826L974K375j096
287D905m660m703q89K973M071K783O42j855m001l728n61L368M825K788p83l834
303A341m773k528J832N013M303P02k871m454l396l71L098M845L241j047m885m798
319d748r71L076M273K521l15k470l001j852K6J717K530K156Q01j393l657l613
335d920k79L819M826K041j755m195m046j183K907N171L353j084m427m066q86K215
351b509L434K476J51k133k661j386M3Q71J701K361J399j185l515l233k90K960
367a516L904J998j005l312l466j258J905L710K843J58k536l543k134O36K998L384
383B766J252j706l172k052l5J386K039J989P65j241k629k137j76J802K666J907
$$ plain form
399 3424 3418 1240 -1928 -3706 -2716 242 3053 4042 2569 -790 -3715 -3772 -794 2716 3900 2237 -602
416 -602 -2448 -2513 -1331 336 1716 2231 1551 -4 -1768 -2783 -2114 255 2726 3327 1430 -1708 -3659
433 -3659 -3005 -393 2326 3398 2209 -669 -3284 -3525 -1235 1748 3067 2153 -19 -1877 -2436 -1606
449 -1606 55 1573 2050 1421 125 -1330 -2300 -1908 119 2349 2878 1339 -1042 -2548 -2431 -837 1335
466 1335 2757 2375 230 -2228 -3156 -1896 677 2756 2843 859 -1711 -2851 -1896 193 1815 2043 1091
483 1091 -216 -1239 -1694 -1295 -6 1459 2004 1259 -248 -1632 -2090 -1260 553 2248 2465 899 -1445
500 -1445 -2711 -2099 25 2275 3028 1515 -1166 -2668 -1956 65 1663 1989 1266 39 -1122 -1636 -1170
517 -1170 19 1198 1655 1166 -113 -1473 -1912 -1070 462 1595 1687 727 -798 -1961 -1954 -643 1229 2305
$$ packed form
399C424ok178l168j778R90K958K811R89j473l359k925n7K978L510J184j663k839
416f02j846o5J182J667J380N15o80j555j764j015O69K369K471O01j897l138j951
433c659O54K612K719J072j189k878k615k41K290K983J319r14k172j858n59Q30
449a606J661J518M77o29j296j455r70L92K027K230N29j539k381j506J17J594K172
466A335J422l82k145k458r28J260K573K079Q7j984k570j140R55K089J622K28r52
483A091j307j023m55L99J289J465N45p45j507j384m58Q30J813J695K17j566k344
500a445j266O12K124K250P53j513k681j502P12K021J598L26p23j227j161n14M66
517a170J189J179M57m89j279j360m39Q42J532J133R2r60j525j163PJ311J872J076
$$ plain form
535 2305 1682 -311 -2041 -2217 -860 941 1955 1669 383 -1088 -1818 -1357 20 1259 1623 1029 -151
552 -151 -1309 -1627 -757 565 1358 1250 632 -254 -1176 -1527 -826 713 1887 1701 265 -1339 -1994 -1257
570 -1257 423 1797 1775 496 -925 -1611 -1312 -314 840 1476 1101 -25 -1161 -1555 -899 280 1153 1230
588 1230 591 -331 -1092 -1261 -675 449 1426 1442 417 -892 -1552 -1182 28 1327 1637 732 -507 -1229
606 -1229 -1147 -497 476 1346 1329 345 -923 -1463 -911 171 1076 1270 704 -279 -1036 -1015 -410 322 959 1154
626 1154 616 -492 -1336 -1188 -211 916 1369 836 -241 -1126 -1252 -628 352 1097 1110 378 -647 -1326 -1008
645 -1008 -33 853 1093 655 -200 -890 -952 -440 217 675 891 639 -164 -1032 -1174 -373 701 1209 871 40
665 40 -796 -1132 -696 239 995 1014 474 -321 -960 -1020 -293 743 1175 703 -144 -775 -852 -449 167 647 744 434
$$ packed form
535B305o23j993j730j76J357J801J014k86j286j471p30M61J377J239L64n94j180
552a51j158l18Q70J322P93j08o18q86r22l51P01J539J174j86j436j604o55P37
570a257J680J374k2j279j421o86K99R98J154O36l75j126j136l94O56J179Q73P7
588A230o39r22p61j69N86J124R77J6j025j309o60L70J210J299L10r05j239p22
606a229Q2O50R73Q70j7r84j268n40N52J082R05J94n66r83p57K1O05P32O37J95
626A154n38j108q44J48R77J127M53n33j077q85j26O24R80P45J3p32j025o79L18
645a008R75Q86K40m38q55o90o2N12O57M58K16k52q03q68j42Q01J074N08l38q31
665D0q36l36M36R35P56J9n40p95o39o0P27J036M32m72q47o31p7M03O16M80R7l10
$$ plain form
687 434 -157 -730 -892 -487 297 914 836 175 -579 -948 -726 -59 675 946 578 -119 -801 -992 -489 460 1121
708 1121 873 13 -741 -848 -423 154 614 714 408 -156 -568 -616 -350 157 693 811 312 -422 -754 -546
728 -546 -96 431 729 641 95 -588 -889 -549 211 849 873 289 -531 -929 -605 71 579 669 371 -131 -557
749 -557 -623 -350 142 557 643 272 -324 -664 -525 -87 327 528 496 180 -341 -685 -538 8 593 789 469
770 469 -207 -772 -704 -67 557 715 420 -7 -405 -583 -390 106 565 617 276 -235 -555 -515 -140 303 525
791 525 379 78 -255 -480 -491 -146 354 619 450 -94 -606 -683 -265 324 616 470 71 -346 -533 -405 -38
812 -38 436 603 327 -136 -486 -474 -186 261 534 418 69 -235 -342 -330 -124 227 535 464 29 -441 -549 -288
834 -288 180 496 499 159 -276 -501 -377 -84 283 471 376 -35 -449 -527 -253 185 438 379 54 -221 -362 -325
$$ packed form
687D34n91n73j62M05P84O17p8o61p54l69K22O67P34K71l68o97o82j91N03R49O61
708A121k48q60p54j07M25N77M60J00l06n64m12m8K66N07N36J18m99p34l32K08
728e46M50N27K98q8n46o83l01L40P60O38K4n84q20l98L24O76N08R0k98n02m26
749e57o6K73M92M15Q6l71n96l40J39M38M14K01l2l16n21l44J47N46N85J96l20
770D69o76n65O8O37O24J58k95m27l98j78J93M96M59N2l41n11l20M0L75M43K22
791E25j46l01l33k25j1L45N00K65j69n44n12p7M18N89K92j46l99m17j87J28L67
812c8M74J67k76m63l50J2K88M47K73j16l49l04j07J2K06L51L08p1m35m70j08K61
834b88M68L16Ll40m35k25J24K93L67J88r5m11m14p8K74M38K53n9l25k75j41L7
$$ plain form
856 -325 -121 152 386 378 98 -304 -504 -338 70 413 472 226 -185 -417 -371 -87 229 405 386 75 -308 -475
878 -475 -277 141 429 375 107 -187 -325 -266 -98 161 319 281 111 -172 -406 -353 -20 327 413 218 -120 -360
900 -360 -353 -151 116 356 352 102 -254 -425 -334 20 363 398 151 -163 -304 -257 -60 153 282 244 112 -89 -268
923 -268 -293 -81 247 375 246 -40 -267 -293 -137 77 295 348 158 -146 -352 -307 -58 258 398 233 -111 -331
945 -331 -290 -72 134 225 191 88 -107 -240 -240 -66 168 290 240 7 -224 -273 -142 43 204 259 163 -56 -248
968 -248 -299 -122 190 380 289 -2 -281 -305 -112 128 247 221 87 -87 -216 -217 -56 141 253 184 20 -170 -262
991 -262 -143 51 170 172 132 -22 -189 -247 -157 92 272 262 29 -208 -285 -180 69 242 237 92 -79 -181 -192 -87
1015 -87 82 214 205 45 -152 -228 -146 40 168 193 114 -27 -122 -180 -125 33 232 242 96 -130 -246 -200 6 186
$$ packed form
856c25K04K73K34qk80m02k00J66M08L43N9k46m11k32M6K84L16J76j9l11l83j67
878d75J98M18K88n4k68k94j38N9J68K59J58l8j70k83k34N3L33L47Q6j95l38k40
900c60PK02K67K40mk50l56j71R1L54L43L5k47l14j41M7J97K13J29l8j32k01j79
923b68k5K12L28J28j29k86k27k6J56K14K18N3j90l04k06M5K49L16J40j65l44k20
945c31M1K18K06R1l4j03j95j33%J74K34J22n0k33k31m9J31J85J61N5r6k19j92
968b48n1J77L12J90r1k91k79k4J93K40J19k6j34j74j29jJ61J97J12o9j64j90r2
991b62J19J94J19Km0j54j67n8R0K49J80j0k33k37p7J05K49J73nj45j71j02j1J05
1015h7J69J32rj60j97p6Q2J86J28K5p9j41r5n8N5J58J99J0j46k26j16M6K06J80
$$ plain form
1039 186 238 96 -75 -154 -155 -97 50 168 185 52 -128 -227 -150 25 145 162 95 -20 -113 -133 -88 -1 150 219 138
1064 138 -50 -216 -181 -23 149 203 128 -29 -147 -165 -97 42 152 177 85 -77 -187 -145 -16 127 145 99 -11
1087 -11 -101 -129 -88 -17 88 134 120 -25 -159 -183 -55 119 191 119 0 -99 -145 -97 31 116 142 93 -40 -150 -157 -30
1113 -30 110 177 107 -13 -85 -87 -51 22 83 122 94 -5 -100 -159 -79 48 155 125 7 -96 -139 -89 0 104 116 93 -31
1140 -31 -121 -159 -68 64 158 119 -9 -84 -105 -43 6 55 95 93 30 -51 -116 -91 15 136 132 46 -73 -107 -60 -19 63 101 101
1169 101 27 -79 -132 -64 49 136 127 44 -90 -112 -65 18 54 73 57 3 -61 -95 -87 -23 83 98 47 -65 -99 -90 -19 43 68
1198 68 78 28 -39 -111 -93 5 94 113 65 -60 -110 -63 5 82 94 56 27 -18 -69 -63 -11 87 110 55 -16 -82 -84 -40 45 67 50
1229 50 19 -27 -88 -75 -29 64 92 73 -37 -112 -108 -26 29 69 36 -16 -44 -71 -47 -32 41 100 65 -32 -71 -69 -17 53 84 82 24
$$ packed form
1039A86N2j42j71p9jN8J47J18J7j33j80r9P7J75J20J7o7j15r3k0M5Q7J51O9q1
1064A38j88j66L5J58J72N4p5j57j18j8O8J39J10K5r2j62j10M2J29J43J8m6j10
1087a1r0k8M1P1J05M6j4j45j34k4J28J74P2p2j19r9m6M8J28Q5K6m9j33j10pJ27
1113c0J40O7p0j20p2kL6P3O1L9k8r9r5n9Q0J27J07l0j18j03m3N0Q9J04J2k3j24
1140c1r0l8R1J32R4l9j28p5k1O2M9M9M0ko3q1o5K5J06J21mq6j19l4M7M1Q2L8%
1169A01p4j06n3O8J13Q7rq3j34k2M7Q3L6J9j6n4o4l4QO4J06J5n1j12l4RP1O2K5
1198F8J0n0o7p2J8R8Q9J9m8j25n0M7O8P7J2l8k9m5n1ON2R8K3n5p1o6kM4Q5K2j7
1229E0l1m6o1J3M6R3K8j9j10p5MQ2N5M0l3n2k8k7K4J5P3N9l5r7l9KN2P0L1kn8
$$ plain form
1260 24 -3 -42 -38 -32 47 94 75 -6 -76 -76 -38 33 80 64 12 -63 -59 -45 -21 22 61 56 -1 -54 -85 -41 10 52 51 5 -33 -36 -54 -34
1294 -34 5 55 64 22 -61 -86 -45 33 70 62 28 -18 -36 -25 4 34 63 51 31 -29 -60 -33 33 56 52 31 -16 -31 -37 -31 8 24 40
1327 40 5 -42 -93 -66 -10 44 39 -2 -27 -54 -45 -17 6 32 55 14 -19 -54 -56 1 43 49 15 -24 -29 -34 -20 12 51 52 32 3 -30 -46
1361 -46 -12 51 69 45 -30 -53 -33 -16 12 58 39 26 -30 -53 -50 -22 38 54 14 -40 -54 -38 -14 0 7 26 4 -18 -43 -52 -11 10
1393 10 43 26 -15 -38 -26 4 -2 31 46 37 -5 -31 -35 -18 47 54 42 -3 -39 -27 -3 21 41 36 16 14 -15 -30 -6 18 33 42 2 -32
1427 -32 -45 -32 3 11 6 22 -18 -38 -45 -42 7 34 35 -7 -25 -62 -24 12 28 29 16 -25 -9 -21 -13 29 28 45 22 -12 -22 -3 8 31
1461 31 36 20 4 3 -20 -31 -5 35 32 7 -16 -40 -35 4 22 26 0 -3 -18 -34 -15 -5 14 11 13 -36 -31 -26 -3 11 2 4 -2 7 -16 -14 -4 24
1499 24 27 16 -3 -27 -17 -2 22 36 26 8 -16 -11 -18 -1 25 40 16 -19 -30 -38 -6 12 9 22 -5 -15 -24 -11 -12 4 18 14 -8 -40
$$ packed form
1260B4k7l9MOP9M7j9q1p0%L8P1M7j6n2p5MJ4K4M3L9nn7n3l1M4N1M2jm6l8lj8K0
1294c4L9N0Rm2q3k5M1P8L7ql4m6j8J1K9L0K9j2k0o0l1K7O6K3mk1m7j5oOL9J6J6
1327D0l5m7n1K7N6N4nm1k5k7RK8K3K6K3m1l3l5kN7M2Ol4l9nnJ4L2L9Jk0k9l3j6
1361d6L4O3J8k4p5k3K0J7K8M6j9j3n6k3LK8O0J6m0n4j4J6K4J4PJ9k2k2k5rM1K1
1393A0L3j7m1k3J2L0oL3J5rm2k6mJ7O5Pj2m5l6J2K4K4K0nk0kk9j5K4K4J5Rm0l4
1427c2j3J3L5QnJ6m0k0pLM9K7Jm2j8l7L8L6J6Jj3m1J6j2QM2jJ7k3l4j0J9J1K3
1461C1Nj6j6jk3j1K6M0lk5k3k4NL9J8Mk6lj5j6J9J0J9lKm9NNK3J4rKoRk3KJ0K8
1499B4Lj1j9k4J0J5K4J4j0j8k4NpJ7K6J5k4l5j1qL2J8lJ3k7j0rJ3jJ6J4mk2l2
$$ plain form
1533 -40 -49 -13 13 21 12 -9 -18 -19 -15 5 7 19 28 -5 -20 -11 5 23 19 27 3 -3 8 -3 9 8 33 23 3 -8 -16 -8 17 29 2 -19 -12 -25
1571 -25 -14 2 -6 6 2 2 -11 -34 -23 -1 27 2 -7 9 2 -1 -18 4 24 24 29 -8 -17 -20 8 20 34 10 -18 -13 -9 8 19 26 18 -4 5 -18
1609 -18 -10 8 27 13 6 1 -15 -7 -2 -4 7 14 14 -7 -21 -16 -15 14 15 6 0 -18 -20 -1 -2 12 20 14 -4 -10 -22 13 39 27 16 7 1 7 24 12 26
1650 26 31 18 8 10 -6 3 17 26 13 -5 -12 2 7 -9 14 16 -16 1 -2 -21 -21 0 12 2 -19 -28 -11 5 2 -2 1 -11 3 -16 -13 -6 4 13
1688 13 6 6 18 -1 5 21 12 10 2 9 5 -3 -10 22 30 29 -3 -20 -22 4 3 17 -10 -4 -7 -15 4 -15 3 17 1 4 -23 -29 -13 -2 2 9 -2 -18 -8
1729 -8 0 16 -9 23 24 10 -16 -2 10 15 9 23 11 5 -4 17 17 18 24 15 9 -2 0 3 15 30 12 4 -4 15 -1 -8 3 10 24 -12 -14 -23 -15 -6 -5 -2
1771 -2 -13 -8 -8 -7 -3 -3 4 3 18 -1 -10 -19 -5 13 19 -10 2 -6 5 7 1 17 27 8 8 1 4 17 24 31 16 20 6 8 2 6 21 19 18 7 6 -15 4
1814 4 21 6 -4 -7 -2 -6 -11 -15 -7 9 -10 -2 -9 -23 -11 12 2 19 8 -9 13 15 11 8 17 16 11 9 8 -3 15 23 31 17 -1 9 25 29 3 -8
$$ packed form
1533d0rL6K6Qrk1rjMK0KJ2Rl3j5RJ6J8mQk4oJ1j1J2jK5j0k0j1qQK5J2k7k1Pj3
1571b5J1J6qJ2m%j3k3J1K2K8k5rJ6plj7K2K0%Nl7rlK8J2J4k4k8NMJ7J1Pqk2Rk3
1609a8QJ8J9j4pnj6QNkJ1P%k1j4NJK9Jroj8kJ9jJ4Qoj8oj2L5K6j2j1roOJ7j2J4
1650B6Nj3j0Kj6RJ4Rj3j8pJ4Nj6K3Kl2J7lj9%K1J2j0k1rJ7J6lmLj2J4j9LPJ0R
1688A3p%J2j9OJ6rkqPmqpL2Qjl2j7kK6jJ4k7OlqJ9j9J8J4j6Lk7oJ6J1MPj1j6J0
1729hQJ6k5L2Jj4k6J4J2NoJ4j2orK1%JOroj1KLJ2J5j8qqJ9j6pJ1PJ4l6krQRJL
1771bj1N%JM%PjJ5j9rrJ4J8Ok9J2qJ1KoJ6J0j9%pLJ3PPj5Mj4KoMJ5kjj1jk1J9
1814DJ7j5j0lNmnmQJ6j9Qpj4J2K3j0J7j1j7K2KmlRjnkjj1J8QQj4j8J0J6Mk6j1
$$ plain form
1854 -8 24 22 17 2 -13 10 10 -5 16 -12 -9 0 -2 9 -3 -10 -4 -3 -17 2 -13 -5 10 3 -15 -11 28 7 16 8 19 23 16 3 2 16 18 16 11 10 -1
1895 -1 17 22 25 6 5 11 3 12 -1 -7 11 -1 3 -10 4 4 -2 12 4 -9 -4 6 0 -4 8 1 0 -7 8 -1 -5 0 -9 3 -6 1 11 -6 0 13 16 21 13 2
1939 2 5 7 11 19 10 13 11 29 12 12 2 8 18 6 9 -6 7 10 -3 0 8 -9 -12 -20 5 -8 -2 1 4 -4 -3 -4 6 14 -8 2 16 5 -7 11 -9 -6
1981 -6 18 14 -8 0 0 1 9 13 2 18 10 19 8 13 7 15 9 10 -6 2 5 -3 -6 3 -9 -5 11 7 2 -9 0 -12 -5 -16 -24 -16 -14 -14 2 -6 -9 -11 8 -5 7 15
2027 15 2 3 -3 -11 -1 11 13 30 7 18 15 1 11 9 -2 15 8 -15 9 3 -2 8 12 -6 -13 -6 2 1 -13 -20 -2 -2 5 -5 -31 0 12 2 -11
2066 -11 4 -5 -20 4 -3 -3 -5 3 -17 -9 5 17 6 8 -9 12 3 5 21 18 3 8 1 22 4 8 7 16 2 10 9 18 2 -7 5 8 -12 3 0 -12 0
2107 0 -4 3 -10 -23 -22 1 0 16 3 0 -4 -8 -8 -8 7 -9 -4 11 -4 -6 -2 11 3 2 14 17 -2 5 20 -14 16 22 16 14 17 5 6 7 17 3 -5 -7 10
2150 10 -1 -9 -2 -1 8 9 -5 -15 -16 -12 -7 0 -15 -6 11 3 -7 -15 -4 17 11 -7 -2 22 5 4 -1 3 17 15 9 9 17 10 13 0 2 -2 -2 -1 8 -1 6 -1 9 3
$$ packed form
1854hL2knj5j5K3%j5K1k8LRkJ1j2pOJj4J9j5QJ5pj8ML9k1RqJ1Mpj3jJ4Kknjj1
1895aJ8NLj9jOqRj3oJ8j2Mj3J4%oJ4qj3NJ0omJ2pjpJ5rmNrJ2rPJ0j7OJ3LNqj1
1939BLKMQrLkJ8j7%j0OJ0j2Lj5J3Lj3LQj7lqK5j3OLLqJjJ0Qk2J0J4j1j2J8k0L
1981fK4mk2Q%JQMj1J6qRj1NoQoJj6QLqlRj2MJ6mnj1Rj2Pj1qQK%J6qlkJ9j3J2Q
2027A5j3JoqJ0J2KJ7k3J1lj4J0kj1J7pk3K4onJ0Mj8pPQjj4pJ8%Pj0k6L1J2j0j3
2066a1J5rj5K4p%kQk0QJ4J2j1Kj7K1rKJ6lj5NpK1j8MjRj4QjRj6rJ2Lk0J5lj2J2
2107@mPj3j3JK3jJ6j3lmm%%J5j6NJ5j5kMJ3qjJ2Lj9PJ5l4L0OokLj2JJJ0j4qkJ7
2150A0j1qPJRJj4j0jMNPj5RJ7qj0qJ1K1oj8NK4j7jnMJ4ko%QpLj3Km%JRrPpJ0o
$$ plain form
2196 3 20 3 -8 2 4 7 -19 -22 -12 -22 -9 -10 -1 -13 -11 -27 1 -12 -10 -4 -20 -7 -14 -3 10 -1 2 7 7 3 25 13 -7 12 -9 11 6 0
2234 0 3 15 1 21 0 0 0 -8 6 5 -8 7 0 -3 -6 0 -3 -4 -2 -11 -7 -14 -18 -12 0 -3 -7 -11 -13 -2 -7 -11 -3 -1 -8 -3 3 2 -11 0 5 9 14 7 5 17 3 20
2282 20 17 10 -2 6 7 10 12 5 9 6 10 8 -6 -3 2 4 -4 -1 -17 -7 -9 -3 -14 -22 -7 -1 -25 -3 -17 -18 -9 2 -7 -8 -7 -1 -2 0 15 -7 25 -3 14 9 4
2327 4 -3 12 20 7 11 1 9 8 -15 0 19 21 13 -4 5 -5 4 11 2 -3 -9 -3 -19 -22 -6 -7 -20 -12 -17 -7 -13 -11 -14 1 -3 -8 -4 7 10 -13 11 -11 9
2370 9 3 11 -2 -2 13 -21 1 6 8 8 4 21 12 14 7 12 3 14 19 17 10 -8 -7 -6 2 -1 -7 -9 -25 4 -11 -22 -14 -7 -9 -13 -11 -1 -5 -7 -13 -10 -5 -1 8 2 0 1 3
2419 3 -1 -1 -14 5 -4 8 2 5 -2 9 8 -2 4 6 1 10 -4 0 3 -22 -1 -1 -6 -6 -1 -2 -11 -22 -21 -26 -12 -13 -28 -9 -11 -27 -6 -15 -19 -11 -21 -14 -19 2 -4
2464 -4 1 1 -1 8 7 12 -3 -2 17 4 7 1 2 0 9 -4 6 21 6 -1 6 -8 -4 -1 -11 -5 -19 0 -14 -12 -20 1 -12 -12 -4 -22 -8 -14 -1 -14 2 -6
2506 -6 -6 -14 -6 -2 10 -7 -4 4 -8 11 5 7 4 17 11 -4 2 4 31 22 15 11 -7 26 1 11 19 9 9 1 -5 10 5 2 -1 0 -3 0 4 -1 -8 -9 -8 5 -3 -15
$$ packed form
2196CJ7j7j1J0KLk6lJ0j0J3jRj2Kj6K8j3KOj6J3pJ1J3j1LN%mK2j2k0J9k1K0no
2234@LJ2j4K0k1%%qJ4jj3J5pllOljKrMpmOJ2lmmkJ1nmQKpNOjj3J1NMNpkJ2j4J7
2282B0lpj2QJLKpMlMkj4LNKqLj6J0kOj1qJ5Ok4K2j4jRJ1rjJOjKJ5k2L2k8J7nn
2327DpJ5Qj3Mj0Qjk3J5J9Kqj7Rj0RPrnoOj6lJ6jj3QnJ0oKlJ5mnMJ1Lk3K4k2K0
2370IoQj3%J5l4K2NK%mJ7rKpNrJ1Nkpj8JJQlokj6K9j5j1QPkmKJ0mkoLNMRokJK
2419Cm%j3J9rJ2oLpJ1jj0OKnRj4MLk5K1%n%Njrj1JnJ4jj5J9kj6K1rmQj0PnK1o
2464dN%kRjNj5JJ9j3LoJkRj3J0J5j5pPj4MLj0Oj4J9j4KqK1j3%Qj8J4oJ3j3J6q
2506f%qQMJ2j7LQj2J9oKlJ3oj5OKK7rpmj8L3k5J0Qj0%qoJ5nllJlLMnpjJJ3qj2
$$ plain form
2552 -15 2 -14 9 -20 -12 2 5 -1 -6 -12 2 -7 4 14 6 -5 2 14 8 10 16 21 10 5 13 19 15 19 12 -2 4 7 -1 0 13 3 -4 -1 -8 -12 -14 3 -5 -7 -2
2597 -2 6 2 9 -3 -3 -6 -4 9 -1 -20 0 6 -3 12 9 26 6 -3 12 22 15 8 7 13 1 16 8 16 23 12 2 6 18 -10 19 -6 0 -11 -1 14
2637 14 7 -11 -6 -10 -4 -23 -4 14 -19 -5 -15 -18 2 -19 -17 0 1 -2 -3 -1 -7 1 5 10 8 4 10 20 25 9 14 8 26 2 -3 9 17 -6 -8 5 5 1 -6
2680 -6 9 -6 -10 -8 8 -3 -3 -19 -18 -27 -15 -18 -17 5 -21 -17 -12 -15 -17 -19 -6 9 -14 0 -2 3 14 -3 -1 5 -13 6 11 -10 3 8 8 7 10 7 22 1
2722 1 8 -3 3 15 14 13 11 8 1 -17 -8 -15 -11 -5 2 -11 -6 -3 -14 -4 -2 3 -12 -16 -2 -3 -18 -9 1 -2 13 2 -7 -2 -1 5 2 -8 15 10 -2 27 14 32
2766 32 14 14 12 1 12 19 17 7 10 9 8 -3 2 -5 5 -1 -10 10 -2 7 -4 -9 -2 -6 -4 2 -6 1 -9 10 1 -1 -8 -10 -14 2 9 -3 15 6 21 11 5 10
2810 10 21 13 -1 20 4 15 11 2 23 12 2 12 6 12 -2 -3 8 10 -1 7 -1 -6 -10 -24 -3 -11 -16 -12 -10 -18 -18 -7 -7 -30 -20 -10 -4 -2 -5 -17 3
2851 3 -9 2 5 4 3 4 8 15 4 3 0 1 10 2 17 14 5 9 11 6 13 10 4 0 0 -9 13 -12 15 4 5 2 -24 -10 -4 0 6 -12 -12 1 4 -25 -21 -25 -12 -14 -12
$$ packed form
2552a5J7j6K3k9QJ4LonoJ4rJ1J0qj1PJ2oKONj1nQOmMpj4OLqJJ3j0pLpmkJ7qkN
2597bQmPj2%lKJ3j0j9K0OrJ5lJ7k0rJ5J0ppjOj2J5qQPj1j0MJ2k8K9k5Oj1J0J5
2637A4pj8NmOj9J9J8l3J4j0lK0k1KJ7JljKoQMNkmOJ0Nj6NoJ8k4nJ2Qk3kJ3%mp
2680fJ5j5mKJ6j1%j6JrJ2lJK2k6MNlkkJ3J5k3J4kNJ1j7KOj8J9Nk1J3N%jLlJ5k1
2722APj1OJ2jjklpj8RpMOPj3NLj1J0KNj5mJ4jj5RJ0lJ5j1rNJOlj0K3nj2K9j3J8
2766C2j8%kj1J1Pkj0Ljjj1NpJ0orK0j2Rj1nPmKOqPj0J9rkpkmJ6Pj2J8rJ5j0oN
2810A0J1qj4K1j6J1mrK1j1j0J0oOj4jJ1Kj1Qqnmj4K1qnMKq%J1%k3J0J0OKlj2K0
2851Cj2J1LjjJMPj1jlJRqJ5lrMKnPlom%rK2k5K7j1Jlk6J4OMOj8%J3Lk9MmJ3kK
$$ plain form
2898 -12 -14 -14 5 -3 -4 -10 -14 -1 1 8 5 0 0 13 8 13 -4 15 0 21 -8 0 17 9 3 1 0 4 12 -6 -8 -6 -2 -19 -21 7 2 3 -13 -13 -8 -21 -7 -5 -6
2943 -6 -4 -14 -8 -4 -12 -10 7 -1 2 -4 0 12 2 17 9 -2 22 25 19 15 21 7 7 9 6 14 2 9 11 3 -4 0 -6 -5 4 -4 -11 -16 -9 -5 -22 -22 -3 -21 -9 -11 -18 -23
2991 -23 -14 -8 4 -1 -8 -2 -6 16 7 -14 2 -1 10 3 3 15 5 7 15 -8 -7 11 0 0 15 16 10 4 -2 -7 -5 -6 -14 0 -11 -13 -6 -9 -9 -10 -6 -11 -27 -16 -18
3036 -18 -28 -18 -12 -5 1 -14 -17 -2 -5 1 9 0 -8 4 -8 4 -2 8 8 15 4 -1 -2 19 -1 1 5 11 5 -3 9 13 -9 2 -2 -7 -9 -2 -9 13 -1 8 -4
3079 -4 -19 5 0 1 -4 -7 -5 -19 -3 0 2 6 3 0 -18 -4 0 -14 4 4 -6 8 8 29 7 7 21 25 12 12 13 18 13 12 15 10 10 9 5 11 -6 8 15 9 -12
3124 -12 -8 -2 -13 -3 -11 -15 8 2 0 -1 13 -2 -4 -10 -12 -22 3 23 -1 7 -2 3 -4 11 11 19 19 6 9 12 33 28 14 26 25 19 15 20 11 9 5 11 0 12
3168 12 2 18 4 -13 -10 3 -7 -8 3 -8 -23 0 8 -1 16 2 -20 -12 11 6 5 -1 1 7 14 3 12 18 6 8 11 2 -8 20 26 16 31 34 18
3207 18 18 27 21 21 25 25 18 2 6 9 8 0 -4 -1 5 4 -6 -7 -3 -17 -1 -4 -8 -3 -1 -2 -11 10 -11 -9 7 -5 3 25 0 14 -7 1 9 -5 17 -3 14 3
$$ packed form
2898a2k%J9qjomJ3KPln%J3nNj7J9j5K1k9QJ7qokjMQj8kKMj7kK8nJj6%Nj3J4Kj
2943fKj0OMqKJ7qLoMJ2j0J5qj1K4LomOj4%KlQj2PKqpMoJRqpnPMj7%J9j8J2kpn
2991b3ROJ2npOmK2rk1J6lJ1p%J2j0KQk3JJ8j1%J5JooonKjqJ4j1kPl%jMnj6J1k
3036a8j0J0OPOj5lJ5lOQrqJ2j2J2oJ0%Pj1njK1k0KMOoqJ2Mk2J1mnkPpK2j4Rj2
3079dj5K4nJnlKj4J6LKMllj8J4Mj4J8%j0J4%K1k2%J4Mj3%JNnjLn%jmOj7J4Pok1
3124a2MOj1J0qmK3okjJ4j5kokj0K5K0k4QrNpJ5%Q%j3LLK1nj4J2jomNrkmOj1J2
3168A2j0J6j4j7LJ3j0jJ1j1j5K3QrJ7j4k2QK3njoKOPj1ROj2KLrj0K8Oj0J5Lj6
3207A8%Ro%M%pj6MLjqmLOjj0jMj4J6lmNKjrK1k1KJ6j2QK2k5J4k1QQj4K2k0J7j1
$$ plain form
3251 3 7 10 21 3 11 3 10 1 14 21 12 6 0 -10 -15 -13 -14 1 -12 -18 -9 2 -5 -30 1 1 -8 2 -23 -21 -7 -14 -18 -14 -21 -8 -6 4 -6 0 13 5 8 13 26
3296 26 19 15 2 5 12 18 -6 9 11 13 8 11 14 4 5 -2 7 -16 -3 13 -12 -1 4 -6 -6 -4 13 -6 -12 4 -16 -12 -7 6 2 -8 -5 4 -4 0 -8 6 -8
3339 -8 7 -4 -2 8 3 9 2 13 12 3 10 28 12 15 26 19 4 5 20 4 13 6 10 11 2 7 5 1 -8 -8 9 -12 0 -6 -5 1 -21 -7 -7 -11 0 -6 0 1 5
3384 5 2 15 -2 4 3 -21 19 16 15 11 15 13 18 24 14 6 31 18 11 14 7 12 18 9 7 10 1 1 4 3 -4 10 -1 -21 2 4 4 0 -3 -7 -13 12 -12 -3 -4 -20 0
3431 0 16 -10 1 11 5 12 11 11 26 26 -2 14 12 25 15 17 15 10 17 16 12 19 9 14 6 -2 7 11 0 1 8 1 -11 -10 1 -5 0 -17 -9 -7 3 -5 -15 -24 -9
3476 -9 -11 -16 -29 -5 4 2 0 -10 3 -10 7 0 10 12 26 20 7 16 8 22 20 2 18 15 11 27 13 3 -6 -12 10 10 4 4 -3 2 -8 -5 15 12 -8 -4
3518 -4 9 -6 -19 -18 -1 -2 -9 4 -12 -7 -8 10 -6 4 4 -1 0 3 23 12 13 21 2 2 21 35 15 5 22 13 22 13 17 30 6 -2 6 7 5 4 5 10
3560 10 11 -1 -3 1 0 -1 -3 -12 -8 -8 -18 5 0 8 0 -5 -11 -8 5 15 13 8 15 6 23 24 12 18 11 30 17 29 13 8 20 17 35 21 13 8 8 15 -7 9
$$ packed form
3251CMLJ1j8QqPrJ3Prooj0nKjJ5j3oRJ1pk5L1%rJ0k5KJ4pmMpJ3KJ0j0OJ3qLNJ3
3296B6pmj3LPOk4J5KKnLLj0JpRk3J3J6k5J1Nj0%KJ7j9oJ6k0MNJ3mj0LRqMqJ4j4
3339hJ5j1KJ0nOpJ1jrPJ8j6LJ1pj5JJ5j6RpMJrNkmr%J7k1J2oJOk2J4%mJ1oOJM
3384ElJ3j7Ojk4M0ljmMkNOj0qK5j3pLpNOrkLr%LjpJ4j1k0K3K%mlmoK5k4Rjj6K0
3431@J6k6J1J0oPj%J5%k8J6kJ3j0KknPjmPj0NqqRMj1JPpj2JJ1oNj7QKJ0qj0rJ5
3476iknj3K4Rkkj0J3j3J7pJ0KJ4oj3RqJ4kj8J6lmJ6j4j0roK2%o%pNj0LK0lk0M
3518dJ3j5j3JJ7jpJ3j6NjJ8j6J0%nJLK0j1JQj9%J9J4k0j0J7rRrMJ3k4qQJkjJN
3560A0Jj2kMjjkrM%j0K3nQqnoLJ3J0knPrJ7Jj2OpJ9j3J2j6nJ2lJ8j4qn%Pk2J6
$$ plain form
3604 9 -4 14 16 15 20 -5 2 -1 0 -9 -8 -10 -12 -15 -18 -28 7 -30 4 4 -2 5 -1 -10 -8 -8 12 -7 -8 -2 5 6 17 6 21 7 9 -4 4 22 19 18 -2 5 26
3649 26 5 8 7 16 7 2 7 4 4 7 7 -1 4 9 14 3 2 -13 -8 -2 3 -3 1 1 -12 -14 -2 1 -10 -3 7 2 4 3 2 11 13 7 19 12 -1 19 10 21 26 4 8 17
3697 17 12 6 13 10 8 7 10 7 -4 -1 -8 -2 -7 -15 -29 -12 -4 -12 -8 -19 -1 -8 -3 -16 -25 -11 5 7 1 6 -1 -18 4 -9 9 7 -2 7 12 9 23 18 20 10 14 -8
3743 -8 21 13 8 4 17 5 11 -16 8 -6 8 8 -14 -8 -10 0 -5 -14 -2 -5 -14 4 -7 -2 -6 -10 -3 -13 1 -25 -10 -5 0 12 -6 0 11 21 12 -6
3783 -6 9 12 15 11 -3 0 -14 18 19 18 3 4 9 -2 6 7 10 2 -11 -2 -14 -20 -14 -9 -17 -4 -10 8 -10 -8 -6 -9 -17 -17 -24 -21 -7 -11 15 10 5 -16 -14 8 9 13
3829 13 3 20 0 14 1 1 16 7 19 22 5 9 12 2 1 -1 5 19 18 7 4 5 -5 -11 3 -6 -17 -16 -7 -11 -8 -14 -18 -14 -21 -9 -16 -10 -6 -9 -13 3 13
3872 13 4 9 -1 7 7 2 12 22 13 16 28 20 28 28 5 8 17 16 13 -4 20 -1 14 8 13 17 5 -11 -7 -6 -6 11 -9 1 -5 -2 -2 -3 -6 -10 -14 -14 -14 -16 -1
3917 -1 -2 1 -8 -17 -6 -7 3 15 16 12 24 1 21 11 15 16 23 10 14 10 11 14 21 11 4 2 21 11 -2 -3 8 -8 -9 -13 6 -8 -1 4 -6 -5 -20 -4
$$ packed form
3604Ij3J8KjNk5PlJrJkkllj0L5l7L4%oPorK%K0j9jOPJJ1j1J5j4Kj3QJ8ljk0PK1
3649B6k1LjRrnNl%L%qNNNj1jj5NONoM%j3kJ2Lj1PJ0nKjjRKoJ2pj3K0rJ1Nk2MR
3697A7noPlkjLlj1LpOnqj4J7QqMj1J8pNj3rJ4J6KoNpj7K2j3J8krRNlJ4nKj0Mk2
3743hK9qnmJ3j2Ok7K4j4J4%k2OkJ0nrJ2lrJ8j1NmmPj0J4k6J5NNJ2j8OJ1J0rj8
3783fJ5LLmj4Lj4L2Jjj5JNj1QJLqj3Rj2oONqJ3oJ8j8KKlq%pLJ4mK6nnk1KK2JM
3829A3j0J7k0J4j3%J5rJ2Lj7MLj0jkOJ4jj1lJj0oJ4rj1JRmLomMpJ2pOMlmJ6J0
3872A3rNj0Q%nJ0J0rLJ2qQ%k3LRjlj7K4k1J5oNMj2j6MJ%J7k0J0oL%jlmm%%kJ5
3917ajLrrJ1jJ0J2JmJ2k3K0j0MJPj3MmJLPj0pkJ9j0j3jJ1j6jmJ9j4PNj0Jj5J6
$$ plain form
3959 -4 -4 -10 -16 -12 3 -8 -1 8 2 -4 8 -8 -9 -2 -7 -1 5 2 -5 2 -2 10 3 22 6 17 10 22 7 14 17 10 6 8 12 12 9 2 3 1 -15 -4 -13 -17 -6 -17 -13
4006 -13 -15 -22 -15 -6 4 -9 5 -2 -12 12 14 8 -2 12 14 17 19 -1 -1 0 6 -5 10 13 19 5 13 13 17 4 7 15 10 18 14 10 -1 2 -11 8 0 0 4 16
4050 16 -4 -3 -5 -19 -25 -12 -18 -13 -17 -11 -3 -11 -13 2 7 -10 -11 -11 7 5 7 -1 10 -2 22 13 12 3 26 11 2 5 21 8 24 18 16 1 3 16 15 10 1 -7
4094 -7 -14 -5 -2 -5 -6 3 -6 -9 2 -15 -1 -12 -12 1 -13 -7 -9 -3 9 -7 -8 3 8 4 10 5 13 16 13 20 18 23 7 11 8 4 21 -7 12 25 2 17 5 13
4138 13 15 8 9 3 -7 -4 6 -14 -7 -17 -11 -1 -9 2 -19 0 0 -18 0 -13 -1 -7 -14 -4 -8 8 14 5 -1 10 9 9 13 16 13 0 19 5 10 6 7 24
4180 24 15 20 19 16 13 0 2 12 14 17 -1 4 -8 -14 -20 16 0 -17 13 5 1 1 -12 -8 -7 -7 -4 11 0 -6 17 5 15 -4 16 4 9 2 -1 21 24 10
4222 10 -2 26 2 20 2 19 14 13 4 -9 10 2 -14 -11 10 7 9 5 -7 -4 8 -8 -13 -20 -20 -17 -8 -23 -10 -20 -9 3 -4 -13 6 -4 -11 -4 10
4261 10 3 11 -3 14 27 13 17 4 11 8 9 21 23 23 18 26 6 17 5 2 8 -9 16 12 8 9 -4 -1 2 -2 2 11 -8 -6 -6 12 15 4 -4 -20 -10 7
$$ packed form
3959d%ooMJ5j1PRooJ2j6jPnOOlpPmJ2pJ9j6J1pJ2j5PLpmKM%lpJkj6J1rmJ1j1M
4006a3kpPRJ0j3J4pj0K4Koj0J4KLKk0%JOj1J5LOj4Q%Mj3LQnQmmj1Lj3J9q%MJ2
4050A6k0Jkj4oJ3oNmOQqkJ5Nj7j%J8kKqJ1j2K4rjrK3j5rLJ6j3J6okj5KJ3jnrq
4094gpRLljRrlJ1j7J4j1%J3j4OkOJ2j6jJ1NmOnQLlPkNj6MlmJ7k8J9J3k3J5j2Q
4138A3KpJoj0LJ0k0Pj0OJ0qJ1k1J9%j8J8j3J2opJ0mJ6OroJ1j%MLlj3J9j4NmJJ7
4180B4rNjllj3KJ0KLj8Nj2ooL6j6j7L0qm%j3MJ%LJ5j1oK3j2J0j9K0j2NplK2Lj4
4222A0j2K8k4J8j8J7njrj3J9qj6LK1lKmj2LJ2j6np%LRj5J3j0J1J2prJ9j0pPJ4
4261A0pQj4J7J3j4Mj3PlJJ2K%nQk0J1j2lOj7K5mmJj3LLmMRj9K%J8Lj1qj6J0J7
$$ plain form
4303 7 -12 1 -10 4 -11 9 15 -9 0 6 7 9 25 -1 6 -3 16 22 14 24 39 30 8 11 4 3 10 9 13 11 7 3 -3 -17 15 -2 -15 8 -3 -7 11
4344 11 -3 -14 -14 -9 -7 -14 -11 -18 -12 1 11 -6 -1 -2 12 -1 15 3 21 -8 12 13 16 16 12 16 9 9 20 0 11 15 18 13 6 14 4 -11 6 -4 -17
4385 -17 3 5 -3 -6 -15 -14 -7 -5 -13 5 -20 -11 -13 -21 -10 -22 1 8 10 -13 -1 -11 -3 -1 -8 17 4 15 4 4 0 7 14 10 19 14 8 21 7 9 -5 3 1 -15
4429 -15 14 -9 11 12 10 -1 -4 -21 0 -7 -19 -14 -19 -13 -5 -3 -21 -17 -7 -4 -7 -12 7 -1 -2 0 14 4 16 8 1 14 12 19 9 15 6 9 21 27 19 25 21 10
4473 10 22 5 12 16 9 19 1 -2 1 14 1 -10 -5 1 7 -10 4 0 -9 -6 -6 -18 -2 -12 -9 0 -6 -15 -9 9 0 3 -4 -6 26 8 -2 16 32 23 9
4514 9 27 11 9 22 6 10 0 0 11 -1 -6 6 -3 -7 7 6 13 6 6 1 2 -9 -18 -11 7 -13 1 -1 0 5 -8 -4 -8 -3 -6 0 -11 -5 -4 -1 4 16 4 10
4558 10 -4 -4 26 19 18 15 19 25 16 15 13 13 12 19 19 0 6 12 -3 -4 -4 -3 -11 -2 -3 -12 -7 -7 5 -5 -4 -20 -13 5 -1 -17 -1 -9 3 11 4 -2 12 11 9 14 16 5
4606 5 24 11 7 0 18 10 11 12 24 23 17 25 6 2 21 7 6 1 -6 2 -2 4 -21 10 2 -3 -4 -1 3 7 -5 -17 4 0 0 -8 -6 -10 -1 -8 16 0 -4 19 6
$$ packed form
4303Gj9J3j1J4j5K0Ok4ROJKJ6k6PrJ9OqJ0J5rk2LpjPjMkmmoj4L2j7j3K3j1mJ8
4344A1j4j1%NKpLpOJ3J0j7NjJ4j3J6j2J8k9K0JL%mMp%J1k0J1MLnpQj0j5J7j0j3
4385a7K0KqlrJPKqJ8k5RkqJ1j2K3PKk3J2j0QKpK5j3J1j1%mPPmRnoJ3j4Kj4Qkj6
4429a5K9k3K0Jkj1lj7K1pj2NnOQKj8MJ0LlnJ9qjKJ4j0J2qpJ3kPj0OrLJ2OqOmj1
4473A0J2j7PMpJ0j8lLJ3j3j1NOOj7J4mrL%j2J6j0LRorOJ8rLpkL2j8j0J8J6rj4
4514IJ8j6kJ3j6Mj0%J1j2nJ2rmJ4jPp%nJj1rPJ8k0J4kJNj3MmNlOj1OJLNJ2j2O
4558A0j4%L0pjlMOrjk%jP%j9OOj5j%JqRjrN%J2j0Jj6PJ8oj6J6qJ2QpoJ4jkNKj1
4606EJ9j3mpJ8qJJJ2joQj9mJ9j4jnpQmOk5L1qnjLMMj2j2K1m%qKmRpK4j6mK3j3
$$ plain form
4651 6 11 13 7 18 8 9 25 12 31 22 22 18 28 10 20 2 -16 12 9 0 -4 12 -2 1 6 6 2 -16 2 5 -1 -9 -22 -5 2 5 0 -11 -5 -4 -13 -2
4693 -2 -5 -3 -4 3 6 -15 -3 21 4 12 0 1 13 28 38 21 11 30 24 16 6 -4 5 23 9 4 8 -1 5 0 -6 -8 -4 -8 -10 -5 0 -11 2 12 4 1 -7
4736 -7 2 -21 -1 16 2 -9 7 9 6 5 17 15 -7 16 7 15 7 22 9 18 10 17 21 11 26 14 15 21 15 14 20 9 6 13 5 2 -11 -7 -2 2 4 6 0 -2 -6
4781 -6 0 -3 -9 -14 -8 4 -7 5 -3 -1 0 -10 12 4 18 2 17 -6 12 12 20 9 -6 -14 5 19 19 19 5 18 1 4 9 14 14 5 4 4 12 6 15 5 -9
4824 -9 6 -14 -12 -7 -13 -9 -4 -14 -16 -24 -1 -13 0 1 -13 -1 -10 5 -6 -2 6 7 -1 6 13 -1 4 8 34 6 5 32 6 18 9 16 21 27 5 15 17 11 24
4867 24 21 1 -9 15 11 3 15 5 1 -7 -2 -4 -2 2 4 -12 4 -1 -14 5 2 -20 -2 7 -1 0 -5 2 19 2 15 19 8 0 3 16 10 22 25 12 9 7
4909 7 14 7 16 14 17 -3 9 9 -4 8 -5 6 -10 -15 -1 -11 -24 -5 -6 -17 -13 -9 0 -5 4 -23 -7 -2 -22 -3 -17 -7 7 -6 3 -5 0 5 9 -10
4949 -10 16 18 16 9 6 19 14 19 11 -2 5 11 4 3 2 11 -8 5 6 -3 4 0 -7 -8 4 0 -17 -17 -5 -10 -8 -7 6 -5 -13 -14 -9 1 -6 -6 10 -1 3 1 -10 7
$$ packed form
4651FNKoJ1j0JJ6j3J9r%mJ0j8J0j8j8K8lrmJ6j4LN%mj8J8Loqj3J7PLnj1OJrJ1
4693blKjPLk1J2K4j7Qj2JJ2J5J0j7j0J9oqj0j0RJ8j4nMrOnokMmkNNj1J3J0qlq
4736gRk3K0J7j4j1J6KljJ2kk2K3rQqJ5j3RqPMj0J5j2JOojOj1lPqlj3MNMKKokm
4781fOlonOJ2j1J2qKJj0K2qJ4j6J5k3J8%Qj1j5qJ9J4%%j4J3j7LNN%rj%QoRj0j4
4824iJ5k0KNoMNj0kqK3j2J3Jj4J2rJ5j1MQJqPPj4NMK6k8jK7k6J2rPNOk2J0KoJ3
4867B4lk0j0K4mqJ2j0mqNkKMKj6J6nj3J9lk2J8RqJnPJ7j7J3Mj1qLJ3oJ2Lj3lk
4909GPpRkLk0J2%j3J2j3J1j6nJ4j0j3J9jj1MMRnRk7J6Nk0J9j4J0J4j3RqNNMj9
4949a0K6KkplJ3nNqj3POpjjRj9J3JrPmpjJ2mj7%J2nKJJ3j1qjNJ0p%J6j1Mkj1J7
$$ plain form
4995 7 10 -5 9 11 29 4 16 10 11 3 8 6 1 -2 -3 5 0 6 -10 -10 -4 -17 -3 -3 4 -9 -3 -6 3 -7 -19 -10 -6 -14 2 1 -23 -15 -8 -12 -18 8 6 4 19 11
5041 11 15 14 28 7 11 19 10 13 6 5 19 23 1 3 15 2 -3 13 -5 28 7 18 4 25 9 2 0 9 -1 -3 10 -7 -11 -21 -17 -11 -7 -1 0 -19 -9
5082 -9 -16 -16 0 0 -14 -13 1 5 10 3 26 -6 0 18 22 5 21 15 12 5 6 13 11 11 5 -9 -1 9 -19 0 -1 5 -2 7 0 5 5 1 -16 -6 -1 -13 5 5 1
5127 1 -7 7 -4 5 1 -9 -14 -2 3 -6 -3 1 8 12 14 10 17 2 2 5 10 8 14 12 25 14 29 6 1 11 0 12 -16 9 10 4 12 6 -14 -1 -1 -5 9 -10
5171 -10 -5 -9 -2 -5 -7 1 2 -4 5 3 -8 -13 0 15 16 4 6 1 8 30 7 20 23 12 11 10 2 12 16 15 2 14 16 25 -9 28 23 -1 2 4 -9 1 1 -6
5215 -6 -5 11 -3 -11 -5 -2 -2 -4 -17 -6 -8 -11 10 -9 5 6 16 1 20 7 -5 -5 15 25 1 9 -10 7 9 10 7 23 18 13 16 7 -5 2 17 10 7
5256 7 9 19 -9 6 -7 3 -1 3 -1 -7 -14 -23 -9 -26 -11 -5 -12 -8 -21 0 0 -12 -5 0 5 3 3 6 4 13 19 17 3 17 12 16 14 28 9 39 14 10 10 8
5300 8 12 7 7 2 -4 8 -2 3 -8 10 -4 3 0 -15 1 4 -11 -14 0 -3 -3 -8 -3 -11 9 3 10 -9 -21 2 6 18 15 -5 10 16 16 19 -4 -4 15 11 10
$$ packed form
4995GLj5J4KJ8k5J2oJqNknljQnOj6%Oj3J4%Pj3OlRj0j2RMqJ6jk4QPmoK6kkJ5q
5041A1MjJ4k1MQrLpjJ4Mk2KJ2j3nJ6j8L3k1J1j4K1j6pkRj0kJ3j7mj0MOMOJj9J0
5082ip%J6%j4JJ4MNpK3l2OJ8Mj7J6olpJPk%oj4QJ0k8J9jOpRpN%mj7J0Nj2J8%m
5127AqJ4j1Rmj0nJ2NrLMPMKmPj5%LNkOkJ3j1J5k3nJ0j1J2k8K5JoQok0J3%mJ4j9
5171a0NmPlkQJoRkj1nJ3J5Jj2KnPK2k3J3Lj1jjqJ0Mjj3J2KRl4L7nk4LKj3J0%p
5215fJJ6j4qOL%kj3J1klK1j9J4JJ0j5J9j3j2%K0J0k4Qj9J7KJlJ6nnLrj2PJ5pl
5256GKJ0k8J5j3J0mMmoprJ4j7J5OpMj3K1%j2PNNk%LkROkj4J4nMkJ4j9L0k5m%k
5300HMn%noJ2j0Nj1J8j4Plj5J6Lj5lJ4l%nNqK0oPj9j2K3MJ2lk0J5O%Lk3%J9mj
$$ plain form
5343 10 12 10 14 -2 19 17 12 12 11 5 0 8 1 4 3 -6 -5 -7 -15 1 1 -8 -29 -14 -1 -6 6 2 1 -4 4 7 -2 -8 -1 -2 4 6 1 9 9 23 35 17 10 16 18 6 17
5392 17 22 21 21 18 10 14 15 7 21 15 3 0 -8 1 -4 -8 -6 -3 -12 -4 -2 0 -9 0 -2 5 -7 -26 -5 -7 0 3 -2 1 -2 5 6 14 -1 2 8 5 10 12 19 6 5 24 15 10 1 25
5444 25 27 8 15 14 9 9 12 7 7 2 -6 -6 -6 6 -6 -8 5 -6 -10 0 4 -5 -4 -17 -12 -9 -16 -7 -19 1 -3 11 -1 -7 8 14 5 17 18 6 27 5 18
5487 18 9 11 23 6 4 18 15 15 11 19 18 11 4 9 -12 6 3 -6 -13 4 -2 8 -14 -18 -12 -11 -7 10 -8 -15 -10 -8 -22 1 7 -5 10 -10 -3 4 11 11 19 12 20
5532 20 21 2 19 19 12 19 17 4 5 18 17 6 -2 0 12 -13 1 -3 -7 -7 -10 -31 -14 -7 -17 -4 -12 -7 -8 -23 -15 -2 2 -4 -14 -9 -19 -2 -21 -4 13
5573 13 -5 -5 -4 1 5 3 2 11 9 4 7 15 10 9 7 7 11 8 11 4 6 -3 2 3 10 5 -8 -5 -10 -2 -2 -14 -6 -17 -24 -18 -12 -18 -9 -15 -7 -9 -10 0 -19 -4 6 2 -3 6 22
5624 22 3 13 -5 9 24 7 11 11 15 9 17 14 19 4 14 14 7 13 11 13 8 21 15 5 -3 -21 13 -4 8 15 -14 -16 -13 -13 -16 -11 -1 -13 0 -13 3
5665 3 -7 7 12 4 -6 -7 8 14 1 5 9 10 20 17 5 7 15 7 8 18 19 10 23 19 8 6 2 11 -3 -4 -8 8 -5 14 -10 11 -7 -2 0 -16 -13 -18 -7
$$ packed form
5343A0KkMj6K1kn%jonQpLjrJkqJ6%rk1J5J3nJ2mjnQLroPjOKnQ%J4J2j8pOKj2J1
5392A7Nj%lqMJqJ4oj2lqRnmKLrQKKrRkPj2j9K1kPLnLlPJQj5LOlNKPj3jJ9rnrK4
5444B5Kj9Pjn%Ln%nq%%J2j2kJ3j1mJ0MrJj3NLpRj2K0mJ4j2oJ5OrJ2Jj2K1k2J3
5487A8rKJ2j7kJ4l%mQjppNk1J8lrpJ7oJ0k2mOJMJ7j8pNKj4K3Oj2J5k0PPP%QpQ
5532B0Jj9J7%pPkj3JJ3jj1qKJ2k5J4mm%lk1J7Pj0J3qNjj5QJ3Moj0Nj0J7j9J7J7
5573A3j8%JNMkjRknLQnjk%MlLpKrNJPnj3LnQ%j2Qj1pOOoRoQkjJ0j9J5J0mnRJ6
5624B2j9J0j8J4J5j7M%MoQlNj5J0%pOkKnJ3oj0qj8L4j7J2Pk9kL%lNJ0j2J3j3J6
5665Cj0J4Nqj0jJ5Oj3MMJJ0lj2KQqJJ0JrJ3mj1kmRj4jmJ6j3J9k4K1j8NKj6LnJ1
$$ plain form
5708 -7 -11 -7 -5 -2 -12 -1 3 3 0 -13 21 3 -2 3 11 0 14 14 18 28 12 16 -7 21 18 9 3 13 16 8 9 12 12 11 -1 6 -10 -9 -5 5 -17 -4 -5 -8
5752 -8 -9 -2 -1 12 -8 -10 -9 -17 -12 -1 -12 4 -7 1 -3 -1 2 -2 7 10 12 19 17 2 17 27 16 18 13 18 9 28 17 15 11 10 2 -1 12 -15 -5 -7 -14 -3 4
5797 4 -24 -12 -17 -4 -23 -13 -20 1 -4 -8 -8 1 -9 -9 -5 -12 17 5 3 0 7 -11 15 16 22 0 8 6 15 5 25 21 1 4 12 16 19 20 3 -1 6 -2 4 13 -5
5842 -5 5 12 -21 -10 5 -9 -12 -14 -11 9 -6 -20 -23 -12 -11 -3 -3 -3 -10 -4 8 15 -11 8 16 14 18 18 24 10 15 7 16 11 23 3 19 27 22 16 10 10 14 21 2
5887 2 9 14 -11 3 -2 -5 10 -1 -5 -5 -3 4 -10 -8 -14 -9 -20 -1 -26 -9 -18 -14 -12 -8 5 -8 -12 -4 2 1 6 12 11 10 6 11 25 14 25 12 25 10 12 11
5931 11 17 13 9 -3 14 12 10 -5 6 0 -21 1 -13 -14 -20 2 -16 -17 -14 -9 -13 -4 -12 0 -11 -3 11 -5 3 6 -16 -3 3 4 6 8 -5 1 10 -10 -5 19
5973 19 -2 21 17 18 18 1 18 9 8 -10 6 -11 2 -6 -13 -14 -9 -2 -8 -7 -15 9 -11 -10 -15 -6 1 -16 -12 -10 -20 -9 -3 -1 5 -7 -14 -2 -3 12 7 12 12 12
6017 12 15 13 1 11 -14 18 10 10 12 10 12 -3 1 -1 11 8 9 18 -4 -12 3 -8 -19 -21 5 -18 -37 -13 -18 -19 -13 -8 -28 -10 -15 -11 -6 -2 -13 -7 7 -9
$$ packed form
5708gmMKLj0J1M%lj3L4j8nNQj1J4%MJ0j6Mk3K8lroJ0LqJL%jj2Pj6JMJ0k2J3jl
5752hjPJJ3k0kJqNJ1j1J6j1QmKLmRLKPkj5J5J0j1KnNrJ9j1kmjqlJ3k7J0kpJ1P
5797Dk8J2nJ3j9J0pK1nm%Rj0%MpK9j2klPj8K6JOk2QkRj0K0mk0LQMLJj7mPqORj8
5842eJ0Pl3J1J5j4lkLK0j5j4lJ1JQ%%pOJ2Pk6J9QkM%Oj4NqRnJ2k0J6Qnoo%MPj9
5887BPNk5J4nlJ5j1m%KPj4KoNj1J9k5J7rMKMJ3j3mQOjNOjjmNJ4j1J1j3J3j5Kj
5931A1Ommj2J7kkj5J1ok1K2j4joK2j8jLNmRqJ2j1QJ4j6QLk2J3OJKKj3ORk0NK4
5973A9k1K3mJ%j7J7rjj8J6j7J3qpjNPoJqK4k0JnRPj7MKj0J1OKOj2pJ2jJ5nN%%
6017A2Lkj2J0k5L2q%KkKj5MkJ2lJRk2qJ5j1j1kK6k3j9K4njONk0J8nMNMj1OJ4j6
$$ plain form
6059 -9 11 -7 5 -1 1 12 8 -6 9 1 -3 3 10 20 15 14 -1 5 17 9 3 18 -2 -18 -9 -6 -14 -18 -11 -13 -14 -17 -16 0 -17 0 -16 -18 -5 -14 -17 -9 -7 -4
6103 -4 5 -13 1 16 11 -4 -3 2 -1 4 12 9 11 8 20 9 21 -3 14 13 3 4 4 -2 3 -1 7 8 3 2 -5 -11 -12 -16 -8 2 -10 -8 2 -11 -20 -25 -14 -2 -8
6148 -8 -6 -6 6 -16 -5 -19 -11 14 -5 -13 13 14 0 8 2 9 8 10 0 7 17 7 5 13 13 19 10 11 -3 4 -6 -8 -1 -27 -18 -13 -4 0 -8 -19 -5 -23 0
6191 0 -12 -7 -13 -3 -15 -5 -14 -14 -3 -8 5 -7 1 -13 17 -4 16 -12 3 7 -1 -4 21 8 12 12 4 2 15 18 13 18 5 10 -1 1 5 -12 -7 -21 -16
6232 -16 -16 -26 -23 -20 0 -19 -27 -17 -21 -35 -15 -14 2 -9 -23 -6 -4 -5 -8 12 0 4 -3 2 -2 18 0 4 11 3 6 15 15 23 12 15 11 4 8 13 5 12 0 -9
6276 -9 6 6 7 8 2 -4 -10 -4 -13 -19 -10 -9 -32 -20 -17 -21 -8 -14 -21 -4 -11 2 -15 -3 8 -8 -5 -10 13 14 12 26 16 20 24 5 17 12 12 4 2 8 12 12 12 -9
6322 -9 -11 -12 -4 -1 -7 -7 -2 -8 -25 -11 -17 -9 -15 -15 -9 -16 -11 -23 -9 -17 -11 10 3 -14 -23 -14 -2 6 -5 13 7 -2 -2 2 17 1 19 2 13 9 11 15 17 13 25 -2
6368 -2 15 11 -3 9 11 6 4 -13 3 -6 -5 6 -7 -13 -23 -22 -19 -5 -17 -3 -12 -26 -6 -4 -4 -12 -8 -17 -4 16 12 7 12 -13 11 18 6 16 19 8 13
$$ packed form
6059iK0j8J2oKJ1mj4J5qmOPJ0njj5OJ2qoJ5k0j6RLqmPkjlJJ6j7J7j6kJ3rlQKL
6103dRj8J4J5nj5JNlNQlKlJ2j1J2k4J7jj0J%oNmQJnjpojmQJ0j2KJ0j3rnJ1J2o
6148hK%J2k2J1j4QK5j9qK6Jj4QoPjKj0PJ0j0kQ%OrJj4Pj0kPk6RNRMqj1J4j8K3
6191@j2NoJ0j2J0r%J1nJ3j2Qj4L0k1K0k8J5MqlK5j3M%qkJ3LnNj3Nj1KMj7Nj4N
6232a6%j0LLK0j9qJ0mj4K0JJ6j1j4J7KjlK0j2MpNmK0j8MPqLR%Qj1LmpMNqPj2r
6276iJ5%JJoooOroRJk3J2LmJ3opJ7pJ3j7J2J1j6LnK3JkJ4j0MMj9J2n%qkOM%%k1
6322ikjQLo%Noj7J4oQo%OpNj2J4qOK1pj7rRJ2Qj1J8or%MJ5j6J8j7J1mKMKmJ2k7
6368bJ7mj4J2Knkj7J6rJJ1j3oj0JLJ4j2J4rj4K0K%qMrJ3K0mnNk5K4Pj2J0Lj1N
$$ plain form
6409 13 13 13 9 -5 5 8 14 8 5 21 -13 3 12 13 6 -10 1 -15 -11 -21 -8 -22 -25 -16 -21 -25 -16 -6 -12 -5 2 2 -7 3 -13 5 4 8 -11 -1 -8 2
6451 2 2 2 10 -1 8 19 18 7 18 5 20 14 3 14 4 8 6 -1 -6 -12 -3 -1 -9 -12 -18 3 -8 -8 -12 1 -15 -5 -22 -19 -10 -16 -14 -12 -18 -19 -14 -5 -5 -13 3
6496 3 -5 8 -12 -16 2 -2 2 3 5 12 4 11 -3 0 9 4 3 7 -1 16 2 9 -3 6 -4 -1 -17 -3 -4 -14 -22 0 -19 -9 -8 -17 -17 -16 -5 -19 -12 -20 -11 -11 -13
6541 -13 -20 -12 -9 -19 4 12 -6 1 -6 11 8 10 22 25 7 14 10 15 15 9 10 6 22 13 16 4 2 3 -13 -21 -23 -29 -15 4 -12 -10 -5 -6 -12 -27 -15 -18 -13 -7 -40
6586 -40 -27 1 -7 -11 -8 -14 -8 -17 1 5 -11 -4 3 2 2 -13 8 5 26 5 21 13 6 20 0 7 4 17 4 -5 2 -6 3 -20 -22 -14 -10 -20 -12 -5 -3 -29 -9
6629 -9 -9 -17 -12 -31 -23 -14 -10 -6 -15 -20 -7 -5 5 -3 -16 -5 6 -10 -21 10 25 -1 15 -3 0 0 1 -2 1 15 10 4 9 -11 10 7 8 -8 6 -4 -11 -6
6671 -6 -6 -12 -26 -14 -13 -25 -13 -37 -34 -21 -14 -14 -10 -15 -21 4 -3 -9 -8 3 16 11 -2 19 9 10 15 11 11 19 15 16 23 -3 10 5 15 19 10 0 13 12 -4
6714 -4 14 8 -14 -8 -9 -15 0 -3 -4 1 -22 -18 -9 -14 -30 -4 -7 -2 -14 -10 -5 -14 -7 1 0 6 1 9 -3 10 4 -7 18 2 1 11 9 13 19 -1 0 7 1 -6 -2 21
$$ packed form
6409A3%%mj4J0LOolJ6l4J6RJpj6J1j6Mj0J3j4lRnmRJ0oPP%rJ0j6J8jMj9J0pJ0
6451B%%Qj1RJ1jj1J1j3J5oj1J1j0MkpnoRKqloK1j1%mJ3j6J0j7LRoKKojNR%qJ6
6496CqJ3k0mJ8mMJKPqPj4LRnjMqJ7j4Pj2Rj0Lj6J4jj0qK2j9J0Jr%JJ1j4PqR%k
6541a3pQLj0K3Qj8PpJ7lKJ2Lj8PmN%oJmJ6rLj2kJj6qkoJ4J9j6KNjoj5J2lNOl3
6586d0J3K8qmLoOrJ8Mj6PPj%j5K1lK1k1J6qpJ4k0PlJ3j3rPqRk3kQMj0QPKk6K0
6629i%qNj9QRMMrnJ3KJ0qj3J1J1j6j1L1J5k6J6j8L%JlLJ4noNk0K1lJj6J4j0pN
6671f%oj4J2Jj2J2k4LJ3P%MnoK5poJJ1J3nj3K1j0JNm%QmJPk6J3nJ0Mrj0J3jj6
6714dJ8ok2OjoJ5ljNk3MRnj6K6lNj2MNrPQjOnQj2J3oj1K5j6jJ0kMOk0JPopMK3
$$ plain form
6760 21 -7 -10 6 -12 -5 -16 -9 -16 -22 -12 -23 -3 -7 -21 -17 -12 -25 -7 -24 -19 -13 3 -1 -20 -19 -6 -2 -12 5 17 1 -5 6 2 7 5 6 14 3 15
6800 15 8 2 -1 7 5 7 5 5 12 16 3 0 -1 -5 3 -5 -17 -14 0 -13 -16 -21 -5 -1 -8 -6 -3 -5 -18 9 -16 -11 -5 20 0 -7 0 -2 12 2 7 -9 4 16 19
6845 19 17 8 6 0 3 1 3 16 9 16 7 -4 2 2 1 -1 7 -11 -5 -12 -8 -17 -16 -10 -12 -19 -21 -23 -19 -12 -8 -15 -4 -3 -11 -1 -1 -2 6 18 16 16 9 14 14 23 12 4 9 24 21 15
6897 15 16 -1 22 5 5 4 12 24 11 -11 6 1 -5 -2 1 -10 0 7 -20 -9 -3 -9 -2 -10 -9 4 -1 -16 -10 -10 -22 -5 0 -4 -3 9 3 21 8 -3 13
6938 13 9 10 8 13 4 13 14 1 17 11 -7 3 8 2 15 9 -1 -9 9 7 12 3 -13 10 3 -12 -4 -6 -12 -9 -20 3 4 -15 -9 -12 3 -6 -8 -3 6 -3 -16 6
6982 6 0 -3 1 -5 13 0 12 11 8 16 5 17 16 10 19 8 28 12 12 9 1 12 7 14 -5 -1 -3 -12 -16 -16 -14 -11 -26 -3 5 -12 -19 -10 -14 -16 0 -7 -5 1 -9 -6
7028 -6 -3 4 -9 7 -3 19 -19 23 1 13 1 5 7 10 4 5 21 16 7 8 17 4 8 -10 -2 5 5 7 4 -11 6 -11 -5 -7 -14 -19 -11 -25 -9 -15 -18 -24 3
7071 3 -11 -8 -3 -13 -5 7 -1 11 -2 10 7 26 17 -1 12 13 8 10 13 -11 -1 6 5 3 17 17 -5 9 -3 -4 8 1 7 -8 2 5 -3 3 4 -15 -4
$$ packed form
6760B1k8lJ6j8Pj1PpoJ0j1K0mj4MNj3J8j7NOJ6mj9JJ3Mj0J7J2j6oJ1mNkJQj1J2
6800A5polQkKk%PMj3ljmQqj2LJ4j3lnJ6MpKLkj3K7k5NOK5k0pPkJ4j0Nj6J3J2L
6845A9krkoLkKJ3pPrj1O%jkQj8OpMrJOkpkkMPMpJ1JqJ0%jQJ2k%pN%Rj1qNJ5lo
6897A5Jj7K3j7%jQJ2j3k2J7noLLj1J0Pk7J1OoPqJJ3nj5O%j2J7NmJJ2oJ8j3j1J6
6938A3mJkNrRJj3J6oj8J0NoJ3oj0qJ8kNrj6K3pj5QkoLj1K3Jj9OlJ5rkNRrj3K2
6982FolMoJ8j3J2jlQj1J2joRj1K0j6%lqJ1nPj9Mkrm%KLj5K3Qj7pRmkJ6pKOj0L
7028fLPj3J6j0K2l8M2k2J2j2MKLoJJ6nrJRj3Mj8QP%Klj5J7j7OkpnQj4J6oloK7
7071Cj4LNj0QJ2qJ2j3J2lJ9rj8J3JnKLk4J0PjkJ4%k2J4j2jJ2pOj5J0LqOJj9J1
$$ plain form
7112 -4 -26 -20 -11 -5 -18 -22 -4 -16 3 -9 -21 -1 -13 2 2 0 2 0 -2 1 9 20 11 30 12 6 25 14 11 7 22 11 1 -4 8 -3 -4 6 -6
7151 -6 -2 -1 -3 -8 -6 4 -15 -5 -14 -4 -19 -4 -11 -21 -10 -26 0 -23 -14 -11 -15 -12 -12 -17 4 -9 -6 1 -7 -1 -1 18 10 18 23 27 10 5 13 5 6 10 1 14 0
7196 0 1 3 -4 0 -13 6 -7 -9 -8 -16 0 -13 -8 -15 -8 -28 -17 -23 -16 -23 -17 -10 -19 -9 -28 -17 -17 -3 -6 0 -1 7 -2 3 21 11 -4 4 16 10 3 -1 -1 6 -2 12
7242 12 10 -4 10 -10 4 0 -4 -11 -2 -1 -1 -21 -4 -10 -23 -9 -14 -13 -10 -13 -12 1 -21 -18 0 -4 -1 0 -1 -9 9 -13 0 11 -1 10 4 -10 2 -5 6
7283 6 18 6 14 9 14 10 -6 -9 -4 9 -9 -8 -4 3 -6 -5 -14 1 6 -11 -8 -6 -21 -19 -33 -30 -8 -15 -23 -19 -14 -22 -26 -27 -12 -12 -12 -1 3 -11 8 -9 5 9 -6
7328 -6 15 6 0 22 16 20 11 -12 19 17 6 2 22 4 5 -7 4 3 -4 -12 -1 -1 -3 8 -21 -17 -17 -19 -11 -10 -12 -17 -19 -9 -11 -26 -17 -10 2 -5 -16 -20 -2 -6
7372 -6 2 0 -10 -9 11 18 10 16 26 -1 8 11 24 27 15 12 16 16 6 -4 5 -7 6 3 -5 -15 -17 -12 -8 -2 -16 -6 -26 -13 -12 -18 -20 -17 -25 -3 -2 -7 -17 -1
7416 -1 -17 -9 -4 -2 -4 -1 0 -3 -1 1 3 -13 -8 11 22 15 12 12 16 6 2 5 2 2 -3 4 -7 -17 -23 -3 -8 -20 -11 -16 -21 -24 -3 -11 -20 -19 -24 -4 -10 -11 -5 -10 -7 -5 -14 3
$$ packed form
7112dk2OROj3mJ8j2J9j2j2K0j2J5%kKkkLQJ1rJ9j8oJ9j1lmJ5j1j0nJ2j1jJ0j2
7151fMJknKJ0j9J0rJ0j5J5pj0J1j6K6k3RLmL%nK1j3LPqO%J9qQNMj7nQqJMrJ3j4
7196@JKpMj3J9j3kJqJ6j3NpPk0J1oPpOPrJ0j9J1%J4lOjQrNJ8j0j5QJ2opm%PqJ4
7242A2kj4J4k0J4mmpRJ%k0J7oj3J4nJLlJJ3k2LJ8mLJjqJ8k2J3J1j2J1oj4J2pJ1
7283FJ2j2QnNmj6lNJ3j8JMPrJrJ5Nj7LKj5Kj4LK2pqMNqmjJ5%%J1Mj4J9j7J4Mj5
7328fK1roK2oMrk3L1kj1mK0j8Jj2J1jpqJ1%kJ1k9M%kQJknkJ0kj5RPJ2pj1mJ8m
7372fQkj0JK0PqOJ0k7RLJ3Lj2lM%j0j0Rj2J3lqj0kNMOj4J0k0J3JokLqK2Jnj0J6
7416aj6QNKkLJlKKKj6NJ9J1pl%Mj0mLl%nPj1j0oK0nj2RnnlK1qrJnK0ojOnLKrJ7
$$ plain form
7466 3 -19 4 2 2 21 9 10 0 13 9 9 5 8 4 -7 17 -4 -5 -7 5 7 -9 0 4 -1 -3 8 -7 -6 -7 -25 -4 -14 -20 -6 -24 -18 -22 1 -34 -17
7507 -17 -23 -12 -15 -23 -12 -13 -13 -3 1 -5 -10 2 6 18 10 27 21 5 10 2 19 5 4 4 3 15 14 -5 14 -4 11 13 -12 17 -7 -3 -2 -9 3 -5 -1 -16
7549 -16 -23 4 -1 -7 -12 -2 -13 -3 -20 -15 -5 -2 9 10 -13 -14 -17 -13 12 19 11 2 16 9 13 7 15 11 2 -5 -8 -2 10 20 4 6 7 -7 -3 0 1 -4 -19 -14 3
7594 3 -3 -12 -13 -20 -23 -12 -19 -20 -17 -20 -23 -27 1 5 -12 -3 5 3 -9 3 2 -13 -4 -8 4 -1 -2 -14 -3 14 22 1 14 7 16 18 11 13 -3 6 -2 7 -10 -9 -10 -5 -13
7641 -13 -6 -27 -16 -24 -24 -21 -23 -27 -16 -26 -33 -13 -22 -32 -29 -12 -13 -8 -10 -7 -13 -5 1 -10 -4 -8 -6 11 5 0 -2 12 9 5 12 3 6 9 9 -9 -1 5 -5 5 2 9 -11
7688 -11 5 -5 -12 -9 -13 -11 -3 -9 -15 -14 -16 -13 -8 -4 7 -12 -14 2 -9 -19 -16 -4 -2 4 -2 9 10 11 5 -10 9 19 15 -3 16 15 13 16 3 1 4 3 7 -10
7732 -10 7 -14 1 -10 1 -9 -7 -3 -15 -21 -19 -18 -19 -22 -4 -22 -20 -13 -11 -14 -4 -11 -18 -15 -22 -9 3 -1 -1 -1 -3 -8 11 7 2 10 2 -3 19 9 13 14 4 9
7776 9 -4 4 -9 -6 -6 -4 -14 3 -8 -8 -18 -14 -18 5 -13 -19 -19 -20 -17 -4 -18 -12 -2 -7 -17 -11 -11 -1 -9 -7 -7 0 -1 6 6 -11 7 14 12 6 -2 -2 10 -6
$$ packed form
7466Ck2K3k%J9j2Jj0J3m%mLmj1K4k1jkJ2Kj6RMnkJ1j5Jjj8K1j0oJ4j8OmK3l5J7
7507a7oJ1lqJ1j%J0MonJ2MJ2qJ7oj6NqJ7j4j%jJ2jj9J9j8J5Kk5K9k4MJpJ2qMj5
7549a6pK7nonJ0j1J0j7NJ0LJ1Jk3jlMK5PqrJ4pMoQmrplOJ2J0j6KJj4MLJnj5NJ7
7594CorjplJ1pjLllmK8Mj7RQkj2J2jj5RmJ2njj2J1J7Qk1J3pRKpKj6RqRj7JjNq
7641a3Pk1J1q%LkmJ1j0pK0rj0LJ7jNkLoQOj1OmKJ7onkJ4lmPrLL%j8QOj0J0lPk0
7688a1J6j0pLmKQooJkLNMJ1j9kJ6j1j0LJ2KOoJ1JJoj5J9J0mj8J9jkLj3kLjMj7
7732a0J7k1J5j1J1j0KMj2oKJjlJ8j8KPKlJ0ppLpJ3J2m%%knJ9mnQqnK2j0MJj0N
7776Ij3Qj3L%Kj0J7j1%j0MmK3j8o%jLJ3j4OJ0nj0O%J0qK%PjP%j7J8Pkoq%J2j6
$$ plain form
7820 -6 8 -1 5 3 11 11 16 14 27 -3 -9 -1 6 8 -11 -5 -1 -1 -10 -9 -26 -14 -19 -14 -28 -5 -17 -20 -9 -17 -14 -16 1 -11 -3 5 3 -6 13 -5 -1 8 2 12 -1
7865 -1 18 10 12 16 9 11 -2 -2 5 -2 -5 9 4 9 1 21 -10 -2 -8 -7 -13 -3 -12 -24 -13 -7 -27 -22 -13 -10 -7 4 -15 -9 -2 -18 -6 -12 -10 -14 -5 -4 -8 -6 -5 -8 4
7912 4 2 21 11 10 15 13 -2 7 11 23 21 10 15 -2 -3 -2 3 -3 9 -7 -3 -16 -6 -12 -10 0 1 -17 -10 -8 -17 -9 -3 -10 -5 8 -18 1 -2 10 2 2 0 0 -1
7957 -1 6 18 10 8 13 30 5 10 -4 12 4 18 13 2 3 -6 -6 -5 15 -10 -8 -11 -26 -1 -20 -22 -20 -8 -8 -13 -15 -26 -20 -10 -22 -27 -18 1 -24 -19 -14 2
7999 2 -9 -7 -11 -19 11 0 3 0 2 -1 8 19 25 14 11 7 21 -1 3 21 17 15 11 6 2 15 -3 5 -8 -10 -22 -16 -4 -14 -20 -17 -8 -20 -24 -13 -7 -2 -2 -13
8043 -13 -3 -21 -21 -5 -14 -3 -8 3 1 -14 4 -18 -4 1 14 8 4 2 -5 13 25 2 10 5 4 2 10 5 -6 6 -17 0 -10 -17 3 -6 -12 -15 -3 -5
8083 -5 -22 -29 -21 -14 -4 -3 -23 -34 1 -18 -24 -3 -23 -7 -9 -3 -9 7 3 20 11 -2 14 17 11 15 13 25 15 9 7 6 6 14 7 -9 2 10 -19 -5 5
8124 5 9 11 4 -5 -12 -21 -22 -9 1 -10 -21 -16 -19 -23 -13 -15 -6 1 -4 -9 -13 -4 -10 5 1 -4 13 13 -2 3 14 5 25 24 7 19 14 16 18 16 20 8 11 5 1 -6 3 12
$$ packed form
7820fJ4rOkQ%NkJ3l0oQPKj9OM%rJj7J2nNj4K3j2lJ1qLkJ7j2QQkrJ9j8MRoJ0j3
7865aJ9qKMpKj3%PplJ4nNqK0l1QoJoJ0rj2J1Ok0NRLLJ1j9OPj6J2oKmRJmKJlJ2
7912DkJ9j0jNkj5RMJ2kj1Nj7jJNoJ2j6Mj3J0oKJ0Jj8PKrQOpNJ3k6J9lJ2q%k%j
7957aPJ2qkNJ7k5Nj4J6qJ4nj1Jr%JK0k5Klj5K5j9kKJ2%nkj1OJ0j2nRJ9k5NNJ6
7999Bj1KmqL0j1LlKlRJ1Oj1lmJ4k2MJ8mkmnmJ3j8Qj3kj2OJ2j0oLRj2mJ1ON%j1
8043a3J0j8%J6rJ1nJ1kj5J8k2J4NJ3omkpJ8J2k3QnjkQnj1J2k3J7j0pK0rolJ2k
8083ej7pQPJ0Jk0j1L5j9oK1k0J6kOoJ6mJ7rj3J6LoMkJ2j0okj%Qpj6J1Qk9J4J0
8124EMKprprjJ3J0j1j1NlmJ0kRPnnmRoJ5mnJ7%j5NJ1rK0jj7J2nKKkMj2LompRR
$$ plain form
8172 12 -12 1 -1 1 -2 -9 -12 -7 -1 -3 -12 5 -12 -9 -22 -5 -20 4 -14
$$ packed form
8172A2k4J3kKlplNOkrJ7j7Lj3J7j5K4j8
8191a4
##END NTUPLES=NMR FID
##END=
