##TITLE=H1
##JCAMPDX= 6.0         $$ Bruker NMR JCAMP-DX V2.0
##DATA TYPE= NMR SPECTRUM
##DATA CLASS= NTUPLES
##ORIGIN= UXNMR, Bruker Analytische Messtechnik GmbH
##OWNER= root
$$ XWIN-NMR		Version 3.5
$$ Mon Feb 22 11:38:46 2016 Russian Standard Time (UT+4h)  servis@DPX200
##.OBSERVE FREQUENCY= 200.131235884673
##.OBSERVE NUCLEUS= ^1H
##.ACQUISITION MODE= SIMULTANEOUS
##.ACQUISITION SCHEME= undefined
##.AVERAGES= 16
##.DIGITISER RES= 18
##SPECTROMETER/DATA SYSTEM= spect
##.PULSE SEQUENCE= zg
##.SOLVENT NAME= DMSO
##.SHIFT REFERENCE= (INTERNAL, DMSO, 0, 17.6849)
##AUDIT TRAIL= $$ (NUMBER, WHEN, WHO, WHERE, WHAT)
$$ ##TITLE= Audit trail, XWIN-NMR		Version 3.5
$$ ##JCAMPDX= 5.01
$$ ##ORIGIN= Bruker BioSpin GmbH
$$ ##OWNER= servis
$$ F:/spectra/data/servis-vadim/nmr/H1/1/pdata/1/auditp.txt
$$ ##AUDIT TRAIL=  $$ (NUMBER, WHEN, WHO, WHERE, WHAT)
(   1,<2016-02-22 11:37:52.09 +0400>,<servis>,<DPX200>,
      <created by zg, POWCHK disabled, PULCHK disabled
       configuration hash MD5:
       00 E9 B6 7A A2 85 ED C7 34 08 36 98 17 FE 4E 26
       data hash MD5: 16K
       24 E0 7D 52 4C 96 B1 42 37 98 32 41 5E 7D 85 42>)
(   2,<2016-02-22 11:37:55.28 +0400>,<servis>,<DPX200>,
      <Start of raw data processing
       efp BC_mod = 2 LB = 0.3 FT_mod = 6 PKNL = 1 PHC0 = -29.40711 PHC1 = -0.3563094 SI = 32K 
       data hash MD5: 32K
       F7 E7 D6 78 B2 C2 D5 7D 3C BE A2 46 A6 AB DD 5D>)
(   3,<2016-02-22 11:38:11.59 +0400>,<servis>,<DPX200>,
      <pk PHC0 = -5.188049 PHC1 = 0 
       data hash MD5: 32K
       71 90 E8 5A CF 57 84 35 36 D4 57 99 D0 D1 B1 55>)
$$ ##END=
$$ 
$$ hash MD5
$$ 73 1A 70 72 1B 01 FC 30 B5 6D 96 F8 25 33 14 EF
##$RELAX= 
##$RELAX= 
##$RELAX= 
##$RELAX= 
##$RELAX= 
##$RELAX= 
$$ Bruker specific parameters
$$ --------------------------
##$DU= <F:/spectra>
##$EXPNO= 1
##$NAME= <H1>
##$PROCNO= 1
##$TYPE= <nmr>
##$USER= <servis-vadim>
##$AMP= (0..31)
100 100 100 100 100 100 100 100 100 100 100 100 100 100 100 100 100 100 
100 100 100 100 100 100 100 100 100 100 100 100 100 100 
##$AQSEQ= 0
##$AQ_mod= 1
##$AUNM= <au_zg>
##$AUTOPOS= <>
##$BF1= 200.13
##$BF2= 200.13
##$BF3= 200.13
##$BF4= 200.13
##$BF5= 500.13
##$BF6= 500.13
##$BF7= 500.13
##$BF8= 500.13
##$BYTORDA= 1
##$CFDGTYP= 0
##$CFRGTYP= 5
##$CHEMSTR= <none>
##$CNST= (0..31)
1 1 145 1 1 1 1 1 1 1 1 1 1 1 1 1 1 1 1 1 1 1 1 1 1 1 1 1 1 1 1 1 
##$CPDPRG= <>
##$CPDPRG1= <>
##$CPDPRG2= <>
##$CPDPRG3= <>
##$CPDPRG4= <mlev>
##$CPDPRG5= <mlev>
##$CPDPRG6= <mlev>
##$CPDPRG7= <mlev>
##$CPDPRG8= <mlev>
##$CPDPRGB= <>
##$CPDPRGT= <>
##$D= (0..31)
0 1 0 0 0 0 0 0 0 0.06 0 0 0 0 0 0 0.0002 0 0 0 0 0 0 0 0 0 0 0 0 0 0 
0 
##$DATE= 1456126671
##$DBL= (0..7)
120 120 120 120 120 120 120 120 
##$DBP= (0..7)
150 150 150 150 150 150 150 150 
##$DBP07= 0
##$DBPNAM0= <>
##$DBPNAM1= <>
##$DBPNAM2= <>
##$DBPNAM3= <>
##$DBPNAM4= <>
##$DBPNAM5= <>
##$DBPNAM6= <>
##$DBPNAM7= <>
##$DBPOAL= (0..7)
0.5 0.5 0.5 0.5 0.5 0.5 0.5 0.5 
##$DBPOFFS= (0..7)
0 0 0 0 0 0 0 0 
##$DE= 6
##$DECBNUC= <off>
##$DECIM= 32
$$ [...]
##$SUBNAM3= <"">
##$SUBNAM4= <"">
##$SUBNAM5= <"">
##$SUBNAM6= <"">
##$SUBNAM7= <"">
##$SUBNAM8= <"">
##$SUBNAM9= <"">
##$SW= 20.6817932712277
##$SWIBOX= (0..15)
0 0 3 0 0 0 0 0 0 0 0 0 0 0 0 0 
##$SW_h= 4139.07284768212
##$TD= 16384
##$TD0= 1
##$TE= 0
##$TE2= 300
##$TE3= 300
##$TEG= 300
##$TL= (0..7)
0 120 120 120 120 120 120 120 
##$TP= (0..7)
150 150 150 150 150 150 150 150 
##$TP07= 0
##$TPNAME0= <>
##$TPNAME1= <>
##$TPNAME2= <>
##$TPNAME3= <>
##$TPNAME4= <>
##$TPNAME5= <>
##$TPNAME6= <>
##$TPNAME7= <>
##$TPOAL= (0..7)
0.5 0.5 0.5 0.5 0.5 0.5 0.5 0.5 
##$TPOFFS= (0..7)
0 0 0 0 0 0 0 0 
##$TUNHIN= 0
##$TUNHOUT= 0
##$TUNXOUT= 0
##$USERA1= <user>
##$USERA2= <user>
##$USERA3= <user>
##$USERA4= <user>
##$USERA5= <user>
##$V9= 5
##$VALIST= <valist>
##$VCLIST= <CCCCCCCCCCCCCCC>
##$VD= 0
##$VDLIST= <DDDDDDDDDDDDDDD>
##$VPLIST= <PPPPPPPPPPPPPPP>
##$VTLIST= <TTTTTTTTTTTTTTT>
##$WBST= 1024
##$WBSW= 4
##$XGAIN= (0..3)
0 0 0 0 
##$XL= 0
##$YL= 0
##$YMAX_a= 37210
##$YMIN_a= -51112
##$ZGOPTNS= <>
##$ZL1= 120
##$ZL2= 120
##$ZL3= 120
##$ZL4= 120
##$ABSF1= 0
##$ABSF2= 0
##$ABSG= 0
##$ABSL= 0
##$ALPHA= 0
##$AQORDER= 0
##$ASSFAC= 0
##$ASSFACI= 0
##$ASSFACX= 0
##$ASSWID= 0
##$AUNMP= <proc_1d>
##$AZFE= 0.1
##$AZFW= 0.1
##$BCFW= 0
##$BC_mod= 2
##$BYTORDP= 0
##$COROFFS= 0
##$CY= 18.4799938201904
##$DATMOD= 1
##$DC= 0
##$DFILT= <>
##$DTYPP= 0
##$F1P= 9.9274215381318
##$F2P= -0.165520771350173
##$FCOR= 1
##$FTSIZE= 32768
##$FT_mod= 6
##$GAMMA= 0
##$GB= 0
##$INTBC= 1
##$INTSCL= 1
##$ISEN= 128
##$LB= 0.3
##$LEV0= 0
##$LPBIN= 0
##$MAXI= 10000
##$MC2= 0
##$MEAN= 0
##$ME_mod= 0
##$MI= 50
##$NCOEF= 0
##$NC_proc= -9
##$NLEV= 6
##$NOISF1= 3.799351
##$NOISF2= 2.8
##$NSP= 0
##$NTH_PI= 0
##$NZP= 0
##$OFFSET= 17.68489
##$PC= 4
##$PHC0= -34.59516
##$PHC1= -0.3563094
##$PH_mod= 1
##$PKNL= yes
##$PPARMOD= 0
##$PSCAL= 4
##$PSIGN= 0
##$REVERSE= no
##$SF= 200.129766148193
##$SI= 32768
##$SIGF1= 3
##$SIGF2= 2
##$SINO= 400
##$SIOLD= 16384
##$SREGLST= <1H.CDCl3>
##$SSB= 0
##$STSI= 32768
##$STSR= 0
##$SW_p= 4139.07284768211
##$SYMM= 0
##$S_DEV= 0
##$TDeff= 16384
##$TDoff= 0
##$TI= <>
##$TILT= no
##$TM1= 0
##$TM2= 0
##$TOPLEV= 0
##$USERP1= <user>
##$USERP2= <user>
##$USERP3= <user>
##$USERP4= <user>
##$USERP5= <user>
##$WDW= 1
##$XDIM= 32768
##$YMAX_p= 450734832
##$YMIN_p= -987104
$$ End of Bruker specific parameters
$$ ---------------------------------
##NTUPLES= NMR SPECTRUM
##VAR_NAME=  FREQUENCY,     SPECTRUM/REAL,   SPECTRUM/IMAG
##SYMBOL=    X,             R,               I
##VAR_TYPE=  INDEPENDENT,   DEPENDENT,       DEPENDENT
##VAR_FORM=  AFFN,          ASDF,            ASDF
##VAR_DIM=   32768,         32768,           32768
##UNITS=     HZ,            ARBITRARY UNITS, ARBITRARY UNITS
##FACTOR=    0.126318333923829, 1,           1
##FIRST=     3539.27304956752, 0,            0
##LAST=      -599.799798114586, 0,           0
##MIN=       -599.799798114586, -987104,     0
##MAX=       3539.27304956752, 450734832,    0
$$ Real data points
##PAGE= N=1
##DATA TABLE= (X++(R..R)), XYDATA
$$ [...]
15259A16316L5713K0631M886j406j0992j9153k891L1987M4793J7176j8159k5450
15247A93451j2847q068j1492k116K2782M0962L5635J4328k785k684J0872K0409
15235B98447J0914j2010k5980j9031n362o145k0626k6472q392K1376L5544K3318
15223B65581L784K550J8956K7944J4433r308k4088k3392p493J7813K8103l63m1137
15210B73383l1186L3374O6581J3468n1251l0411L4373K8718k9619j1023P3761
15199C70168K7257k20574m16020k83075P4672K85170J91098P428k9442M3098O4407
15188A14187J9775Q033M4850N5879K1959j672M272K237j6069j5022R743K0370
15176B68542P015p03K262j1248l5849k8420J5846M3241J9719k3011m1966l5903
$$ plain form
15259 116316 152029 172660 177546 176140 165148 145995 143104 175091 219884 237060 218901 193451
15247 193451 180604 172536 161044 158928 181710 222672 258307 272635 269850 267166 278038 298447
15235 298447 309361 297351 271371 252340 246978 240833 220207 193735 185343 206719 242263 265581
15223 265581 269365 271915 290871 318815 333248 323940 299852 276460 268967 286780 314883 314520 273383
15210 273383 242197 275571 342152 355620 304369 273958 308331 337049 307430 296407 370168
15199 370168 397425 176851 -239169 -522244 -447572 -162402 28696 36124 6682 49780 114187
15188 114187 133962 141995 186845 242724 264683 263011 267283 269520 253451 238429 248172 268542
15176 268542 275557 274854 277116 265868 230019 201599 217445 260686 280405 257394 215428 179525
15164A79525k0903K102K8734L8407K6695J8562K6817K8624N409k4277l4382k6188
15152B49125j2274P185L0067L9119K4904J496j6662l0812l8776k8734o556J964
15140B20046q052j1281P20M115m999P767M8594O2558J5591l7926l1633P590N946
15127B79036l1507k9188K7388N8353J1909n7111p1776l5635j828J3571L0100M2774
15115B36086K3611k1176m4517j9434K5419M4105K6075k734j7206j5470q014k1
15103B26724P712Q865k704j7249j5484K946J4456N825n713l696k234j7913l1459
15090A70076j5265J2457O793l0317m3938p316L5242L1467q558l5226k5983K110
15078I1542K6924L7364K7179N47k2413k5895j6731p711L197J8991K6040J4139
$$ plain form
15164 179525 158622 160724 189458 227865 254560 273122 299939 328563 333972 309695 275313 249125
15152 249125 236851 244036 274103 313222 338126 339622 322960 292148 253372 224638 218082 220046
15140 220046 211994 200713 201433 205548 200549 208316 256910 319468 335059 297133 265500 273090 279036
15127 279036 247529 218341 245729 304082 315991 258880 187104 151469 149641 163212 193312 236086
15115 236086 259697 238521 194004 174570 199989 244094 270169 267435 250229 234759 226745 226724
15103 226724 234436 243301 240597 223348 207864 210810 225266 231091 225378 221682 219448 201535 170076
15090 170076 154811 167268 174061 143744 99806 92490 127732 159199 150641 115415 89432 91542
15078 91542 118466 155830 183009 183556 161143 135248 118517 110806 114003 132994 159034 173173
15066A73173n89Q30P419o18j0159O846L7409L3507j5343n6517m4457l317J3103
15053A41287N56J155K7800L8784M987l4443j9819M1153P4696L6121l2546o0835
15041B18896l7646q713l415n873P72L411r792j8918k01L3644M7532K9422r44k2648
15027B25527l1075k6662q050J7271L0524K0248j943j1840N66J8501J6883p006
15015B42944k9085k8716j2205L870J8358L4732L7493J0126k7567l5286r140J3110
15003B18634J1832J0556K5210L1006Q081j8020j7624o245j1347j7670O006M4250
14991B84669N0715J8392j4357k5731l1780m2718m2674k3625k306R228J9657L4926
14979B34396M5172M3013L2032J4648n500j2310L640J9560O962k1269k7960j1915
$$ plain form
15066 173173 172584 173414 180833 180215 170056 176902 214311 247818 232475 175958 131501 128184 141287
15053 141287 141843 142998 170798 209582 214569 180126 160307 201460 276156 312277 279731 218896
15041 218896 181250 172537 169122 163249 164021 167432 157640 138722 138521 172165 219697 249119 248175 225527
15027 225527 194452 167790 159740 177011 207535 227783 225840 214000 214566 233067 249950 242944
15015 242944 213859 185143 172938 176808 195166 229898 267391 277517 249950 214664 205524 218634
15003 218634 230466 241022 266232 297238 305319 287299 269675 263430 252083 234413 240419 284669
14991 284669 335384 353776 339419 313688 281908 239190 196516 172891 170585 179813 199470 234396
14979 234396 279568 322581 354613 369261 363761 351451 355091 374651 381613 360344 332384 320469
14967C20469o876j9526j8133P645K5496J6295M800J2398K0510N716k3461m5564
14955B99769m9575k6518K2639N9452L8257j9082l5131J1552M8795K0578l0561
14944C40175m1018k3697k3547k9152m643K9923K9086M528N53J1460J379j5641
14932B79406J91K6344N694m3997m5178Q718L6958N703k1703l479J0012k1949m7380
14919A89340j1093M4344M5940M899j5497n859m595j4484m836J8046J6848n695
14907B57358r780O903K878k9956m3888r769L6676M8171K6675M728m194r110j4112
14894B62580j2771l379O236Q129K596k134Q79P464Q036M040N214P343n729k8102
14880B60402k6840R391M3357L8445J0514k779k108j4434l6796l9130j7345K075
$$ plain form
14967 320469 313593 294067 275934 283579 309075 325370 330170 342568 363078 368794 345333 299769
14955 299769 250194 223676 246315 305767 344024 324942 289811 301363 350158 370736 340175
14944 340175 299157 275460 251913 222761 218118 248041 277127 281655 282208 293668 295047 279406
14932 279406 279597 305941 311635 267638 222460 231178 268136 273839 252136 248657 258669 236720 189340
14919 189340 178247 222591 268531 273430 257933 252074 247479 232995 228159 246205 263053 257358
14907 257358 247578 254481 257359 227403 183515 173746 210422 258593 285268 289996 285802 276692 262580
14894 262580 249809 246430 252666 260795 263391 261257 262136 269600 277636 281676 286890 294233 288504 260402
14880 260402 233562 242953 286310 324755 335269 332490 330382 315948 279152 240022 222677 224752
14868B24752R801K1437L4491K3571j0931l1778j8240N784J2423M659m690j5007
14856B56272k1944j2085Q267J0642j0130k0162K302L1842L6675K3256J1817k513
14844C14239k9846n1230m1464j0077J3658K2164K5349K1451O071l966P518K0560
14832B94427K915l6654n5861l7335m762J8185L0057L1817K0132N788O963J8841
14820B94513J9940J1097J3764K5401J6669j5316l2245j3108J1139P910p040l582
14808C29142P952l480l3052m4968k7232m595K848K017L690M041j901o829N45K2576
14794B50754M7843N2875J9976l2838n5225k1882K5950K7992j3540l8440j6429
14783B47036J2949N162k3874k7867Q61K8256L2005K4951K6912L8949M8263M0939
$$ plain form
14868 224752 234553 255990 290481 314052 303121 271343 253103 258887 271310 275969 271279 256272
14856 256272 234328 222243 230510 241152 231022 210860 213162 245004 281679 304935 316752 314239
14844 314239 284393 233163 191699 181622 195280 217444 242793 264244 270315 266349 273867 294427
14832 294427 297342 260688 204827 167492 162730 180915 210972 242789 262921 268709 275672 294513
14820 294513 314453 325550 339314 364715 381384 366068 333823 320715 331854 339764 332724 329142
14808 329142 337094 333614 300562 255594 228362 223767 226615 228632 232322 236363 234462 227633 228178 250754
14794 250754 298597 351472 371448 338610 283385 261503 287453 315445 301905 263465 247036
14783 247036 259985 265147 241273 213406 214267 242523 274528 299479 326391 365340 413603 454542
14771D54542R602l5402o3296m8997m717K9238K8747Q244m265j054L763k363j4414
14758C59628j6520k582J1104O98l2875n6139m0027K191L0690K9600K1541K8795
14746C36104M1517L6728J3496p105j0689m375l830j3689k1874j1922J6190L9148
14734D09699L2625Q78k6938l1813k2499j4189p364J339M326l135o680Q330K8653
14721C73232K6547J49k1675j8974m779n09m568m0J5750K4774J0925j9639m2273
14708C38920l5747k861K8614L0172K247k3553j7239J5744L8927K4364j6265m3797
14696C39526l3314J314K6173K4791J0454L798P642P886n367k2185j9742J1570
14684C52546M8307N1158J1629l0337l3507r374q51j3085o931K8857M5409M757
$$ plain form
14771 454542 464144 428742 365446 316449 311732 340970 369717 377961 373696 372642 376405 374042 359628
14758 359628 343108 340526 351630 352328 319453 263314 223287 225478 256168 285768 307309 336104
14746 336104 377621 414349 427845 420740 410051 405676 401846 388157 366283 354361 370551 409699
14734 409699 442324 443202 416264 384451 361952 347763 340399 341738 346064 342929 336249 344579 373232
14721 373232 399779 399928 378253 359279 354500 353991 349423 349383 365133 389907 400832 381193 338920
14708 338920 303173 300312 328926 359098 361345 337792 320553 336297 375224 399588 383323 339526
14696 339526 306212 307526 333699 358490 368944 372742 380384 388270 382903 360718 340976 352546
14684 352546 400853 452011 463640 433303 399796 390422 389571 376486 369555 398412 443821 448578
14672D48578n3732o1713j4413L1374L8796K2833N721r950j8127n373J6929J6686
14660D17609p670j7980M353K7610K0253l528j5780j9572k9124l1652o286L4304
14648C72537N4789M1420J0358j8332l2928k7686j0016J48m517p903L16N428l945
14635C79669j3376j1795j4762k8901k4099J8519N8615M5946k297k5947q921J3688
14623C86339K3793L3460L4345K376l9833l4995J6089M1894Q198k8436j4754J5785
14611D44261Q128j9786j4827J5130J4829k4609n1616l2344J0878M2086M7785K7947
14599D67862p693k9927j3718K3132L7036J6060j1859k6165l0836k3219R653N2185
14587D62511O1332K7368m567Q17J7953P137j8419j6420J0341J3724k3130n3997
$$ plain form
14672 448578 394846 333133 318720 350094 388890 411723 417444 407494 389367 383994 400923 417609
14660 417609 409939 391959 396312 423922 444175 440647 424867 405295 376171 344519 338233 372537
14648 372537 427326 468746 479104 460772 427844 400158 390142 390290 385773 377870 378186 383614 379669
14635 379669 366293 354498 339736 310835 286736 305255 363870 409816 407519 381572 372651 386339
14623 386339 410132 443592 477937 480313 440480 405485 421574 463468 471666 443230 428476 444261
14611 444261 452389 432603 417776 432906 447735 423126 371510 339166 350044 392130 439915 467862
14599 467862 460169 430242 416524 439656 476692 492752 480893 454728 423892 400673 410326 462511
14587 462511 523843 551211 546644 547461 565414 572551 554132 537712 548053 561777 538647 484650
14575D84650l3724J8076M5274K8445j034j2660r946o652o23J0769J2411n828k3343
14562E05815j5118N595M645j5900j7223J2191L2920J5269j2228m683L4985O5379
14550F11647O1247K9451j2307m3447m3585j7531j615j5907l0105j1401J7229J2920
14538E56596j2056q601K3608L2175N5k4901p652K3077K8556J5007L300j1494l3893
14525E83777m0182j6167R643J0124P121L2235O5609O1731K0656j3457j7314q925
14513F94851n725k085P594J5580J6078J0547k118j9616k5870j0032J0966J3811
14501G03981M653O056J6939J7256O264J825N079J258o205k97J0714J366j9136
14488G49753r832L2766N5375K3409k5446l5682p794J8934K8695L2392K9224J0179
$$ plain form
14575 484650 450926 469002 514276 542721 541687 529027 519081 512429 511806 522575 534986 529158 505815
14562 505815 490697 496292 500937 485037 467814 480005 512925 528194 515966 511283 546268 611647
14550 611647 672894 702345 690038 646591 603006 585475 583860 567953 537848 526447 543676 556596
14538 556596 544540 535939 559547 591722 591777 566876 559224 582301 610857 625864 629164 617670 583777
14525 583777 543595 527428 537071 547195 554316 586551 652160 713891 734547 721090 703776 694851
14513 694851 689126 687041 694635 710215 726293 736840 734722 715106 689236 679204 690170 703981
14501 703981 708634 714690 731629 748885 755149 756974 762053 763311 757106 756809 767523 768889 749753
14488 749753 739921 772687 828062 851471 826025 790343 782549 801483 830178 862570 891794 901973
14476I01973j0008p411P588J858k4246l3501j2864L642q495k2699n413K7697L7155
14463H55276K2811J8770L0928K5603q604l0007k173M6841N8942K3254j7561l0332
14451I93748k2444r325R215K8038K7959Q056k942R726J9689L320j5701j280L5501
14438A083560N2410M0227K8206K9444K4580N242o921K913K0582L1135L8790M4856
14426A395024L5459Q682j1315n160J7595L8901N4418O2309N4762L6674K9256L9043
14414A755648M6112L6827K2416J2516L042N261M3927J00289J05549L5034l5414
14403B131207k5787L0754L8961j1854l6731P807O0862N7437J7846m760p070j4625
14391B244047k1819q694R109O4k8394m1552l4762l5186m9935n4936m0217k9023
$$ plain form
14476 901973 891965 884554 892142 894000 869754 836253 823389 827031 818536 795837 790424 818121 855276
14463 855276 878087 896857 927785 953388 944784 914777 912604 959445 1018387 1041641 1024080 993748
14451 993748 971304 961979 971194 999232 1027191 1035247 1032305 1042031 1061720 1065040 1049339 1048059 1083560
14438 1083560 1135970 1176197 1204403 1233847 1258427 1263669 1256748 1259661 1280243 1311378 1350168 1395024
14426 1395024 1430483 1439165 1427850 1422690 1440285 1479186 1533604 1595913 1650675 1687349 1716605 1755648
14414 1755648 1801760 1838587 1861003 1873519 1876561 1881822 1925749 2026038 2131587 2166621 2131207
14403 2131207 2105420 2136174 2175135 2163281 2126550 2134357 2195219 2252656 2270502 2265742 2258672 2244047
14391 2244047 2222228 2213534 2222643 2222707 2194313 2152761 2117999 2082813 2032878 1977942 1937725 1908702
14379A908702m0028n9148o2489m6930k6476j4450j7998l5340n1108m8675l3693
14368A472367k9976m4410n3499l7938j4933j6338m2486n9532m4211j2696L117
14357A119465m793j6831j5970q855j4340l8330o4566o8786m1408J026K6980J7277
14345H90869j6143m1874m0622k1140m704k223j0979k3957l2286k5541l281J6200
14333F84319J2904q142k1124j3995l915r202j9066q019K3617M1918J9754k5987
14321F73062n1316l7724j2721r840k2357j7248J0112K4298L180k4310j7384J8269
14309E36021M1011L2118J2029O61n375j1471j2530j1347k0647l4998k9456r93
14297D95023J8863J2634O555K2360K8791j5997q9081j17139o8160J0154N2475
$$ plain form
14379 1908702 1868674 1809526 1747037 1700107 1673631 1659181 1641183 1605843 1554735 1506060 1472367
14368 1472367 1442391 1397981 1344482 1306544 1291611 1275273 1232787 1173255 1129044 1116348 1119465
14357 1119465 1114672 1097841 1081871 1073016 1058676 1020346 955780 886994 845586 846612 873592 890869
14345 890869 874726 832852 792230 771090 766386 764163 753184 729227 696941 671400 668119 684319
14333 684319 697223 689081 667957 653962 650047 640845 621779 613760 637377 679295 699049 673062
14321 673062 621746 584022 571301 561461 539104 521856 531968 556266 559446 535136 517752 536021
14309 536021 577032 609150 621179 621840 616465 604994 592464 581117 560470 525472 496016 495023
14297 495023 513886 526520 533075 555435 584226 568229 479148 362009 293849 304003 356478
14286C56478M4312J6142k482l334Q785K4823L6218L9800L5214J8546j0676l6629
14274E27197l7110j1709J3008J3769l636j5200q175O014N546j5332l2660j5069
14262D26643L2372O1118L5122j7657l7509j1642J3374K539k0839j7259J0629K8891
14250E05782K2067L858j1412k1807k5559j7430N91J7386K2218J0887j0961k6075
14238D69545j9532j281K169j1547j1078J9248M5795L1979k106p193J8651K8280
14226E62930K466k0832j1368M610p715k9485j6081K9884N6463L2782j2536l1304
14214E59814j0394K3262L6131J7591j3890k8193j3300J1922K1397J3322N265K817
14202F25744o342k4160l0123r944J9079K7036P181k0516l4639k8437p054J6864
$$ plain form
14286 356478 400790 416932 414450 411116 419901 444724 480942 520742 555956 574502 563826 527197
14274 527197 490087 478378 491386 505155 501519 486319 478144 484158 489704 474372 441712 426643
14262 426643 459015 520133 555255 537598 500089 488447 501821 504360 483521 466262 476891 505782
14250 505782 527849 531707 520295 498488 472929 455499 456090 473476 495694 506581 495620 469545
14238 469545 450013 448732 450901 439354 428276 447524 493319 525298 523192 515999 534650 562930
14226 562930 565396 544564 533196 537806 530091 500606 484525 514409 570872 603654 591118 559814
14214 559814 549420 572682 608813 626404 612514 584321 571021 582943 604340 617662 622927 625744
14202 625744 619402 595242 565119 555175 574254 601290 608471 587955 553316 524879 517825 534689
14190E34689K8115K2936J5785J9421K2827O745k0625k7028k454K1069J1805j7402
14178F15883k8432j0011J3571K1301J7754J3584O813o181j7566j8234j0608j649
14166E96225P291J4891J4011K054j0930j4942j3446j3504j0669K936K1293K9482
14154F24692K2662P416j1020k8068l1606j3962R344J4159K718P77J4884K0339
14142F32335M524p643M096J4355r994m7489m3437O971M3508K3680j9943l0916
14130E70047m541K1257K6790K2715J4268m921k5089k5328j1048r752k0982j0424
14118E42992K7612M2539k651o3061n8753K0603J00371J11258N8546n706m5154
14107G28596n6381m8388k9293o991J1073J9292J5019M222J048R386J1440o294
$$ plain form
14190 534689 562804 585740 601525 620946 643773 650518 629893 602865 600411 621480 633285 615883
14178 615883 587451 577440 591011 612312 630066 643650 650463 644282 626716 608482 597874 596225
14166 596225 603516 618407 632418 634472 623542 608600 595154 581650 570981 573917 595210 624692
14154 624692 647354 654770 643750 615682 584076 570114 579458 593617 596335 597112 611996 632335
14142 632335 636859 629216 633312 647667 637673 590184 546747 553718 597226 620906 600963 570047
14130 570047 565506 586763 613553 636268 650536 645615 620526 595198 584150 574398 553416 542992
14118 542992 570604 613143 610492 547431 488678 509281 609652 720910 779456 773750 728596
14107 728596 672215 623827 594534 587543 598616 617908 632927 637149 638197 647583 659023 652729
14095F52729k2304l851L8114N2223J6329k9220l7420j4040M276N276K949L229
14083F68290J569K132P531J193k6311m4873j9296K9127M0611J029l7200l1729
14071E92073m072N936m32J89N239l731k0806k3275j0773l334m835j72J1266J0013
14057E53286r292k4100j5007Q257K2167J6155l792k4196k8583o945K8337M6748
14045E63035L1342j032k0982k0298j3048r730o004K798J0420Q926K69p439q874
14032E29383j695J4495L1479L2293J0570j4004j5394L502J3438J361j1133m783
14020E89512L733j0826l6659l8279j0476J3997J3957N252P296J4934J9195K7382
14008E99018M0687L7022M084k9068k4258J3271M3739M5904L1650J3769p646k5341
$$ plain form
14095 652729 630425 626574 664688 716911 733240 704020 666600 652560 656836 662112 665061 668290
14083 668290 669859 671991 679522 680715 654404 609531 590235 619362 659973 661002 623802 592073
14071 592073 588001 593937 593505 593694 598933 595202 574396 551121 540348 537014 532179 532007 543273 553286
14057 553286 543994 519894 504887 513144 535311 551466 547674 523478 494895 487950 516287 563035
14045 563035 594377 593345 572363 552065 539017 529287 523283 526081 536501 545427 545696 538257 529383
14032 529383 527688 542183 573662 605955 616525 602521 587127 590629 604067 605428 594295 589512
14020 589512 593245 582419 545760 507481 497005 511002 524959 530211 537507 552441 571636 599018
14008 599018 639705 676727 680811 651743 627485 640756 684495 730399 762049 775818 768172 742831
13996G42831k3591n330N708J16l422Q918K1396J2818j1091k6305k1449o136M681
13983F99144L572p597k0600k7241k4692j2522R107K9568K7463n14k0358J31L7643
13970F93104L7167n735l2112q479J9160k342m7232n0292o619K9177L2990L5448
13958F94235N0490M5445O604k3794j4610j786k8041o3728m8592P318L0911m394
13946F50058l9440j9899K6751L9284J0263j6436j5208m134n695j5844j7028j099
13934E91573K4130L8439K3676j1362k9710q497K7934M0611K9624K2601J8883q987
13922G58915n3340o2203j5362L4901L3992k3j3584q49P11j8403k6793q903J3555
13909F42614K2992K6668K7588J4416p987j5158l827p45j5746k2155l137J7462
$$ plain form
13996 742831 719240 713910 719618 719734 716312 725230 746626 759444 748353 722048 700599 694463 699144
13983 699144 702716 695119 674519 647278 622586 610064 619171 648739 676202 675688 655330 655461 693104
13970 693104 730271 724536 692424 683945 703105 700763 653531 603239 596620 625797 658787 694235
13958 694235 744725 790170 796774 772980 758370 756584 728543 664815 616223 623541 654452 650058
13946 650058 610618 590719 617470 656754 667017 650581 635373 631239 625544 609700 592672 591573
13934 591573 615703 654142 677818 666456 636746 628249 656183 696794 726418 749019 767902 758915
13922 758915 705575 643372 628010 662911 696903 696880 683296 682447 683158 664755 637962 629059 642614
13909 642614 665606 692274 719862 734278 726291 711133 707306 706561 690815 668660 665523 682985
13897F82985J4173j947r436j0587j2588m538J5692K0019q914m0087l5800r507
13885E99465r33j1385q967J3085K8709K4495J1288m924k2877k3178Q757M0370
13873F53905K3056l1373n7431k8281J1736K1997J7949K3700K5281P253q432r23
13861F58437P920q492l3057l5846k4518k0286j0816K3104N5468M4869M802j1672
13849F49913N552J1704j6410m4885l9108j0345J4022K7958L2156J6707j5077l2846
13837E99341j6739J1356J8722O187k937k240k742l886O872K6136L1295J1841j3385
13824F69821j9578o057O882O721L647J3008L0081L3158J2626j4927k7625k1583
13812F86174m308K0562M5441M8913J8220k3971m0643k6993j1491j1189j3733p194
$$ plain form
13897 682985 697158 695211 685775 675188 662600 658062 673754 693773 684859 644772 608972 599465
13885 599465 598532 587147 578180 591265 619974 644469 655757 650833 627956 604778 613535 653905
13873 653905 676961 645588 588157 559876 571612 593609 611558 635258 660539 667792 659360 658437
13861 658437 666357 657865 624808 588962 564444 544158 533342 556446 611914 656783 661585 649913
13849 649913 655465 667169 650759 605874 566766 556421 570443 598401 630557 647264 632187 599341
13837 599341 582602 593958 612680 618867 615930 613690 610948 607062 613934 640070 671365 683206 669821
13824 669821 650243 644186 651068 657789 661436 674444 704525 737683 750309 735382 707757 686174
13812 686174 681866 702428 747869 796782 815002 791031 750388 723395 711904 700715 686982 679788
13800F79788J263M590O922O524n760k2805k5159j6660k1034l2386j3672L4606
13788E96217N4789J7104k5970k1175k027k4647n5198j4886P6317J05289L2794
13777G38607m4933m3807r265k0235n3976l7424J7739L4126J854r422K3832L8026
13765F35122m862m8671l4770N266Q985j4435r987K3819L3730L738j8282R70K8901
13752F09524J9752j9042m3376l2912o796R948J2074Q177M619j039j3257k4431
13740E23241j4234K3337N6453M2666j4046n8098m8812r751R410j33p980r24O63
13727E01792j3012j5739J6753O3844P7572L8283k1488m9572k5904J8426L5174
13716F26129J3031j2107r013L818j0359m2098m2259K650M4285M1622J7086J1120
$$ plain form
13800 679788 681051 685641 692563 699087 693327 670522 645363 628703 607669 575283 561611 596217
13788 596217 651006 668110 642140 620965 618938 594291 539093 524207 600524 705813 738607
13777 738607 693674 649867 640602 620367 566391 528967 546706 580832 582686 573264 597096 635122
13765 635122 630260 581589 546819 552085 561070 546635 536648 560467 594197 597935 579653 580623 609524
13752 609524 629276 610234 566858 533946 527150 537098 549172 557349 561968 560929 547672 523241
13740 523241 509007 532344 588797 631463 617417 559319 510507 500756 510166 510033 502053 501129 501792
13727 501792 488780 473041 489794 553638 631210 669493 648005 598433 572529 590955 626129
13716 626129 639160 627053 618040 621858 611499 569401 527142 529792 574077 615699 632785 643905
13704F43905J4609o681m0307l5233J8152O5872O0811J5764k8343n0309m6551j6819
13692E94870K2142L7020J8760q88J687M522j6579l6219j5986K6103L5508M642
13680F75582j7922p469K434j4983l0931j1056K4729L3455J4665L043J1371K1468
13668G04386K3985K7530K8557R007k8556n3604m6116j9345M122J6911J8779P042
13656F92698j1504j7767m691R604P071m073k846J4059K9611K8980J3288n766j6783
13643G31881j6311r865k893P122K1415K7449J2476j1129j5741J423J1659k134
13631G55352k0342k0147j0643j3098k5059k7271j2128J4600M4469O0053L9853
13620G85639o829l5295k5805j8785m7301o5595q827R1654J29113O5214j9960m4178
$$ plain form
13704 643905 658514 651833 611526 576293 594445 660317 721128 736892 708549 658240 611689 594870
13692 594870 617012 654032 672792 671904 673591 678113 661534 625315 609329 635432 670940 675582
13680 675582 657660 650191 652625 637642 606711 595655 620384 653839 668504 671547 682918 704386
13668 704386 728371 755901 784458 793465 764909 711305 665189 645844 649966 666877 685656 692698
13656 692698 681194 663427 658736 668340 675411 671338 668492 682551 712162 741142 754430 748664 731881
13643 731881 715570 705705 702812 709934 731349 758798 771274 760145 744404 745827 757486 755352
13631 755352 735010 714863 704220 691122 666063 638792 626664 641264 685733 745786 785639
13620 785639 778810 743515 717710 698925 651624 586029 577202 668856 797969 863183 843223 799045
13608G99045k0377k230L082J5454K4096P973j7345k5473k5166l2432k6911R156
13596G08872L6728R870l8847l4377K5583O4797M4063R208L914M798k0548m8925
13584G65136m1161n834K0982L0264L4882L4904K5679J9723K4602J7068k4116p2703
13572H29426p8882l3490K1592M4614L1571O087p428k210N739l564k3511k5562
13560G64382k995J5939J4328J4088L0988L6161K306m0127m2616j5258q528k8639
13548G40029l1104l87K5186K2049J6922K8609K6997j2999n7180n4255o613L8996
13536G36250N3020M1647J9664k143j2074p651l223p096m869J2766K4421R191j3857
13523H46046j2490N158M023j7672k5835j0374j661j4509k0248J383K1945J0541
$$ plain form
13608 799045 778668 776438 779520 794974 819070 827043 809698 784225 759059 726627 699716 708872
13596 708872 745600 755470 716623 682246 707829 772626 816689 825897 829811 834609 814061 765136
13584 765136 723975 718141 739123 769387 804269 839173 864852 884575 909177 926245 902129 829426
13572 829426 750544 717054 738646 783260 814831 820918 813490 811280 817019 813455 789944 764382
13560 764382 761387 777326 791654 805742 836730 872891 875197 835070 792454 777196 768668 740029
13548 740029 708925 708538 733724 755773 772695 801304 828301 815302 758122 703867 697254 736250
13536 736250 789270 830917 850581 848438 836364 828713 825490 818394 813525 826291 850712 859903 846046
13523 846046 833556 838714 842737 825065 799230 788856 787195 772686 752438 753821 775766 786307
13511G86307j0180J627L3788L1467j6735n2164k6184K9185M3925M072l4658k5753
13499G64697J0756K4650M278j6584j1378O721J0243m661j9334k1629j8385j9856
13487G09518k3508j8156P51K3959L5403K5614R60j8381j2578J9244N1807N1552
13475H46185J1180l5183m3798j1998J7389J2049o039N949M5064O0563K2803l5027
13463H89137n9082l7074N90K4874L0166K1636M966j0921j7704j6132j0491J302
13451H21267J9428K9369J5243j4073k9206j5241J0720K2153J2993q20l008N276
13439H74101Q730j66n146J5077M7582M6328p347o3560n6700P484N6123M4504N966
13426I72976r249l071n065j2037J194K5796K3548j0070l1947j4814J2970J3929
$$ plain form
13511 786307 776127 777754 811542 843009 826274 774110 747926 777111 821036 825108 790450 764697
13499 764697 775453 800103 804381 787797 776419 783140 793383 788722 769388 747759 729374 709518
13487 709518 686010 667854 668605 692564 727967 753581 754541 736160 723582 742826 794633 846185
13475 846185 857365 822182 778384 766386 783775 795824 789785 795734 840798 901361 924164 889137
13463 889137 830055 792981 793571 818445 848611 870247 875213 864292 846588 830456 819965 821267
13451 821267 840695 870064 885307 871234 842028 826787 837507 859660 872653 871833 868825 874101
13439 874101 882831 882665 877519 892596 940178 986506 979159 915599 858899 866383 922506 967010 972976
13426 972976 963727 960656 955591 943554 944748 970544 994092 984022 952075 937261 950231 964160
13414I64160k804l520J2924J7747N030K777K3698L9437K3537n865j3910l110n965
13401A054136k8301l6661j1717J9050K3396J2505J6493K9108J5969k4550m8840
13390A020588k9528L507O918j4219j7969J1193M0767L5311J259k3618j4624J5477
13378A035062L3267K0555p751k1839j0575R463J8239J4507Q454M010n42k775j20
13365A099955J622l512r238o108P82j834j3318j9487j5128r485p326k264O333
13352A020992Q025P92k204L834L383j2312k3444q749J8093K5143R439k70J0860
13339A053582K3047J5168n256j8511j9488j2768J693J9809K4029L770k3070k8335
13327A033670p253K2616M6122N3830L3080j3789m9055l5044P504J7167k1116n1043
$$ plain form
13414 964160 961356 957836 970760 988507 993537 996314 1020012 1059449 1082986 1077121 1063211 1060101 1054136
13401 1054136 1025835 989174 977457 996507 1019903 1032408 1048901 1078009 1093978 1069428 1020588
13390 1020588 991060 994567 1001485 987266 969297 980490 1021257 1056568 1057827 1034209 1019585 1035062
13378 1035062 1068329 1088884 1081133 1059294 1048719 1058182 1076421 1090928 1099382 1103392 1102850 1100075 1099955
13365 1099955 1101577 1098065 1088827 1082719 1083501 1081667 1068349 1048862 1033734 1024249 1016923 1014659 1020992
13352 1020992 1029017 1029809 1027605 1031439 1034822 1022510 999066 990317 1008410 1033553 1042992 1042722 1053582
13339 1053582 1076629 1091797 1086541 1068030 1048542 1035774 1037467 1057276 1081305 1085075 1062005 1033670
13327 1033670 1026417 1049033 1095155 1148985 1182065 1168276 1119221 1084177 1091681 1108848 1087732 1036689
13315A036689l0116O273O897q896J3188O1553O4671K939n2301l8234J4133L2622
13303A109418L681k5255k1097J982J8502K3253K3012K1260J7030O643j2051k9042
13291A137336k5845j235K0169J9935J1244J4023K1638J6301K176n002p543j3375
13279A189822p437K5385N7721M6582K747j6678N665K1688o95k3811m986L0640
13267A326643L2189N848j289J7622K3498L338r748J616R482o290j9518j578L0037
13254A411850L9973K7388J6366J1495j808k1968k9758j9588l346J5085L9547N6128
13242A541364M1670N003j4431l278M329j5978l4223j3494K5217L2036Q111L726
13230A580052L4804N4662K8026j2600j6195J4041L3288K0163m973j5272k650K3486
$$ plain form
13315 1036689 1006573 1012846 1019743 1010847 1024035 1085588 1150259 1153198 1100897 1062663 1076796 1109418
13303 1109418 1113099 1087844 1066747 1068729 1087231 1110484 1133496 1154756 1171786 1178429 1166378 1137336
13291 1137336 1111491 1110256 1130425 1150360 1161604 1175627 1197265 1213566 1215742 1210740 1203197 1189822
13279 1189822 1182385 1207770 1265491 1312073 1314820 1298142 1303807 1325495 1324800 1300989 1296003 1326643
13267 1326643 1358832 1364680 1363391 1381013 1404511 1407849 1398101 1399717 1409199 1402909 1383391 1381813 1411850
13254 1411850 1451823 1479211 1495577 1507072 1505264 1483296 1453538 1433950 1430604 1445689 1485236 1541364
13242 1541364 1583034 1588037 1573606 1570328 1574657 1558679 1524456 1510962 1536179 1568215 1576326 1580052
13230 1580052 1614856 1669518 1697544 1684944 1668749 1682790 1716078 1736241 1731268 1715996 1713346 1736832
13218A736832M0469K7035n851j6324J2076L8120K0591j4362r550L4017N8322L6716
13206A958091O072K036J4916K6702M2294O0155N6245K5230j5L235J5965J8942
13194B229868K5118M0973L9006P256j4948L862L0312J9773p734m430K1384K5411
13182B415851J1522K3104N7635O4023L0518M902J2774K1529O985n826L639J2182
13170B658838l73j2920m169J0436J3587J6610K5289J8419p158j5008J0032K5413
13158B738996k39k7573j0829J9561N453l8201m6661j4980n527m1738o8695m1525
13146B468042Q315K6601R335j2720k8162m6302o3043n8170k4355J7653L3970P728
13134B338892l8885n9494l5157k106o621m2318o2118m6058k1130j3005j5990j8185
$$ plain form
13218 1736832 1777301 1804336 1798485 1782161 1794237 1832357 1852948 1838586 1829036 1863053 1921375 1958091
13206 1958091 1964163 1966199 1981115 2007817 2050111 2110266 2166511 2191741 2191726 2194961 2210926 2229868
13194 2229868 2254986 2295959 2334965 2342221 2327273 2331135 2361447 2381220 2373486 2369056 2390440 2415851
13182 2415851 2427373 2450477 2508112 2572135 2602653 2607555 2620329 2641858 2648843 2643017 2646656 2658838
13170 2658838 2658465 2645545 2641376 2651812 2665399 2682009 2707298 2725717 2718559 2703551 2713583 2738996
13158 2738996 2738757 2711184 2700355 2719916 2725369 2687168 2640507 2625527 2620000 2578262 2509567 2468042
13146 2468042 2476357 2502958 2512293 2499573 2471411 2425109 2362066 2303896 2279541 2297194 2331164 2338892
13134 2338892 2300007 2240513 2205356 2203250 2196629 2154311 2092193 2046135 2025005 2012000 1996010 1977825
13122A977825k0393j9354o780L313j6873n7753o8287k5533K7705M1774K3001O429
13110A865074j378j2693j7980o95K2395K0382m04o670N103O553o740l744K5740
13097A894943M6316L0580K296k127J1672J2500l020r091L992J7688K1422K9222
13085B056393M7843N5503L4968R338J5058M6049N7976L3736J0876K4364N1686
13074B443790M8382J9210J0424L4720N0588K9350N00M169L1656M6866M3217M1119
13062B803991M3260L3001J3390Q729K2188K6965J1329J076J8120M1009L1857r715
13050C045200m3258l5382O431M8445O5343N6064L4716J4458K41q073j0798q408
13038C164979l914l016j1807l1711n2554n5104l1885m281k442k3933l2524r574
$$ plain form
13122 1977825 1957432 1938078 1931298 1934611 1917738 1859985 1791698 1766165 1793870 1835644 1858645 1865074
13110 1865074 1863696 1851003 1833023 1832328 1854723 1875105 1874701 1868031 1873134 1879687 1872947 1869203 1894943
13097 1894943 1941259 1971839 1974135 1972008 1983680 1996180 1993160 1984069 1988061 2005749 2027171 2056393
13085 2056393 2104236 2159739 2194707 2204045 2219103 2265152 2323128 2356864 2367740 2392104 2443790
13074 2443790 2492172 2511382 2521806 2556526 2607114 2636464 2636964 2641133 2672789 2719655 2762872 2803991
13062 2803991 2847251 2880252 2893642 2902371 2924559 2951524 2962853 2963929 2982049 3023058 3054915 3045200
13050 3045200 3001942 2966560 2972991 3021436 3086779 3142843 3177559 3192017 3192258 3184185 3173387 3164979
13038 3164979 3161065 3158049 3146242 3114531 3061977 3006873 2974988 2970707 2968265 2944332 2911808 2902234
13026B902234J5341O475k4421l7522k7202k7232n2070p1061n5959k3195o535j0047
13014B588806j3979j3089k0787l8409m5336k6759L258J5230m103l8338n8668n2774
13002B295052l4023j9672o666J8470M7450M8169P056m1134m6722n882L1473K1260
12990B314831k2023m5805k5744P181J1031j2936k8069j5543M913J0388N053J593
12978B204870m865k2712m0562m3282l8874m1633l8903q227L5887M9120J7079k4821
12966B043077m0450l1627j7331n010K854J498k246M585J0495j1826n1433n5807
12954A846779q780L0869R916l6934l7753R306L9617K1472r867k0315k0967k8531
12942A794812l1071j6859n53K874J760N562M909o694j3735k9K7849N1356N6970
$$ plain form
13026 2902234 2917575 2924050 2899629 2862107 2834905 2807673 2755603 2684542 2628583 2605388 2598853 2588806
13014 2588806 2574827 2561738 2540951 2502542 2457206 2430447 2433705 2448935 2444832 2406494 2347826 2295052
13002 2295052 2261029 2241357 2234691 2253161 2300611 2348780 2355836 2314702 2267980 2262098 2293571 2314831
12990 2314831 2292808 2247003 2221259 2228440 2239471 2226535 2198466 2182923 2187836 2198224 2203277 2204870
12978 2204870 2200005 2177293 2136731 2093449 2054575 2012942 1974039 1965812 2001699 2050819 2067898 2043077
12966 2043077 2002627 1971000 1953669 1948659 1951513 1953011 1950765 1955350 1965845 1954019 1902586 1846779
12954 1846779 1837999 1868868 1878784 1841850 1804097 1813403 1853020 1874492 1864625 1844310 1823343 1794812
12942 1794812 1763741 1746882 1746329 1749203 1750963 1756525 1761434 1754740 1741005 1740976 1768825 1820181 1877151
12929A877151L5592j0761n2962n4495k1119r72j7491l4782j5562J8169J9556j0330
12917A731994k7304j2179Q208R740K762L440L540j1542l1972l2182o997J6336
12905A653844Q448k5353m7898l3014L679K6596K3919J2261M036m632j2485q008
12893A601393N637P795n241j0350K491R360p689k8448k8167j6282j1903p520P181
12880A518257J1091j4977m0930k3445K2695M1833K0861P25K976L323q402k23M1512
12867A575296P1836M5174j8313n9711n2753j9335P634J1363m223j7467r996M970
12855A534475k595k7877k7397J5238N5528M7910Q146j6648j3109r41R977K3204
12843A605911L2185K8209J9141J1731m851k7612k0239L2108P5432M9693j8392
$$ plain form
12929 1877151 1912743 1901982 1849020 1794525 1773406 1772434 1754943 1720161 1704599 1722768 1742324 1731994
12917 1731994 1704690 1692511 1700719 1710459 1713221 1716661 1720201 1708659 1676687 1644505 1637508 1653844
12905 1653844 1662292 1636939 1589041 1556027 1559706 1586302 1610221 1622482 1626518 1621886 1609401 1601393
12893 1601393 1607030 1614825 1609584 1599234 1601725 1611085 1603396 1574948 1546781 1530499 1518596 1511076 1518257
12880 1518257 1529348 1514371 1473441 1449996 1472691 1514524 1535385 1536110 1539086 1542409 1534007 1533784 1575296
12867 1575296 1647132 1692306 1673993 1614282 1561529 1542194 1549828 1561191 1556968 1539501 1529505 1534475
12855 1534475 1531880 1504003 1476606 1491844 1547372 1595282 1603428 1586780 1573671 1572730 1582707 1605911
12843 1605911 1638096 1666305 1685446 1697177 1692326 1664714 1644475 1676583 1752015 1801708 1783316
12832A783316m6720j4230J9189J1453j0853j5011r357j133L0940Q2702R5893L3481
12820A959670n2899q1402m2356L703J3389J093j055J4580L1493K8529N7l0571
12808A844231k9281M890L3468L0778J6579J5684J5742k807k2443j4445J0788K0908
12796A924092J3614R783Q951l187j4131j19K4354K3266J788k275R876l279m2306
12783A950427n0238l975L9912L0909J860R409M0820M1882J0788j522K2116L8267
12771B130655J2563k9981m3452k0281P628J2096j715o255J1562K9189J6410j7129
12759B101290k7988j276K4656J6018o580o912Q780J2788R238J8096K5149L006
12747B176265k8630k3097J4212K8111K063j7893l228J6368J7404K3256M2743L1015
$$ plain form
12832 1783316 1736596 1722366 1741555 1753008 1742155 1727144 1717787 1716654 1747594 1830296 1926189 1959670
12820 1959670 1906771 1825369 1783013 1786716 1800105 1801198 1800143 1814723 1846216 1874745 1874802 1844231
12808 1844231 1814950 1819840 1853308 1884086 1900665 1916349 1932091 1929284 1906841 1892396 1903184 1924092
12796 1924092 1937706 1947489 1956440 1953253 1939122 1939003 1963357 1986623 1988411 1986136 1996012 1992733 1950427
12783 1950427 1900189 1896214 1936126 1967035 1968895 1978304 2019124 2061006 2071794 2070272 2092388 2130655
12771 2130655 2143218 2113237 2069785 2049504 2057132 2069228 2067513 2061258 2072820 2102009 2118419 2101290
12759 2101290 2073302 2072026 2096682 2112700 2106120 2099208 2107988 2120776 2130014 2148110 2173259 2176265
12747 2176265 2147635 2124538 2138750 2166861 2168924 2151031 2147803 2164171 2181575 2204831 2247574 2278589
12735B278589l3314q4642n2637K7537O0889K7817k915Q780K2787J022k7549j8690
12723B207674J8401M2365L8781K4611J4416J0104J0439J0249J603j0877j0507
12712B357259M988J5251O758q957j7819k2004k3111j1579R514J6194J570m652
12700B323412J6520L3005P560l6311m1911l554K7878K5170J7496K8143L1386K461
12688B431255l0356k4980Q898K5688J0515j0297j7344j6833j1925N345K6368K6198
12676B422532M998l033J8877L8414J9805k0658l5328r814K2862K8936R037j4090
12664B482538k1694j0086Q430J5094P537O491K2975L1371M344l4389l3783M932
12652B483760K0710j5230m7646j6791M7123O2060R091m6297m6813o682K7951L7881
$$ plain form
12735 2278589 2245275 2160633 2107996 2135533 2196422 2224239 2221324 2230104 2252891 2253913 2226364 2207674
12723 2207674 2226075 2268440 2307221 2331832 2346248 2356352 2366791 2377040 2378643 2367766 2357259
12712 2357259 2362247 2377498 2384256 2375299 2357480 2335476 2312365 2300786 2310300 2326494 2328064 2323412
12700 2323412 2339932 2372937 2380497 2344186 2302275 2298721 2326599 2351769 2369265 2397408 2428794 2431255
12688 2431255 2400899 2375919 2384817 2410505 2421020 2410723 2393379 2376546 2364621 2369966 2396334 2422532
12676 2422532 2427530 2424497 2443374 2481788 2501593 2480935 2445607 2435793 2458655 2487591 2496628 2482538
12664 2482538 2460844 2450758 2459188 2474282 2481819 2488310 2511285 2542656 2547000 2512611 2478828 2483760
12652 2483760 2504470 2489240 2441594 2424803 2471926 2533986 2543077 2496780 2449967 2443285 2471236 2509117
12640B509117L0840J7127Q206J5515L1360L1283J0443m736L287J6626J5090R348
12628B693506J4874J7529o48j9854o950K7552L8733J3503j3377j7050j5079k3941
12616B708798k1296J5103N5280M5082j7479o9150n4946Q295N6694N3981K3696
12605B804058J0158K4721M0287L1062L159j8005j9473r151K248J3514K4335K6712
12593B933625J5112J18K87J7810L1216K0071p193k1201q717J1075J5348R684J4931
12580C032166L0667L5368K2697J1745J3289J1401o358k3344j9485l918K636L455
12568C110319J5961L5815M0631K6622J4294J6931K6675L2094K8281J2270q815
12557C351078j0626J9751N3400N0885K0337N152J4363J2932r866j6534J1031L2702
$$ plain form
12640 2509117 2539957 2557084 2565290 2580805 2612165 2643448 2653891 2649155 2652442 2669068 2684158 2693506
12628 2693506 2708380 2725909 2725261 2705407 2698457 2726009 2764742 2778245 2764868 2747818 2732739 2708798
12616 2708798 2687502 2702605 2757885 2802967 2785488 2716338 2661392 2669687 2726381 2780362 2804058
12605 2804058 2814216 2838937 2879224 2910286 2913445 2895440 2875967 2866816 2869064 2882578 2906913 2933625
12593 2933625 2948737 2948855 2949142 2966952 2998168 3018239 3011046 2989845 2981128 2992203 3007551 3017235 3032166
12580 3032166 3062833 3098201 3120898 3132643 3145932 3157333 3150975 3127631 3108146 3104228 3106864 3110319
12568 3110319 3126280 3162095 3202726 3229348 3243642 3260573 3287248 3319342 3347623 3359893 3351078
12557 3351078 3340452 3360203 3413603 3464488 3484825 3489977 3504340 3517272 3507406 3490872 3501903 3534605
12545C534605J5345r661k28K4590K1712K867J3272M7965N5308K2497m837K088
12533C725523J6886J2690M764J3369K4840J7943j210j4687j7948j1308O604K0716
12521C798182O817k3762k2677K5256O6698N1232O456l968K6078M6114L2540J5991
12509D024957K1888L4715L6060L4715L7562K7608j163j6632R636N1920N8489K4328
12497D344083L56K3357O6395P7531M9295K3002K6737L6906J7648j9368k3969K2551
12485D644524P5867Q3869N1607K5298K5752L1808K7720K8181M2053M5355J8681
12474E100715j0549J504N0473Q4185P0515L3807J3256J3533J6156J7213K5868
12463E416676L6621L2789J6771J0378K0066K5818J4163N06M523K1997L7637M8585
$$ plain form
12545 3534605 3549950 3540289 3540061 3564651 3586363 3589230 3602502 3650467 3705775 3728272 3723435 3725523
12533 3725523 3742409 3755099 3759863 3773232 3798072 3816015 3814805 3800118 3782170 3770862 3777466 3798182
12521 3798182 3804999 3781237 3758560 3783816 3850514 3901746 3908202 3904234 3930312 3976426 4008966 4024957
12509 4024957 4046845 4081560 4117620 4152335 4189897 4217505 4216342 4199710 4209346 4261266 4319755 4344083
12497 4344083 4344439 4367796 4434191 4511722 4561017 4584019 4610756 4647662 4665310 4645942 4621973 4644524
12485 4644524 4720391 4804260 4855867 4881165 4906917 4938725 4966445 4994626 5036679 5082034 5100715
12474 5100715 5090166 5091670 5142143 5226328 5296843 5330650 5343906 5357439 5373595 5390808 5416676
12463 5416676 5453297 5486086 5502857 5513235 5533301 5559119 5573282 5573788 5578311 5600308 5637945 5686530
12451E686530N4393M0331j16l5261k2374L2238P2040N9667K0146k57O510J3840
12439E927687N972o201q540q21J0192J9724K4050J9139L103k0742m0824m0972
12427E891767j7798Q086J4512J0069K0728M2537M0668Q296j1510R549L3495J1027
12415F061426l7892n0743j7587P725n540k3446j0964J2758J3835J342Q009L4799
12403E993722N0145L5699O226j2323o796J6663L7465L7233J9205K514n638j5527
12391F158588k7928k4643J429K7930L0901J3824m262j0274M979M4582Q4823Q6398
12379F386347M9488K6386M8874P6025N6043R865j799K5381M0207K6161K1748M1508
12367F806234M6015J7189O00L1367O9413O0343K2959J8060N2516P4332N6489K9439
$$ plain form
12451 5686530 5740923 5781254 5781138 5745877 5723503 5755741 5827781 5887448 5907594 5907337 5913847 5927687
12439 5927687 5933659 5927458 5918918 5918097 5928289 5948013 5972063 5991202 5994305 5973563 5932739 5891767
12427 5891767 5873969 5882055 5896567 5906636 5927364 5969901 6010569 6018865 6007355 6016904 6050399 6061426
12415 6061426 6023534 5972791 5955204 5962929 5957389 5933943 5922979 5935737 5949572 5950914 5958923 5993722
12403 5993722 6043867 6079566 6085792 6073469 6066673 6083336 6120801 6158034 6177239 6179753 6174115 6158588
12391 6158588 6130660 6106017 6107446 6135376 6166277 6180101 6175839 6165565 6170544 6215126 6299949 6386347
12379 6386347 6435835 6462221 6511095 6587120 6643163 6653028 6651229 6676610 6716817 6742978 6764726 6806234
12367 6806234 6852249 6869438 6870038 6901405 6970818 7031161 7054120 7072180 7124696 7199028 7255517 7284956
12355G284956K2911K4344J4189N371K1173N4852P5541O6088M0070K5498L8386
12344G673379O6430P6252M6851j069k1362O060N1413P0646N4331L0424K5756L8271
12332H117382M7096L9211K1154Q642R893K0263L0221L4225L1995K8016L3241N7649
12320H478988R0650R7388N4419j0123l4643N353O3073P5937M1879J4177K5980
12309H903078N2571N6447L8561K4004K0616J9474K0648K7267K4344j264k4447
12298I161299o118M2078O2398L5582J3604L8508P3862O3042K0223M905K7504M5372
12286I582259M4804N7046Q4444Q1117L3363l245J4852N3835O2924N3420O3708
12275A0128527Q2855P1413L6016K0506L3417M4311M8528P4058J16453J26448Q3677
$$ plain form
12355 7284956 7307867 7332211 7346400 7351771 7372944 7427796 7503337 7569425 7609495 7634993 7673379
12344 7673379 7739809 7816061 7862912 7861843 7840481 7846541 7897954 7968600 8022931 8053355 8079111 8117382
12332 8117382 8164478 8203689 8224843 8233485 8243378 8263641 8293862 8328087 8360082 8388098 8421339 8478988
12320 8478988 8569638 8667026 8721445 8711322 8676679 8682032 8745105 8821042 8862921 8877098 8903078
12309 8903078 8955649 9012096 9050657 9074661 9095277 9114751 9135399 9162666 9187010 9185746 9161299
12298 9161299 9155181 9197259 9259657 9295239 9308843 9347351 9421213 9484255 9504478 9509383 9536887 9582259
12286 9582259 9627063 9684109 9768553 9849670 9883033 9879788 9894640 9948475 10011399 10064819 10128527
12275 10128527 10211382 10282795 10318811 10339317 10372734 10417045 10465573 10539631 10656084 10782532 10866209
12264A0866209L4177K7397N3857P2941P0910O1981N5612N1788N3417N9816N9819
12253A1467924M9787M6631O5915R6770J12596R9223O4731L2451K9005O2667J06387
12242A2234087J19930R7187P3329P7315R8259J09022J01254Q4492P1177P4960
12232A3141012J02746J36558J45890J29202J17119J23321J24881J07362R1963
12223A4220054R4583R7483R2060J07159J53301J80828J48709J00177J04524J49569
12213A5448447J66438J46206J47537J84646J95155J46192R5314J03313J47516
12204A6780764J69442J59909J47825J43864J44443J59500J88155J94344J56290
12195A8244536J17863J38425K05091K46498K28970J90716J77804J90098K01859
$$ plain form
12264 10866209 10900386 10927783 10981640 11054581 11125491 11187472 11243084 11294872 11348289 11408105 11467924
12253 11467924 11517711 11564342 11630257 11727027 11839623 11938846 12003577 12036028 12065033 12127700 12234087
12242 12234087 12354017 12451204 12524533 12601848 12700107 12809129 12910383 12994875 13066052 13141012
12232 13141012 13243758 13380316 13526206 13655408 13772527 13895848 14020729 14128091 14220054
12223 14220054 14314637 14412120 14504180 14611339 14764640 14945468 15094177 15194354 15298878 15448447
12213 15448447 15614885 15761091 15908628 16093274 16288429 16434621 16529935 16633248 16780764
12204 16780764 16950206 17110115 17257940 17401804 17546247 17705747 17893902 18088246 18244536
12195 18244536 18362399 18500824 18705915 18952413 19181383 19372099 19549903 19740001 19941860
12186A9941860K01182J93365J87133J89946K04293K23295K37799K44878K43075
12177B1866826K31873K25864K48807K94800L17821K87297K34810K14443K34905
12168B4157446K65905K92538L18891L31255L09688K73783K66261K88111L00232
12159B6804110K94817L08799L50812L73121L46760L14039L26277L69075L93458
12150B9881268L91162L92896M11367M30256M39954M46684M52001M54297M64426
12141C3764311M91546N20578N31743N35876N60880O06033O38826O39401O23958
12132C8913152O19874O37264O69530P05700P36339P56955P69860P80841P97492
12123D5387007Q29322Q76831R20420R40013R48410R78194J028953J062784J067656
$$ plain form
12186 19941860 20143042 20336407 20523540 20713486 20917779 21141074 21378873 21623751 21866826
12177 21866826 22098699 22324563 22573370 22868170 23185991 23473288 23708098 23922541 24157446
12168 24157446 24423351 24715889 25034780 25366035 25675723 25949506 26215767 26503878 26804110
12159 26804110 27098927 27407726 27758538 28131659 28478419 28792458 29118735 29487810 29881268
12150 29881268 30272430 30665326 31076693 31506949 31946903 32393587 32845588 33299885 33764311
12141 33764311 34255857 34776435 35308178 35844054 36404934 37010967 37649793 38289194 38913152
12132 38913152 39533026 40170290 40839820 41545520 42281859 43038814 43808674 44589515 45387007
12123 45387007 46216329 47093160 48013580 48953593 49902003 50880197 51909150 52971934 54039590
12114E4039590J083997J140281J204074J237759J264220J324001J397897J435380
12106F4127199J441957J472297J543640J620098J681002J740739J799406J841357
12098G7267695J889070J985790K110775K189800K215401K274646K415700K567715
12090I4916592K653907K712417K827624K997160L154036L282907L423982L582691
12082A19551316L726102L864557M050826M287827M514202M701643M898957N151840
12074A54747270N436170N703728N949097O198124O464039O744795P039082P342572
12066B05624877P648005P961050Q292586Q628300Q936096R212913R491958R791492
12058B75587277J0087317J0347316J0561344J0726077J0835011J0896438J0925091
$$ plain form
12114 54039590 55123587 56263868 57467942 58705701 59969921 61293922 62691819 64127199
12106 64127199 65569156 67041453 68585093 70205191 71886193 73626932 75426338 77267695
12098 77267695 79156765 81142555 83253330 85443130 87658531 89933177 92348877 94916592
12090 94916592 97570499 100282916 103110540 106107700 109261736 112544643 115968625 119551316
12082 119551316 123277418 127141975 131192801 135480628 139994830 144696473 149595430 154747270
12074 154747270 160183440 165887168 171836265 178034389 184498428 191243223 198282305 205624877
12066 205624877 213272882 221233932 229526518 238154818 247090914 256303827 265795785 275587277
12058 275587277 285674594 296021910 306583254 317309331 328144342 339040780 349965871
12051C49965871J0900802J0772377J0518980J0168450R736300R190626Q504016
12044D19757422P696763O794344N781124M635011L375641K041581O52946p66179
12036D49968653k165342l511937m820559o087757p237799q201357r018632r783439
12028C99141831j0495300j1050314j1386263j1556821j1638745j1639076j1534232
12021C19841080j1342121j1103732j0828339j0503822j0141411r772672r413250
12014B46735733r056001q691163q316270p936981p569848p231256o916751o607797
12006A84409666o302381o017366n758576n515397n286901n081072m885193m675893
11998A40886887m464916m289509m145839l985208l797779l640245l541988l442420
$$ plain form
12051 349965871 360866673 371639050 382158030 392326480 402062780 411253406 419757422
12044 419757422 427454185 434248529 440029653 444664664 448040305 450081886 450734832 449968653
12036 449968653 447803311 444291374 439470815 433383058 426145259 417943902 408925270 399141831
12028 399141831 388646531 377596217 366209954 354653133 343014388 331375312 319841080
12021 319841080 308498959 297395227 286566888 276063066 265921655 256148983 246735733
12014 246735733 237679732 228988569 220672299 212735318 205165470 197934214 191017463 184409666
12006 184409666 178107285 172089919 166331343 160815946 155529045 150447973 145562780 140886887
11998 140886887 136421971 132132462 127986623 124001415 120203636 116563391 113021403 109578983
11990A09578983l278178l084955k943906k860436k771948k657184k557675k491076
11982H6933625k419112k316411k206397k108764k010032j910249j843060j817544
11974G0302056j789003j724469j654707j619826j599733j547270j466625j408362
11966E7492061j395288j396047j371978j317531j253602j206649j193007j200957
11958D7157002j192107j143400j082014j053044j057621j052817j012313r55367
11950C8608319r10402q81894q64592q58718q51552q12614p35974o67190o53821
11941C1371562o79015o80584o35693n88723n83039o00449n94172n56619n20173
11932B5933095n03308m92851m79049m72217m74572m67133m42231m23072m28249
$$ plain form
11990 109578983 106300805 103215850 100271944 97411508 94639560 91982376 89424701 86933625
11982 86933625 84514513 82198102 79991705 77882941 75872909 73962660 72119600 70302056
11974 70302056 68513053 66788584 65133877 63514051 61914318 60367048 58900423 57492061
11966 57492061 56096773 54700726 53328748 52011217 50757615 49550966 48357959 47157002
11958 47157002 45964895 44821495 43739481 42686437 41628816 40575999 39563686 38608319
11950 38608319 37697917 36816023 35951431 35092713 34241161 33428547 32692573 32025383 31371562
11941 31371562 30692547 30011963 29376270 28787547 28204508 27604059 27009887 26453268 25933095
11932 25933095 25429787 24936936 24457887 23985670 23511098 23043965 22601734 22178662 21750413
11923B1750413m37403m19168l79267l51782l49940l54330l48245l37382l31361
11914A8441535l29358l29132l30115l23892l01970k76413k70385k82676k85126
11905A5712468k64362k42229k41288k51560k49075k30762k12634k05486k08716
11896A3606356k18140k25294k18087j95598j74688j71402j83662j99185k08285
11887A1812015k02582j78341j50766j44940j58918j57938j24877r4128j07381
11878A0492144j51684j73952j50171j09659r0999j00126j16101j19058j07748
11869I372646r9715j11541j32443j31475j02923q3043r9501j26648j23115r4654
11859H267588p9477q4817q4774p5400q0716r9809r9473p3337o0308q3653j15045
$$ plain form
11923 21750413 21313010 20893842 20514575 20162793 19812853 19458523 19110278 18772896 18441535
11914 18441535 18112177 17783045 17452930 17129038 16827068 16550655 16280270 15997594 15712468
11905 15712468 15448106 15205877 14964589 14713029 14463954 14233192 14020558 13815072 13606356
11896 13606356 13388216 13162922 12944835 12749237 12574549 12403147 12219485 12020300 11812015
11887 11812015 11609433 11431092 11280326 11135386 10976468 10818530 10693653 10599525 10492144
11878 10492144 10340460 10166508 10016337 9906678 9815679 9715553 9599452 9480394 9372646
11869 9372646 9272931 9161390 9028947 8897472 8794549 8711506 8612005 8485357 8362242 8267588
11859 8267588 8188111 8103294 8018520 7943120 7862404 7762595 7663122 7589785 7529477 7445824 7330779
11848G330779j22646j13412j00645p1963k6147m645m0143r7514j12454p6177m0345
11837F524688m4324p4475r4622q7373o4133n3708p5845j11541j15312p5310l7664
11826E690381m3254o6927o0139l1815l3509p2515r6761p3509l2466j4283j8710
11815E146493k4058k3505k1372k0404k8167n0094o6795n0816j6889j5618n7998
11804D770777q8606o4342k0311j5291m2444m5297o411L2055L4538J2520q326k2028
11792D536834k9595k4207p714j49j4332l4447l5390j5123M386L741j5248l5294
11780D333462m2006l5778k6824k0824j4757p357m813j0680j7985j7640q018P553
11768D134333K2178K0804q650n0306o5792l9719q14K0002K9751M5572N1426K3465
$$ plain form
11848 7330779 7208133 7094721 6994076 6922113 6895966 6891321 6851178 6753664 6641210 6565033 6524688
11837 6524688 6480364 6405889 6311267 6223894 6159761 6106053 6030208 5918667 5803355 5728045 5690381
11826 5690381 5647127 5580200 5520061 5488246 5454737 5382222 5285461 5211952 5179486 5165203 5146493
11815 5146493 5122435 5098930 5077558 5057154 5028987 4978893 4912098 4861282 4844393 4828775 4770777
11804 4770777 4682171 4617829 4597518 4582227 4539783 4494486 4488075 4520130 4554668 4567188 4558862 4536834
11792 4536834 4507239 4483032 4475318 4475169 4460837 4426390 4391000 4375877 4380263 4384004 4368756 4333462
11780 4333462 4291456 4255678 4228854 4208030 4193273 4185916 4181103 4170423 4152438 4134798 4126780 4134333
11768 4134333 4156511 4177315 4168665 4118359 4052567 4012848 4012034 4032036 4061787 4107359 4158785 4182250
11756D182250j6324k1358O151J4185j6476l8960j2312L7327N9160M5809K3403
11745D262855L142j7051k4326p137J3070P097j3674j4277M545P775j2370k1777
11733D187872j552K2773K6764K3104K8669L0491J4695Q58J2273L2648K9516O918
11721D415029l400M977Q815K490P808K8384L4404J1469r749J383K7616L2290J6616
11708D578132J3142L1025M4341L6847K5051K5894K9211K0203R115J6257L7930
11697D867148M9531M0694K8848L3484N0060N7199M3736K1822J4343L2160O3224
11686E302249Q3139P7641N5754M0374M4997O0006O3560M7219K7542K6301M0343
11675E869125M2788K0498k347O174L9901N9960M7098K5979K8458N3024P5154Q0381
$$ plain form
11756 4182250 4165926 4144568 4150719 4164904 4148428 4109468 4097156 4134483 4193643 4239452 4262855
11745 4262855 4265997 4248946 4224620 4217483 4230553 4237650 4223976 4209699 4214244 4222019 4209649 4187872
11733 4187872 4186320 4209093 4235857 4258961 4287630 4318121 4332816 4333674 4345947 4378595 4408111 4415029
11721 4415029 4411629 4416606 4425421 4427911 4435719 4464103 4498507 4509976 4500227 4501610 4529226 4561516 4578132
11708 4578132 4591274 4622299 4666640 4703487 4728538 4754432 4783643 4803846 4812961 4829218 4867148
11697 4867148 4916679 4957373 4986221 5019705 5069765 5126964 5170700 5192522 5206865 5239025 5302249
11686 5302249 5385388 5463029 5518783 5559157 5604154 5664160 5727720 5774939 5802481 5828782 5869125
11675 5869125 5911913 5932411 5930064 5936238 5976139 6036099 6083197 6109176 6137634 6190658 6265812 6346193
11663F346193O8739M1893J0144J985L7109Q9959J07881P2998K4080P688K6995
11652F835664M9727M8895K2628j0491k1077J1296O9622J01817P2927J0100k4416
11641G166692l905L8009N4365L6676J1526J559M915P980N114K321O568J5701K0058
11628G367579J3430j67j1796j7082j8220j9467k3070k6918k4726j3572l352j0530
11616G212109l5978n6692m9544j8907Q841J3954l369l2142n7753o2759l9519p051
11604F871190P00k7338o3857p3407m9124j2858J0225P700j8839n4523p7232p4506
11592F438131n3723l0091j0777K238L845n823j2465m877K674j4350n2107p6825
11580F185850o8742m6604l5728l1496j4852R479J5714m886l0483l5633j5569J7127
$$ plain form
11663 6346193 6414932 6456825 6466969 6468954 6506063 6596022 6703903 6776901 6800981 6808669 6835664
11652 6835664 6885391 6934286 6956914 6946423 6925346 6936642 7006264 7108081 7181008 7191108 7166692
11641 7166692 7162787 7200796 7255161 7291837 7303363 7304922 7309837 7317817 7322931 7325252 7331820 7347521 7367579
11628 7367579 7381009 7380842 7369046 7351964 7333744 7314277 7291207 7264289 7239563 7225991 7222639 7212109
11616 7212109 7176131 7119439 7069895 7050988 7059829 7073783 7070414 7038272 6980519 6917760 6878241 6871190
11604 6871190 6871890 6844552 6780695 6707288 6658164 6645306 6655531 6663231 6644392 6589869 6512637 6438131
11592 6438131 6384408 6354317 6343540 6345778 6349623 6343800 6331335 6326458 6329132 6314782 6262675 6185850
11580 6185850 6117108 6070504 6034776 6003280 5988428 5997907 6013621 6008735 5978252 5942619 5927050 5944177
11568E944177M3083M2463J0643k7451l8283k2069j3090k7874l8271j5559K1943
11557E879712L4036J5579m255r768r811m963J6131M1962M0526J1630j803K2035
11545F031011M4986K7940k157J0720O4664R8743P7069K9219j492r886j1591o297
11533F352929J5573M6774O6962O6537N3550M1640L8061L7992K8979R993L357L0372
11521F792719P4134Q8989N5553O690j2430P373M1687O3839N9247K7097j2628k6948
11509G165322m010L0074M4457M1511M3107N1521M8484K7857N432m628n148o622
11497G437357j6025l2831m3832k8614J3169M6587L4920j3443n2104n0816k2595
11486G271773L393J3159P444p303j7526j0845K718n636m4317p9001o7852j4599
$$ plain form
11568 5944177 5987260 6029723 6040366 6012915 5974632 5952563 5939473 5911599 5873328 5857769 5879712
11557 5879712 5913748 5929327 5925072 5915304 5905493 5900530 5916661 5958623 5999149 6010779 6008976 6031011
11545 6031011 6075997 6103937 6101780 6112500 6177164 6275907 6352976 6382195 6380703 6370817 6359226 6352929
11533 6352929 6368502 6415276 6482238 6548775 6602325 6643965 6682026 6720018 6748997 6758990 6762347 6792719
11521 6792719 6866853 6955842 7011395 7018085 7005655 7013028 7054715 7118554 7177801 7204898 7192270 7165322
11509 7165322 7161312 7191386 7235843 7277354 7320461 7371982 7420466 7448323 7453755 7449127 7443979 7437357
11497 7437357 7421332 7388501 7344669 7316055 7329224 7375811 7410731 7397288 7345184 7294368 7271773
11486 7271773 7275166 7288325 7295769 7288466 7270940 7260095 7262813 7257177 7212860 7133859 7066007 7051408
11474G051408L0294K5517j4015l5073r807L0061L3860o39k3490j722L4535L5242
11462G156171j383l2776l1501r521J0650J7561O290j6696k5246j666K8310K4362
11450G124555n238j2493J2533K3157o042l2913j1451L9698P0306O6533M7481K4562
11438G340688N500J0937M2322N7792K7538r697J160M2305M8112R445j5517J140
11426G561725J7696Q30j9564o305K4084L4117K2017R731L212k842m768k487q957
11413G628489k2662j7756J2093L0362J1076j4180l736K4606K1057j3303k5297
11402G630749P939M5649M5923J9993L334M416Q425J1687K4111M3602N1734M0250
11390G937812K7948L9055O7436P7110M8120R103K899K6413L6025J6287M488K8328
$$ plain form
11474 7051408 7081702 7107219 7093204 7058131 7048324 7078385 7112245 7111606 7088116 7086394 7120929 7156171
11462 7156171 7154788 7122012 7090511 7080990 7091640 7109201 7115491 7098795 7073549 7071883 7100193 7124555
11450 7124555 7119317 7106824 7119357 7142514 7136472 7103559 7092108 7131806 7202112 7268645 7316126 7340688
11438 7340688 7346188 7357125 7399447 7457239 7484777 7475080 7476240 7518545 7566657 7576102 7560585 7561725
11426 7561725 7579421 7580251 7560687 7554382 7578466 7612583 7634600 7644331 7647543 7644701 7639933 7637446 7628489
11413 7628489 7605827 7588071 7600164 7630526 7641602 7627422 7623686 7648292 7669349 7656046 7630749
11402 7630749 7638688 7684337 7730260 7750253 7753587 7758003 7766428 7778115 7802226 7845828 7897562 7937812
11390 7937812 7965760 8004815 8072251 8149361 8197481 8206584 8209483 8235896 8271921 8288208 8292696 8321024
11378H321024N7723N2460K6610K1585L6274L4412J2126N929L0626N6931O0744
11367H716444N2572M6078L7436L0536M3260P0890Q1128O5801N9111Q0056R6460
11356I379772P8996N3530N7884P7210P1455M5978M1284O2444P3010O0456N5338
11345A0057357P3182Q4538O4974L6881L3986N2399O6197P1320Q3519J04098J16433
11334A0844884J13465J05308R9100R0794P9899P5344P9961Q2049P1596N6984N5471
11323A1754855P0128Q5650Q8201Q1622P9178Q4521Q8549Q4435P8314Q2052R9145
11312A2676650J19595J26515J09764P8948O1121P5913J11541J34959J27904J02692
11302A3725602Q1300P3637Q0951J02234J25978J32386J19071J09971J22220J39657
$$ plain form
11378 8321024 8378747 8431207 8457817 8479402 8515676 8550088 8562214 8568143 8598769 8655700 8716444
11367 8716444 8769016 8815094 8852530 8883066 8926326 8997216 9078344 9144145 9203256 9283312 9379772
11356 9379772 9458768 9512298 9570182 9647392 9718847 9764825 9806109 9868553 9941563 10002019 10057357
11345 10057357 10130539 10215077 10280051 10316932 10350918 10403317 10469514 10540834 10624353 10728451 10844884
11334 10844884 10958349 11063657 11162757 11253551 11333450 11408794 11488755 11570804 11642400 11699384 11754855
11323 11754855 11824983 11910633 11998834 12080456 12159634 12244155 12332704 12417139 12495453 12577505 12676650
11312 12676650 12796245 12922760 13032524 13111472 13172593 13248506 13360047 13495006 13622910 13725602
11302 13725602 13806902 13880539 13961490 14063724 14189702 14322088 14441159 14551130 14673350 14813007
11292A4813007J40215J33931J45127J67417J70868J52263J43056J60683J83900
11283A6210467J88692J80768J77034J78622J79079J79135J77548J66845J54269
11274A7792459J66276K12074K60283K73568K52614K26466K15030K22230K48496
11265A9869496K82643K95580K72934K44412K49389K81204K99741K94151K93537
11256B2383087L12998L30789L31479L33408L53438L76922L85722L87918L94826
11247B5590587L95099L81135L78058M11006M58588M75495M53906M28635M26266
11238B9398775M43300M72296N12092N46843N51537N31211N23497N47580N79437
11229C4106568N93492N98411O09830O17127O06572N93146N95584N99405N82835
$$ plain form
11292 14813007 14953222 15087153 15232280 15399697 15570565 15722828 15865884 16026567 16210467
11283 16210467 16399159 16579927 16756961 16935583 17114662 17293797 17471345 17638190 17792459
11274 17792459 17958735 18170809 18431092 18704660 18957274 19183740 19398770 19621000 19869496
11265 19869496 20152139 20447719 20720653 20965065 21214454 21495658 21795399 22089550 22383087
11256 22383087 22696085 23026874 23358353 23691761 24045199 24422121 24807843 25195761 25590587
11247 25590587 25985686 26366821 26744879 27155885 27614473 28089968 28543874 28972509 29398775
11238 29398775 29842075 30314371 30826463 31373306 31924843 32456054 32979551 33527131 34106568
11229 34106568 34700060 35298471 35908301 36525428 37132000 37725146 38320730 38920135 39502970
11220C9502970N63790N75582O01961N87216N19570M56282M44832M60217M49456
11211D4161876M04257L53737L10462K64764K18638J84076J51557R7639K6657k8920
11201D6144743n7219q5783j39356k04021k49238k67596k77438k98428l35794l77395
11191D3852475l98201l81171l42683l23038l40721l69251l70999l41162l04924
11182D0680325k83254k78131k83154k90388k88409k68398k35130k04796j90349
11173C8358316j90191j87834j64327j19923q1408p2747p9015o1583j3828K5746
11163C7413206K9266J9533L1636O0684P8540Q2152Q8904R7258R1429P9756Q9732
11152C8162096J23774J54820J68295J74916J78893J69320J49958J43183J56148
$$ plain form
11220 39502970 40066760 40642342 41244303 41831519 42351089 42807371 43252203 43712420 44161876
11211 44161876 44566133 44919870 45230332 45495096 45713734 45897810 46049367 46147006 46173663 46144743
11201 46144743 46087524 46001741 45862385 45658364 45409126 45141530 44864092 44565664 44229870 43852475
11191 43852475 43454274 43073103 42730420 42407382 42066661 41697410 41326411 40985249 40680325
11182 40680325 40397071 40118940 39835786 39545398 39256989 38988591 38753461 38548665 38358316
11173 38358316 38168125 37980291 37815964 37696041 37614633 37541886 37462871 37401288 37387460 37413206
11163 37413206 37442472 37462005 37493641 37554325 37632865 37715017 37803921 37901179 37992608 38072364 38162096
11152 38162096 38285870 38440690 38608985 38783901 38962794 39132114 39282072 39425255 39581403
11143C9581403J76309K05523K57600L12821L23954K88971K68845L01197L43188
11134D2059811L42851L24109L44486L98340M26162M07268L82375L85861M11108
11125D5482371M46590M92696N32448N36559N15061N18611N66858O16073O22681
11116E0329948O02362N97691O19027O49271O81658P18902P52440P74131P96449
11107E6521879Q33496Q72975Q93542R00580R18367R53136R89411J019458J052459
11098F4955303J094422J139438J183024J228998J282051J344137J414586J483860
11090G5125819J535711J568544J604365J660351J722994J771152J813991J878997
11082H8681924J966999K047532K100533K136579K171284K203994K229214K247940
$$ plain form
11143 39581403 39757712 39963235 40220835 40533656 40857610 41146581 41415426 41716623 42059811
11134 42059811 42402662 42726771 43071257 43469597 43895759 44303027 44685402 45071263 45482371
11125 45482371 45928961 46421657 46954105 47490664 48005725 48524336 49091194 49707267 50329948
11116 50329948 50932310 51530001 52149028 52798299 53479957 54198859 54951299 55725430 56521879
11107 56521879 57355375 58228350 59121892 60022472 60940839 61893975 62883386 63902844 64955303
11098 64955303 66049725 67189163 68372187 69601185 70883236 72227373 73641959 75125819
11090 75125819 76661530 78230074 79834439 81494790 83217784 84988936 86802927 88681924
11082 88681924 90648923 92696455 94796988 96933567 99104851 101308845 103538059 105785999
11074A05785999K260299K265823K275139K298354K316022K289261K211814K125230
11066A23827941K063481K007453J919242J799425J677211J557582J417033J250776
11058A37520144J086328R38462P81258N85243L62851J55476j3185j50644k70787
11049A40995146l78350m77873n75462o63189p18665p32604p23998p13229o91358
11040A35320418o37202n58984m91767m48184l98192l12238k02130r9161j1126
11031A32161434P2971J51206K15154K80533L74399M88751N81953O35689O78585
11022A35640675P41221Q20327R03566R93850J082852J134503J133548J127007
11014A43577549J173732J265339J340456J371145J389941J428598J475348J507147
$$ plain form
11074 105785999 108046298 110312121 112587260 114885614 117201636 119490897 121702711 123827941
11066 123827941 125891422 127898875 129818117 131617542 133294753 134852335 136269368 137520144
11058 137520144 138606472 139544934 140326192 140911435 141274286 141429762 141416577 141265933 140995146
11049 140995146 140616796 140138923 139563461 138900272 138181607 137449003 136725005 136011776 135320418
11040 135320418 134683216 134124232 133632465 133184281 132786089 132473851 132271721 132172560 132161434
11031 132161434 132234405 132385611 132600765 132881298 133255697 133744448 134326401 134962090 135640675
11022 135640675 136381896 137202223 138105789 139099639 140182491 141316994 142450542 143577549
11014 143577549 144751281 146016620 147357076 148728221 150118162 151546760 153022108 154529255
11006A54529255J526563J546481J566685J584945J607345J630100J634304J616703
10998A67242381J602155J604778J599911J560148J499271J450103J413160J360953
10990A79332860J286846J215454J161477J107703J033616R43699Q54831P70290
10982A87706776O78994N73617M60809L55541K67890J93631J18531L2810o3069
10973A90325530j66365k74290l75664m57533n28985o18389p31078q30907q88706
10964A85453613r31262j009657j129645j248508j335354j397064j446094j484801
10956A75471228j528977j603730j698536j764637j779955j783234j818184j874690
10948A61619285j915423j933718j950877j976469k005423k038280k071279k081521
$$ plain form
11006 154529255 156055818 157602299 159168984 160753929 162361274 163991374 165625678 167242381
10998 167242381 168844536 170449314 172049225 173609373 175108644 176558747 177971907 179332860
10990 179332860 180619706 181835160 182996637 184104340 185137956 186081655 186936486 187706776
10982 187706776 188385770 188959387 189420196 189775737 190043627 190237258 190355789 190388599 190325530
10973 190325530 190159165 189884875 189509211 189051678 188522693 187904304 187173226 186342319 185453613
10964 185453613 184522351 183512694 182383049 181134541 179799187 178402123 176956029 175471228
10956 175471228 173942251 172338521 170639985 168875348 167095393 165312159 163493975 161619285
10948 161619285 159703862 157770144 155819267 153842798 151837375 149799095 147727816 145646295
10940A45646295k057005k028889k037079k072505k090827k076760k054926k039462
10932A29188842k016317j982194j960115j961071j962473j940897j900872j858780
10924A13606123j822748j799978j798921j810652j809244j782381j743326j706966
10916I9331907j676358j656234j651021j643426j607269j550899j513376j505751
10908H6527573j494329j458679j424198j412802j403695j375637j347787j338803
10900G5271643j322313j270409j210758j188199j193031j181878j151801j135834
10892F5617420j135575j117826j077600j048869j046677j046508j026768r89332
10884E7128265r38581q84992q63191q91782r20560q83864q07859p87097q38890
$$ plain form
10940 145646295 143589290 141560401 139523322 137450817 135359990 133283230 131228304 129188842
10932 129188842 127172525 125190331 123230216 121269145 119306672 117365775 115464903 113606123
10924 113606123 111783375 109983397 108184476 106373824 104564580 102782199 101038873 99331907
10916 99331907 97655549 95999315 94348294 92704868 91097599 89546700 88033324 86527573
10908 86527573 85033244 83574565 82150367 80737565 79333870 77958233 76610446 75271643
10900 75271643 73949330 72678921 71468163 70279964 69086933 67905055 66753254 65617420
10892 65617420 64481845 63364019 62286419 61237550 60190873 59144365 58117597 57128265
10884 57128265 56189684 55304692 54441501 53549719 52629159 51745295 50937436 50150339 49311449
10875D9311449q66544q04699p18726p01204p38194p50458p17084o81834o69513
10866D2663193o67938o70614o72794o46283n81611n34176n59901o21214o30495
10857C7078167n78584n41474n55413n66519n27328m71856m57441m84258n09667
10848C2385627n05196m70672m23513l94821m04966m29359m23638l91501l81781
10839B8560180m05954m14451l80120l47360l58151l80152l59850l08890k82111
10830B5323141k94887l15193l21719l21571l19720l12162l02548k93329k73251
10821B2568761k44158k39009k74554l07450k85160k25784j95666k15435k42182
10812B0339363k44511k39507k44636k45136k30240k19713k29602k43636k41389
$$ plain form
10875 49311449 48444905 47640206 46921480 46220276 45482082 44731624 44014540 43332706 42663193
10866 42663193 41995255 41324641 40651847 40005564 39423953 38889777 38329876 37708662 37078167
10857 37078167 36499583 35958109 35402696 34836177 34308849 33836993 33379552 32895294 32385627
10848 32385627 31880431 31409759 30986246 30591425 30186459 29757100 29333462 28941961 28560180
10839 28560180 28154226 27739775 27359655 27012295 26654144 26273992 25914142 25605252 25323141
10830 25323141 25028254 24713061 24391342 24069771 23750051 23437889 23135341 22842012 22568761
10821 22568761 22324603 22085594 21811040 21503590 21218430 20992646 20796980 20581545 20339363
10812 20339363 20094852 19855345 19610709 19365573 19135333 18915620 18686018 18442382 18200993
10803A8200993k28610k18989k08753j89891j71244j68078j81330j97809k02215
10794A6434074j87309j64695j60847j83362j99692j77368j36844j26153j46708
10785A4951096j52317j29195j23285j63960k08672k00307j45080r5701q2624r7066
10775A3552889j20907j39429j40732j31328j35888j57616j62591j31261r7230
10766A2335907r8453j16507j09149q1933p6020r6848j08842r8486r0846r9044
10756A1359779j05746j03681j08833j21631j18751r7996q8269r7060r1410n5361
10746A0371041k5429l7333p1500q6177p6914o7067o2243n2449m3628m9357o1062
10735I737882o0742n5629o6231q4741q0590m8990k1344k0582l4472m3018m6922
$$ plain form
10803 18200993 17972383 17753394 17544641 17354750 17183506 17015428 16834098 16636289 16434074
10794 16434074 16246765 16082070 15921223 15737861 15538169 15360801 15223957 15097804 14951096
10785 14951096 14798779 14669584 14546299 14382339 14173667 13973360 13828280 13732579 13649955 13552889
10775 13552889 13431982 13292553 13151821 13020493 12884605 12726989 12564398 12433137 12335907
10766 12335907 12237454 12120947 12011798 11929865 11853845 11756997 11648155 11549669 11458823 11359779
10756 11359779 11254033 11150352 11041519 10919888 10801137 10703141 10614872 10517812 10426402 10371041
10746 10371041 10345612 10308279 10236779 10150602 10073688 10006621 9944378 9891929 9848301 9798944 9737882
10735 9737882 9677140 9621511 9555280 9470539 9389949 9340959 9319615 9299033 9264561 9221543 9174621
10724I174621n4336n8950m9564l1906k4788l5733n0132m8194l0260j9491l2891
10713H738376n4193n1038k0850K258l300j5586q548K385j1791l7583l5038n096
10701H499996O910j6568l6514k0981N187N624p516R83K7728L9308L0864L0526
10689H565547M5377M6596K0474k228J1313M9686P6139P6425O5053N5447M8474
10678I058303M7299O0046Q1413Q9222P1909N0438N7938R7590J34341J35769J11519
10667I995787R9221J15949J40989J49308J43337J41244J50219J67074J91608K19382
10657A1514118K32152K20142K07291K26098K68934K95677K93739K95467L23153
10648A3876771L53733L63081L72253M12711M68646M97509M96134N00617N22859
$$ plain form
10724 9174621 9120285 9061335 9011771 8979865 8955077 8919344 8869212 8821018 8790758 8771267 8738376
10713 8738376 8684183 8633145 8612295 8614553 8611253 8595667 8587119 8589504 8577713 8540130 8505092 8499996
10701 8499996 8506906 8490338 8453824 8432843 8438030 8443654 8436138 8437121 8464849 8504157 8535021 8565547
10689 8565547 8610924 8657520 8677994 8675766 8687079 8736765 8812904 8889329 8954382 9009829 9058303
10678 9058303 9105602 9165648 9247061 9336283 9408192 9458630 9516568 9614158 9748499 9884268 9995787
10667 9995787 10095008 10210957 10351946 10501254 10644591 10785835 10936054 11103128 11294736 11514118
10657 11514118 11746270 11966412 12173703 12399801 12668735 12964412 13258151 13553618 13876771
10648 13876771 14230504 14593585 14965838 15378549 15847195 16344704 16840838 17341455 17864314
10639A7864314N36224N34461N55733O20681O85984O98978O74432O73331P14989
10630B3559127P54347P51934P26928P20909P37027P44385P30189P15927P18781
10621C0159554P24529P15188P04229P16848P41004P31293O72992O11960N95301
10612C6372898O04670N84848N26198M73528M50233M22654L61136K93340K60320
10603D0349825K49809K17231J56128J01280O6003K1757n1506j33019j95415k41915
10593D0540178k90189l40664l80975m08517m31935m58757m93041n36882n85553
10584C6613665o29516o66842p02339p30224p35044p20417p18717p53213q01502
10575C0155851q18714p94879p68738p78355q12940q27141p98745p56792p43866
$$ plain form
10639 17864314 18400538 18934999 19490732 20111413 20797397 21496375 22170807 22844138 23559127
10630 23559127 24313474 25065408 25792336 26513245 27250272 27994657 28724846 29440773 30159554
10621 30159554 30884083 31599271 32303500 33020348 33761352 34492645 35165637 35777597 36372898
10612 36372898 36977568 37562416 38088614 38562142 39012375 39435029 39796165 40089505 40349825
10603 40349825 40599634 40816865 40972993 41074273 41140276 41162033 41110527 40977508 40782093 40540178
10593 40540178 40249989 39909325 39528350 39119833 38687898 38229141 37736100 37199218 36613665
10584 36613665 35984149 35317307 34614968 33884744 33149700 32429283 31710566 30957353 30155851
10575 30155851 29337137 28542258 27773520 26995165 26182225 25355084 24556339 23799547 23055681
10566B3055681p60773p67517p39481o98363o74868o65358o50607o36539o39158
10557A6823017o40680o06307n45630n09249n11428n04373m54701m00505l93671
10548A2256473m19609m20832l79786l32080l07540l01445l01662l05150l03460
10539I184909k83694k50234k22173k07134j98054j93113j96303k01008j94765
10530G238431j77187j55253j31112j14190j26294j65259j85626j56539j18222
10521E908749j27803j64430j55125r3064n4214p9506j16760j14130r8882j11596
10511D793239j24668r4075m7462m6379q6713j08932r4022p9168q0466o8427l2445
10500C930482j0088k9368o6724q5849q3128p3370o0588m4524l2934k9101k5810
$$ plain form
10566 23055681 22294908 21527391 20787910 20089547 19414679 18749321 18098714 17462175 16823017
10557 16823017 16182337 15576030 15030400 14521151 14009723 13505350 13050649 12650144 12256473
10548 12256473 11836864 11416032 11036246 10704166 10396626 10095181 9793519 9488369 9184909
10539 9184909 8901215 8650981 8428808 8221674 8023620 7830507 7634204 7433196 7238431
10530 7238431 7061244 6905991 6774879 6660689 6534395 6369136 6183510 6026971 5908749
10521 5908749 5780946 5616516 5461391 5368327 5314113 5234607 5117847 5003717 4904835 4793239
10511 4793239 4668571 4574496 4527034 4480655 4393942 4285010 4190988 4111820 4031354 3962927 3930482
10500 3930482 3920394 3891026 3824302 3738453 3655325 3581955 3521367 3476843 3443909 3414808 3388998
10489C388998k4404l9076o9011q6606o9480k9489L086J1295k049k4694m0085l4677
10477B983808j2709L707k136k3663m0991m2807l5002l1578l7508m0485k7484j0149
10465B683003j5162m1204n1417k8156o179j8885l9262k0998K2083L5434J3169
10454B532426K485J5443P474l5472n8447k3962K3827K9188P293J757M254j9030
10442B487236n2207m9967j6957j351j5701k5918j8928k0588l7753l9848j5708
10431B192310J050j3785l7178m0306l2739l7937n1297m9667k6106M313K0636Q387
10419A937681k6631n1071l4673M165J2511k4816n9345m6501q696m2k9473n4715
10407A618394m4230j2840N693k539k5971m5466n0678m3825l0790j2587P305J3050
$$ plain form
10489 3388998 3364594 3325518 3256507 3169901 3100421 3070932 3074018 3085313 3083264 3058570 3018485 2983808
10477 2983808 2971099 2974806 2972670 2949007 2908016 2865209 2830207 2798629 2761121 2720636 2693152 2683003
10465 2683003 2667841 2626637 2575220 2547064 2540885 2522000 2482738 2461740 2483823 2519257 2532426
10454 2532426 2534911 2550354 2557828 2522356 2463909 2439947 2463774 2492962 2500255 2502012 2506266 2487236
10442 2487236 2435029 2385062 2368105 2366754 2351053 2325135 2306207 2285619 2247866 2208018 2192310
10431 2192310 2193360 2179575 2142397 2102091 2069352 2031415 1980118 1930451 1904345 1908658 1929294 1937681
10419 1937681 1911050 1859979 1825306 1829471 1841982 1817166 1757821 1711320 1702624 1702582 1673109 1618394
10407 1618394 1574164 1561324 1567017 1564478 1538507 1493041 1442363 1398538 1367748 1355161 1362466 1375516
10395A375516p584l6836l9910j2359R209l346l3011m7824m4488l8544l1663j8233
10383A070927j0181k2910m3103m1497j6246N325R312J0546J8621J6411j1791m9346
10371I36068o3145m3204j2419K093j833n132K232M380j6324m4155m2062n558K1362
10358G32303L430l5213m5352k0534L753P869M799J158j4996l7607l5540k355K1906
10345E83621N402k7077l0574l190J9913K0290Q883o592l0173n1972m7937j6202
10333D24392J1858J0898o767j2738o65J2946J5975J2088Q118L766m352j6031k6392
10320D33096k8071j6782M19O055j0235l5439m3663k5959j309P510P11n430n267
10307B75636p737j3967r558J1567L0409K4730j170k3535k9020k1036l027K1921
$$ plain form
10395 1375516 1367932 1331096 1291186 1278827 1288036 1284690 1251679 1203855 1159367 1120823 1089160 1070927
10383 1070927 1060746 1037836 994733 953236 936990 942315 951627 962173 980794 997205 985414 936068
10371 936068 872923 829719 817300 819393 817560 812428 814660 819040 802716 758561 716499 710941 732303
10358 732303 735733 700520 655168 634634 638387 646256 651055 652213 637217 599610 564070 561715 583621
10345 583621 589023 561946 531372 528182 548095 568385 577268 570676 540503 488531 440594 424392
10333 424392 436250 447148 440381 427643 426978 439924 455899 467987 476105 479871 475519 459488 433096
10320 433096 405025 388243 388662 394717 384482 349043 305380 279421 278112 285622 286333 280903 275636
10307 275636 267899 253932 244374 255941 286350 311080 309910 286375 257355 236319 233292 255213
10295B55213L5988J8083k1077m0421k0674O712M466j5320j1418K0162L6433J0606
10283B78753k7178l1365j675K2300J6429m269j6884k0528k4162k3101p410J3029
10271A73939J3580j0122k9731j9533P093J4169p685k8125j8286J1531K7131J3248
10259A47209j2379k3427j1624J0099K1711J2778q520k3041k1476j3945j2993j3468
10247E0924j817J7204K0072k956k8605k6540J815K3817J4935j3718l1387k2927
10235H17o07J4665J4162K730j0729j8015j3152K459J8870K8086L1810L0726J3616
10222A15438k5565o1779n4564p50M9056M5755K54l4071k7311K912K7249L4478
10210G1102K1686j4237n8192p2625l6743J9190M1662J6025j6600r689L2904O0748
$$ plain form
10295 255213 291201 309284 288207 247786 227112 233824 238290 222970 211552 231714 268147 278753
10283 278753 251575 220210 218535 240835 257264 252995 236111 215583 191421 168320 160910 173939
10271 173939 187519 177397 147666 128133 135226 149395 141710 113585 95299 106830 133961 147209
10259 147209 134830 111403 99779 109878 131589 144367 135847 112806 91330 77385 64392 50924
10247 50924 49107 66311 86383 83427 54822 28282 30097 53914 68849 55131 23744 817
10235 817 210 14875 29037 31767 21038 3023 -10129 -7670 11200 39286 71096 101822 115438
10222 115438 89873 28094 -26470 -27220 21836 67591 67845 33774 6463 9375 36624 71102
10210 71102 92788 78551 20359 -52266 -89009 -69819 -28157 -12132 -28732 -38421 -5517 55231
10198E5231L4830k5287n9844l6443J1314K5149n483l4252k2119J5949M0646L8739
10186C8430K1664m546l6398n3157l5858k446J1626P913K0258M9464N0573P737
10174G5260k5753l263L7349K6703k8726n6477k8961M227O593P696L3398M6411
10162I4457R724l7797l4568N003J6465m566K872N3111P5296J9601o1659q5871
10150E2068m6926P0K4731L5761L2979N970k5052k2081J1834L2636K1598P775J3057
10137A44420J9476J1303P906K3987L0910k600n1131n6304n734M8096N4288K1268
10125B45885m605P91J8752K1605R649N321J7173K5662J2240j0954j7417m679N638
10112C25061M455O250J8259K5273J7781J1057J8130K4536J1913r541j5845m805
$$ plain form
10198 55231 90061 64774 4930 -31513 -20199 4950 -533 -34785 -56904 -40955 -309 38430
10186 38430 60094 55548 19150 -34007 -69865 -72311 -60685 -52772 -32514 16950 67523 75260
10174 75260 49507 46244 83593 110296 81570 25093 -3868 359 6952 14648 48046 94457
10162 94457 104181 66384 31816 36819 53284 48718 51590 104701 179997 199598 137939 52068
10150 52068 5142 5212 29943 65704 98683 104653 79601 57520 69354 101990 123588 131363 144420
10137 144420 163896 175199 183105 207092 238002 235402 184271 127967 122233 170329 224617 245885
10125 245885 241280 242071 260823 282428 292077 297398 314571 340233 352473 341519 324102 319423 325061
10112 325061 329516 335766 354025 379298 397079 408136 426266 450802 462715 453174 437329 432524
10100D32524O051P663L048q726k7819l8259k2257J0890L1798K7210J0656j244
10088D31535l419N080K2239L5943L4826K6656K7921L6632L5404J9848K183j1806
10076F63042k5443l1649j7623Q803K4496K5280K6517K8006J3457q924o065K4650
10064G24547M0971J9968l554N891K6934K1648J902O181L0247L3203N225j8968
10052H94195j4352Q106L0426M4206L7709O155k2695j4196J7399K2032r446k8923
10040I70616o906K3907K6508J5383J9719L0339K4998J5369K3422L4397K0290o713
10028A191329j2128J693M610K77K3102O8361Q1661L8745j1944j5831J6459L7965
10016A424299L5622L3198M2565N0736M8756M1239K9160J0607j365J2749M8376
$$ plain form
10100 432524 438575 446238 449286 440560 412741 374482 352225 363115 394913 422123 432779 431535
10088 431535 428116 433196 455435 491378 526204 552860 580781 617413 652817 672665 674848 663042
10076 663042 637599 605950 588327 597130 621626 646906 673423 701429 714886 705962 699897 724547
10064 724547 765518 785486 781932 787823 814757 836405 838307 844488 874735 907938 913163 894195
10052 894195 879843 887949 918375 962581 1000290 1006445 983750 969554 986953 1008985 999539 970616
10040 970616 963710 987617 1014125 1029508 1049227 1079566 1104564 1119933 1143355 1177752 1198042 1191329
10028 1191329 1179201 1180894 1185504 1185781 1208883 1277244 1358905 1397650 1385706 1369875 1386334 1424299
10016 1424299 1459921 1493119 1535684 1586420 1635176 1676415 1705575 1716182 1714817 1727566 1775942
10005A775942P6035P6811O1540M9815M6873M8603N4640O6212Q0187R3188J04301
9994B534147J08537R7216P2740N4680O0380Q3183R9874R8976R2107R4082J00282
9983C496204R4096P6526P5441J12942J68640J94325J71934J39486J44050J82457
9973D856101K11563K11188K08312K32711K74538L02753L09032L13238L31777L57728
9963G608941L73393L73842L76275M05918M66707N27952N54571N52686N65395O14760
9953A2420440O71446P00128P11876P41774P89721Q21289Q25242Q32261Q65855
9944A9380032R05316R14933Q89169Q51410Q21717P99961P70402P12017O12886
9935B6657843M80388L27655J51196n7587k76304m56489n79483o80412p94675r05619
$$ plain form
10005 1775942 1851977 1928788 1990328 2040143 2087016 2135619 2190259 2256471 2336658 2429846 2534147
9994 2534147 2642684 2739900 2812640 2867320 2927700 3010883 3110757 3209733 3301840 3395922 3496204
9983 3496204 3590300 3666826 3742267 3855209 4023849 4218174 4390108 4529594 4673644 4856101
9973 4856101 5067664 5278852 5487164 5719875 5994413 6297166 6606198 6919436 7251213 7608941
9963 7608941 7982334 8356176 8732451 9138369 9605076 10133028 10687599 11240285 11805680 12420440
9953 12420440 13091886 13792014 14503890 15245664 16035385 16856674 17681916 18514177 19380032
9944 19380032 20285348 21200281 22089450 22940860 23762577 24562538 25332940 26044957 26657843
9935 26657843 27138231 27465886 27617082 27559495 27283191 26826702 26247219 25566807 24772132 23866513
9925B3866513r75393j007524j038784j075897j082542j037595r70831r21640q86759
9916A4869548q33794p55550o85692o56013o53721o34549n76378n05691m61076
9907I107084m42122m15849l70446l32841l22604l18221k91636k52922k32146k33319
9897E894978k36342k31907k23695k06948j78331j58449j68466j90084j86923j61683
9887C952150j49909j58053j55852j36031j29265j43987j44032j11650q3073q8211
9877B652087j01366r2057q1682j00573j25031j13896q2007p7303j00428j07296
9867A670448q4744o4065n8223m4153j8247j4885m9763q9237r8235q2142o1668
9856A005086m1271k3556k2063l6299m2021k8830k1049l8590o2202o2166l9933
$$ plain form
9925 23866513 22891120 21883596 20844812 19768915 18686373 17648778 16677947 15756307 14869548
9916 14869548 14035754 13280204 12594512 11938499 11284778 10650229 10073851 9568160 9107084
9907 9107084 8664962 8249113 7878667 7545826 7223222 6905001 6613365 6360443 6128297 5894978
9897 5894978 5658636 5426729 5203034 4996086 4817755 4659306 4490840 4300756 4113833 3952150
9887 3952150 3802241 3644188 3488336 3352305 3223040 3079053 2935021 2823371 2740298 2652087
9877 2652087 2550721 2458664 2376982 2276409 2151378 2037482 1955475 1878172 1777744 1670448
9867 1670448 1585704 1521639 1463416 1419263 1401016 1386131 1336368 1247131 1148896 1066754 1005086
9856 1005086 963815 940259 918196 881897 839876 811046 789997 751407 689205 627039 587106
9845E87106j7031k664L215o059k9496m3420k8467j140O772q955k6763l5425m2005
9832C55668m7655m1343k1106k403J94j1592k4550k6590j6615p876j5571l4929
9820A05632m1411k1947N035J2894j54j5187k0990k2024k2447j7353j396K0422
9808a8926L0547R916l8103p6810o8569k1776J6129J7507k20j5212l0436m3581
9796b39534k8623J8172M8879K5351j7157j9012J2275J9408p147j7453N932J4308
9784a84601k2411n7702l7120J8757M6933K8487m093k7411m6900o0689m8398p609
9772d02757K8977L0584O639q225l28P896p498l5181m1966k0110J017k10n243J0496
9758d35909L2529K9828Q561K033J1402K909k8581m1203j2089J9975Q875l2147
$$ plain form
9845 587106 570075 567411 570626 564567 535071 491651 463184 462044 468816 459861 433098 397673 355668
9832 355668 308013 266670 245564 243161 243355 231763 207213 180623 164008 156132 140561 105632
9820 105632 64221 42274 47309 60203 60049 44862 23872 1848 -20599 -37952 -39348 -18926
9808 -18926 11621 21537 -16566 -93376 -161945 -183721 -167592 -150085 -150305 -165517 -195953 -239534
9796 -239534 -268157 -249985 -201106 -175755 -192912 -211924 -199649 -180241 -187388 -204841 -198909 -184601
9784 -184601 -207012 -264714 -301834 -283077 -236144 -207657 -211750 -239161 -286061 -346750 -395148 -402757
9772 -402757 -373780 -343196 -336557 -344782 -345110 -337214 -344712 -379893 -421859 -441969 -440952 -441162 -446405 -435909
9758 -435909 -403380 -373552 -364991 -362958 -351556 -348647 -377228 -418431 -430520 -410545 -401670 -433817
9746d33817n1640k8076J3566M0140L8998J6933q431k0494j8234j2157m430R503
9734d58139J9537Q801j2592j4696L348R091p469j7477q304m473j0374R437N6141
9721d27169O5556N422n5104m2892M281M115l1884k6718K0507L2370q177k7411
9709d87104R702M1836J9977j6950k1602j3322k1397k4130j315J4544k209j5730
9697e17700O656K8082N000l1494k7033L468P948j0496r534P620J257k4138k4383
9684e84747K906J3676k283m916K1240L8555K0254j0184k2526j8090q639L061Q942
9671e42751o88j0467N018L3921L6296O928j4972p628O510O475j97q185k5279l8632
9657e53651j9442K0970L1207j355k4847n636J7096l02l2098k7986N775K3394J2009
$$ plain form
9746 -433817 -485457 -513533 -499967 -459827 -420829 -403896 -412327 -432821 -451055 -463212 -467642 -458139
9734 -458139 -438602 -429801 -442393 -457089 -453741 -444650 -452119 -469596 -477900 -482373 -492747 -483310 -427169
9721 -427169 -361613 -356191 -411295 -454187 -449906 -445791 -477675 -504393 -483886 -451516 -459693 -487104
9709 -487104 -477402 -435566 -415589 -432539 -454141 -467463 -488860 -512990 -514305 -499761 -501970 -517700
9697 -517700 -511044 -482962 -477962 -509456 -536489 -533021 -525073 -535569 -545103 -537483 -536226 -560364 -584747
9684 -584747 -581841 -568165 -570448 -575364 -554124 -515569 -495315 -505499 -528025 -546115 -554754 -551693 -542751
9671 -542751 -543439 -553906 -548888 -514967 -478671 -471743 -486715 -494343 -487833 -481358 -481555 -489740 -515019 -553651
9657 -553651 -573093 -552123 -520916 -522271 -547118 -552754 -535658 -535960 -568058 -596044 -590269 -566875 -554866
9644e54866l180q130q882n258M223M452j2550k1146L540L9607M5007J7320j0571
9631e10434k1860k4236j8614o56J3417K411k1816k7670j0972N087J0418J3315
9619e91610J2662K317l535J1551K9143J8082j1820k2222q156K47l775L897K2908
9606e40311K0721p570k5099j5561p282j5113j2517J1432K0929n482l2158k5689
9594f33700j1636k5042m4335k8137J2601L4539L1514K9900L1655J6913p060j3209
9582f05997o313j6063l9591m1388j4421P743Q984J4155L9652O2263N6629K9759
9570e04588M82k4182l5969k1337R491K0021k324k0561j82L5393L3692j3732n7588
9557e81384n0385M81M2827L3341j9375o2384n3049m441L3768L4610J4018n504
$$ plain form
9644 -554866 -558046 -566176 -575058 -580316 -576093 -571641 -584191 -605337 -601797 -562190 -517183 -499863 -510434
9631 -510434 -532294 -556530 -575144 -575800 -562383 -559972 -581788 -609458 -620430 -615343 -604925 -591610
9619 -591610 -578948 -576631 -580166 -568615 -539472 -521390 -533210 -555432 -563588 -563341 -567116 -563219 -540311
9606 -540311 -519590 -527160 -552259 -567820 -575102 -590215 -602732 -591300 -570371 -575853 -608011 -633700
9594 -633700 -645336 -670378 -714713 -742850 -730249 -695710 -664196 -634296 -602641 -585728 -592788 -605997
9582 -605997 -612310 -628373 -667964 -709352 -723773 -716030 -707046 -692891 -653239 -590976 -534347 -504588
9570 -504588 -504106 -528288 -564257 -585594 -576103 -556082 -558406 -578967 -579149 -543756 -510064 -523796 -581384
9557 -581384 -631769 -631288 -588461 -555120 -574495 -636879 -689928 -694369 -660601 -625991 -611973 -617477
9545f17477k0247k5207l006M3093P1261M7705l955l0573j7187L564M379o854j3336
9532e67840j5518j8943j7822o432N791M588r963k4385k7961k0550o977R340K5398
9519f71274L4323K7049L213k0619k2481j00K2272K0017l035k0124j3385Q317K3090
9506f12737J9999O704k969n531r624k0531k8295j9189M016K4693L4459L8032L4608
9493e36365J4023j9795m0860l1990q509N545J0579K0821L3226L1856J6793L860
9481e00816k178j0871k2968k6310j6215r6J7646L3898L2777J353l8436m4946j2805
9468e89967J6987J6190O547J6957L3789K5049o283k7350k3468r600J047J0551
9456e29551J8208J4838Q2j2794j3163k087J2333J6984K26k7204l0538N386M3284
$$ plain form
9545 -617477 -637724 -662931 -665937 -622844 -551583 -503878 -507833 -538406 -555593 -552029 -547650 -554504 -567840
9532 -567840 -583358 -602301 -620123 -626555 -620764 -616176 -626139 -650524 -678485 -699035 -706012 -696672 -671274
9519 -671274 -636951 -609902 -606689 -627308 -649789 -649889 -627617 -607600 -610635 -630759 -644144 -635827 -612737
9506 -612737 -592738 -586034 -589003 -594534 -604158 -624689 -652984 -672173 -668157 -643464 -609005 -570973 -536365
9493 -536365 -522342 -542137 -582997 -614987 -623496 -617951 -607372 -586551 -553325 -521469 -504676 -500816
9481 -500816 -502994 -513865 -536833 -563143 -579358 -579454 -561808 -527910 -495133 -493780 -532216 -577162 -589967
9468 -589967 -572980 -556790 -550243 -533286 -499497 -474448 -480731 -508081 -531549 -541149 -540102 -529551
9456 -529551 -511343 -496505 -496423 -509217 -522380 -524467 -512134 -495150 -494924 -522128 -552666 -547280 -503996
9443e03996L7129J71j2835Q640J4246k1373m8438j5683M5983O4639K9491l504
9431d05530j561N517j2741l5124k5712R191L2799K9000J3146N70r688j9863k2593
9418d42589j1892M966J2750L414j5238k6826k4776k0538k6089l2307j9678Q746
9406e90057K4922J4510k294l629o4j2102k8366j8611J4641L1619J1698j5024j0730
9393e83487J7020K9081J0198j4497j7665k947Q083Q082R408K0091K7235J3197
9381d76201j5823l0594j4386J3008J8928j218k2117k4321j3467k342P031J6328
9369e45174K2313K3686K2813J4255j1210m2446m8084j6202K3106L2879J2900r598
9357e20762j7995j4197k168J2659J7687R662N731J4795J3912j5265m2669k5425
$$ plain form
9443 -503996 -466867 -466696 -479531 -470891 -456645 -478018 -526456 -542139 -496156 -431517 -402026 -405530
9431 -405530 -407091 -401574 -414315 -449439 -475151 -465960 -433161 -404161 -391015 -390445 -400133 -419996 -442589
9418 -442589 -454481 -449515 -436765 -433351 -448589 -475415 -500191 -520729 -546818 -579125 -598803 -590057
9406 -590057 -565135 -550625 -552919 -556548 -556612 -568714 -597080 -615691 -601050 -569431 -557733 -572757 -583487
9393 -583487 -566467 -537386 -527188 -541685 -559350 -562297 -554214 -546132 -536724 -516633 -489398 -476201
9381 -476201 -492024 -522618 -537004 -523996 -505068 -506286 -528403 -552724 -566191 -568533 -561502 -545174
9369 -545174 -522861 -499175 -476362 -462107 -473317 -515763 -563847 -580049 -556943 -524064 -511164 -520762
9357 -520762 -538757 -552954 -555122 -542463 -524776 -515114 -509383 -494588 -480676 -495941 -538610 -564035
9345e64035K1109L8639J4876J602K7035M6240J3716m0847n6539l0206j0162j6827
9333e55399k0319L388L6214M7550L1391L950j7245k5144k5356k7585k9050j5918
9321e93523J0330K5141J4670k162n976r438k9093m5810l0503N548K6661K7809
9309f06346K9987K9773N805k4956j5596L2728N7207K2477k7078l5937j3145n92
9297e45673m697n524m753j5071k0410M369M3456N5016L3004J2671J3439J5969
9285d18204L443r807m871J2138K1164J2281r586k9486k8006K370M2197O0260M6942
9272b99165K0710J970n536p726r064r976o020O898J8575Q064k3881m1493j7051
9259c63695K5332L8391J4967j0903j9914k4794l0745k1907R70R766n558j6710
$$ plain form
9345 -564035 -542926 -504287 -489411 -487809 -460774 -414534 -400818 -441665 -498204 -528410 -538572 -555399
9333 -555399 -575718 -572330 -536116 -488566 -457175 -453225 -470470 -495614 -520970 -548555 -577605 -593523
9321 -593523 -583193 -558052 -543382 -545544 -551520 -560958 -590051 -635861 -666364 -660816 -634155 -606346
9309 -606346 -576359 -546586 -540781 -565737 -581333 -548605 -491398 -468921 -495999 -531936 -545081 -545673
9297 -545673 -550370 -555894 -560647 -575718 -596128 -591759 -548303 -493287 -460283 -447612 -434173 -418204
9285 -418204 -414761 -424568 -429439 -417301 -396137 -383856 -393442 -422928 -450934 -448564 -406367 -346107 -299165
9272 -299165 -278455 -276485 -282021 -289747 -298811 -308787 -314807 -307909 -289334 -281270 -305151 -346644 -363695
9259 -363695 -338363 -299972 -285005 -295908 -315822 -340616 -371361 -393268 -392298 -382532 -388090 -404800
9247d04800l865J1691Q298M333K3124M3583K7548j7509m4110k9941j956P442j584
9234c77746r343n144O068J1518P53k1366l3006j8653R086K4207J9357P992On503
9220c91774n477P263K5807K9903J2114j0623j7453m120K0081M2413M9287L2585
9208b09994J191k3825l1832l1378l1587k6747q913J3029J9239K185k3813l6292
9196c88737k4356K750K2533J7294r063l2096k9309l734J7980J4430n571j3067
9184d30946M897K8054K8952Q458p536l500R476J4663J1100P154N177J136q270
9171c31185k2825l5410l1754o937J8763J9935L455J155J9675K8086Q963j0739
9159c38818k476J9658K5674J4245q6j7691l6348k9735J3105M9943L6437m441j8413
$$ plain form
9247 -404800 -408665 -396974 -388676 -384343 -361219 -317636 -290088 -307597 -351707 -381648 -383604 -376162 -377746
9234 -377746 -387089 -392233 -386165 -374647 -373894 -395260 -428266 -446919 -437833 -413626 -394269 -386277 -386271 -391774
9220 -391774 -397251 -389988 -364181 -334278 -322164 -332787 -350240 -354360 -334279 -291866 -242579 -209994
9208 -209994 -208803 -232628 -264460 -295838 -327425 -354172 -363085 -350056 -330817 -328632 -352445 -388737
9196 -388737 -413093 -410343 -387810 -370516 -379579 -411675 -440984 -444718 -426738 -412308 -417879 -430946
9184 -430946 -426049 -397995 -369043 -360585 -368121 -371621 -362145 -347482 -336382 -329228 -324051 -322915 -331185
9171 -331185 -354010 -389420 -421174 -428111 -409348 -389413 -385958 -384803 -365128 -337042 -328079 -338818
9159 -338818 -341294 -321636 -295962 -281717 -281803 -299494 -335842 -365577 -352472 -302529 -266092 -270533 -288946
9146b88946p130j4492l7668k9211Q693J5914j8816k6945K4898O8075L7139k4707
9134b93196l4711N665L0585J7441q39q140j6965k0343K26K4592J4218k0103k9658
9121c31228n191J5122J4295J3361J7075M900j5552q728K0788K2488j6701m3541
9109c12912k1068J6132K2718P369r35n254j7576k2234m283J7534K3454K6191L6394
9096b34470L0923l687l2162k1884n38j0270l3085k1023J9402L5601J2926r893
$$ plain form
9146 -288946 -296076 -310568 -348236 -377447 -368754 -352840 -371656 -398601 -373703 -305628 -268489 -293196
9134 -293196 -327907 -322242 -291657 -274216 -275055 -283195 -300160 -320503 -320277 -295685 -281467 -301570 -331228
9121 -331228 -336419 -321297 -307002 -293641 -276566 -271666 -287218 -295946 -275158 -252670 -269371 -312912
9109 -312912 -333980 -317848 -295130 -287761 -288696 -293950 -311526 -333760 -338043 -320509 -297055 -270864 -234470
9096 -234470 -203547 -207234 -239396 -261280 -261818 -272088 -305173 -326196 -306794 -271193 -258267 -268160
$$ [...]
##END NTUPLES=NMR SPECTRUM
##END=
