##TITLE=H1
##JCAMPDX= 6.0         $$ Bruker NMR JCAMP-DX V2.0
##DATA TYPE= NMR FID
##DATA CLASS= NTUPLES
##ORIGIN= UXNMR, Bruker Analytische Messtechnik GmbH
##OWNER= root
$$ XWIN-NMR		Version 3.5
$$ Mon Feb 22 12:07:52 2016 Russian Standard Time (UT+4h)  servis@DPX200
##.OBSERVE FREQUENCY= 200.131235884673
##.OBSERVE NUCLEUS= ^1H
##.DELAY= (6, 6)
##.ACQUISITION MODE= SIMULTANEOUS
##.ACQUISITION SCHEME= undefined
##.AVERAGES= 32
##.DIGITISER RES= 18
##SPECTROMETER/DATA SYSTEM= spect
##.PULSE SEQUENCE= zg
##.SOLVENT NAME= CDCl3
##.SHIFT REFERENCE= (INTERNAL, CDCl3, 0, 16.5164)
##AUDIT TRAIL= $$ (NUMBER, WHEN, WHO, WHERE, WHAT)
$$ ##TITLE= Audit trail, XWIN-NMR		Version 3.5
$$ ##JCAMPDX= 5.01
$$ ##ORIGIN= Bruker BioSpin GmbH
$$ ##OWNER= servis
$$ F:/spectra/data/servis-vadim/nmr/H1/1/audita.txt
$$ ##AUDIT TRAIL=  $$ (NUMBER, WHEN, WHO, WHERE, WHAT)
(   1,<2016-02-22 12:06:53.14 +0400>,<servis>,<DPX200>,
      <created by zg, POWCHK disabled, PULCHK disabled
       configuration hash MD5:
       00 E9 B6 7A A2 85 ED C7 34 08 36 98 17 FE 4E 26
       data hash MD5: 16K
       C3 B4 2F FB 22 EC 39 C8 04 B9 5D 14 38 03 DD B1>)
$$ ##END=
$$ 
$$ hash MD5
$$ 25 3B 31 62 D4 57 8B 4D E2 F7 11 D0 43 43 85 2B
##$RELAX= 
##$RELAX= 
##$RELAX= 
##$RELAX= 
##$RELAX= 
##$RELAX= 
$$ Bruker specific parameters
$$ --------------------------
##$DU= <F:/spectra>
##$EXPNO= 1
##$NAME= <H1>
##$PROCNO= 1
##$TYPE= <nmr>
##$USER= <servis-vadim>
##$AMP= (0..31)
100 100 100 100 100 100 100 100 100 100 100 100 100 100 100 100 100 100 
100 100 100 100 100 100 100 100 100 100 100 100 100 100 
##$AQSEQ= 0
##$AQ_mod= 1
##$AUNM= <au_zg>
##$AUTOPOS= <>
##$BF1= 200.13
##$BF2= 200.13
##$BF3= 200.13
##$BF4= 200.13
##$BF5= 500.13
##$BF6= 500.13
##$BF7= 500.13
##$BF8= 500.13
##$BYTORDA= 1
##$CFDGTYP= 0
##$CFRGTYP= 5
##$CHEMSTR= <none>
##$CNST= (0..31)
1 1 145 1 1 1 1 1 1 1 1 1 1 1 1 1 1 1 1 1 1 1 1 1 1 1 1 1 1 1 1 1 
##$CPDPRG= <>
##$CPDPRG1= <>
##$CPDPRG2= <>
##$CPDPRG3= <>
##$CPDPRG4= <mlev>
##$CPDPRG5= <mlev>
##$CPDPRG6= <mlev>
##$CPDPRG7= <mlev>
##$CPDPRG8= <mlev>
##$CPDPRGB= <>
##$CPDPRGT= <>
##$D= (0..31)
0 1 0 0 0 0 0 0 0 0.06 0 0 0 0 0 0 0.0002 0 0 0 0 0 0 0 0 0 0 0 0 0 0 
0 
##$DATE= 1456128412
##$DBL= (0..7)
120 120 120 120 120 120 120 120 
##$DBP= (0..7)
150 150 150 150 150 150 150 150 
##$DBP07= 0
##$DBPNAM0= <>
##$DBPNAM1= <>
##$DBPNAM2= <>
##$DBPNAM3= <>
##$DBPNAM4= <>
##$DBPNAM5= <>
##$DBPNAM6= <>
##$DBPNAM7= <>
##$DBPOAL= (0..7)
0.5 0.5 0.5 0.5 0.5 0.5 0.5 0.5 
##$DBPOFFS= (0..7)
0 0 0 0 0 0 0 0 
##$DE= 6
##$DECBNUC= <off>
##$DECIM= 32
##$DECNUC= <off>
##$DECSTAT= 4
##$DIGMOD= 1
##$DIGTYP= 9
##$DL= (0..7)
0 120 120 120 120 120 120 120 
##$DP= (0..7)
150 150 150 150 150 150 150 150 
##$DP07= 0
##$DPNAME0= <>
##$DPNAME1= <>
##$DPNAME2= <>
##$DPNAME3= <>
##$DPNAME4= <>
##$DPNAME5= <>
##$DPNAME6= <>
##$DPNAME7= <>
##$DPOAL= (0..7)
0.5 0.5 0.5 0.5 0.5 0.5 0.5 0.5 
##$DPOFFS= (0..7)
0 0 0 0 0 0 0 0 
##$DQDMODE= 0
##$DR= 18
##$DS= 0
##$DSLIST= <SSSSSSSSSSSSSSS>
##$DSPFIRM= 0
$$ [...]
##$SUBNAM0= <"">
##$SUBNAM1= <"">
##$SUBNAM2= <"">
##$SUBNAM3= <"">
##$SUBNAM4= <"">
##$SUBNAM5= <"">
##$SUBNAM6= <"">
##$SUBNAM7= <"">
##$SUBNAM8= <"">
##$SUBNAM9= <"">
##$SW= 20.6817932712277
##$SWIBOX= (0..15)
0 0 3 0 0 0 0 0 0 0 0 0 0 0 0 0 
##$SW_h= 4139.07284768212
##$TD= 16384
##$TD0= 1
##$TE= 0
##$TE2= 300
##$TE3= 300
##$TEG= 300
##$TL= (0..7)
0 120 120 120 120 120 120 120 
##$TP= (0..7)
150 150 150 150 150 150 150 150 
##$TP07= 0
##$TPNAME0= <>
##$TPNAME1= <>
##$TPNAME2= <>
##$TPNAME3= <>
##$TPNAME4= <>
##$TPNAME5= <>
##$TPNAME6= <>
##$TPNAME7= <>
##$TPOAL= (0..7)
0.5 0.5 0.5 0.5 0.5 0.5 0.5 0.5 
##$TPOFFS= (0..7)
0 0 0 0 0 0 0 0 
##$TUNHIN= 0
##$TUNHOUT= 0
##$TUNXOUT= 0
##$USERA1= <user>
##$USERA2= <user>
##$USERA3= <user>
##$USERA4= <user>
##$USERA5= <user>
##$V9= 5
##$VALIST= <valist>
##$VCLIST= <CCCCCCCCCCCCCCC>
##$VD= 0
##$VDLIST= <DDDDDDDDDDDDDDD>
##$VPLIST= <PPPPPPPPPPPPPPP>
##$VTLIST= <TTTTTTTTTTTTTTT>
##$WBST= 1024
##$WBSW= 4
##$XGAIN= (0..3)
0 0 0 0 
##$XL= 0
##$YL= 0
##$YMAX_a= 32311
##$YMIN_a= -68646
##$ZGOPTNS= <>
##$ZL1= 120
##$ZL2= 120
##$ZL3= 120
##$ZL4= 120
##$ABSF1= 10
##$ABSF2= 0
##$ABSG= 5
##$ABSL= 3
##$ALPHA= 0
##$AQORDER= 0
##$ASSFAC= 0
##$ASSFACI= 0
##$ASSFACX= 0
##$ASSWID= 0
##$AUNMP= <proc_1d>
##$AZFE= 0.1
##$AZFW= 0.1
##$BCFW= 1
##$BC_mod= 2
##$BYTORDP= 0
##$COROFFS= 0
##$CY= 12.5
##$DATMOD= 1
##$DC= 2
##$DFILT= <>
##$DTYPP= 0
##$F1P= 11.0000006437302
##$F2P= -0.999999642372123
##$FCOR= 0.5
##$FTSIZE= 0
##$FT_mod= 4
##$GAMMA= 1
##$GB= 0
##$INTBC= 1
##$INTSCL= 1
##$ISEN= 128
##$LB= 0.3
##$LEV0= 0
##$LPBIN= 0
##$MAXI= 10000
##$MC2= 0
##$MEAN= 0
##$ME_mod= 0
##$MI= 0
##$NCOEF= 0
##$NC_proc= 0
##$NLEV= 6
##$NOISF1= 0
##$NOISF2= 0
##$NSP= 1
##$NTH_PI= 0
##$NZP= 0
##$OFFSET= 16.51637
##$PC= 1
##$PHC0= -28.25718
##$PHC1= -0.3563094
##$PH_mod= 0
##$PKNL= yes
##$PPARMOD= 0
##$PSCAL= 4
##$PSIGN= 0
##$REVERSE= no
##$SF= 200.13
##$SI= 32768
##$SIGF1= 0
##$SIGF2= 0
##$SINO= 400
##$SIOLD= 32768
##$SREGLST= <1H.CDCl3>
##$SSB= 0
##$STSI= 0
##$STSR= 0
##$SW_p= 4139.07284768211
##$SYMM= 0
##$S_DEV= 0
##$TDeff= 0
##$TDoff= 0
##$TI= <>
##$TILT= no
##$TM1= 0
##$TM2= 0
##$TOPLEV= 0
##$USERP1= <user>
##$USERP2= <user>
##$USERP3= <user>
##$USERP4= <user>
##$USERP5= <user>
##$WDW= 1
##$XDIM= 8192
##$YMAX_p= 0
##$YMIN_p= 0
$$ End of Bruker specific parameters
$$ ---------------------------------
##NTUPLES= NMR FID
##VAR_NAME=  TIME,          FID/REAL,        FID/IMAG
##SYMBOL=    X,             R,               I
##VAR_TYPE=  INDEPENDENT,   DEPENDENT,       DEPENDENT
##VAR_FORM=  AFFN,          ASDF,            ASDF
##VAR_DIM=   8192,          8192,            8192
##UNITS=     SECONDS,       ARBITRARY UNITS, ARBITRARY UNITS
##FACTOR=    0.0002416,     1,               1
##FIRST=     0,             0,               0
##LAST=      1.9789456,     0,               0
##MIN=       0,             -68646,          0
##MAX=       1.9789456,     32311,           0
$$ Real data points
##PAGE= N=1
##DATA TABLE= (X++(R..R)), XYDATA
$$ [...]
$$ plain form
754 -3781 1904 2402 -3607 -802 3849 -934 -2818 1863 297 -2571 2131 2533 -3283 -887 3770 -1021
770 -1021 -2644 3495 1540 -4555 -62 3952 -1769 -2524 2770 187 -3325 1290 2072 -2468 132 3128
786 3128 -1927 -2537 3129 1144 -2970 1312 2320 -3424 -1393 3848 -286 -3188 1870 1266 -3341 618
802 618 3793 -1759 -2460 2799 693 -2662 1523 2142 -2570 -578 2490 -1690 -1968 3172 599 -3776
818 -3776 864 2821 -2595 -1108 4010 -158 -3773 1438 2349 -2058 37 2292 -2137 -1934 2762 183
834 183 -2847 1586 1797 -3180 -435 3621 -924 -2545 2639 1151 -3249 674 3051 -1837 -1424 2607
850 2607 -789 -3034 2173 2289 -2692 -641 2271 -1400 -1270 3077 397 -2971 1202 2000 -2483 -277
866 -277 3267 -1394 -3092 2226 1425 -3086 207 2829 -1670 -1851 2221 133 -1832 1959 1261 -3034
$$ packed form
754c781N685M98o009K805M651m783j884M681j566k868M702M02n816K396M657m791
770a021j623O139j955o095M493M014n721p55N294k583l512M615P82m540K600K996
786C128n055o10N666j985m114M282J008n744K031N241m134k902N058o04m607L959
802F18L175n552p01N259k106l355M185O19m712J992L068m180k78N140k573m375
818c776M640J957n416J487N118m168l615N211R11m407K095K255m429K03M696k579
834A83l030M433K11m977K745M056m545j621N184j488m400L923K377m888M13M031
850B607l396k245N207J16m981K051K912l671J30M347k680l368M173P98m483K206
866b77L544m661j698N318q01m511L293K622m499j81M072k088j965L791o98m295
$$ plain form
882 -3034 -149 2877 -1274 -1682 2612 -38 -3549 1115 2891 -1977 -1199 2486 -676 -2168 2336 1442
898 1442 -2568 388 2433 -1938 -1532 2709 87 -2613 1238 1268 -2710 -21 3011 -1241 -2130 2204
914 2204 508 -2545 1526 2661 -2497 -1638 2641 -12 -2118 1545 939 -2630 83 2173 -1565 -1141
930 -1141 2552 -244 -2638 1627 1977 -2346 -275 2914 -1106 -2469 1998 1219 -2177 427 1596 -2106
946 -2106 -813 2809 -229 -2281 1474 1100 -2289 490 2660 -1491 -1817 2095 149 -2420 1202 1676
962 1676 -2387 -675 2368 -1039 -2009 2276 1179 -2500 207 2053 -1299 -589 2382 -592 -2383 1532
978 1532 1291 -2160 226 2148 -1890 -1794 2663 775 -2472 771 1851 -1794 -609 2319 -484 -1627
994 -1627 1681 491 -2472 549 2103 -1630 -1125 2101 -456 -2233 1701 1760 -2126 -415 2009 -957
$$ packed form
882c034K885L026m151m08M294k650l511M664J776m868P78L685l162j492M504q94
898A442m010K956K045m371M06M241k622k700L851L0l978K689L032m252q89M334
914B204j696l053M071J135n158Q59M279k653k106L663o06l569K713K090l738M24
930a141L693k796k394M265L50m323K071L189m020j363M467p79l396K604J169l702
946b106J293L622l038k052L755l74l389K779K170m151l26L912j946k569L622M74
962A676m063J712L043l407r70M285j097l679K707J846l352P10K971k974j791L915
978A532k41l451K386J922m038R6M457j888l247L243J080l645J185K928k803j143
994a627L308j190k963L021J554l733N05L226k557j777L934N9l886J711K424k966
$$ plain form
1010 -957 -1204 2193 248 -2590 644 1801 -1706 -731 2058 -665 -1922 1544 941 -1914 610 2037
1026 2037 -1551 -1082 2233 -34 -1947 1529 1408 -2487 -584 2358 -564 -1567 1465 243 -1980
1041 -1980 941 1803 -1621 -667 1953 -693 -1675 1884 946 -2417 50 1969 -1434 -1333 2037 220
1057 220 -2018 878 1210 -1773 28 2342 -786 -1727 1545 597 -1737 825 1571 -1882 -1021 1964
1073 1964 -271 -1600 1425 743 -2175 281 2230 -1079 -1294 1923 287 -2001 735 1444 -1438 -358
1089 -358 1557 -1025 -1538 1691 634 -1827 552 1374 -1769 -665 2445 -48 -2040 981 1096 -1664
1105 -1664 66 1768 -1135 -1333 1586 157 -1734 959 1368 -1650 -382 1869 -584 -1270 1779 682
1121 682 -2054 233 1586 -1229 -702 1854 -504 -2139 1089 1374 -1519 -228 1540 -935 -1121 1692
$$ packed form
1010i57k47L397j945k838L234J157l507R75K789k723j257L466o03k855K524J427
1026B037l588M69L315k267j913L476j21l895J903K942k922j003L032j222k223
1041a980K921Q62l424R54K620k646r82L559r38l363K467J919l403J01L370j817
1057B20k238K896L32k983J801K314l128r41L272r48k334K562P46l453Q61K985
1073A964k235j329L025o82k918K456J949l309k15L217j636k288K736P09k882J080
1089c58J915k582n13L229j057k461K379Q22l143J104L110k493j992L021J15k760
1105a664J730J702k903j98K919j429j891K693M09l018J268K251k453o86L049j097
1121F82k736K287J353k815N27K556k358j635L228K85k893J291J768k475j86K813
$$ plain form
1137 1692 411 -1592 730 1113 -1610 -336 1843 -739 -1607 1433 654 -2009 242 1926 -929 -1067
1153 -1067 1452 -11 -1344 1202 1152 -1622 -367 1432 -796 -923 1622 100 -1997 577 1475 -1282
1169 -1282 -463 1780 -415 -1482 1331 870 -1611 234 1625 -1137 -1192 1433 133 -1416 777 758
1185 758 -1680 -138 1731 -597 -1046 1379 144 -1721 891 1682 -1440 -886 1635 -235 -1505 1048
1201 1048 871 -1469 -38 1318 -897 -763 1566 130 -1415 839 893 -1500 -29 1746 -778 -1565
1217 -1565 1154 545 -1464 450 1239 -1369 -828 1634 76 -1266 917 759 -1403 94 1432 -812
1233 -812 -858 1324 -53 -1568 720 1067 -1343 -206 1579 -689 -1371 1424 890 -1454 95 1206
1249 1206 -927 -571 1451 -125 -1419 686 627 -1263 214 1308 -1053 -1009 1493 232 -1498 734
$$ packed form
1137A692j281k003K322L83k723J274K179k582q68L040p79k663K251J684k855j38
1153a067K519j463j333K546n0k774J255J799k228j27K545j522k097K574Q98k757
1169a282Q19K243k195j067K813m61k481J845J391k762n5K625j300j549K193j9
1185G58k438J542J869k328m49K425j235j865K612P91l122N54K521j870j270K553
1201A048j77k340J431J356k215J34K329j436j545K254N4k393J471J775k524p87
1217a565K719o09k009J914P89k608N41K462j558j342K183j58k162J497J338k244
1233h12m6K182j377j515K288L47k410J137J785k268o82K795n34k344J549J111
1249A206k133L56K022j576j294K105n9j890J477J094k361M4K502j261j730K232
$$ plain form
1265 734 1265 -1276 -548 1424 -343 -1173 1105 543 -1516 20 1179 -762 -524 1256 -271 -1298
1281 -1298 949 987 -1201 -46 1256 -821 -899 1444 314 -1576 371 1143 -1091 -576 1364 -133
1297 -133 -1105 825 520 -1202 281 1233 -802 -665 1094 -252 -1197 998 869 -1554 -372 1394 -471
1314 -471 -968 1141 355 -1384 369 1199 -778 -459 1157 -304 -1071 888 494 -1219 220 1137 -959
1331 -959 -812 1269 152 -1149 711 821 -1269 -196 1540 -298 -1078 829 339 -1156 361 1014
1347 1014 -953 -599 1030 -213 -906 923 513 -1228 166 1222 -774 -757 1311 220 -1347 361
1363 361 907 -922 -251 1163 -392 -1043 798 500 -865 396 844 -983 -422 1297 -78 -1064 715
1380 715 616 -1198 -12 1196 -605 -867 1019 193 -1178 440 959 -779 -281 980 -396 -837 946
$$ packed form
1265G34N31k541P28J972j767q30K278n62k059J536J159j941K38J780j527j027
1281a298K247L8k188J155J302k077p8K343j130j890J947P72k234N15J940j497
1297a33r72J930l05j722J483R52k035J37J759j346r45K195j29k423J182J766j865
1314d71m97K109p86j739J753Q30j977L19J616j461p67J959l94j713J439R17k096
1331i59J47K081j117j301J860J10k090J073J736j838p80J907m90j495J517O53
1347A014j967L54J629j243o93J829m10j741J394J056j996J7K068j091j567J708
1363C61N46j829O71J414j555o51J841k98j365J261M48j827N61J719j375r86J779
1380G15r9j814J186J208j801k62J886q26j371J618N19j738M98J261j376m41J783
$$ plain form
1397 946 500 -1090 81 782 -859 -384 1230 -187 -1260 628 792 -967 -78 1158 -459 -824 888
1414 888 315 -971 339 770 -849 -344 938 -365 -795 899 351 -1223 119 1133 -560 -527 972
1431 972 -66 -1078 610 858 -860 -298 860 -430 -693 870 251 -1003 308 777 -789 -292 1035
1448 1035 -193 -852 711 428 -1068 115 1070 -626 -796 819 92 -874 537 687 -935 -279 929
1465 929 -193 -523 798 133 -1014 357 862 -787 -397 985 -224 -1000 624 569 -901 17 925
1482 925 -518 -651 876 233 -807 375 520 -849 -130 1008 -313 -833 615 243 -868 328 833
1499 833 -716 -481 920 -14 -794 576 561 -850 -101 798 -426 -572 789 175 -885 262 576 -686
1517 -686 -65 933 -378 -799 737 494 -821 136 744 -634 -512 884 81 -831 355 439 -737 -28
$$ packed form
1397I46m46j590J171P01j641M75J614j417j073J888J64j759Q89J236j617l65J712
1414H88n73j286J310M31j619N05J282j303m30J694n48j574J342J014j693L3J499
1431I72j038j012J688K48j718N62J158j290k63J563o19j254J311M69j566M97J327
1448A035j228o59J563k83j496J183R55j696j70J615p27r66J411J50j622O56J208
1465I29j122l30J321o65j147J371N05j649L90J382j209p76J624n5j470R18R08
1482I25j443j33J527o43j040J182J45j369P19J138j321n20J448l72j111J196N05
1499H33j549K35J401r34p80J370j5j411P49Q99j224j46J361o14j060J147L14j262
1517f86O21R98j311m21J536k43j315R57O08j378J22J396q03r12J186Q4j176P09
$$ plain form
1535 -28 842 -411 -523 756 138 -873 373 740 -655 -310 761 -271 -767 686 501 -896 -51
1552 -51 713 -440 -353 803 6 -831 388 579 -597 -80 729 -394 -631 670 184 -838 259 667
1570 667 -661 -408 797 -40 -627 534 387 -799 -39 784 -300 -415 593 -73 -740 442 595 -713
1588 -713 -220 722 -292 -565 683 279 -801 121 674 -517 -355 732 -34 -674 373 356 -692 56
1606 56 745 -389 -558 587 107 -605 444 533 -717 -238 795 -137 -581 522 247 -765 104 683
1624 683 -430 -405 636 -10 -612 398 429 -559 38 657 -426 -489 679 197 -693 193 464 -598 -210
1643 -210 766 -95 -678 383 332 -551 136 600 -428 -358 628 24 -585 362 418 -644 -100 647 -308 -458
1663 -458 633 184 -700 150 583 -397 -203 671 -142 -658 421 380 -541 9 466 -429 -310 662 26 -642
$$ packed form
1535b8Q70j253j12J279o18j011J246L67j395L45J071j032m96J453j85j397Q45
1552e1P64j153Q7J156p97q37J219J91j176N17Q09j123k37J301m86j022J097M08
1570F67j328K53J205q37n87J161j47j186P60Q23j084j15J008o66o67J182J53j308
1588g13M93R42j014k73J248m04j080R22N53j191J62J087p66o40J047j7j048P48
1606E6O89j134j69J145m80p12J049Q9j250M79J033r32m44J103k75j012Q69N79
1624F83j113K5J041o46o02J010L1r88N97O19j083o3J168m82q90Q86K71j062L88
1643b10R76q61n83J061n1q83O87M64j028P0R86o04o09R47N6j062N44P47r55j50
1663d58J091m49q84Q50M33r80J94Q74q13n16J079m1r21N50M57q95J19R72o36o68
$$ plain form
1683 -642 314 461 -571 -100 689 -209 -519 505 211 -656 117 554 -389 -316 483 -109 -474 499 338 -598
1703 -598 -46 571 -270 -306 615 47 -683 241 536 -489 -177 572 -169 -523 439 273 -546 118 514 -353
1723 -353 -284 538 0 -453 383 264 -638 -36 624 -255 -447 454 58 -590 255 543 -447 -243 527 -80
1743 -80 -421 425 252 -518 57 467 -408 -284 562 -1 -565 286 326 -509 -4 637 -232 -477 436 208 -451
1764 -451 190 395 -479 -227 543 -49 -448 314 160 -517 73 501 -312 -274 542 40 -544 258 417 -414
1784 -414 -126 509 -210 -448 412 239 -482 43 368 -358 -126 541 -71 -481 318 298 -432 55 508 -310
1804 -310 -389 494 113 -502 206 387 -391 -136 480 -113 -329 426 197 -511 67 425 -296 -193 471 -134
1824 -134 -523 338 358 -447 -68 437 -238 -301 484 153 -482 150 372 -302 -141 451 -91 -368 315 129 -469
$$ packed form
1683f42R56J47j032M71P89q98l10J024k94q67P73M37r43P3P99n92l65R73j61r36
1703e98N52O17q41l6R21n68p30R24K95j025L12P49p41l54R62j66q19O64L96q67
1723c53O9Q22n38m53Q36j19r02O02O60q79j92R01l96o48Q45K88r90K04P70o07
1743h0l41Q46j73p70N75M10q75J24Q46n63n64Q51M0q35N05O41q69k45R13k28o59
1764d51O41K05q74K52P70n92l99P62j54o77N90M28q13L8Q16n02n84Q02J59q31
1784d14K88O35p19k38Q60j73p21N25L25p26K32O67o12m10P99k0p30M87M53q18
1804c10p9Q83l81o15P08J81p78K55O16n93k16P55k29p08N78L58p21J03O64o05
1824a34l89Q61K0q05L79N05o75o3P85l31o35O32K22o74J61N92n42k77O83j86n98
$$ plain form
1845 -469 118 451 -302 -264 449 -9 -406 346 366 -444 -146 466 -106 -311 369 74 -475 141 359 -315 -151
1866 -151 443 -101 -373 374 239 -432 75 442 -307 -320 413 83 -415 179 263 -420 -90 488 -108 -333 285
1887 285 100 -357 167 377 -341 -218 410 -68 -375 301 240 -462 -14 444 -228 -289 414 112 -415 128 287
1908 287 -305 -55 399 -164 -381 296 140 -373 104 310 -357 -234 463 15 -437 236 258 -359 7 419
1928 419 -189 -278 330 95 -397 127 267 -303 -100 363 -191 -335 365 220 -401 46 362 -265 -160 440
1948 440 -2 -437 177 282 -304 -69 350 -168 -277 337 94 -360 166 303 -286 -107 399 -105 -335 303
1968 303 180 -437 -11 395 -189 -218 306 -11 -373 222 291 -288 -87 343 -149 -241 345 77 -389 120 317
1989 317 -302 -161 375 -35 -331 255 212 -352 35 404 -155 -260 316 49 -281 218 214 -348 -125 361 -107
$$ packed form
1845d69N87L33p53L8P13m58l97P52K0q10K98O12n72k05O80k95n49O16K18o74J64
1866a51N94n44k72P47j35o71N07L67p49j3P33l30m98N94Q4o83L30N78n96k25O18
1887B85j85m57N24K10p18J23O28m78l07O76o1p02M48M58o72o1P03l02n27N43J59
1908B87n92K50M54n63k17O77j56n13M77K06o67J23O97m48m52O73K2o17L66M12
1928D19o08q9O08k35m92N24J40n70K03M63n54j44P00j45o21M47L16o27J05O00
1948D40m42m35O14J05n86K35M19n18j09O14k43m54N26J37n89J79N06n04k30O38
1968C03j23o17M26M06n84k9N24l17l62N95O9n79K01M30m92r2N86k68m66N09J97
1989C17o19J41N36m10k96N86m3n64L87L69n59j05N76k67l30M99mn62K23M86m68
$$ plain form
2010 -107 -249 286 80 -379 99 357 -255 -168 362 -12 -342 204 228 -317 -4 319 -199 -248 308 71 -300
2031 -300 166 234 -297 -34 405 -78 -318 232 122 -348 75 317 -243 -216 324 21 -297 172 206 -291 -11
2052 -11 331 -160 -190 306 90 -348 99 265 -274 -96 355 -118 -352 245 200 -288 16 267 -202 -158 326
2073 326 8 -295 130 164 -294 6 304 -156 -235 280 85 -359 112 300 -218 -131 307 -66 -276 230 202
2094 202 -315 -43 268 -171 -140 302 -17 -352 172 231 -263 -32 330 -149 -243 274 114 -317 72 296 -227
2115 -227 -145 258 -10 -254 174 151 -304 -7 293 -154 -168 253 3 -304 177 274 -269 -129 270 -94 -264
2136 -264 237 118 -314 42 266 -160 -165 289 -3 -250 190 154 -291 1 303 -136 -225 226 27 -285 130
2157 130 224 -273 -109 328 -37 -248 181 88 -268 63 266 -186 -143 273 -6 -276 170 162 -269 -8 281 -179
$$ packed form
2010a07j42N35k06m59M78K58o12Q7N30l74l30N46K4n45L13L23n18m9N56k37l71
2031c00M66O8n31K63M39m83k40N50j10m70M23K42n60K7N40l03l18M69L4m97K80
2052a1L42m91l0M96k16m38M47J66n39J78M51m73k34N97m5m88L04K51m69M4M84
2073C26l18l03M25L4m58L00K98m60p9N15j95m44M71J88n18Q7M38l73k10N06k8
2094B02n17K72L11m39L1M42l19l35N24N9m94K31L62m79r4N17j60m31L89K24n23
2115b27Q2M03k68k44M28k3m55K97L00m47j4M21k50l07M81R7n43J40L99l64j70
2136b64N01j19m32L56K24m26nM54k92k47M40l6m45K92L02m39q9M51j99l12M15
2157A30R4m97J64M37l65k11M29r3l56L31K03m52M3M16k79k70M46qm31K61K89m60
$$ plain form
2179 -179 -197 259 106 -257 74 197 -220 -58 294 -38 -268 151 89 -252 23 247 -197 -156 287 6 -265
2200 -265 125 187 -240 -42 279 -111 -209 231 83 -286 23 219 -152 -89 265 -59 -254 195 180 -228 5
2221 5 247 -169 -156 267 27 -290 102 185 -236 -58 252 -68 -206 214 79 -253 63 202 -175 -90 218 -70
2243 -70 -230 197 174 -286 -34 246 -129 -162 241 23 -273 93 212 -181 -80 232 -92 -219 190 87 -244
2264 -244 67 213 -181 -139 258 -8 -216 174 145 -243 -33 290 -89 -179 189 55 -226 113 194 -213 -94
2285 -94 247 -51 -163 180 129 -244 58 245 -164 -137 238 12 -264 113 141 -212 -37 247 -103 -191 175 75
2307 75 -183 105 174 -210 -76 237 -23 -203 137 73 -247 22 226 -161 -152 211 23 -238 108 170 -174 -37
2329 -37 207 -76 -161 201 92 -217 41 152 -197 -68 255 -27 -222 153 136 -178 11 200 -133 -146 208
$$ packed form
2179a79j8M56j53l63L31J23m17J62L52l32k30M19o2l41K75K24m44M1M43k81k71
2200b65L90O2m27J98L21l90r8M40j48l69L09J96l71O3L54l24j95M49j5m08K33
2221EK42m16J3M23k40l17L92Q3m21J78L10l20j38M20j35l32L16J39l77Q5L08k88
2243g0j60M27k3m60K52K80l75l3M03k18k96L66J19l93J01L12l24j27M09j03l31
2264b44L11J46l94M2L97k66k08L90k9l88K10L23l79r0L68j34k81L39Q1m07J19
2285i4L41k98j12L43n1l73L02J87m09K7L75k26k76L77K8l53J75K84l50q8L66j00
2307G5k58K88O9l84J34L13k60j80L40o4l20K69K04l87RL63j88k61L46O2l44J37
2329c7K44k83q5L62j09l09K58J11l49J29L23k82j95L75j7l14J89J89l33j3L54
$$ plain form
2350 208 38 -213 109 171 -170 -53 204 -90 -155 196 88 -254 30 238 -128 -84 214 -33 -229 144 160
2371 160 -211 -24 202 -99 -146 199 36 -196 79 146 -182 -45 221 -59 -161 164 95 -235 52 232 -136
2392 -136 -139 200 -7 -183 123 156 -184 -42 175 -78 -118 156 -5 -212 99 174 -174 -86 194 -40 -212 163
2414 163 124 -198 23 199 -127 -148 206 45 -176 108 109 -185 -25 197 -75 -151 140 57 -205 104 197 -167
2436 -167 -100 209 -16 -185 125 140 -200 0 203 -110 -114 178 20 -209 86 130 -156 -9 202 -94 -173 153
2458 153 71 -177 63 161 -163 -91 214 24 -178 93 117 -159 -16 181 -92 -128 180 38 -194 91 154 -155
2480 -155 -50 192 -52 -144 166 103 -220 -5 174 -126 -69 177 -13 -169 90 108 -136 -5 153 -90 -135 170
2502 170 29 -206 67 168 -157 -72 206 -45 -160 143 103 -188 -5 194 -69 -91 150 -38 -190 119 148
$$ packed form
2350B08j70k51L22O2l41J17K57k94o5L51j08l42K84K08l66M4K98k47j96L73J6
2371A60l71J87K26l01m7L45j63k32K75O7l28J37K66k80j02L25o9l30K87J80l68
2392a36lL39k07j76L06L3l40J42K17k53m0K74j61k07L11P5l48Q8K80k34j72L75
2414A63l9l22K21J76l26k1L54j61k21K84Jk94J60K22k72p6K91q3k62L09R3l64
2436a67O7L09k25j69L10J5l40K00K03l13mK92j58k29K95M4k86J47K11k96p9L26
2458A53q2k48K40R8l24P2L05j90k02K71K4k76J43J97k73l6L08j42k32K85O3l09
2480a55J05K42k44r2L10o3l23K15J79l00N7K46j90j56K59J8k44J31J58k43m5L05
2502A70j41k35K73J01l25Q5K78k51j15L03m0k91J83J99k63k2K41j88j52L09K9
$$ plain form
2523 148 -172 -48 168 -97 -130 159 62 -185 68 161 -137 -61 189 -1 -180 108 78 -164 19 195 -96 -113
2545 -113 135 40 -138 97 147 -166 -29 191 -53 -139 119 63 -177 40 148 -100 -103 159 9 -141 110 94
2567 94 -143 22 175 -102 -135 160 56 -157 65 127 -148 -36 196 -21 -158 112 62 -146 27 165 -118
2588 -118 -89 161 17 -152 85 113 -155 -39 153 -52 -125 147 59 -178 49 156 -106 -36 157 -37 -156 97
2610 97 98 -114 22 151 -96 -91 165 28 -161 86 112 -139 -4 183 -81 -133 124 58 -168 33 137 -101 -50
2633 -50 139 -17 -143 117 95 -148 -18 139 -80 -81 162 9 -189 51 138 -142 -41 137 -40 -130 146 61
2655 61 -149 23 134 -84 -57 150 -15 -100 122 84 -142 -3 145 -75 -112 102 19 -166 61 151 -140 -53 118
2678 118 -10 -111 105 70 -156 6 154 -83 -75 130 0 -148 71 79 -109 4 170 -51 -119 127 51 -133
$$ packed form
2523A48l20J24K16k65l3K89r7k47K53R3k98P6K50j90j79K88l0k42J83J76k91j7
2545a13K48r5j78K35N0l13J37K20k44q6K58n6k40K17J08k48lK62j50j50K51j6
2567I4k37J65J53k77l3K95j04k13K22O2k75J12K32k17j37K70n0k08J73J38k83
2588a18K9K50j44j69K37K8k68J16J92k05p3K72q8k37K27J07k62P0J93j94j19K53
2610I7Jk12J36J29k47NK56j37j89K47K6k51J35J87k64n2K57o6k26K01J04k38N1
2633e0J89j56j26K60k2k43J30J57k19jK43j53j98K40Q7k80J01J78j77r0K76q5
2655F1k10J72J11k18K7K07j65q5K22l8k26J39J48k20l7K14q3j85K27R0k91Q7J71
2678A18j28j01K16l5k26J62J48k37QK05j30j48K19Qj88J13J66k21o8K46p6j84
$$ plain form
2700 -133 44 105 -133 -73 136 -22 -118 68 69 -121 6 140 -78 -86 150 15 -115 63 94 -135 -30 165 -54
2723 -54 -116 111 64 -128 12 102 -84 -58 152 -4 -116 40 64 -126 -18 124 -80 -80 119 19 -139 34 101
2746 101 -85 -20 117 -43 -115 93 45 -134 10 98 -84 -47 119 -36 -145 84 95 -110 -18 121 -71 -94 123
2769 123 53 -116 14 94 -85 -41 117 -24 -104 108 64 -103 7 113 -62 -46 104 -2 -122 76 121 -80
2791 -80 -26 106 -37 -74 92 20 -133 42 119 -67 -19 106 -18 -108 74 70 -132 3 108 -58 -79 107 17 -96
2815 -96 53 78 -108 -26 125 -13 -67 71 31 -109 33 112 -70 -60 84 -1 -92 87 75 -110 -28 110 -66 -85
2839 -85 102 17 -135 24 80 -86 -35 101 -24 -101 87 43 -109 19 111 -71 -60 107 24 -98 89 62 -85
2862 -85 -1 120 -53 -76 87 16 -78 14 94 -87 -29 106 -19 -97 89 43 -110 -17 96 -71 -58 114 13 -110
$$ packed form
2700a33J77O1k38O0K09j58r6J86Jj90J27J34k18qK36j35j30J78L1k29J05J95k19
2723e4o2K27m7j92J40R0j86K6K10j56j12J56K4j90J08J42k04%J99j00j58J73O7
2746A01j86O5J37j60p2K08m8j79J44Q8j82L7J66j55j09K29J1k05R2J39j92k3K17
2769A23p0j69J30Q0j79M4J58j41q0K12m4j67J10J06j75J6J50j06j20J98M5k01
2791h0N4J32j43l7J66p2j53J75P7j86M8J25j24r0J82mk02J35J05j66k1J86r0j13
2815i6J49K5j86Q2J51j38n4J38m0j40J42P9j82J0J44q5r1J79j2j85Q2J38j76j9
2839h5J87q5j52J59N6j66N1J36j25p7J88m4j52J28R2j82J1J67q3j22J87k7j47
2862h5Q4J21j73k3J63p1r4R2Q0j81N8J35j25p8J86m6j53R3J13j67J3J72j01j23
$$ plain form
2886 -110 40 76 -80 -17 93 -44 -82 96 27 -112 20 94 -69 -41 90 -30 -88 101 54 -95 -3 116 -24
2909 -24 -71 103 -6 -83 77 75 -68 -22 96 -21 -73 97 31 -111 -6 88 -69 -31 94 -21 -95 58 72 -63
2933 -63 7 121 -18 -76 92 26 -116 33 64 -84 -27 99 -19 -78 53 22 -79 27 91 -77 -66 106 8 -99
2957 -99 62 64 -75 -10 103 -16 -54 93 22 -84 51 92 -76 -42 98 -17 -94 36 49 -75 24 110 -44 -94
2981 -94 81 6 -97 19 77 -69 -15 97 -38 -86 74 30 -94 19 64 -79 -23 66 -14 -87 35 69 -84 -22
3005 -22 82 -53 -51 70 35 -75 38 55 -71 -21 94 -24 -81 87 11 -103 10 66 -65 -28 90 0 -92 52
3029 52 67 -91 -21 56 -28 -65 67 24 -106 35 53 -78 -36 79 -30 -60 78 55 -93 -10 78 -50 -59 89 -7
3054 -7 -87 56 49 -92 -20 100 -23 -40 74 8 -87 44 73 -73 -31 86 -23 -70 74 67 -76 36 82 -52 -43 66
$$ packed form
2886a10J50L6j56O3J10j37l8J78o9j39J32P4j63K8J31j20n8J89m7j49R2J19j40
2909b4m7J74j09p7J60kj43M6J18j17n2J70o6j42J05R4j57L8J25j15p4J53J4j35
2933f3P0J14j39n8J68o6j42J49L1j48N7J26j18n9J31l1j01J06O4j68J1J72r8j07
2957i9J61Kj39O5J13j19l8J47p1j06J35M1j68L4J40j15p7J30J3j24R9Q6j54n0
2981i4J75p5j03J16N8j46N4J12j35m8J60m4j24J13M5j43N6Q9q0p3J22L4j53O2
3005b2J04j35KJ21l5j10J13J7j26N0J15j18n7J68p6j14J13N6j31L7J18r0r2J44
3029E2J5j58P0P7q4l7J32m3j30J41J8j31M2J15j09l0J38k3j48Q3Q8j28rJ48r6
3054gq0J43pj41P2J20j23j7J14o6r5J31K9j46M2J17j09m7J44pj43J12M6j34RJ09
$$ plain form
3080 66 13 -59 27 51 -72 -24 91 -36 -93 56 35 -85 42 75 -55 -54 111 13 -66 46 40 -73 -7 76 -44 -48
3106 -48 81 11 -50 46 73 -79 -28 83 -44 -97 72 36 -65 11 44 -48 -49 76 9 -68 25 41 -55 -4 74 -54 -62
3133 -62 64 22 -62 49 66 -50 -5 75 -24 -77 59 40 -63 0 47 -47 -39 68 14 -78 65 53 -71 2 81 -47
3159 -47 -64 78 23 -89 39 45 -59 -18 82 -14 -58 74 45 -66 6 77 -33 -29 43 2 -73 36 66 -63 -48 78
3185 78 -28 -69 67 7 -87 18 53 -61 -46 70 -16 -75 53 37 -66 -3 74 -18 -49 64 22 -71 28 79 -73 -21
3211 -21 100 5 -59 58 31 -79 23 72 -47 -34 62 -13 -65 18 36 -64 -15 82 -51 -70 66 -9 -63 26 48 -58
3237 -58 -28 85 -21 -56 47 43 -60 11 70 -44 -42 73 -16 -65 31 34 -52 -14 88 -42 -39 73 16 -61 20 65 -53
3264 -53 -27 86 -20 -65 15 39 -68 -30 51 -38 -48 66 10 -55 13 37 -72 -16 84 -40 -72 16 16 -89 4 72 -62
$$ packed form
3080F6n3p2Q6K4j23M8J15j27n7J49k1j20J27L3j30JJ65r8p9J12oj13O6Q3j20m
3106d8J29p0o1R6K7j52N1J11j27n3J69l6j01P6L3r2jJ25o7p7R3J6r6N1P8j28q
3133f2J26m2q4J11J7j16M5Q0r9n3J36j9j03O3M7r4QJ07n4r2J43j2j24P3P9j28
3159d7j7J42n5j12J28Oj04M1J00r6m4J32k9j11P2P1j10MP2m1p5J09L0j29J5J26
3185G8j06m1J36o0r4J05L5j14J5J16q6n9J28j6j03O3P7r2l1J13m2r3R9N1j52N2
3211b1J21r5o4J17k7j10J02M9j19J3R6p5n2Q3J8j00M9R7j33j9J36p5n4Q9K2j06
3237e8L0J13j06l5J03mj03P1N9j14KJ15q9m9R6Lq6L8J02j30LJ12n7p7Q1M5j18
3264e3K6J13j06m5Q0K4j07L8Q1q9j0J14n6o5O8K4j09N6J00j24l2Q8%j05R3O8j34
$$ plain form
3291 -62 -35 50 -10 -70 53 45 -84 -2 61 -21 -44 83 15 -86 16 65 -44 -16 81 -9 -54 39 37 -56 3 78 -36 -30
3319 -30 86 -9 -53 42 37 -71 9 100 -30 -63 40 5 -82 38 57 -60 -29 49 -24 -65 64 41 -73 11 74 -33
3345 -33 -35 59 -12 -49 40 16 -70 -6 55 -15 -41 71 29 -54 34 66 -49 -12 71 0 -66 23 5 -64 30 61 -41 -41 67
3374 67 5 -74 18 28 -70 -20 76 -41 -65 47 25 -69 -1 41 -58 -37 68 -22 -49 20 49 -68 -11 66 -54 -65 59
3401 59 19 -50 15 51 -36 -24 62 -11 -47 45 28 -52 9 75 -49 -29 69 9 -83 23 57 -51 -18 60 -38 -23 63 20 -60
3430 -60 21 44 -32 -13 48 -14 -48 33 21 -51 4 38 -27 -10 44 -12 -62 28 34 -58 -44 64 -36 -45 37 19 -58 31 46 -56
3460 -56 -20 43 -6 -55 39 32 -65 -17 53 -35 -36 40 -11 -72 0 28 -67 -37 56 -20 -50 38 2 -53 26 81 -40 -24 46 -1 -50
3491 -50 30 29 -63 -14 65 -35 -47 38 12 -59 13 59 -55 -16 64 -8 -41 47 21 -62 6 36 -27 -52 61 4 -38 23 30 -56
$$ packed form
3291f2K7Q5o0o0J23qj29Q2O3q2k3J27o8j01J02M9j09K8R7r0m5R3kr3N9P5j14O
3319c0J16r5m4R5nj08Q0R1j30l3J03l5q7J20J9j17L1P8p3m1J29k3j14Q4O3j07
3345c3kR4p1l7Q9k4q6O4O1p0k6J12m2q3Q8L2j15L7Q3p1o6Q9j8o9R4L1j02%J08
3374F7o2p9R2J0r8N0R6j17k4J12k2r4O8M2r9K1J05r0k7O9K9j17N7P7j20j1J24
3401E9m0o9O5L6q7J2Q6p3l6R2j7q0O1O6j24K0R8o0r2J06L4j08L3P8r8J5Q6m3q0
3430f0Q1K3p6J9O1o2l4Q1j2p2N5L4o5J7N4n6n0R0Or2J4J08j00rQ2j8p7Q9J5j02
3460e6L6O3m9m9R4pr7M8P0q8jP6n1o1P2K8r5L0R3p6l0Q8l6n5P9N5j21J6P0m7m9
3491e0Q0jr2M9P9j00j2Q5k6p1P2M6j14L9Q0p2l3Q8k6q3O8L0o3k5J13n7m2O1Pq6
$$ plain form
3521 -56 -10 63 -48 -48 30 0 -59 -2 50 -55 -18 59 8 -60 22 34 -50 38 51 -28 -29 79 4 -53 7 37 -53 -11 40 -13
3551 -13 -43 37 32 -72 7 41 -44 2 90 -8 -71 26 21 -73 -10 48 -47 -47 42 9 -60 25 24 -34 -32 28 -25 -42 34 -10 -65 -6
3583 -6 51 -23 -30 42 -16 -27 14 11 -38 9 35 -21 -21 30 12 -51 32 32 -65 8 62 -2 -44 52 14 -40 10 41 -43 -25 34 -5 -45
3616 -45 10 19 -43 3 40 -18 -55 46 -13 -65 35 71 -29 -42 52 -7 -26 44 19 -55 4 43 -42 -18 49 14 -34 48 20
3645 20 -38 -8 58 -33 -45 38 13 -47 25 46 -44 -6 69 10 -60 36 -3 -46 -15 38 -30 -27 38 6 -56 14 39 -64 -4 47
3675 47 -51 -61 48 28 -48 1 61 -25 -45 24 -27 -35 58 39 -55 -3 53 -28 -8 40 -4 -58 9 53 -36 -6 51 -5 -44 57
3705 57 17 -67 -9 60 -34 -12 27 -9 -59 9 30 -53 -6 29 -26 -47 66 10 -32 11 38 -50 -48 42 -6 -25 40 -1 -40 8
3735 8 54 -9 -19 41 3 -57 17 24 -49 -22 44 -53 -36 33 8 -46 11 21 -22 -11 42 1 -33 26 -1 -20 2 44 -42 -29 37
$$ packed form
3521e6M6P3j11%P8l0n9N7N2j05L7P7n1o8Q2J2q4Q8J3p9jJ08p5n7O0L0r0M2N1n3
3551a3l0Q0nj04P9L4q5M6Q8r8o3R7nr4O3N8r5%Q9l3o9Q5jn8KO0n3j7P6m4n5N9
3583fN7p4pP2n8j1M1lm9M7K6n6%N1j8o3Q3%r7P3N4o4m2R6l8n4N0L1q4J8N9l9m0
3616d5N5Ro2M6L7n8l7J01n9n2J00L6j00j3R4n9j9P0k5p4N9L9q5K4O7l5m8Q2k8
3645B0n8L0O6r1j2Q3k5o0P2K1r0L8P5n9p0R6l9m3L1N3o8LO5l2o2P0K5j03O0N1
3675D7r8j0J09k0p6M9O0q6k0O9n1qR3j9r4N2N6q1K0M8m4n4O7M4q9L0N7n6l9J01
3705E7m0q4N8O9r4K2L9l6n0O8K1q3M7L5n5k1J13n6m2M3K7q8KR0m8j9O5m1l9M8
3735HM6o3j0O0l8o0P4Pp3K7O6r7J7O9k5n4N7J0m3J1N3m1l4N9k7j9K2M2q6J3O6
$$ plain form
3766 37 -15 -30 35 34 -45 11 68 -23 -53 43 5 -25 11 39 -17 -11 42 2 -31 39 15 -37 6 44 -48 -13 58 1 -51 35 31 -36
3798 -36 -12 43 -31 -59 42 9 -38 20 35 -41 -27 25 -24 -34 26 1 -48 -13 31 -23 -6 25 -6 -46 33 60 -35 9 64 -18
3828 -18 -23 31 7 -22 21 34 -29 -8 47 -28 -35 27 42 -34 -3 44 -23 -11 46 5 -33 8 33 -23 2 34 -10 -34 26 25 -45 -21
3860 -21 41 -33 -15 19 -9 -45 10 23 -17 -4 42 -16 -26 20 13 -42 32 32 -62 -25 34 -12 -9 44 2 -55 -4 29 -30 -10 29 3
3892 3 -32 33 34 -44 -2 43 -12 -37 55 5 -39 6 54 -35 -12 24 1 -19 18 4 -39 -5 29 -35 3 19 -9 -13 -2 29 -39 -10
3924 -10 21 -14 10 18 11 -31 -5 36 -22 -1 35 -9 -22 16 4 -38 12 31 -31 -13 35 21 -54 10 12 -42 -10 58 -7 -30 46 19
3956 19 -20 14 27 -17 -9 35 -24 -54 30 -7 -54 -15 29 -33 -14 33 13 -50 19 -3 -36 -17 7 -13 -38 39 -5 -56 13 26 -25
3987 -25 -15 36 -4 -35 49 9 -20 -13 39 -23 -25 27 11 -17 46 27 -34 -2 27 -13 -13 9 3 -25 29 25 -14 -6 27 -2 -24 36 30 -37
$$ packed form
3766C7n2j5O5jp9N6N7r1l0R6l8l0L6K8n6ON3m0l3P0k4n2M3L8r2L5P1n7n2Q6mo7
3798c6K4N5p4k8J01l3m7N8J5p6J4N2m9j0O0k5m9L5M4n4J7L1l1m0P9K7r5M4N5q2
3828a8nN4k4k9M3J3o3K1N5p5pO2J5p6L1M7o7J2N7m1l8M1K5n6K5L2m4k4O0jp0K4
3860b1O2p4J8L4k8l6N5J3m0J3M6n8j0M6pn5P4%r4L7N9m6LN3m2n7N1L3n9K0L9k6
3892Cl5O5Jp8M2M5n5k5R2n0m4M5M8q9K3L6k3k0L7j4m3L4L4o4L8J6k8mJ1L1o8K9
3924a0L1l5K4Qpm2K6M1n8K1L6m4j3L8j2m2N0J9o2J8M8j4p5O4Kn4L2O8o5k3P6k7
3956A9l9L4J3m4QM4n9l0Q4l7m7L9M4o2J9M7k0o3O9k2l3J9K4k0k5P7m4n1O9J3n1
3987b5J0N1m0l1Q4m0k9PN2o2kN2j6k8O3j9o1L2K9m0%K2ok8N4ml9QL3k9k2O0oo7
$$ plain form
4021 -37 2 27 -36 -39 27 11 -55 -8 28 -28 -37 41 -9 -21 12 -5 -29 -14 27 -25 -4 32 -7 -14 16 23 -23 -12 16 -30 -33 48 -14
4054 -14 -37 17 44 -19 -36 25 -27 -23 31 25 -44 4 21 -20 -37 48 13 -38 32 24 -31 -11 41 -41 -28 9 -1 -45 -1 9 -31 -1
4086 -1 37 -12 -53 25 22 -33 7 42 -11 -21 45 -9 -29 11 29 -24 18 24 -15 -65 30 -8 -39 14 9 -36 -26 25 -11 -29 19 24 -31
4119 -31 16 9 -22 -13 47 -7 -48 -14 21 -31 18 25 -7 -12 28 5 -19 55 29 -23 -14 47 -1 -61 27 31 -18 -4 40 -21 -14 22 -37 -23
4153 -23 22 33 -17 0 22 13 -18 41 13 -12 2 20 -25 -11 34 -8 7 14 30 -19 15 37 4 -19 29 23 -29 24 47 -21 35 53
4185 53 20 -17 28 6 -19 24 16 -23 -3 24 12 3 14 10 -24 35 30 -8 -30 21 -2 -16 21 4 -25 15 30 0 -28 19 1 -17
4217 -17 24 37 -26 -6 51 11 -14 7 11 -3 18 23 -4 9 24 -2 -26 29 -3 -6 -8 37 -11 1 20 -3 -10 11 24 -4 15 35 17
4250 17 -27 31 4 -7 6 15 -10 -14 25 31 -12 17 9 9 1 29 6 -15 10 17 -35 8 28 1 2 44 19 -23 23 21 -11 25 29 -3 -5 50
$$ packed form
4021c7L9K5o3lO6j6o6M7L6n6rP8n0j2L3j7k4J5M1n2K1L6l9pL0Pm6J1K8m6lQ1o2
4054a4k3N4K7o3j7O1n2MN4oo9M8J7m1j7Q5l5n1P0qn5K0N2q2J3L7j0m4M4J0m0L0
4086aL8m9m1P8ln5M0L5n3j0O6n4k0M0J8n3M2Ol9n0R5l8l1N3nm5J0N1l6j8M8Nn5
4119c1M7pl1RO0n4m1L4L5n2M9Pl2nM0k3k4P4k6n2RO1m8o0Q8Mm9J4M4o1PL6n9J4
4153b3M5J1n0J7K2rl1N9k8k5J4J8m5J4M5m2J5PJ6m9L4K2l3k3M8on2N3K3o8N6J8
4185E3l3l7M5k2k5M3ql9K0K7j2rJ1ml4N9nl8k2N1k3j4L7j7k9M0J5l0k8M7j8j8
4217a7M1J3o3K0N7m0k5K1Mj4K1Nk7J3J5k6k4N5l2lkM5m8J2J9k3pK1J3k8J9K0j8
4250A7m4N8k7j1J3Rk5mL9Om3K9q%qK8k3k1K5Pn2M3K0k7JM2k5m2M6kl2L6Ml2kN5
$$ plain form
4286 50 24 -18 33 20 -6 -19 15 -5 -10 12 36 -4 9 24 -4 -9 36 -19 -13 13 22 -23 18 25 -3 -13 22 16 -14 30 17 -25 -11
4319 -11 28 -2 -17 22 11 -4 10 22 -18 -1 42 17 -13 25 47 -20 22 41 6 -5 20 12 -19 -9 28 -5 16 33 2 -15 19
4350 19 9 -36 -11 5 -12 -25 5 6 -30 15 -1 -20 5 24 -19 -37 32 12 -13 14 6 -7 10 41 -2 -5 18 8 -22 20 48 -3
4382 -3 -8 9 18 -21 33 17 -26 -21 2 -17 -10 33 8 -19 8 2 -25 2 35 7 3 13 -1 2 8 16 -29 -12 29 -3 -41 15 23 -21 9 36
4418 36 -11 -3 23 10 -12 24 8 1 -2 22 -14 -2 11 23 -9 14 34 3 -34 8 0 -22 14 16 -13 -6 9 -2 -2 51 18 -16 10 21
4452 21 -6 -10 26 -15 -5 19 -1 -18 17 10 -5 -27 16 12 -25 -1 -2 -25 -9 48 -11 -15 41 13 1 18 23 9 -17 22 18 -9 28 25
4486 25 8 -5 29 -15 -6 11 17 6 11 29 -25 -20 4 -21 -12 30 -6 -25 15 20 -22 -12 34 18 0 28 14 13 24 35 -12 -13 19 7
4520 7 7 -6 37 -23 -5 10 10 -9 27 28 -22 20 19 -22 5 8 3 -12 17 4 -15 26 19 -10 -22 11 -4 -22 2 33 -7 -8 17 -3 -12
$$ packed form
4286E0k6m2N1j3k6j3L4k0nK2K4m0J3J5k8nM5n5OK6Rm5M1Pk8j0L5ol0M4j3m2J4
4319a1L9l0j5L9j1j5J4J2m0J7M3k5l0L8K2o7M2J9l5j1K5ql1J0L7l3K1J7l1j7L4
4350A9j0m5K5J6j7j3L0Jl6M5j6j9K5J9m3j8O9k0k5K7qj3J7L1m3lK3j0l0M2K8n1
4382cnJ7Rl9N4j6m3NK3j9PM3k5k7K7ok7K7L3k8mJ0j4LOQm5J7M1l2l8N6Qm4L0K7
4418C6m7QK6j3k2L6j6plK4l6J2J3J2l2K3K0l1l7M2qk2L6Kk9PJ5j1%N3l3l4K6J1
4452B1k7mL6m1J0K4k0j7L5pj5k2M3ml7K4jk3J6N7n9mN6k8j2J7Nj4k6L9mk7L7l
4486B5j7j3L4m4RJ7Oj1NJ8n4NK4k5RM2l6j9M0Nm2J0M6j6j8K8j4jJ1J1m7jL2j2
4520G%j3M3o0J8J5%j9L6Jn0M2jm1K7Lnj5K9j3j9M1pk9j2L3j5j8K4L1m0jK5k0r
$$ plain form
4555 -12 32 2 -38 10 14 0 -9 34 8 1 20 18 -33 -5 7 10 -11 19 21 -21 3 27 27 5 28 19 -12 25 -1 -3 1 21 -7 1 -3 -1 -8
4592 -8 11 13 2 2 16 5 3 20 17 -16 19 14 -21 -3 26 -11 -26 9 -7 -30 13 26 7 13 18 17 -16 12 -7 -8 -6 17 -4 -8 13 2
4628 2 -16 0 27 -13 -21 16 15 -4 19 22 -28 13 10 -17 -12 -7 -3 -15 18 -1 -16 -18 5 -5 -4 22 16 -20 4 19 -14 -11 34 16 -19 6
4664 6 9 -5 2 17 14 14 18 31 10 20 5 3 -1 17 3 -4 33 17 6 6 25 -23 2 4 14 -20 -8 2 -12 6 19 -5 -10 -2 3 -19 -25 -4
4702 -4 -2 -25 20 -4 -2 26 13 -20 -7 18 -14 -26 15 4 -20 4 41 -5 -18 4 -20 -3 6 9 -19 13 -7 -5 3 24 8 -14 0 1
4736 1 -39 0 -19 -24 -19 13 14 -8 2 22 -7 -8 32 -13 -10 9 -1 -31 27 3 10 0 4 11 2 17 32 0 -4 16 -4 -2 11 -23 -15 -5 9
4773 9 -14 12 5 4 2 -8 -11 -5 -1 9 4 -16 7 -9 0 16 20 -4 9 5 -24 -19 -2 -4 -17 -18 -6 -9 8 33 -7 -13 -14 5 1 -16 27 -15 -10 1
4813 1 14 -5 11 18 -3 7 26 4 -7 3 -2 -4 15 -2 -7 -5 23 11 -4 0 -5 -42 -11 14 14 -11 -7 3 -15 8 14 -20 -5 8 -3 -19
$$ packed form
4555a2M4l0m0M8Mj4rM3k6pJ9kn1K8J2Lk1L0Km2K4K4%k2K3rl1L7k6kMK0k8QmKp
4592hJ9Kj1%J4j1kJ7ll3L5nl5J8K9l7j5L5j6k3M3J3j9ONjl3K8j9jKK3k1mK1j1
4628Bj8J6K7m0qL7jj9K3Ln0M1lk7NNMj2L3j9j5kK3j0JK6ol6K4J5l3LM5j8l5K5
4664FLj4PJ5l%MJ3k1J0j5kmJ8j4pL7j6j1%J9m8K5KJ0l4J2J0j4J8J3k4nQNk2oK1
4702dKk3M5k4KK8j3l3J3K5l2j2M1j1k4K4L7m6j3K2k4J7RLk8L2k0KQK1j6k2J4J
4736Am0L9j9nNL2Jk2J0K0k9jM0m5LJ9j0l0N8k4Pj0MPrJ5J5l2mK0k0KJ3l4QJ0J4
4773Ik3K6pjkj0lOMJ0nk0K3j6RJ6Mk4J3mk9NJ7kj3jJ2lJ7K5m0ojJ9mj7M3m2NJ1
4813AJ3j9J6Pk1J0J9k2j1J0nkJ9j7nKK8j2j5Mnl7L1K5%k5MJ0j8K3Ol4J5J3j1j6
$$ plain form
4849 -19 23 -6 -17 8 11 -23 -13 2 -16 -11 27 13 -6 20 18 13 13 21 11 20 5 16 -11 14 10 3 -14 29 22 -10 38 -3 -13 1 23
4884 23 -19 -16 -8 -15 -25 -12 -1 -1 -9 5 9 -2 6 19 -3 10 24 -11 2 24 -8 1 14 17 11 -10 15 15 4 11 9 1 11 32 13 -3 29
4921 29 3 10 10 8 -6 -9 20 -6 10 15 6 -22 14 10 2 -2 15 9 -20 -24 8 -20 1 7 0 -23 -2 7 -5 -3 17 -21 19 8 -10 24 -9 9
4959 9 2 -11 -1 19 -15 8 8 4 7 7 -14 -8 -15 2 -2 13 23 -3 13 5 -14 -13 9 -1 -11 -11 0 -4 15 -8 1 6 14 2 -15 -11 18 -22 -6
4998 -6 2 -5 6 0 3 8 17 -5 -3 25 27 8 1 -4 -10 2 3 8 -27 6 7 -3 5 14 13 -24 -1 -6 9 -23 11 -15 -2 14 18 -15 -1 2 6 -19 9
5039 9 -9 2 5 4 -11 -7 18 -9 -9 10 24 21 2 19 6 2 9 -6 18 3 3 10 -2 21 -6 13 21 13 6 -3 20 5 4 13 -6 7 23 24 3
5078 3 -16 24 -6 20 13 -13 -6 17 8 -13 4 20 15 0 8 18 7 9 7 -12 5 22 13 -10 4 3 -2 1 14 22 18 34 3 4 8 28 0 -2 29
5117 29 16 0 2 21 13 26 29 -6 -9 9 11 -18 -12 4 0 -18 -1 3 -19 10 -1 -17 -3 10 1 22 19 5 20 23 11 6 13 19 4 -8 23
$$ packed form
4849a9M2k9j1K5Ll4J0J5j8NL8j4j9K6kn%Qj0Rj5J1k7K5mpj7M3pl2M8m1j0J4K2
4884B3m2LQpj0J3J1%qJ4Mj1QJ3k2J3J4l5J3K2l2RJ3Lok1K5%j1PkqJ0K1j9j6L2
4921B9k6P%kj4lK9k6J6Nrk8L6mqmJ7ok9mL2k8K1Opk3K1Rj2KK0l8M0j1j8L4l3J8
4959Ipj3J0K0l4K3%mL%k1OpJ7mJ5J0k6J6qj9JK2j0j0%J1mJ9k3RNQj2j7MK9m0J6
4998fQpJ1oLNRk2KK8Kj9pnoJ2JNl5L3Jj0QRjl7K3nJ5l2L4k6J3J6Ml3J4LMk5K8
5039Ij8J1Ljj5MK5k7%J9J4lj9J7j3mPj5K4j5%Pj2K3k7J9QqprK3j5jRj9J3J6Jk1
5078Cj9M0l0K6pk6PK3rk1J7J6nj5QJ0j1Kkj9J7J7rk3J4jnLJ3QmJ6l1JMK0k8kL1
5117B9j3j6KJ9qJ3Ll5lJ8Kk9OJ6mj8J7Mk2K9j1j6J4J3rK1lj4J5Lj2nPOj5j2L1
$$ plain form
5154 23 8 5 19 23 -2 10 12 10 6 24 2 15 17 15 -6 10 19 9 36 15 19 11 27 18 0 -1 10 -13 9 5 1 -1 6 -4 3 -14 15 -3 -32
5193 -32 -3 -11 0 4 22 -13 5 4 8 1 10 9 -3 -3 6 14 2 -8 -1 3 0 -7 20 -2 0 -4 -5 2 12 -19 -2 -1 -6 1 -8 1 24 -14 9 20 7 -9
5235 -9 6 -1 9 10 5 0 30 3 17 16 7 11 6 27 24 20 -19 30 1 16 12 12 13 9 -16 9 29 23 -16 16 1 -23 -12 -10 0 -2 -7 -24 -30 2
5275 2 -8 12 5 -14 -28 -5 -11 5 1 -7 -25 5 -9 5 9 -8 4 -7 -6 8 -14 -1 -4 6 8 -17 -7 20 8 -5 27 3 22 -1 10
5310 10 15 2 12 1 10 8 -5 12 -30 -21 -15 13 12 -14 -6 3 21 -2 -14 -6 -19 0 -19 -25 -3 -21 -4 -5 -6 -26 -6 -8 15 -10 1 -6 13
5347 13 5 -17 -3 5 2 -15 -19 -1 3 -20 -7 -10 -7 1 1 -20 -8 -27 4 13 -4 -13 -22 -4 -5 3 -9 -20 6 -13 -5 -5 -6 12 -5 1 -17 -32 -5
5386 -5 2 -1 19 8 6 1 3 10 0 -5 -8 -16 -18 -1 5 -1 -6 -6 -4 -7 -3 -22 -22 -3 -15 2 8 5 -4 29 0 -26 -23 -5 -38 -25 -5 3 4 4 0 -24 -13 -7
5430 -7 -13 -20 1 11 0 -8 -9 4 -7 -3 15 -2 3 -5 -2 9 1 14 -7 5 42 5 2 -8 9 -1 -16 -31 -40 -11 -2 -35 -19 -15 -19 -23 -29 -14 -6
$$ packed form
5154B3j5lJ4Mk5J2KkmJ8k2J3Kkk1J6Rj0K7k1MqJ6rj8jJ1k3K2mmkPj0Pj7K9j8k9
5193c2K9qJ1MJ8l5J8jMpRjj2%RQj2j0PMlpK7k2KmjPJ0l1J7JnPrRK3l8K3J1j3j6
5235iJ5pJ0JnnL0k7J4jrMnK1lml9M9k9J5m%Jmk5K5K0ol9L2j5k4J1KJ0knj7oL2
5275Bj0K0pj9j4K3oJ6mqj8L0j4J4Mj7J2j1JJ4k2J3lJ0Kk5J0K7j2j3L2k4J9k3J1
5310A0Nj3J0j1Rkj3J7m2ROK8jk6QRJ8k3j2Qj3J9j9oK2j8J7jjk0K0kK3k5J1pJ9
5347A3qk2J4Qlj7mJ8Mk3J3lLQ%k1J2j9L1Rj7rrJ8jQj2j1K6j9Q%jJ8j7Oj8j5K7
5386ePlK0j1knKPj0nlqkJ7Oon%KlMj9%J9j2J7OlrL3k9k6LJ8l3J3K0QJ%mk4J1O
5430gopK1J0j1qjJ3j1MJ8j7NqLJ1qJ3k1J2L7l7lj0J7j0j5j5rK9Rl3J6MmmoJ5Q
$$ plain form
5469 -6 -22 2 -5 18 3 -2 12 3 1 -19 8 12 -23 -8 4 -14 0 22 6 -9 -8 18 -20 -8 11 28 -7 -6 -3 -1 10 5 17 -5 6 12
5505 12 17 -21 17 15 6 -11 -8 -4 -8 3 -8 -10 12 -14 -4 -16 -18 -3 5 20 -8 -27 -17 5 -15 -2 -1 4 5 -1 -3 -16 9 -9 -5 -14 -16 -24 -12
5544 -12 15 -14 13 6 8 -17 -9 -3 1 16 22 -15 -3 10 18 2 26 21 0 24 -5 2 2 0 13 3 -26 -2 -8 -9 9 -6 -3 -20 -9 23 15 -5
5582 -5 12 -11 -1 14 16 -38 8 15 14 26 3 -10 0 10 -8 -21 22 2 0 -4 12 1 -15 0 -7 8 13 14 -22 -1 1 -9 9 -9 -23
5617 -23 -10 10 0 -10 11 7 -12 -13 15 -13 4 -7 20 7 -4 -7 -15 -14 3 19 7 0 1 -10 14 12 20 22 2 12 -16 13 27 -7 8
5652 8 18 24 6 -5 17 6 5 20 22 2 16 3 8 9 -8 -1 15 10 6 -7 5 22 8 -7 -2 0 -5 3 -10 1 11 6 -20 -29 16 0 1 -2 8
5691 8 -6 9 -4 6 -1 9 -5 -2 10 -8 8 -9 6 23 3 -12 15 4 4 7 8 5 1 -4 -12 2 -16 -14 7 15 -9 -11 27 -22 -3 6 27
5728 27 13 5 5 -6 4 -11 29 7 4 6 -10 6 30 3 -7 6 22 12 12 9 -15 -6 17 14 -10 1 2 1 -6 1 4 3 -6 -4 -20 11 24 14
$$ packed form
5469fj6K4pK3j5nJ4rkk0K7Ml5J5J2j8J4K2j6j5JK6l8J2J9J7l5JLKJ1nJ2k2J1O
5505A2Nl8L8krj7LMmJ1j1kK2k6J0j2kJ5QJ5k8j9J0K2k0J3JNJokj3K5j8MrkqJ2
5544a2K7k9K7pKk5QOMJ5Ol7J2J3Qj6K4nk1K4k9P%kJ3j0k9K4ojJ8j5Lj7J1L2qk0
5582eJ7k3J0J5Kn4M6PjJ2k3j3J0J0j8j3M3k0kmJ6j1j6J5pJ5NJl6K1Kj0J8j8j4
5617b3J3K0j0j0K1mj9jK8k8J7j1K7j3j1lqJJ7J6j2pJj1K4kQKk0J0k8K9J4l4J5
5652HJ0Oj8j1K2j1jJ5Kk0J4j3NJj7PJ6nmj3J2J7j4j5NKnQj3J1J0nk6rM5j6JlJ0
5691Hj4J5j3J0pJ0j4LJ2j8J6j7J5J7k0j5K7j1%LJlmnqJ4j8KK1Qk4kL8m9J9RK1
5728B7j4q%j1J0j5M0k2lKj6J6K4k7j0J3J6j0%lk4RK3lk4J1JjpPLjrKj6L1J3j0
$$ plain form
5766 14 -13 -20 15 -3 -2 0 6 19 17 1 4 19 3 14 17 -11 12 1 28 8 7 6 19 -9 5 2 9 -4 5 6 -12 0 14 -6 -17 15 18
5803 18 4 13 -6 -25 -12 -14 -3 -2 8 -3 -47 -4 11 -8 2 6 -5 -9 12 3 9 0 2 -9 4 18 3 27 1 17 0 16 19 -1 2 26
5839 26 30 -12 32 22 -3 5 20 -2 3 25 10 7 1 4 -7 12 1 -18 -18 -8 -5 -9 -4 14 19 -7 9 2 -31 -22 -5 -1 5 -3 9 -2 7 -11 15
5878 15 31 -1 -9 2 7 13 10 27 17 8 7 9 9 14 11 14 20 3 10 1 0 6 6 16 21 3 13 27 27 20 12 43 3 -7 18 14 -11 7 -5 -6 -6 21
5920 21 4 10 6 11 3 17 -10 7 20 11 9 -18 21 -7 17 -7 12 7 15 18 0 1 34 16 7 -18 -11 21 -21 19 -8 2 -11 0 -9 -14 -7 -15
5958 -15 -21 -28 -3 5 -9 1 -2 -21 -9 0 -41 -1 -6 -2 -18 8 11 -25 4 10 -14 4 14 -18 11 5 17 -14 14 25 -2 13 10 16 6 -6
5994 -6 12 10 -3 9 -28 -6 16 -3 6 1 4 -4 -7 12 3 12 3 3 2 0 -1 6 15 7 -2 9 8 -4 -22 -26 -8 10 -23 27 2 10 15 14 5 11 31 8 8
6037 8 13 22 -16 13 13 2 4 8 16 1 3 0 -10 17 5 -8 -11 19 8 -24 10 12 0 -6 -17 -1 -18 8 2 -9 -12 2 -6 25 28 23 -9 -11 9
$$ packed form
5766A4k7pL5j8JKOJ3kj6LJ5j6J1Lk8K3j1K7k0jjJ3k8J4lPj3RJj8J2J4k0j1L2L
5803A8j4Rj9j9J3kJ1JJ0j1m4M3J5j9J0Mj1mK1rOrKj1J3J4j5K4k6J6j7J6Lk0LK4
5839B6Mm2M4j0k5QJ5k2NK2j5loLj1J9j1j9%J0LmNJ8Nk6J6pl3RJ7MOqJ2j1Rj8K6
5878A5J6l2qJ1NOlJ7j0rjK%NlLOj7PrjO%J0Nj8J0J4%pqL1m0j0K5mk5J8j2j%K7
5920B1j7OmNqJ4k7J7J3rkk7L9k8K4k4J9nQLj8JL3j8rk5PL2m2M0k7J0j3J1rnPq
5958a5opK5Qj4J0lj9J2Rm1M0nMj6K6Ll6K9Ok4J8J0l2K9oJ2l1K8J1k7J5lOj0j2
5994fJ8kj3J2l7K2K2j9RnLqlJ9rRr%jkjPRqrJ1jj2j8mJ8J8l3N0k5QNjrOK0k3%
6037HNRl8K9%j1KMQj5Klj0K7j2j3lL0j1l2L4Kj2oj1J6j7K6oj1lJ4qL1Lnl2kK0
$$ plain form
6076 9 0 1 15 6 17 28 8 -3 -4 9 2 5 27 -6 8 32 -18 -9 -15 10 -23 -13 7 3 -42 -6 -12 -12 -13 -7 -19 -4 8 1 -30 -18 7 -8
6114 -8 -6 12 -2 -25 6 -8 -3 5 15 -9 -9 17 6 0 16 13 0 18 11 12 3 -6 8 -1 7 4 28 -10 12 -3 11 1 -27 -12 2 0 -17 14
6152 14 20 -6 9 19 -9 1 10 -6 0 13 8 16 29 -2 -3 22 11 18 23 1 26 16 19 27 27 -13 17 19 -14 -7 28 28 10 19 8 20 2 -1
6190 -1 8 -9 4 -7 -1 12 8 -15 -12 15 -8 -21 -1 7 6 11 3 14 -11 9 12 -7 13 22 -3 17 23 22 6 19 11 19 11 3 12 25 12 13 -9 9
6230 9 21 17 13 10 -6 -8 16 26 7 10 13 3 21 14 11 -14 15 12 9 8 18 3 25 22 17 -16 -4 -1 8 -2 3 33 12 8 -20 2 1 11 10 -2
6270 -2 22 28 18 23 29 25 26 26 18 18 27 4 -5 16 29 0 -6 4 14 17 6 8 -2 -10 -5 -3 -12 13 5 3 6 19 18 9 23 7 -11 25 7 -4 -6 12
6312 12 22 11 2 9 27 21 5 0 7 28 9 6 7 17 12 3 2 -12 19 43 -3 4 21 12 -2 14 9 6 -7 4 8 2 5 4 -9 -17 -7 -11 -22 -1
6352 -1 14 -14 -3 9 -5 1 15 -5 -2 -5 24 10 17 16 29 -1 -2 6 0 -9 27 -9 31 1 1 30 6 40 35 11 33 1 3 35 9 -2 23
$$ packed form
6076IrJJ4rJ1J1k0j1jJ3pLK2l3J4K4n0RoK5l3J0K0mm5L6o%jOj2J5J2pl1J2K5j5
6114hKJ8j4k3L1j4NQJ0k4%K6j1oJ6lj3J8pJrrJ4rQlK4l8K2j5J4j0k8J5J4kj7L1
6152A4Ok6J5J0k8J0Rj6OJ3nQJ3l1jK5j1PNk2K5j0LQ%m0L0Kl3PL5%j8Rj1J2j8l
6190aRj7J3j1OJ3mk3LK7k3j3K0QjNqJ1k5K0Lj9K0Rk5K0Ojj6J3qQqqRJ3j3Jk2J8
6230IJ2mmlj6kK4J0j9LLj0J8plk5K9lljJ0j5K2lnl3J2LRj0NL0k1mk8K2jJ0jj2
6270bK4Oj0NOmJ%q%Rk3rK1J3k9oJ0J0Lj1Kj0qNKrK5qkLJ3jrJ4j6j8L6j8j1kJ8
6312A2J0j1rPJ8oj6nPK1j9lJJ0nrjj4L1K4m6PJ7rj4J6nlj3J1MoLjj3qJ0mj1K1
6352aJ5k8J1J2j4OJ4k0LlK9j4PjJ3l0jQorL6l6M0l0%K9k4L4nk4K2l2KL2k6j1K5
$$ plain form
6389 23 9 0 17 10 -25 -10 24 0 0 4 5 -9 11 3 7 24 22 -3 -14 13 6 7 19 36 15 -6 20 -3 21 30 30 16 10 36 15 -16 1
6426 1 28 9 -17 2 1 10 10 26 11 22 2 14 11 21 2 18 18 12 7 12 19 -26 -4 -2 25 15 -7 8 -5 10 -3 -4 4 12 -4 -8 6 9
6464 9 -10 -5 22 22 9 26 18 -13 12 21 20 9 18 28 -11 3 37 14 10 32 10 -11 0 2 5 -17 -2 -9 -15 3 -3 -9 27 -19 -24 23 3 32
6502 32 -20 11 9 10 3 10 22 -3 24 9 8 -11 -1 9 -11 21 8 11 19 30 5 14 1 31 18 18 3 11 24 9 23 -8 22 -18 -4
6537 -4 -5 9 -16 -3 -6 32 -8 21 -20 -14 14 9 8 29 26 -20 10 41 19 18 28 21 6 -7 30 2 24 23 21 -4 39 21 16 22 18 10 -8 24
6575 24 26 2 5 33 28 -7 10 15 8 10 13 8 8 14 11 -8 5 7 -6 -2 1 3 -26 34 10 23 11 -20 -1 13 23 16 20 -3 18 22 22 31 2 17
6615 17 26 0 12 42 18 31 20 13 25 21 12 -11 5 12 10 1 -7 16 12 -8 14 8 9 9 22 25 1 17 -2 15 20 17 6 -1 12 24 16 11 26
6654 26 17 23 8 -9 29 36 23 19 31 1 13 32 16 17 18 26 -20 10 32 -2 -7 24 2 1 8 9 -22 -31 6 4 -14 -6 -10 -14 6 6 -5 -11 -5 9
$$ packed form
6389B3j4rJ7pl5J5L4k4%MJj4K0qMJ7kk5j1K7pJJ2J7k1k1K6k3K4R%j4oK6k1l1J7
6426AK7j9k6J9jR%J6j5J1k0J2lJ0j9J6%onNPm5K2KK7j0k2J5j3J5j3jQQj6mJ4L
6464Ij9NK7%j3J7ql1K5Rjj1RJ0l9J4L4k3mK2k2k1J1KLk2J5poJ8ooL6m6nM7k0K9
6502C2n2L1kJpPJ2k5K7j5jj9J0J0k0L2j3LQJ1k5Rj3L0j3%j5QJ3j5J4l1L0m0J4
6537djJ4k5J3lL8m0K9m1OK8njK1lm6L0L1k2jJ0pj5j3L7k8K2jkk5M3j8nOmqj8L2
6575B4Kk4LK8nl5J7NpKLn%Olj9J3Kj3MLKk9O0k4J3j2l1J9J4J0pMk3K1M%Rk9J5
6615A7Rk6J2L0k4J3j1pJ2mrk3J6PkrqK3mk0K2oJ%J3Lk4J6j9J7Nlj1pJ3J2qnJ5
6654B6rOj5j7L8Pj3mJ2l0J2J9j6JJQm6L0K2l4nL1k2jPJl1rL7kj8QmmK0%j1oOJ4
$$ plain form
6694 9 15 -7 6 -26 -10 -22 -2 -8 8 -7 14 -11 14 26 -2 3 3 -14 3 6 12 -10 -7 -15 -8 3 30 18 -14 -3 2 -1 18 4 -7 3
6730 3 -4 21 -37 21 -10 -1 7 4 -26 -6 26 -17 -9 0 -10 -15 1 -1 -8 9 17 -9 -4 -9 -12 9 13 1 -11 0 0 1 9 -1 8 10 15 25 0 1 30
6771 30 0 8 -3 10 1 -39 -4 12 -3 7 14 -15 -1 4 -25 -3 12 -14 -6 -1 -13 -6 14 2 -2 -1 -11 -22 2 2 19 1 8 -2 19 10
6807 10 8 5 22 32 11 10 -4 25 10 10 12 7 13 17 5 -15 -3 9 18 5 1 9 -6 -10 -1 15 4 -1 5 -15 14 -15 -4 14 23 17 1 7 23
6846 23 -20 1 22 17 0 11 29 0 39 18 10 20 22 38 3 25 18 4 -5 23 29 15 28 9 6 17 11 -20 9 3 11 9 6 18 4 16
6882 16 0 -2 -3 1 15 20 10 9 8 -4 9 -3 1 -9 -9 7 3 -6 -11 -1 6 -20 33 9 18 12 5 12 22 18 6 26 0 32 5 8 1 4 26 -4
6922 -4 5 0 -16 24 -14 -32 6 -2 -3 -18 19 0 -19 -2 -14 -8 -12 29 12 7 -15 -7 -1 -10 9 -1 -23 -10 13 7 27 -8 12 -8 22 2
6958 2 -12 -7 -8 6 -16 -10 23 3 34 14 0 5 14 -9 14 12 -23 15 4 -9 -4 -1 -4 -15 4 -16 -6 -14 14 -6 -15 -22 -4 -19 15 7 -9
$$ packed form
6694IOk2J3l2J6j2K0oJ6j5K1k5K5J2k8N%j7J7LOk2LqPJ1K7j2l2J1NlJ9j4j1J0
6730CpK5n8N8l1RQll0K0L2m3QRj0nJ6kpJ7Qk6NnlK1Mj2j2J1%JQj0RKNJ0k5JK9
6771C0l0Qj1J3rm0L5J6j5J0Pk9J4Nk9K2J5k6QNj2PK0j2mJj0j1K4%J7j8Pj0K1r
6807A0klJ7J0k1jj4K9j5%KnOMj2k0J2J2Rj3mQj5mRJ6j1nOk0K9k9J1J8Roj6OJ6
6846B3m3K1K1nj7J1J8k9L9k1qJ0KJ6l5K2pj4rK8Oj4J3j9lJ1ol1K9oQklJ2j4J2
6882A6j6kjMJ4Nj0jjj2J3j2Mj0%J6mrnJ0Pk6N3k4RopPJ0mj2K0k6L2k7LpLK2l0
6922dRnj6M0l8j8L8qjj5L7j9j9J7j2OmM1j7nk2QOrJ9j0k2J3K3oK0l5K0k0L0k0
6958Bj4NjJ4k2OL3k0L1k0j4NRk3K3kl5L8j1j3NLlj1J9k0J0qK8k0rpJ8j5L4qj6
$$ plain form
6995 -9 -6 -16 17 7 23 10 0 20 10 9 19 7 3 -8 -5 -5 -6 -38 -22 -7 -6 -4 15 -3 -5 23 -17 -15 25 0 16 -17 -9 -22 -23 -15 -12 -22
7033 -22 -29 0 9 -24 -3 -6 -25 12 -22 -29 20 27 -5 5 -8 10 -1 32 8 1 24 12 15 6 7 22 16 9 8 -5 7 -3 2 4 2 6 -5 0 22
7072 22 -15 -9 24 7 -7 18 -1 -19 -20 -4 -11 0 3 10 6 -23 23 -5 -12 -6 -14 -1 -5 12 18 13 20 -10 -7 9 24 -27 -3 -8 13 18 28 11
7110 11 16 18 11 -4 5 11 -17 -2 15 0 -2 -13 -9 -7 16 -9 1 -2 18 -16 -5 -1 -11 -1 -7 0 -4 9 -16 4 0 15 18 6 -6 5 26 17
7148 17 26 12 7 13 0 14 16 26 19 32 8 23 5 9 13 12 -14 16 14 4 9 19 -20 0 8 -1 -3 -6 -15 -31 -20 17 12 -6 -17 2 -9 20
7186 20 -17 -4 13 13 -6 -17 1 13 18 13 25 -8 -7 21 3 -10 17 24 5 -5 3 10 -22 17 8 16 -6 29 -13 11 28 4 7 17 36
7221 36 -8 -11 -4 2 4 -13 -7 9 -18 -15 -4 -15 6 -5 -6 5 5 -12 0 7 12 2 9 14 -11 43 34 12 2 2 13 12 24 14 9 22 12 2
7259 2 8 26 -11 12 15 11 -3 7 17 1 3 18 9 5 20 -6 -17 3 -8 -7 -28 4 -6 17 -7 -15 -20 -9 1 -2 -3 3 16 6 16 6 0
$$ packed form
6995iLj0L3j0J6j3j0K0j0jJ0j2mj1L%jl2J6J5JKJ9j8kK8m0KM0k5J6l3Qj3jQLj0
7033b2pK9Rl3K1lj9L7l4pM9Pl2J0j3J8j1L3k4pK3j2LrJJ5opjj3J2j0NKkMj1NK2
7072B2l7OL3j7j4K5j9j8jJ6pJ1LPmk9M6k8pOqJ3mJ7OnPl0LJ6J5n1K4nK1NJ0j7
7110A1NKpj5ROk8J5J7j5kj1MKK3k5J0lK0l4J1Mj0J0oPmJ3k5K0mJ5Lj2j2J1K1r
7148A7Rj4nOj3J4KJ0pJ3k4J5j8MMjk6L0kj0NJ0l9K0Qrklrj6J1L7nj8j1J9j1K9
7186B0l7J3J7%j9j1J8J2NnJ2l3JK8j8j3K7Pj9j0QPl2L9rQk2L5m2K4J7k4LJ0J9
7221C6m4lPOKj7OJ6k7LJ1j1K1j1jJ1%j7J2PNj0PNk5N4rk2j0%J1jJ2j0nJ3j0j0
7259BOJ8l7K3Lmj4J0J0j6KJ5rmJ5k6j1K0j1Jk1L2j0K3k4qnJ1J0ljOJ3j0J0j0o
$$ plain form
7296 0 -5 27 20 -18 26 -12 9 25 3 16 1 24 30 25 10 -1 15 -4 -1 -15 23 29 0 2 1 16 0 4 10 -4 18 9 14 14 12 -1 2 17
7334 17 4 2 4 42 5 18 20 18 13 13 19 37 13 12 28 24 4 23 27 5 24 23 -6 19 23 4 9 -14 4 25 -11 -1 -4 11 13 10 16 6 2
7373 2 3 -4 33 10 10 16 -9 13 1 6 3 16 14 17 -12 16 3 19 20 21 -13 18 14 17 -4 -6 26 28 31 34 25 23 7 9 -1 8 7 -4 22 18 21 -11
7415 -11 -2 -3 4 2 0 18 6 3 -12 0 8 7 14 3 23 13 19 9 10 -5 9 16 5 3 16 18 14 34 22 13 21 29 6 -15 -3 11 -8 16 12 16
7455 16 -8 -10 -6 27 30 16 -6 2 3 3 8 -3 25 -6 -1 -4 -1 9 -5 -2 17 11 16 -6 -13 13 14 0 0 11 -1 1 14 2 6 8 -3 12 -6 3
7495 3 6 26 -16 -3 6 -6 11 4 6 10 -25 -1 9 11 9 24 -9 -2 7 21 -16 14 5 -5 -3 -10 7 -6 -1 11 7 -13 7 -7 -15 4 7 6 -8
7534 -8 -13 -19 3 3 -5 3 30 22 16 36 -1 22 7 14 2 23 -3 -2 -12 3 1 -16 7 1 -6 -2 -17 2 -11 -10 -19 -8 -17 7 3 -7 -17 -13 -8 7
7574 7 7 21 3 17 17 3 -11 5 8 4 3 4 23 28 0 9 12 18 2 0 23 8 11 14 26 13 9 10 -4 24 2 -14 11 8 1 7 -10 -1 -7 0 10
$$ packed form
7296@nL2pl8M4l8K1J6k2J3j5K3Onj5j1J6j9Lj4L8Ok9KjJ5j6MOj4K2rN%kj3LJ5
7334A7j3kKL8l7J3Kkn%OJ8k4jJ6mk0J9Mk2J9jk9K5Mj9Nk3J8K1l6J0lJ5KlOj0m
7373BJpL7k3%Ok5K2j2NlJ3kLk9K8j3J6JJl4L1mLk1kL2KLLrkj6Kj0Rjj1K6mLl2
7415a1RjPkkJ8j2lj5J2QjPj1K0j0Oj0Jj5J4Pj1kJ3KmK0j2rQQk3k1J2J4j9K4mM
7455A6k4kML3Lj4k2QJ%Nj1K8l1NlLJ0j4LJ9oNk2pK6Jj4%J1j2KJ3j2MKj1J5j8R
7495CLK0m2J3Rj2J7pKMl5K4J0KkJ5l3PRJ4l7L0rj0KpJ7j3NJ2mk0K0j4qJ9Ljj4
7534hnoK2%qQK7qoK0l7K3j5Pj2K1k6Jj0J5kj7K3opMj5J9j3JrJ1rK4mj0j0MNJ5
7574G%J4j8J4%j4j4J6LmjJJ9Nk8RLOj6kK3j5LLJ2j3mJj4K8k2j6K5lpOj7RoPJ0
$$ plain form
7615 10 13 12 18 25 -16 13 17 -8 24 10 7 -6 5 9 15 11 23 42 14 19 17 29 3 27 -3 -16 2 13 -2 14 31 4 7 26 23 4 6
7652 6 24 27 11 -4 1 3 -6 16 3 18 8 -3 -9 4 13 8 -25 9 -16 -14 18 1 23 23 13 4 19 13 28 10 15 38 26 6 8 6 -3 17
7690 17 11 30 28 8 15 15 22 -16 -30 -1 2 -2 6 0 -12 4 5 11 0 -14 10 -6 -3 -15 -5 -2 -5 2 -24 9 10 21 6 8 11 -25 23 10 -4
7729 -4 42 20 22 3 9 -18 -3 14 -5 -15 8 22 4 25 22 5 7 14 8 -5 -11 14 10 4 6 6 -3 2 -4 -11 8 -6 0 -15 -13 -2 12 -12 -23
7768 -23 8 4 22 -9 -5 -4 14 7 -5 0 18 9 30 6 29 28 5 12 18 -13 16 1 21 11 1 18 24 -3 -11 4 8 3 -1 19 13 -21 15 10
7806 10 4 -9 4 -26 -12 11 4 8 -4 -14 -14 6 4 8 15 20 7 -1 -10 19 24 25 13 -4 9 3 12 13 11 14 24 14 1 -1 11 -17 11 11 -9 15
7846 15 -1 5 19 4 2 6 -5 12 -3 3 13 23 10 29 4 0 12 27 14 11 7 -14 3 -9 -5 7 8 18 10 1 0 3 12 11 11 11 19 16 15 9 5
7887 5 15 -1 13 30 10 6 19 1 17 17 5 21 25 17 6 1 -12 10 19 -7 -16 34 8 18 17 14 -15 7 11 -13 -12 6 -9 -12 -27 6 -2
$$ packed form
7615A0LjOPm1K9Mk5L2j4lj3J1MOmJ2J9k8NkJ2k6K4l0j3J8J1j5J6J7k7LJ9lj9K
7652FJ8Lj6j5NKrK2j3J5j0j1oJ3Rnl3L4k5KL2j7K2%j0rJ5oJ5j8NK3j2k0KkrK0
7690A7oJ9kk0P%Pl8j4K9LmQoj2J6JOj1j4K4j6Lj2J0LlPk6L3JJ1j5KLl6M8j3j4
7729dM6k2Kj9Ok7J5J7j9j0K3J4j8K1lj7KPoj3oK5moK%rNopJ9j4Oj5KJ1J4k4j1
7768b3L1mJ8l1MJJ8pj2NJ8rK1k4K3jk3POl1K9j5K0j0j0J7Ok7qJ5MnmK0ol4L6n
7806A0oj3J3l0J4K3pMj2j0%K0kMPNj3qrK9NJj2j7J3oRJkLJ0j0j3kJ2k8K8%k0K4
7846A5j6OJ4j5kMj1J7j5OJ0J0j3J9k5mJ2J5j3lmk1J7j2MJ2JJ0qrjLRj%%Qljom
7887EJ0j6J4J7k0mJ3j8J6%j2J6Mqj1nj3K2Rk6rN0k6J0jlk9K2Mk4JJ8j5lj5L3q
$$ plain form
7924 -2 9 14 22 15 15 8 -2 -4 23 8 11 30 18 0 4 8 -20 14 2 8 2 -22 2 -8 -26 -6 -9 -15 -25 22 17 4 -15 5 -11 10 4 15
7962 15 22 7 4 1 6 0 -14 10 22 7 27 20 5 20 7 4 5 24 26 2 5 24 20 8 10 47 11 15 18 14 1 28 23 10 13 2 10 -7 7
8001 7 11 -9 -7 -9 21 11 5 12 2 1 -1 5 11 -3 2 -1 17 14 9 -3 1 17 6 21 28 6 -2 19 26 -6 0 6 17 -7 10 10 17 21 17 28 18 3
8043 3 -1 4 7 -14 13 11 10 -3 11 5 -18 -16 0 7 -5 10 -6 30 10 4 -4 -4 12 6 14 2 8 -6 -6 16 12 22 5 11 30 14 7 -6 -15 18
8083 18 -4 13 11 -9 19 23 11 -4 22 19 8 7 -2 12 0 19 23 26 -2 6 8 0 5 2 28 -10 29 9 -2 10 4 -18 1 -5 -15 23 18 4
8121 4 8 -4 1 13 9 17 8 29 12 24 28 21 -2 -2 16 -3 2 14 24 -4 10 21 -5 20 8 13 5 11 -1 -4 -28 2 16 22 4 19 19 9
8159 9 26 13 -4 8 6 10 2 -3 27 14 25 14 17 0 35 21 4 1 10 20 2 8 6 20 14 -14 -5 -1 9 -9 13 17
$$ packed form
7924bJ1NQp%pj0kK7j5LJ9j2j8MMk8L4j2Ook4K4j0j8K0loj0M7nj3j9K0j6K1oJ1
7962A5Pj5llNoj4K4J2j5K0pj5J5j3lJJ9Kk4LJ9mj2KL7l6MLmj3K7nj3Lj1Qj7J4
8001GMk0KkL0j0oPj0jkOOj4NlJ8lnj2MJ6j1J5Pk2qK1Pl2OOJ1k4J7%PMmJ1j0j5
8043CmNLk1K7kjj3J4ok3KJ6Pj2J5j6L6k0oq%J6oQj2Oj4%K2mJ0j7OJ9j6pj3rL3
8083A8k2J7kk0K8Mj2j5K6lj1jrJ4j2J9MLk8QKqNlK6l8L9k0j1J2ok2J9oj0L8nj4
8121DMj2NJ2mQrK1j7J2Mpk3%J8j9NJ2J0k8J4J1k6K5j2NqOj2lk4L0J4Oj8J5%j0
8159IJ7j3j7J2kMqnL0j3J1j1Lj7L5j4j7lRJ0j8OkJ4ok8RMJ0j8K2M
8191A7
$$ Imaginary data points
##PAGE= N=2
##DATA TABLE= (X++(I..I)), XYDATA
$$ plain form
0 0 0 0 0 0 0 0 0 0 0 0 0 0 0 0 0 0 0 0 0 0 0 0 0 0 0 0 0 -1 32 -32 32 -32 32 -32 32 -32 43 -64 64 -64 65 -88 96
43 96 -96 107 -128 129 -156 161 -185 193 -225 242 -258 289 -321 364 -407 451 -513 588 -668 786
63 786 -935 1143 -1455 1968 -2976 5669 -27275 -68646 7247 25277 -7217 -351 20810 -3597
77 -3597 -10111 7188 4723 4460 19213 -4012 -24490 9511 25066 -13222 -11061 23113 2328
90 2328 -25781 5168 20295 -6009 -2143 11892 -13487 -14471 20949 10975 -21479 -2730 13724
103 13724 -12468 -12116 15586 5488 -11985 38 -1826 -10028 12825 14155 -19625 -8876 24626
116 24626 -2399 -28352 12209 27910 -16510 -22155 12841 8860 -8129 3504 3502 -7142 4890
129 4890 5148 -10909 6934 22155 -12233 -23026 17633 17995 -18753 -6763 17384 -5986 -16084
$$ packed form
0@%%%%%%%%%%%%%%%%%%%%%%%%%%%jL3o4O4o4O4o4O4o4P5j07J28j28J29j53J84
43I6j92K03k35K57k85L17l46L78m18M67n00N47o10O85p71Q58r64J101j256J454
63G86j721K078k598L423m944Q645l2944m1371P5893J8030l2494O866K1161k4407
77c597o514J7299k465k63J4753k3225k0478L4001J5555l8288K161L4174k0785
90B328k8109L0949J5127k6304L866J4035k5379r84L5420r974l2454J8749J6454
103A3724k6192L52K7702j0098j7473J2023j864q202K2853J330l3780J0749L3502
116B4626k7025k5953M0561J5701m4420n645L4996l981j6989J1633kj0644J2032
129D890K58j6057J7843J5221l4388j0793M0659L62l6748J1990K4147k3370j0098
$$ plain form
142 -16084 8964 5056 -11100 5541 7717 -15522 -3500 18446 -2118 -13717 9379 5788 -14694
155 -14694 756 12494 -6838 -5444 8524 -8156 -10887 17954 9310 -21614 -2055 22360 -4451
168 -4451 -15882 13354 12136 -12882 -4559 7978 -2641 -58 6728 -8217 -6383 13039 -1470
181 -1470 -17667 9941 19243 -15036 -14880 17284 7651 -14469 1944 9401 -9167 -3577 9575
194 9575 -4915 -7199 9541 -1292 -14039 7473 12510 -11890 -6236 13971 -745 -10614 8517
207 8517 5620 -11205 2726 9784 -12034 -6779 16720 680 -17596 4472 12659 -8965 -4690
220 -4690 12070 -423 -7788 6306 2659 -5925 7079 4427 -14696 -1064 16946 -5409 -16284
233 -16284 9681 9797 -14371 -4215 13527 -1235 -7739 6358 1098 -7231 6270 5538 -10030
$$ packed form
142a6084K5048l908j6156J6641K176k3239J2022K1946k0564j1599K3096l591k0482
155a4694J5450J1738j9332J394J3968j6680k731K8841q644l0924J9559K4415k6811
168d451j1431K9236j218k5018Q323J2537j0619K583O786j4945J834J9422j4509
181a470j6197K7608R302l4279J56L2164r633k2120J6413P457j8568N590J3152
194I575j4490k284J6740j0833j2747K1512N037k4400N654K0207j4716r869J9131
207H517k897j6825J3931P058k1818N255K3499j6040j8276K2068Q187k1624M275
220d690J6760j2493p365J4094l647q584J3004k652j9123J3632J8010k2355j0875
233a6284K5965J16k4168J0156J7742j4762o504J4097n260q329J3501p32j5568
$$ plain form
246 -10030 213 10335 -8621 -10062 12914 5698 -14339 -1003 9910 -5238 -2891 10830 -2135
259 -2135 -9833 8185 6453 -10328 1484 11751 -7818 -10489 9481 3958 -9749 2463 6411
272 6411 -7928 -1995 8634 -3773 -4126 11877 629 -14964 4228 14288 -7410 -8709 9257
285 9257 273 -11233 3731 7210 -6789 -1833 5327 -5765 -2319 11800 -403 -11558 6054
298 6054 9029 -10158 -3746 12649 -630 -10675 3455 3323 -7360 2985 8070 -7386 -5107
311 -5107 9076 -383 -7306 8560 6911 -11153 -3320 10195 -1350 -5821 5784 -385 -9299 3669
325 3669 6025 -8441 -1551 10526 -4085 -10249 8111 7606 -8081 -649 7658 -5069 -5383 7549
339 7549 1270 -6128 3970 1322 -10338 1949 12064 -4911 -8957 7982 3982 -8641 2736
$$ packed form
246a0030J0243J0122j8956j441K2976p216k0037J3336J0913j5148K347J3721j2965
259b135p698J8018j732j6781J1812J0267j9569k671J9970n523j3707J2212L948
272F411j4339N933J0629j2407l53J6003j1248j5593J9192J0060k1698j299J7966
285I257q984j1506J4964L479j3999M956P160j1092L446J4119j2203j1155J7612
298F054K975j9187O412J6395j3279j0045J4130j32j0683J0345N085j5456K279
311e107J4183r459o923J5866j649j8064P833J3515j1545m471J1605o169q914J2968
325C669K356j4466O890J2077j4611o164J8360n05j5687P432Q307j2727l14J2932
339G549o279p398J0098k648j1660J2287J0115j6975m046J6939m000j2623J1377
$$ plain form
352 2736 9038 -5132 -4541 6123 -1747 -5480 6654 2340 -9788 696 7471 -6542 -4777 10125
366 10125 1439 -10172 1889 6625 -4174 233 6880 -5139 -6724 7169 2463 -7858 2845
379 2845 6308 -8231 -4813 9156 1208 -6773 3903 3872 -6227 879 6821 -3928 -2784 7599
393 7599 -1892 -9595 5092 7820 -7315 -3986 6893 -2012 -5868 6324 3946 -6504 466 4526
407 4526 -4860 -527 8448 -2818 -8758 5024 4557 -8152 -927 7800 -3527 -6182 5123 1404
421 1404 -5399 4242 5063 -6734 -1599 7775 -1920 -5255 6536 2506 -8871 125 7395 -3046
435 -3046 -3652 4702 -1608 -5379 5595 4038 -6908 207 7110 -4388 -5481 7212 2601 -7563
449 -7563 674 4796 -5007 -2508 5795 -1237 -4556 4247 957 -6271 3535 7467 -5539 -4860 6916
$$ packed form
352B736O302j4170N91J0664p870l733J2134m314j2128J0484O775j4013J765J4902
366A0125q686j1611J2061M736j0799M407O647j2019j585J3893m706j0321J0703
379B845L463j4539L418J3969p948p981J0676l1j0099P106N942j0749J144J0383
393G599r491p703J4687K728j5135L329J0879q905l856J2192k378j0450O970M060
407D526r386M333Q975j1266n940J3782m67j2709P225Q727j1327k655J1305l719
421A404o803R641Q21j1797N135R374r695l335J1791m030j1377Q996P270j0441
435c046o06Q354o310l771J0974j557j0946P115O903j1498j093J2693m611j0164
449g563Q237M122r803K499Q303p032l319Q803l290p228R806L932j3006O79J1776
$$ plain form
464 6916 1214 -6024 3298 4034 -6399 -1825 5761 -2218 -3801 5251 305 -6799 3012 6039 -4929
479 -4929 -2100 6989 -1026 -6196 3711 3374 -4835 850 4161 -5613 -3367 6996 177 -6752 3139
494 3139 4302 -6087 -1047 7519 -1218 -5494 3422 1943 -4334 2063 3547 -5313 -1697 5825 -2371
509 -2371 -5588 5459 3761 -6721 -595 6256 -2275 -3173 5679 1041 -5733 1775 3656 -4068 -226
524 -226 4981 -3760 -5278 5154 2603 -5700 679 4308 -3911 -1866 5786 -583 -4729 3870 2432
539 2432 -6061 452 6241 -3206 -4625 4687 925 -5790 1996 4991 -3281 -1788 3636 -1876 -2252
554 -2252 5746 1095 -6537 1379 5058 -4402 -2687 6000 -607 -6591 2421 4129 -3975 -653 4523
569 4523 -2253 -3035 4435 798 -4174 3096 3646 -5437 -2070 5451 -791 -4016 3380 898 -5841 1071
$$ packed form
464F916n702p238R322P36j0433M574P586p979j583R052m946p104R811L027j0968
479d929K829R089q015n170R907l37q209N685L311r774K246J0363o819o929R891
494C139J163j0389N040Q566q737m276Q916j479o277O397J484q860L616P522q196
509b371l217J1047j698j0482O126O851q531q98Q852m638o774P508J881p724L842
524b26N207q741j518J0432k551q303O379L629q219K045P652o369m146Q599j438
539B432q493O513N789r447j419R312l762o715P786K995q272J493N424n512l76
554b252P998m651p632P916L679r460J715Q687o607n984R012J708q104L322N176
569D523o776p82P470l637m972P270N50r083L367P521o242l225P396k482o739O912
$$ plain form
585 1071 5362 -2994 -2724 4613 -513 -4887 3610 4288 -4527 -1588 4365 -1512 -3154 3478 757 -4060
601 -4060 1832 2545 -4555 -270 6145 -1648 -5145 3806 2772 -4922 617 5407 -2952 -4366 3313
616 3313 1027 -3249 2059 1697 -4658 -153 4767 -2065 -2925 4576 931 -5062 1838 4433 -3538 -1801
632 -1801 4658 -1252 -4786 3087 2744 -4301 -122 3791 -3078 -2836 4791 1435 -4032 1136 2222 -3165
648 -3165 502 4405 -2494 -3562 3769 718 -4883 1867 4429 -4055 -2942 4693 376 -4098 2389
663 2389 3103 -3317 -752 2972 -1772 -1353 3788 -901 -4824 2156 3125 -3789 -683 4281 -2266 -4083
679 -4083 4081 2775 -3902 353 3516 -2719 -1870 4188 -33 -3806 2095 1983 -3991 -292 3830 -1742
695 -1742 -2265 3267 -207 -3807 2845 3584 -3884 -1383 4237 -1329 -3551 3668 2068 -4935 -758 3690
$$ packed form
585A071M291q356K70P337n126m374Q497O78q815K939N953n877j642O632k721m817
601d060N892P13p100M285O415p793l497Q951j034p694N539M790q359j414P679
616C313k286m276N308l62o355M505M920o832q60P501l645n993O900K595p971J737
632a801O459n910l534P873l43p045M179L913o869K42P627l356n467N168J086n387
648c165L667L903o899j068P331l051n601O750K562q484J113P635m317m474O487
663B389P14o420K565L724m744M19N141m689l923O980R69o914L106M964o547j817
679d083Q164j306o677M255L163o235Q49O058m221l773N901j12n974L699M122n572
695a742n23N532l474l600O652P39p468K501N620n566k222P219j600p003M177M448
$$ plain form
711 3690 -1479 -1867 2805 -430 -3010 2379 1881 -3238 770 3886 -2733 -2945 3974 887 -4286 1389
727 1389 3318 -3622 -2246 3831 171 -2872 2057 1172 -3334 1032 3860 -2036 -2085 3010 -283 -3055
743 -3055 2501 2146 -3871 -696 3421 -1936 -2620 3687 1035 -4123 986 3373 -2670 -1445 4048 -47
759 -47 -3562 1327 1486 -2486 778 2476 -3062 -2012 3567 -51 -3239 2479 2328 -4000 -587 4672
775 4672 -663 -3205 2412 1354 -3310 486 2706 -2123 -1222 2725 -1215 -3065 2706 2077 -3042 197
791 197 2875 -2303 -1774 3949 653 -3691 1001 2148 -2867 -456 3563 -1395 -3406 2306 1643 -2735
807 -2735 614 2700 -1986 -1299 2844 -395 -2215 2554 1305 -3761 -59 3273 -1933 -2160 3308 296
823 296 -4119 884 3307 -1657 -991 2429 -1013 -2094 2682 1194 -2956 620 2262 -2671 -1344 3417
$$ packed form
711C690n169l88M672l235k580N389m98n119M008L116o619k12O919l087n173N675
727A389J929o940J376O077l660l043M929q85m506M366K828n896m9N095l293k772
743c055N556l55o017L175M117n357o84O307k652n158N109K387o043J225N493m095
759d7l515M889J59l972L264J698n538J050N579l618l188N718j51o328L413N259
775D672n335k542N617j058m664L796K220m829R01L947l940j850N771o29n119L239
791A97K678n178N29N723l296m344M692J147n015K411M019m958k011N712o63m378
807b735L349K086m686O87M143l239j820M769j249n066L702L332n206k27N468l012
823B96m415N003K423m964O66L420l442j081M776j488m150L576J642m933J327M761
$$ plain form
839 3417 -403 -3310 1772 1906 -2980 -79 3469 -1139 -2211 2435 403 -2859 1630 2750 -2680
854 -2680 -1720 2409 -560 -1948 2284 839 -3210 451 2709 -1707 -969 3175 -448 -3218 1944 2379
870 2379 -2776 -713 2931 -1194 -2646 1866 925 -2202 927 1605 -2568 -634 3253 -386 -2273 2066
886 2066 856 -3217 594 3316 -1702 -2271 2150 115 -2507 1579 1923 -2474 -452 2766 -1050 -1864
902 -1864 2623 1007 -2707 575 1998 -2109 -782 2823 -819 -2897 1609 1306 -2477 561 2731
917 2731 -2069 -2147 2838 1024 -2325 937 1604 -2225 -500 2443 -961 -1896 1967 301 -2868 889
933 889 2404 -2038 -1116 2785 -357 -2676 1773 2033 -2098 -360 1978 -1373 -1296 2524 216 -2780
949 -2780 810 1752 -1941 -187 2720 -909 -2214 2010 1140 -2240 638 2128 -1954 -1377 2327 -331
$$ packed form
839C417l820k907N082J34m886K901L548m608j072M646k032l262M489J120n430
854b680R60M129k969j388M232j445m049L661K258m416P38M144l623k770N162M35
870B379n155K063L644m125j452M512r41l127L129O78m173J934L887l639j887M339
886B066j210m073L811K722n018n69M421k035k622M086L44m397K022L218l816q14
902a864M487j616l714L282J423m107J327L605l642k078M506l03l783L038K170
917B731m800p8M985j814l349L262O67l829J725K943l404r35L863j666l169L757
933H89J515m442R22L901l142k319M449K60m131J738K338l351P7L820k308k996
949b780L590R42l693J754K907l629j305M224q70l380K878J490m082N77L704k658
$$ plain form
965 -331 -2469 1562 1465 -2662 -600 2353 -778 -1296 2008 94 -2390 1215 2080 -1826 -554 2220
981 2220 -1183 -2105 2275 1237 -2744 -65 2177 -1378 -1209 2280 199 -1949 1256 1251 -2069 96
997 96 2472 -1102 -1767 1830 237 -2355 1020 1997 -2066 -1195 2157 -252 -1576 1751 833 -2456 222
1014 222 2335 -1200 -1367 1871 -127 -2273 1005 1347 -1929 -265 1967 -1146 -1612 2030 688 -2039
1030 -2039 935 1846 -2004 -937 2606 43 -2069 1033 897 -1875 341 1963 -1348 -1317 1897 79
1046 79 -1785 1434 1459 -2183 -440 2304 -752 -1734 1725 667 -2258 196 1541 -1486 -659 2115
1062 2115 -493 -2150 1241 1307 -1596 232 1762 -1401 -1326 1971 352 -1914 759 1119 -1982 -343
1078 -343 2225 -723 -1821 1573 875 -1946 362 1931 -1021 -866 1625 -349 -1584 1426 1107 -1919
$$ packed form
965c31k138M031r7m127K062K953l131n18L304j914k484L605Q65l906J272K774
981B220l403r22M380j038l981K679K242l555J69L489k081k148L205nl320K165
997I6K376l574o65L597j593k592L375R77m063Q71L352k409j324L327r18l289K678
1014B22K113l535j67L238j998k146L278L42l276J664K232l113m66L642j342k727
1030b039K974R11l850J067L543k563k112L102j36k772K216J622l311L1L214j818
1046G9j864L219K5l642J743K744l056r82L459j058k925K454J345l027Q27K774
1062B115k608j657L391O6k903J828J530l163P5L297j619k266K673L60l101J639
1078c43K568k948j098L394o98k821K308J569k952J55K491j974j235L010l19l026
$$ plain form
1094 -1919 -158 1562 -1265 -1117 2187 342 -2363 537 1637 -1327 -479 1829 -657 -1679 1358
1109 1358 736 -1825 305 1466 -1493 -1004 1785 -110 -1626 1273 1071 -1949 -120 2024 -647 -1098
1125 -1098 1642 101 -2116 819 1832 -1415 -903 1494 -432 -1405 1402 849 -1643 208 1468 -1134
1141 -1134 -670 1879 -148 -1795 1053 1104 -1853 -301 1973 -728 -1695 1162 529 -1461 657 1359
1157 1359 -1490 -777 1644 -171 -1187 1254 501 -1975 185 1752 -1045 -1054 1554 -56 -1741 941
1173 941 1300 -1453 -228 1761 -662 -1386 1447 769 -1462 356 1081 -1363 -554 1719 -292 -1529
1189 -1529 957 585 -1632 436 1845 -1155 -1305 1603 376 -1581 688 1245 -1387 -549 1417 -518
1205 -518 -1149 1238 410 -1579 342 1246 -1154 -423 1740 -330 -1705 1061 1128 -1354 -78 1370 -1014
$$ packed form
1094a919J761J720k827J48L304j845k705K900J100k964Q48K308k486j022L037
1109A358o22k561K130J161k959M89K789j895j516K899k02l020J829K144k671m51
1125a098K740j541k217K935J013l247N12K397j926r73K807n53k492J851J260k602
1141a134M64K549k027j647K848N1k957J552K274k701r67K857o33j990K118P02
1157A359k849P13K421j815j016K441p53k476K160J567k797rK608j610j685K682
1173I41L59k753J225J989k423p24K833o78k231J818P25k444Q09K273k011j237
1189a529K486l72k217K068J409l000j50K908j227j957K269N57k632Q38J966j935
1205e18o31K387q28j989J921R04k400P31K163k070j375K766O7k482J276J448k384
$$ plain form
1222 -1014 -1148 1504 420 -1522 464 1052 -1206 -289 1545 -364 -1146 1149 457 -1479 402 1349
1238 1349 -1112 -731 1432 -351 -1608 1092 1149 -1515 -413 1392 -509 -876 1318 283 -1467 451
1254 451 1052 -1017 -234 1300 -731 -1317 1242 597 -1594 212 1438 -1044 -951 1421 151 -1287 797
1271 797 921 -1334 -289 1395 -422 -936 963 55 -1405 623 1200 -1122 -543 1284 -358 -1061 1236
1288 1236 675 -1537 66 1410 -794 -899 1300 147 -1364 426 796 -1090 -132 1286 -540 -983
1304 -983 1031 280 -1159 688 1101 -1340 -684 1495 -95 -1278 754 601 -1376 -18 1323 -614
1320 -614 -856 1057 106 -1097 685 902 -1062 -147 1214 -600 -1023 1169 481 -1319 258 979 -1074
1337 -1074 -514 1497 -13 -1314 607 754 -987 34 1161 -665 -878 1002 153 -1089 500 694
$$ packed form
1222a014j34K652j084j942J986N88k258R17J834j909p82K295o92j936J881R47
1238A349k461L81K163j783j257K700N7k664J102J805j901l67K194j035j750J918
1254D51O01k069P83J534k031n86K559o45k191J806J226k482R3K372j270j438K084
1271G97J24k255J045J684j817n14J899r08j460K028N77k322N79J827j642p03K297
1288A236n61k212J603J344k204j05K199j153j511J790L70j886R58J418j826m43
1304i83K014p51j439J847M13k441O56K179j590j183K032j53j977J358J341j937
1320f14k42J913r51j203J782K17j964R15J361j814m23K192o88j800J577P21k053
1337a074N60K011j510j301J921J47j741J021J127j826k13J880q49j242J589J94
$$ plain form
1353 694 -1186 -243 1234 -488 -1005 1099 519 -1356 103 1193 -622 -558 1059 -139 -1219 599
1369 599 772 -905 -92 882 -731 -674 1241 249 -1196 450 916 -951 -259 1274 -307 -1083 832
1386 832 500 -1175 97 1093 -675 -704 914 -47 -918 749 727 -1076 -199 972 -485 -605 1073 67
1404 67 -1400 338 990 -906 -489 1033 -260 -1039 719 602 -946 95 943 -588 -547 968 20
1421 20 -890 612 557 -1152 -172 1189 -358 -865 788 266 -1061 382 1047 -738 -592 904 -78 -824
1439 -824 684 453 -1019 -29 886 -606 -598 920 34 -1006 475 676 -921 -138 1124 -414 -993 712
1457 712 421 -902 177 744 -839 -566 941 6 -797 524 375 -916 153 1051 -552 -613 949
1474 949 135 -1022 417 819 -783 -319 910 -308 -851 712 461 -859 73 687 -619 -295 998
$$ packed form
1353F94j880R43J477j722n17K104n80j875J459J090j815O4J617j198j080J818
1369E99J73j677Q13R74j613N7J915r92j445J646M66j867O92J533j581p76J915
1386H32l32j675J272R96j768k9J618r61q71J667k2j803Q77J171j457j20J678j006
1404F7j467J738O52j896M17J522j293p79J758j17j548J041Q48j531M1J515r48
1421B0r10J502n5j709R80J361j547n07J653n22j327J443O65j785J46J496r82p46
1439h24J508k31j472R90R15j492QJ518q86j040J481K01j597P83J262j538n79J705
1457G12k91j323J079N67j583K73J507r35q03J321j49j291J069Q98j603o1J562
1474I49q14j157J439M02j602M64J229j218n43J563k51j320R32O14j306L24J293
$$ plain form
1491 998 -66 -964 446 529 -805 -12 871 -601 -761 781 236 -918 284 732 -718 -342 856
1508 856 -145 -707 648 363 -908 24 708 -524 -389 805 -183 -943 570 716 -778 -156 832 -360
1526 -360 -600 846 331 -889 124 653 -618 -280 790 -215 -738 538 317 -864 98 861 -515
1543 -515 -548 745 -15 -800 492 612 -835 -356 764 -232 -614 600 143 -866 177 751 -478 -308
1561 -308 716 -158 -671 598 435 -783 33 762 -526 -587 745 175 -752 279 535 -699 -212 844
1579 844 -100 -580 477 202 -674 290 695 -640 -438 721 -55 -713 476 407 -813 -121 746 -331
1597 -331 -539 626 173 -776 200 520 -569 -171 719 -289 -732 474 318 -643 154 576 -580 -360
1615 -360 825 97 -689 365 462 -655 -72 761 -293 -577 539 146 -666 225 524 -514 -212 643
$$ packed form
1491I98j064q98J410Q3j334P93Q83j472j60J542n45j154J202M48j450L76J198
1508H56j001n62J355k85j271R32O84j232J35J194r88p60J513J46j494O22R88j192
1526c60k40J446n15j220J013N29j271L38J070j005n23J276k21j181R62P63j376
1543e15l3J293p60p85J292J20j447M79J120r96l82J214m57j009J043N74j229J70
1561c08J024q74n13J269j63j218Q16P29j288o1J332n70r27J031K56j234M87J056
1579H44r44m80J057k75q76R64M05j335K02J159p76o58J189o9j220O92Q67j077
1597c31k08J165m53r49R76L20j089L98Q90j008m43J206j56r61P97M22j156K20
1615c60J185p28p86J054R7j117N83Q33j054k84J116l93q12Q91K99j038L02Q55
$$ plain form
1633 643 -219 -605 595 413 -729 -15 596 -437 -374 685 35 -802 179 447 -561 -139 565 -355 -518
1652 -518 566 221 -636 182 515 -520 -270 660 -118 -598 445 320 -728 -43 685 -278 -379 566 34
1671 34 -644 348 568 -466 -205 526 -242 -444 557 175 -715 106 524 -509 -301 628 -55 -634 369
1690 369 377 -599 -35 621 -288 -482 422 68 -547 280 396 -620 -247 591 -117 -421 449 174 -657 134
1710 134 652 -331 -347 576 -4 -556 331 408 -500 -79 552 -247 -412 496 187 -482 220 393 -485 -155 657
1731 657 -117 -589 345 224 -594 57 532 -436 -469 483 68 -510 243 331 -484 -94 501 -260 -383 492 112
1752 112 -620 127 454 -414 -206 579 -107 -594 363 387 -443 5 454 -323 -318 548 119 -515 206 314 -441
1773 -441 -56 545 -206 -442 437 170 -529 128 517 -346 -284 473 -26 -505 301 336 -512 -147 388 -243 -297
$$ packed form
1633F43q62l86J200j82j142P14O11j033O3J059o50q37R81K68j008M22P04r20j63
1652e18J084l45q57Q18L33j035K50R30p78m80J043j25j048O85P28r63j01R45n32
1671C4o78R92K20j034K61P31p68k02J001l82q90Q21M18j033K08R29o83n79J003
1690C69Qr76N64O56r09j94R04l54o15Q27J16j016L73Q38p08l04Q70k75q31P91
1710A34N18r83j6R23n80n52Q87P7r08M21O31p99j65R08l09o69P02J73q78L30Q12
1731F57p74m72R34j21q18O51M75r68l3R52m15n78P53Q8q15L90N95p61j23Q75l80
1752A12p32P47L27q68K08P85o86m87R57K4q30M48M49p77NQ66m29o34P21J08p55
1773d41L85O01p51k36Q79k67o99O57L89q63O2P57m99m79Q06L5q48L65N35o31n4
$$ plain form
1794 -297 447 -24 -573 210 382 -412 -120 494 -199 -456 425 268 -505 41 480 -309 -308 464 29 -422 290
1815 290 289 -475 -30 533 -148 -311 398 31 -503 259 452 -432 -245 450 -109 -413 370 221 -549 -29 451
1836 451 -251 -288 409 10 -433 207 241 -428 -37 459 -252 -418 345 125 -445 173 402 -405 -226 487 41
1857 41 -385 267 207 -407 44 447 -230 -277 394 9 -423 232 304 -436 -82 442 -177 -405 396 210 -455
1878 -455 54 318 -351 -204 469 -29 -478 185 194 -363 28 360 -287 -318 381 43 -419 192 298 -421 -136
1899 -136 456 -149 -389 321 200 -431 -1 373 -204 -154 384 -56 -394 282 301 -331 10 373 -239 -279 434
1920 434 92 -463 100 348 -305 -152 413 -89 -366 237 188 -388 12 346 -263 -252 299 -50 -377 237 227
1941 227 -423 -127 365 -148 -278 364 97 -480 71 385 -271 -179 333 -70 -339 277 157 -361 43 357
$$ packed form
1794b97P44m71n49P83J72p94K92O14o93k57Q81j57p73N46M39p89JP72m35m51P12
1815B90jp64M45N63o81j63P09l67n34P62J93q84J87O95n59l04P83j49p70N20M80
1836D51p02l7O97l99m43O40L4o69L91M96p11j66P63k20n70O18K29q07J79P13m46
1857D1m26O52o0o14M51M03o77m7O71l85m32O55P2p40L54N24o19k28Q01j86o65
1878d55N09K64o69J47O73m98m49O63Rn57L91L32o47l1O99l38m62O11J06p19K85
1899a36N92o05k40P10j21o31M30L74n77N0N38m40l38O76J9o32L41L63o12m0P13
1920D34l42n55N63K48o53J53N65n02k77O03m9n76M00L34o09J1N51l49l27O14j0
1941B27o50K96M92n13j30O42k67n77N51L14o56R2N12m03k69O16j20n18M04L14
$$ plain form
1961 357 -224 -209 378 22 -343 203 268 -399 -107 442 -79 -323 239 64 -382 99 354 -281 -236 298 -63
1982 -63 -315 240 156 -403 -19 335 -219 -276 339 34 -409 112 261 -347 -116 384 -110 -348 242 164 -270
2003 -270 92 284 -261 -171 380 -22 -304 229 161 -374 18 398 -195 -278 330 97 -345 102 298 -261 -113
2024 -113 320 -97 -306 237 168 -350 11 234 -265 -176 366 -43 -415 153 227 -313 -40 343 -180 -284 283
2045 283 119 -314 68 243 -268 -126 312 -61 -262 294 168 -325 33 343 -166 -147 346 -5 -365 192
2065 192 285 -279 -96 268 -130 -244 271 95 -329 67 254 -219 -118 289 -93 -311 186 134 -366 7 303
2086 303 -196 -258 257 0 -304 151 246 -290 -115 305 -72 -206 235 62 -340 103 272 -226 -122 298 -49
2107 -49 -273 257 223 -278 10 333 -134 -226 289 73 -267 118 185 -271 -97 313 -85 -258 174 61 -307
$$ packed form
1961C57n81J5N87l56l65N46O5o67K92N49n21k44N62j75m46M81K55o35M5N34l61
1982f3k52N55q4n59L84L54n54n7O15l05m43N21J49o08K31N00m94k38N90p8m34
2003b70L62J92n45R0N51m02k82N33o8n35L92L80n93q3O08k33m42M47J96n59J48
2024a13M33m17k09N43o9n18L61K23m99Q9N42m09l72N68P4n40K73L83n23j04N67
2045B83j64m33L82J75n11J42M38l73k01N56j26m93L58L10n09J9M93l51l60N57
2065A92R3n64J83L64l98j14N15j76m24L96J87m73J01M07l82k18M97n2n00L73K96
2086C03m99o2N15k57l04M55R5n36J75M20l77j34M41j73m02M43J69m98J04M20l47
2107d9k24N30l4n01K88L23m67r2N15k16l40L85O7m56J74M10l98j73M32j13l68
$$ plain form
2128 -307 102 314 -260 -181 299 17 -299 165 205 -327 -71 277 -141 -230 261 71 -274 92 224 -202 -68
2149 -68 296 -69 -281 218 164 -238 55 290 -216 -173 327 53 -268 115 186 -245 2 278 -100 -217 204
2170 204 63 -287 81 207 -252 -121 247 -111 -282 196 141 -315 -52 227 -129 -159 293 19 -296 109 213
2191 213 -214 -44 237 -141 -214 253 107 -275 89 244 -202 -110 291 -7 -239 203 202 -258 -25 286 -97
2212 -97 -145 220 -16 -258 142 205 -214 -68 227 -101 -195 228 98 -302 20 229 -229 -161 225 -30 -249 120
2234 120 123 -248 -23 225 -122 -174 217 28 -230 132 177 -245 -88 276 -55 -186 184 101 -286 59 275 -139
2256 -139 -144 241 -4 -204 147 165 -250 -19 249 -123 -209 205 68 -267 93 182 -239 -109 273 -65 -261 140
2278 140 97 -243 35 202 -175 -187 201 -26 -244 100 117 -241 -28 246 -97 -172 222 92 -254 66 211
$$ packed form
2128c07M09K12n74P9M80k82l16M64M0n32K56L48m18q9M91j90l45L66J32m26J34
2149f8L64l65k12M99n4m02K93K35n06M3N00k74l21L83P1m31K47K76l78j17M21
2170B04j41l50L68J26m59J31L68l58j71M78n5m56K63K79l56l0M52k74l15M05J04
2191B13m27J70K81l78p3M67j46l82L64J55m46R2M01k98k32M42jm60K33L11l83
2212i7m8L65k36k42M00O3m19J46K95l28r4M23j30m00L22K09m58O8L86k55k19L69
2234A20Ll71K25K48l47n2L91j89k58L62M5m22J57L64l31j31L70q3l87L45K16m14
2256a39nL85k45k00L51J8m15K31K68l72q6M14j37l35L60Q9m21J30L82l38j96M01
2278A40m3l40K78J67l77j2L88k27k18L44J7l58K13K74l43p5L94j30l46L20J45
$$ plain form
2299 211 -147 -71 279 -5 -204 157 155 -201 2 192 -157 -131 252 40 -224 95 144 -223 -41 215 -122 -211
2321 -211 158 62 -285 35 196 -175 -111 194 -37 -225 157 118 -207 -46 180 -135 -124 201 17 -262 97
2342 97 209 -191 -82 228 -58 -191 168 119 -193 79 204 -113 -68 224 -7 -173 150 132 -238 -23 218
2363 218 -89 -166 193 10 -262 75 188 -193 -123 168 -83 -187 143 66 -248 2 196 -159 -133 179 -19
2384 -19 -223 102 135 -203 -10 249 -77 -172 174 73 -182 89 175 -162 -108 229 -2 -148 148 106 -198 47
2406 47 215 -126 -113 186 34 -208 81 169 -195 -72 173 -89 -190 138 39 -205 31 118 -179 -116 185 -46
2428 -46 -223 76 80 -187 17 188 -144 -152 197 31 -185 97 168 -144 -31 246 -43 -137 163 78 -187 41 173
2451 173 -119 -49 205 -45 -189 132 141 -167 -26 202 -92 -137 180 59 -214 29 152 -143 -82 179 -64 -181
$$ packed form
2299B11l58P6L50k84j99L61kl56K03J90l49K6L83k12k64L19M9l67J82K56l37q9
2321b11L69r6l47L20J61l71O4L05k31j88L82l9l25J61K26l15J1L25j84k79L59
2342I7J12m00J09L10k86j33L59m9l12K72J25l17M5K92k31j66L23j8l70K15K41
2363B18l07p7L59j83k72L37J13l81P0K91k51j04L30p7l14K50J94l55K6L12j98
2384a9k04L25L3l38J93K59l26r5L46j01k55K71Q6l37N4L37k31j46K96m2l04K45
2406D7J68l41J3K99j52k42K89Q8l64J23K45k62j01L28r9k44K36Q7k97O3L01k31
2428d6j77K99Mk67K04J71l32qL49j66k16K82P1l12J13K77k89r4L00q5k65K28J32
2451A73k92P0K54k50j44L21Rl08J41K28k94m5L17j21k73K43J23k95O1K61k43j17
$$ plain form
2473 -181 129 63 -212 16 148 -136 -118 154 -23 -176 110 120 -195 -58 170 -56 -122 166 70 -205 63 184
2495 184 -110 -56 173 -44 -161 141 111 -188 16 226 -123 -112 195 -2 -185 87 132 -172 -80 210 -40 -139
2517 -139 123 30 -196 36 143 -156 -108 155 -25 -152 111 59 -211 -20 182 -94 -135 167 61 -174 84
2538 84 135 -88 -42 201 -34 -145 146 89 -139 73 168 -124 -68 213 19 -133 75 120 -169 -22 188 -66
2560 -66 -137 134 15 -179 17 99 -159 -58 160 -73 -171 100 74 -162 -10 143 -102 -104 167 -20 -188 50
2582 50 132 -126 -18 175 -56 -104 158 73 -137 57 128 -118 -38 154 -19 -130 162 106 -168 -3 164 -86
2604 -86 -87 159 8 -179 41 136 -140 -52 100 -78 -171 113 27 -194 12 130 -122 -92 146 -10 -163 78 90
2627 90 -176 -13 157 -55 -109 139 20 -145 62 152 -114 -63 156 -7 -82 160 72 -129 36 170 -89 -63
$$ packed form
2473a81L10o6k75K28J32k84J8K72j77j53K86J0l15J37K28k26o6K88r6k75K68J21
2495A84k94N4K29k17j17L02l0k99K04K10l49J1L07j97j83K72M5l04R2K90k50r9
2517a39K62r3k26K32J07k99M8K63j80j27K63n2k70J91K02k76m1L02j06k35K58
2538H4N1k23M6K43k35j11K91n7k28K12R5k92N6K81j94j52K08M5k89J47K10k54
2560f6p1K71j19j94J96Q2k58J01K18k33r8K71k6k36J52J53k45kK71j87j68K38
2582E0Q2k58J08J93k31m8K62q5k10J94P1k46Q0J92j73j11K92n6k74J65J67k50
2604h6jK46j51j87K20R5k76Q8J52j78r3K84q6k21K06J18k52L0K38j56j53K41J2
2627I0k66J63J70k12n4K48j19j65K07R0k66N1K19j63p5K42q8k01J65J34k59K6
$$ plain form
2649 -63 141 -1 -149 75 102 -156 -51 132 -76 -132 103 18 -158 32 84 -150 -67 163 -50 -157 92 51
2671 51 -156 4 110 -125 -135 112 11 -143 56 86 -106 -23 131 -42 -79 125 62 -128 57 143 -81 -37 165
2694 165 -12 -145 107 92 -115 -5 133 -79 -102 110 32 -158 14 68 -145 -44 132 -74 -131 78 31 -157
2716 -157 22 88 -101 -100 110 -37 -157 63 74 -142 -34 106 -73 -86 90 9 -144 32 101 -80 -28 158 -39
2739 -39 -98 109 88 -105 33 133 -69 -72 137 13 -128 48 103 -117 -30 116 -69 -105 88 8 -140 52 98
2762 98 -119 -71 82 -33 -117 81 45 -172 -45 128 -57 -83 106 23 -119 58 89 -113 -11 123 -47 -88 108
2785 108 42 -91 56 138 -95 -62 151 19 -85 100 65 -132 -20 126 -50 -49 87 1 -129 48 79 -114 -44
2808 -44 89 -76 -142 79 44 -108 -5 86 -110 -76 126 14 -117 42 65 -108 -6 114 -56 -83 119 44 -85
$$ packed form
2649f3K04j42j48K24K7k58J05J83k08n6K35q5j76J90N2k34Q3K30k13j07K49m1
2671E1k07J60J06k35j0K47j01j54J99L0j92Q3J54j73l7K04o3j90J85Q6k24M4K02
2694A65j77j33K52j5k07J10J38k12k3K12p8j90J72N4k13J01J76k06n7K09m7j88
2716a57J79O6j89JK10j47j20K20J1k16J08J40j79j3J76q1j53J76O9j81N2J86j97
2739c9n9K07k1j93J38J00k02lK09j24j41J76N5k20Q7J46j85l6J93q0j48J92M6
2762I8k17M8J53j15q4J98l6k17J27J73j85k6J89q3j42J77L1k02J02J34j70m1J96
2785A08o6j33J47Q2k33L3K13j32j04J85l5j97J12J46j76JJ36q6j30J77L1j93P0
2808d4J33j65o6K21l5j52J03R1j96L4K02j12j31J59K3j73J02J20j70k7K02p5j29
$$ plain form
2831 -85 65 95 -104 -30 145 -23 -76 74 71 -122 20 111 -52 -37 101 22 -98 57 58 -78 -11 81 -76 -80 101
2856 101 24 -153 6 71 -107 -83 88 -39 -130 49 57 -103 10 75 -75 -85 100 7 -96 65 81 -93 -18 124
2880 124 -28 -53 110 33 -93 19 133 -49 -48 109 -9 -87 59 82 -96 -5 83 -57 -83 69 -3 -102 26 71
2904 71 -107 -50 92 -19 -125 52 -1 -121 4 69 -71 -77 79 -9 -104 56 74 -110 -14 98 -69 -70 82 9
2928 9 -112 46 90 -68 3 114 20 -66 84 80 -66 8 109 -45 -68 73 25 -94 44 43 -108 -33 93 -50 -120
2953 -120 68 35 -109 -4 74 -98 -69 65 -28 -114 33 47 -89 -23 78 -66 -70 91 9 -110 37 60 -63 -12
2977 -12 99 -14 -78 75 72 -62 26 86 -54 -14 106 17 -62 70 49 -78 -6 86 -51 -96 94 -20 -126 36
3001 36 89 -74 -46 70 -59 -89 33 19 -120 -21 56 -80 -67 99 -14 -120 46 60 -102 -23 98 -48 -61 77
$$ packed form
2831h5J50L0j99P4J75j68n3J50lj93J42R1j63J5J38p9j20J55Jj36O7R2j57mJ81
2856A01p7j77J59O5j78K4J71j27r1J79Qj60J13O5j50j0J85r3j03J61J6j74P5J42
2880A24j52k5J63p7j26J12J14j82JJ57j18p8J46K3j78R1Q8j40k6J52p2r9J28M5
2904G1j78N7J42j11j06J77n3j20J25O5j40oJ56q8r5J60J8j84R6J12j67jJ52p3
2928Ij21J58M4j58P1J11r4q6J50mj46P4J01j54k3J41m8j19J38jj51P5J26j43p0
2953a20J88l3j44J05P8j72K9J34r3q6J47J4j36O6J01j44mJ61q2j19J47K3j23N1
2977a2J11j13o4J53lj34Q8O0j40M0J20q9p9J32k1j27P2R2j37m5J90j14j06J62
3001C6N3j63K8J16j29l0J22j4j39R9P7j36J3J66j13j06J66J4j62P9J21j46j3J38
$$ plain form
3025 77 26 -54 61 74 -51 -38 93 0 -45 77 28 -66 13 112 -23 -31 62 7 -105 53 82 -101 -19 85 -21 -86
3051 -86 35 11 -104 -3 67 -89 -71 66 -50 -118 34 20 -88 -8 68 -55 -74 86 9 -89 71 75 -68 -15 86
3076 86 -2 -49 52 29 -56 43 83 -58 -25 100 -7 -88 45 44 -84 -1 66 -62 -71 90 34 -71 20 48 -68 -34
3102 -34 62 -42 -87 28 2 -102 -6 66 -67 -58 70 -38 -100 44 71 -78 -23 81 -34 -72 83 36 -71 24 74
3127 74 -53 -6 98 5 -60 90 71 -74 17 85 -65 -73 89 -20 -92 44 58 -86 -68 69 -44 -77 52 9 -106
3152 -106 2 30 -84 -51 67 -30 -94 40 9 -107 -38 56 -69 -77 82 0 -78 38 55 -69 -24 65 -16 -46 51 44
3178 44 -74 39 93 -48 -30 110 3 -36 57 74 -85 -28 70 -43 -67 43 13 -75 -1 17 -66 -48 61 -36 -89 31
3204 31 -4 -86 -1 52 -97 -79 62 7 -85 16 35 -72 -1 89 -36 -52 72 28 -53 39 58 -54 -14 86 -9 -60
$$ packed form
3025G7n1q0J15J3j25J3J31r3m5J22m9r4P9R9j35qR3n5j12J58K9j83Q2J04j06o5
3051h6J21k4j15J01P0j56J8J37j16o8J52j4j08Q0P6j23j9J60p7r8J60Mj43N3J01
3076H6q8m7J01k3q5R9M0j41L3J25j07q1J33jj28Q3O7j28rJ61n6j05R1K8j16L4
3102c4R6j04m5J15k6j04R6P2j33RJ28j08o2J44K7j49N5J04j15l8J55m7j07R5N0
3127G4j27M7J04r3o5J50j9j45R1O8j50qJ62j09p2J36J4j44J8J37j13l3J29m3j15
3152a06J08K8j14L3J18r7o4J34l1j16O9R4j25qJ59q2p8J16J7j24M5Q9q1l0R7p
3178D4j18J13N4j41J8J40j07l9R3J7j59N7R8j13k4J10l0q8P4J8q3J8J09r7n3J20
3204C1l5q2Q5N3j49J8J41n5r2J01J9j07P1R0j25j6J24m4q1R2J9j12M0J00r5n1
$$ plain form
3230 -60 64 52 -55 -4 79 -39 -43 91 -7 -80 27 50 -83 -32 61 -69 -80 26 -7 -108 0 26 -69 -51 36 -28
3256 -28 -77 11 10 -84 -14 69 -48 -51 56 18 -82 23 51 -66 -42 84 -9 -46 84 45 -83 32 78 -29 -9 72
3282 72 6 -88 45 49 -65 -18 67 -26 -45 42 -8 -84 14 39 -83 -39 42 -58 -58 42 -1 -74 -14 42 -41 -46 36 22 -45
3311 -45 19 47 -82 -9 59 -4 -20 62 20 -65 39 65 -58 -5 118 9 -61 38 28 -49 20 49 -32 -60 46 -9 -64
3338 -64 19 7 -77 -29 52 -54 -74 43 -16 -95 8 40 -94 -56 34 -33 -103 33 33 -64 8 66 -49 -51 41 8 -67 25
3366 25 41 -55 -4 70 -14 -55 66 47 -65 28 68 -30 -16 59 0 -59 49 48 -61 -8 42 -33 -56 34 -21 -92 2 27 -68
3395 -68 -61 29 -23 -65 32 19 -77 2 54 -83 -43 48 -10 -72 32 62 -79 10 44 -1 -17 84 42 -54 22 56 -35 -42 56
3424 56 38 -27 66 58 -71 -11 47 -19 -11 44 0 -67 13 39 -70 -24 51 -45 -71 13 -1 -91 -33 17 -66 -31 28 -24 -63 23
$$ packed form
3230f0J24j2j07N1Q3j18mJ34r8p3J07K3j33N1R3j30j1J06l3j01J08K6r5J8Q7o4
3256b8m9Q8jr4P0Q3j17lJ07l8j00J05K8j17K4J26r3l7J30l9j28J15M6j07K0Q1
3282G2o6r4J33Mj14M7Q5r3j9Q7n0p6R8K5j22M4Q1j00%J00m3p3O0N6q3nQ2j4o7
3311d5O4K8j29P3O8o3j6Q2m2q5J04K6j23N3J23j09p0R9j0p7O9K9q1k8J06n5n5
3338f4Q3j2q4M8Q1j06k0J17n9p9J03L2j34L8R0o7p0J36%r7P2N8j15kR2l3p5R2
3366B5J6r6N1P4q4m1J21j9j12R3M0r8J4P5n9n9J08jj09N3N0p5k3R0n5p1R4K5r5
3395f8PR0n2m2R7j3r6P9N2j37M0R1n8o2J04L0j41Q9L4m5j6J01m2r6P6L4r1pR8
3424E6j8o5R3qj29O0N8o6QN5m4o7Q0K6j09M6P5r6k6Q4j4r0N8N0q3L5N9n2l9Q6
$$ plain form
3454 23 30 -61 -14 69 -21 -51 45 35 -20 48 51 -45 0 70 13 -57 52 30 -54 29 69 -19 -23 54 2 -50 35 27 -64 1 51 -31
3486 -31 -56 52 -10 -73 0 33 -71 -31 38 -36 -82 2 -4 -85 -16 29 -62 -44 36 0 -62 26 36 -46 15 67 -28 -44 56
3515 56 40 -48 14 62 -20 -5 74 18 -28 54 19 -59 7 57 -60 -36 30 -13 -75 12 24 -35 -22 47 -10 -60 13 -6 -62 8
3545 8 48 -44 -62 37 -34 -58 41 33 -42 1 49 -25 -14 56 -11 -44 30 69 -21 9 50 -4 -43 51 53 -45 8 70 -27 -7 60 -4
3577 -4 -31 38 34 -52 3 51 -28 -61 15 -21 -57 13 12 -62 -26 29 -40 -62 22 -4 -50 -14 44 -57 -31 49 13 -56 7 20 -37
3608 -37 -1 56 -20 -28 65 34 -35 34 58 -30 10 68 -2 -30 56 36 -18 10 49 -55 -34 64 0 -75 -2 24 -69 -31 34 -26
3638 -26 -49 13 -1 -85 -23 18 -52 -50 20 -27 -69 28 -4 -52 -10 60 -28 -15 37 8 -37 28 47 -45 -5 83 4 -13 51 37 -24
3669 -24 17 46 -44 -2 46 -21 -33 39 15 -51 -32 47 -39 -44 36 -4 -72 -7 8 -84 -53 22 -42 -54 16 -6 -49 -19 42 -41 -54
$$ packed form
3454B3Pr1M7Q3r0l0R6j0n5O8Lr6M5P0n7p0J09k2q4Q3M0q8mP7n2n2Q5qr1O5N0q2
3486c1k5J08o2o3P3L3j04M0O9p4m6Q4oq1O9M5r1J8Q0l6o2Q8J0q2O1N2r5j6J00
3515E6j6q8O2M8q2J5P9n6m6Q2l5p8O6N0j17K4O6m3o2Q7J2n9J3O9n7n0P3j9n6P0
3545HM0r2j8R9p1k4R9qp5M3M8p4J1P0o7l3P4L9r0L0M1n4l9R4Kr8N3O2r7K0O7o4
3577dk7O9mq6N5M8p9l3P6l6l6P0jp4L6N5o9k2Q4k6m6L6N8j01K6Q0l6o9O3J3n7
3608c7L6N7p6qR3l1o9O9K4q8M0N8p0k8Q6k0n4K8L9j04K1R8o4p5P3K6r3L8O5o0
3638b6k3O2j4q4O2M1p0KP0m7m2R7l2m8M2P0q8J3N2k9m5O5J9r2M0Q8p9j7O4j4o1
3669b4M1K9r0M2M8o7j2P2k4o6J9P9q6nQ0m0o8O5J5r2L1P5o4j2P0k2m3L0O1q3j3
$$ plain form
3700 -54 37 -6 -20 40 27 -28 5 53 -4 -8 68 41 -37 52 44 -29 8 59 -18 -40 50 23 -53 14 18 -46 -36 24 12 -37 25 12
3732 12 -56 -36 17 -42 -70 12 -27 -56 -3 10 -55 -29 22 -27 -62 16 32 -65 -4 23 -38 -14 15 20 -27 25 40 -27 22 44 -18
3763 -18 -8 44 25 -22 47 21 -34 -23 46 -19 -33 10 -4 -58 -24 23 -47 -41 11 -23 -60 -10 0 -47 -33 3 -49 -39 4 10 -63
3794 -63 -12 19 -27 -36 33 -22 -56 39 39 -30 3 54 -22 -19 53 24 -32 48 47 0 -10 49 3 -5 41 27 -38 11 61 -44 -24 21
3826 21 -15 -73 18 13 -49 -32 7 -39 -49 5 -24 -65 -18 44 -63 -35 21 -11 -28 44 -7 -31 5 57 -9 -35 58 -13 -14 56 32
3857 32 -39 16 69 17 -6 48 33 -14 42 39 -19 19 46 -19 -48 21 12 -19 16 36 -21 -41 27 -33 -44 -4 -10 -68 -29 40 -40 -72
3889 -72 13 14 -31 1 39 -21 -7 33 1 -15 38 18 -41 18 57 0 -8 55 18 -18 38 55 -6 22 48 -22 -14 35 -2 -20 8 21
3921 21 -32 3 28 -12 -36 3 -3 -44 -9 8 -39 -43 20 -11 -66 12 15 -43 -22 26 -25 -42 28 -13 -34 18 33 -1 5 61 -13 -25
$$ packed form
3700e4R1m3j4O0j3n5L3M8n7mP6k7p8Q9qp3L7N1p7k2R0k7p6O7Mo4J0O0j2m9O2j3
3732A2o8K0N3n9k8Q2l9k9N3J3o5K6N1m9l5P8J6r7O1K7o1K4K9Nm7N2J5o7M9K2o2
3763a8J0N2j9m7O9k6n5J1O9o5j4M3j4n4L4M7p0ON2l4l7N0J0m7J4L6n2J0M3Op3
3794f3N1L1m6rO9n5l4R5%o9L3N1p6LP2k9n6Q0jm7j0N9m6qM6j4o5M9N0j05K0M5
3826B1l6n8R1no2J7L9m6j0N4k9m1M7O2j07K8N6l2j7P2n1k4L6N2o6k6R3p1jP0k4
3857C2p1N5N3n2k3N4j5m7N6ln8L8K7o5k9O9rl1L5K0n7k0O8o0j1M0on8L9O9q0l2
3889g2Q5Jm5L2L8o0J4M0l2j6N3k0n9N9L9n7qO3l7l6N6J7o1K8K6p0QM9l7j8K8J3
3921B1n3L5K5m0k4L9om1L5J7m7mO3l1n5P8Ln8K1M8n1j7P0m1k1N2J5l4ON6p4j2
$$ plain form
3953 -25 42 38 -8 30 51 14 17 38 -10 -11 42 36 -30 -16 27 -3 -33 12 11 -48 -3 -2 -38 -38 6 -3 -43 -5 -6 -61 -28 34 -11 -56 25
3988 25 -23 -51 15 -2 -29 -35 19 -18 -39 34 -7 -37 3 46 -18 -6 35 8 -7 30 31 -2 6 55 -16 -13 44 6 -11 12 -1 -49
4020 -49 -8 10 -7 -42 -2 -11 -48 -14 -5 -21 -28 29 -50 -35 -11 -23 -48 -4 27 -11 -39 18 17 -36 15 27 -14 -4 49 5 -28 35
4052 35 12 -38 25 34 20 37 56 13 -1 42 7 -21 2 7 -17 -28 26 -25 -39 -3 -5 -65 -23 6 -23 -57 -1 -8 -56 -23 -14 -51 -27
4085 -27 1 -26 -64 -15 15 -25 -5 34 22 -25 46 4 -35 22 46 -24 -2 62 4 -8 12 13 -22 33 39 -1 -29 14 -3 -24 2
4116 2 6 -20 8 -3 -30 -41 -17 -7 -31 -23 7 -40 -66 -12 -50 -41 -12 -23 -55 -20 35 -28 -15 22 -10 -22 17 7 -7 11 26 -7
4148 -7 -3 36 40 -6 28 43 -15 1 45 4 -4 25 20 -25 0 23 -41 -59 -7 -23 -60 -15 -31 -67 -51 0 -37 -57 5 -38 -34 -23 -23 -36
4182 -36 -36 -2 -27 -48 1 -10 -42 14 18 -22 -22 46 23 -13 24 29 -18 25 49 4 -21 19 25 -4 30 36 -22 4 33 12 -36 8 6 -37
$$ packed form
3953b5O7mm6L8K1l7LK1m8jN3oo6J4M3l0l0M5jn9M5Jl6%M4rm0L8jn5L3O2m5m5Q1
3988B5m8k8O6j7k7oN4l7k1P3m1l0M0M3o4J2M1k7j5L7Jl3QM9p1LN7l8j7K3j3m8
4020d9M1J8j7l5M0rl7L4Rj6pN7p9J5K4j2k5M4L1l8k8N7jn3N1J2m1J0N3m4l3O3
4052C5k3n0O3Rj4J7J9m3j4M3l5k8K3Nk4j1N4n1j4L6ko0M2K9k9l4N6pm8L3Rl7K4
4085b7K8k7l8M9L0m0K0L9j2m7P1m2l9N7K4p0K2O4n8j2K0Jl5N5Om0k8M3j7k1K6
4116BMk6K8j1k7j1K4J0k4QL0m7k6N4l8RK9j1l2L5N5o3J3L7l2j2L9j0j4J8J5l3
4148gML9Mm6L4J5n8J6M4m1qK9nm5K5K3o4j8N2j6l7M5j6l6J6N1l7k0O2m3MJ1%j3
4182c6%L4k5k1M9j1l2N6Mm0%O8k3l6L7Nm7M3K4m5k5M0Ok9L4On8K6K9k1m8M4km3
$$ plain form
4216 -37 -28 19 -36 -58 12 -23 -38 -15 -12 -27 -23 -9 -13 -40 29 -4 -38 -29 -2 -13 -2 21 -16 -15 6 11 -21 -1 27 21 -24 22 19 -2 20
4251 20 47 2 -5 49 1 10 33 -1 -30 15 19 -4 -18 15 -2 -29 -3 -8 -54 -24 -5 -34 -36 -9 -34 -49 -7 3 -33 -5 17 -24 -15
4284 -15 16 25 -17 13 35 16 -19 35 3 -2 28 51 -9 -5 49 2 -1 21 4 -14 13 17 -10 -14 31 -14 -29 3 11 -50 -3 3 -46 -31
4318 -31 -9 -23 -53 -3 -25 -69 -27 21 -33 -36 0 -17 -35 6 11 -5 -26 10 -8 -6 20 24 -25 24 42 -18 19 22 14 -3 37 14 -26
4351 -26 7 33 -12 -11 18 11 -28 -15 13 -21 0 3 -1 -30 11 -19 -54 -16 -24 -44 -24 10 -25 -39 -4 14 -34 -29 11 -7 -19 27 11
4384 11 -26 22 25 -2 1 24 22 -11 21 32 -2 32 31 -3 -1 35 8 -32 18 22 -8 9 32 -17 -26 7 -12 -28 -19 -11 -38 -34 5 -49 -51 -1
4420 -1 -13 -38 -35 -8 -34 -7 6 -6 -31 -4 14 -50 -4 5 -13 -6 4 -7 -21 8 17 20 -4 34 21 -6 37 36 -3 8 33 -23 -17 15
4454 15 10 -23 18 3 -30 -26 10 -26 -51 -17 -16 -43 -4 8 -22 -34 -2 -31 -40 -15 -4 -19 12 26 -17 -8 22 -1 -5 31 38 -1 23 32
$$ packed form
4216c7RM7n5k2P0l5j5K3Lj5MJ4mk7O9l3l4RK7j1J1K3l7JK1Nl2K0K8om5M6lk1K2
4251B0K7m5pN4m8RK3l4k9M5Mk3j4L3j7k7K6nm6L0J9k9kK7k5j5M2J0l6K8K2m1R
4284a5L1Rm2L0K2j9l5N4l2nL0K3o0MN4m7lK2j7j8K7Mk7mM5m5j5L2Qo1M7Om9J5
4318c1K2j4l0N0k2m4M2M8n4lL6j7j8M1Nj6k1L6j8KK6Mm9M9J8o0L7Lqj7M0k3m0
4351b6L3K6m5JK9pl9J3K8l4K1Lmk9M1l0l5L8qk0K0L4l5j4L5J8m8NM0j8j2M6j6
4384A1l7M8Lk7LK3kl3L2J1l4L4jl4KL6k7m0N0Ml0J7K3m9rL3j9j6RQk7ML9n4kN0
4420aj2k5LK7k6K7J3j2k5K7J8o4M6Rj8PJ0j1j4K9RLk4L8j3k7M3jl9J1K5n6OL2
4454A5nl3M1j5l3ML6l6k5L4Jk7L9J2l0j2L2k9rK5J1j5L1J4m3RL0k3mL6Pl9K4R
$$ plain form
4488 32 -3 11 28 14 19 29 9 -15 -7 41 23 -24 8 14 -4 3 10 -27 -8 -10 -17 -4 -15 -6 -33 -27 -2 -35 -32 -18 8 -28 -36 -4 -16 7
4524 7 -16 -13 -20 -5 18 -10 -4 39 5 -19 29 26 -3 32 60 15 20 47 40 -3 40 21 -9 0 34 -12 20 18 0 -17 12 12 -36 8 -4
4559 -4 -27 -29 1 -8 -9 -20 2 -34 -20 -23 -20 -26 9 1 -33 -15 -3 -5 -22 13 -9 7 31 40 16 2 21 16 5 50 14 -14 -6 26 3 4 36
4596 36 -7 -18 26 4 -23 -13 18 -4 -22 -8 -9 -39 -12 -7 -14 -32 -10 -35 -31 -5 0 -29 -12 9 -2 -8 10 -8 -34 11 -9 -14 10 11
4630 11 18 -2 32 12 -3 21 19 0 9 25 -2 -19 20 20 -9 15 3 13 -18 22 4 -11 2 -16 -22 -16 -20 2 -30 24 -28 -36 -12 -12 -53
4665 -53 -35 -20 -23 -23 -23 0 -24 6 4 -2 3 35 7 -18 6 36 -22 -6 40 -17 -8 40 20 6 36 33 1 -5 12 12 6 20 2 -28 22 4
4701 4 -18 -4 2 0 -44 -27 -4 -40 -13 10 -32 -16 1 -19 -34 -28 7 -47 -20 2 -4 3 -11 -7 -28 -20 15 8 13 27 8 -3 20 37 8
4736 8 -9 45 2 -14 24 10 -18 -7 12 -23 8 -10 -4 -27 -11 -10 -33 -30 -13 -30 -32 -10 -23 -16 -3 -24 -48 -22 14 -23 -21 -9 -6 -26
$$ packed form
4488C2l5J4J7j4NJ0k0k4QM8j8m7L2Oj8PPl7J9kpJ3j1Rk7OK5l3LJ4K6l6qL2j2K3
4524Gk3LpJ5K3k8OM3l4k4M8lk9L5K8m5NK7pm3M3j9l0RL4m6L2kj8j7K9%m8M4j2
4559dk3kL0rjj1K2l6J4lLoL5ql4J8J2kj7L5k2J6K4Rk4j4J9nj1M5l6k8QL2k3JL2
4596C6m3j1M4k2k7J0L1k2j8J4jl0K7Npj8K2k5MK6Nk9J7K1j1oJ8j8k6M5k0nK4J
4630A1Pk0L4k0j5K4kj9RJ6k7j7L9%k9K4j2J0l1M0j8j5J3j8oOmK2l2N4n2qK4%m1
4665e3J8J5l%%K3k4L0koNL2k8k5K4L0n8J6M6n7RM8k0j4L0ll2oJ7%oJ4j8l0N0j8
4701Dk2J4Okm4J7K3l6K7K3m2J6J7k0j5OL5n4K7K2oPj4Mk1QL5pNJ4j9j1K3J7k9
4736Hj7N4m3j6L8j4k8J1J9l5L1j8Ok3J6Jk3LJ7j7kK2j3PJ3k1k4K6L6l7KJ2Lk0
$$ plain form
4770 -26 -10 29 -14 -2 28 6 -11 16 22 -5 22 22 14 13 36 34 -1 39 49 8 10 13 -6 -2 8 10 -25 3 -11 -27 -18 1 -13 -35 -9
4805 -9 -11 -32 -21 4 -28 -22 -2 -31 -27 -11 -3 -24 -18 5 -2 -28 26 5 -31 7 13 3 -11 23 6 4 29 46 1 14 24 28 38 22 39
4840 39 7 16 20 -19 -6 -5 -5 -15 -5 -9 -42 -43 -16 -19 -7 9 -27 -54 -5 10 -35 -33 -8 -12 -21 -6 -13 -8 6 -11 0 3 21 1 4 16 22 6
4878 6 8 21 24 7 25 18 3 33 18 26 7 55 7 29 15 2 -12 -11 7 -7 -2 -18 -19 -26 -7 -21 -24 -12 0 -19 -23 -23 -17 -43 -6 2 -23
4915 -23 -9 19 0 -2 18 3 7 25 27 28 0 41 9 14 20 30 18 16 31 27 7 53 14 1 17 17 6 11 14 -1 -17 6 -3 -27 11 8 -15
4952 -15 -3 2 -3 -16 9 -11 -30 -3 2 10 -25 -7 3 -15 5 -15 -12 20 13 12 10 6 24 28 29 38 13 19 49 12 0 13 12 -2 -7 12 26 3
4990 3 5 -13 -29 -1 14 -25 -23 12 -22 -30 -19 -18 -36 0 -2 -18 -21 -23 -30 -24 -8 17 -7 -27 20 -17 10 21 -12 -10 10 18 15 -13 25 15 7
5027 7 19 44 7 17 7 30 24 -7 30 -1 -9 2 -23 10 -10 -24 -27 -11 -8 -11 -24 -16 -55 -24 -6 -14 -34 -32 -14 -38 13 -9 -5 11 2 4
$$ packed form
4770b6J6L9m3J2L0k2j7K7Ok7K7%qjK3kl5M0J0m1KLj9MJ0Kl5K8j4j6RJ9j4k2K6
4805ikk1J1K5l2OK0k9MJ6Qk1OK3pk6N4k1l6L8Oj0j4L4j7kK5J7m5J3J0MJ0j6J7
4840C9l2RMl9J3J%j0J0ml3jK7lJ2J6l6k7M9J5m5KK5mrJ5pNJ4j7J1LJ8k0LJ2Oj6
4878FKJ3Lj7J8pj5L0j5Qj9M8m8K2j4j3j4JJ8j4Nj6jpJ9j4lJ2J2j9m%Ok6L7Qk5
4915b3J4K8j9kK0j5MJ8KJk8M1l2NOJ0j2kJ5mk0M6l9j3J6%j1NLj5j6K3rk4L8lk3
4952a5J2Nnj3K5k0j9K7NQl5J8J0j8K0k0LL2pjkmJ8MJRk5OL0l7j2J3jj4nJ9J4k3
4990CKj8j6K8J5l9KL5l4qJ1Jj8L6kj6lkpOJ6K5k4k0M7l7K7J1l3KK0Qlk8L8j0q
5027GJ2K5l7J0j0K3ol1L7l1qJ1k5L3k0j4lJ6Llj3Ql9L1J8qk0KJ8k4N1k2MJ6rK
$$ plain form
5063 4 -14 10 3 -6 16 -4 -2 28 -4 15 2 40 19 8 37 23 5 -10 16 20 13 4 32 -7 -6 -15 -10 4 7 -10 -47 -3 -11 -22 -22 0 -19
5100 -19 -16 0 -24 -50 4 -18 -26 -17 6 28 -27 7 -10 3 2 12 -5 3 6 24 17 -8 4 12 4 -17 -6 -19 12 8 0 6 22 -2 -10 4 1
5137 1 -18 0 -14 -21 -24 -6 -18 -16 -12 -29 -27 -12 9 -33 -35 -25 7 -20 -18 -10 -32 -36 8 -10 -9 1 -8 -7 33 9 -1 8 30 10 14 42 31 6
5175 6 12 14 17 -9 10 14 -2 2 -13 -7 -2 13 -8 -24 -8 -8 -19 -19 -19 -32 -27 -26 -12 -22 1 -16 -17 -21 4 -16 -11 -32 -11 9 -16 9 11 -15 8
5214 8 4 -11 6 12 14 19 17 19 8 23 24 19 46 10 -1 2 0 9 4 3 -26 -18 -8 -10 -26 -29 -25 -40 -23 -22 -25 -33 -33 -11 -38 -14 17 -26 1 -18 -20 -3
5256 -3 -18 -3 -12 10 -9 -9 -2 4 -4 -3 -30 -4 22 36 16 21 1 18 -5 5 13 17 -2 6 -17 -3 10 -4 -9 -2 -20 -1 -18 -17 -22 -36 -47 -25
5294 -25 -38 -41 -32 -54 -25 -1 -46 -36 -15 -10 -18 -32 -3 -11 6 -4 10 10 29 17 19 11 -2 4 2 -12 7 28 -11 -2 25 7 19 15 3 3 13
5331 13 0 14 -8 -26 -19 1 -11 -41 -19 -11 -40 -13 11 -17 -17 -20 -26 -28 -20 7 -24 -16 -16 -26 1 -14 17 -9 10 9 18 -4 10 23 30 1
$$ packed form
5063Dj8K4prK2k0KL0l2J9j3L8k1j1K9j4j8j5K6MprK8l9JrNJ4Lj7l7M4qj1%K2j9
5100a9LJ6k4k6N4k2qRK3K2n5L4j7J3jJ0j7QLJ8pk5J2Qqk1J1j3L1mqOJ6k4qJ4l
5137Aj9J8j4plJ8j2KMj7KJ5K1m2kJ0L2k7KQk2mM4j8JJ0rJM0k4j0RK2k0MK8j1k5
5175FOKLk6J9Mj6Mj5ONJ5k1j6J6%j1%%j3NJJ4j0K3j7jmK5k0Nk1K1K0k5K5Kk6K3
5214Hmj5J7OKNkKj1J5JnK7l6j1LkRnjk9QJ0kj6lMj5J7Jlq%K2k7K4L1m3K7j9kJ7
5256cj5J5rK2j9%POqJk7K6K6J4k0Nk0J7k3J0QMj9Qk3J4J3j4nPj8J9j7Jnj4j1K2
5294b5j3lRk2K9K4m5J0K1Nqj4K9qJ7j0J4%J9j2Kqj3Okj4J9K1l9RK7j8J2mj2%J0
5331A3j3J4k2j8PK0j2l0K2Qk9K7K4k8%lokQK7l1Q%j0K7j5L1k6J9jRk2J4J3Pk9
$$ plain form
5367 1 -2 20 31 -2 22 -8 18 21 -18 -1 -3 20 -26 -1 6 -34 -5 -26 -18 -26 -11 -13 -32 -14 -6 -33 -35 -37 -20 -29 -24 -21 -24 -18 -18 -2 2 1 -7 -18
5407 -18 -4 -5 7 21 27 -2 -4 27 40 21 28 42 33 16 9 7 13 -6 0 -4 4 -10 0 -4 -23 -32 -10 -8 -2 -19 -37 -16 -8 -19 -22 -22 -26 -31 -38 -4 -29
5448 -29 -2 8 5 4 9 8 2 -1 9 -11 9 11 20 17 5 14 -4 14 31 2 7 22 19 9 -1 13 -13 4 1 -2 -15 8 -12 -32 -15 -19 -20 -9
5486 -9 -26 -31 -25 -36 -9 -63 -18 -28 -36 -26 -7 -14 -1 -21 7 -13 28 18 24 23 31 7 16 14 21 21 -6 -13 1 15 17 28 -15 11 20 -2 11 4
5524 4 11 17 14 -6 15 -20 -9 -34 -12 -9 -16 -11 -26 -18 -23 -47 -26 -31 -43 -30 0 -18 -12 -9 -23 -16 -22 -46 -19 12 11 -9 -4 17 22 15 15 13 -8 6
5564 6 -1 1 -17 6 6 0 -5 -4 -11 -11 -23 -31 -20 -5 -15 -18 -22 -14 -42 -17 -24 -31 -30 -8 -29 -4 -25 0 -12 -29 -9 -31 -26 -13 -17 -18 4 -11 0 9
5604 9 2 22 13 14 22 16 3 19 16 22 17 -2 9 15 9 -7 -21 -14 -21 -8 -4 -10 -8 -38 -18 -18 -31 -19 -33 -15 -22 -22 -24 -29 -21 -30 -1 -24 -34 -11 -9 -13 4
5647 4 -9 11 -17 -23 -16 17 -2 -27 -1 12 -4 18 10 15 7 14 10 17 2 10 2 -1 8 7 19 -16 -14 -8 -14 -42 -22 -19 -21 -5 -34 -38 -36 -15 -27 -24 -33 -2
$$ packed form
5367AlK2J1l3K4l0K6Ll9J7kK3m6K5Pm0K9k1QqJ5kj9J8Qk7kkJ7rNLlO%J6Mjqj1
5407a8J4jJ2J4Ok9kL1J3j9PJ4rj7pkOj9OmQj4J0mj9rK2KOj7j8K1Qj1l%mnpL4k5
5448b9K7J0ljNjolJ0k0K0KRlj2Rj8J8J7k9NJ5lj0j0J4k6J7llj3K3k0k0J7mjJ1
5486ij7nOj1K7n4M5j0qJ0J9pJ3k0K8k0M1j0OjQk4RkP%k7pJ4J4KJ1m3K6Rk2J3p
5524DPOlk0K1l5J1k5K2LpNj5Qnk4K1nj2J3L0j8OLj4Pok4K7L1jk0NK1Np%kk1J4
5564FpKj8K3%onJp%j2qJ1J5j0lmQk8K5ppJK2k1K5k1K5j2j7K0k2NJ3mjK2j5J1R
5604IpK0rJQoj3J6lOnj9J1Ooj6j4PpJ3MoKl0K0%j3J2j4J8p%knQrK9k3j0K3KmJ7
5647Dj3K0k8oPL3j9k5K6J3j6K2qNqPmPj5QqlRjJ2l5KOok8K0LkJ6k9mKK1j2LrL1
$$ plain form
5689 -2 -22 -10 -30 -8 -8 -2 -29 -18 11 -4 18 0 13 10 -8 6 5 6 3 4 21 12 2 27 8 4 10 -2 -6 21 2 2 -6 12 5 -25 -21 -17 -20
5728 -20 -31 -8 -30 -43 -17 -15 -30 -44 -18 -50 -19 -19 -18 -7 -12 -31 14 2 0 15 -15 14 14 14 2 35 14 0 16 -1 13 24 17 -26
5762 -26 -1 22 -7 -12 29 18 7 -10 10 -3 -5 7 -5 -42 -22 -17 -9 -26 -13 -30 -11 -24 -17 -18 -2 1 -10 -27 -19 -8 -15 -9 3 -19 -13 8
5798 8 -2 14 4 4 -6 16 12 8 9 8 18 -2 23 12 6 22 27 -10 -14 -19 9 -29 -28 -15 -49 -26 -24 -5 -5 -30 -17 -35 -12 -15 -29 -34 -26 -25 -19
5837 -19 -10 -24 -23 -8 -2 -6 -6 -19 -22 -4 33 25 14 37 6 29 31 39 18 11 28 20 13 -1 47 20 11 25 4 14 7 0 -23 -26 -28 -27 -15 -21 -30 -22 -18
5878 -18 -18 -13 -17 -16 -8 -11 -5 -35 -19 -19 14 -8 -15 -20 7 -17 9 13 -5 0 30 15 22 28 15 -7 16 6 -17 11 10 9 18 26 -2 -4 6 10 -25 -5
5918 -5 -26 -4 -3 -14 -25 -34 4 -21 -46 -30 -28 -32 -24 -20 -8 -17 -15 2 -25 1 -17 20 2 2 5 7 32 35 18 -8 27 7 9 8 26 11 7 22
5956 22 7 7 15 -6 -2 -5 -3 -14 -7 -18 16 -36 -10 -3 -19 -6 -17 -43 -15 -17 2 -32 -14 -31 -36 -21 -29 -11 -35 -8 -25 -30 -3 14 17 -10
$$ packed form
5689bk0J2k0K2%Ok7J1K9j5K2j8J3lj8J4jJlJJ7rj0K5j9mOj2mK7j9%qJ8pl0MMl
5728b0j1K3k2j3K6Kj5j4K6l2L1%JJ1nj9M5j2kJ5l0K9%%j2L3k1j4J6j7J4J1pm3
5762b6K5K3k9nM1j1j1j7K0j3kJ2j2l7K0NQj7J3j7J9j3PjJ6Lj1j7QJ1pOJ2k2OK1
5798Hj0J6j0%j0K2mmJjJ0k0K5j1oJ6Nl7mnK8l8JJ3l4K3KJ9%k5J3j8K3lj4nQJO
5837a9Rj4JJ5Om%j3lJ8L7qj1K3l1K3KQk1pJ7qpj4M8k7rJ4k1J0ppk3lkJJ2orQM
5878a8%NmJQlOl0J6%L3k2pnK7k4K6Mj8NL0j5POj3k2K3j0k3K8jjRQk8kJ0Ml5K0
5918ek1K2Jj1j1rL8k5k5J6KmQMJ2rKJ7k7K6j8L7j8%LKK5Lj7k6L5k0KjJ8j5mJ5
5956B2j5%Qk1MlKj1Pj1L4n2K6Pj6J3j1k6K8kJ9l4J8j7nJ5qJ8k4K7j7nK7J7Lk7
$$ plain form
5992 -10 32 30 6 9 23 13 8 6 29 24 6 24 12 11 21 -10 -3 8 14 -15 -28 -2 -2 -3 -30 -26 -22 -10 -9 -29 -21 -37 -18 -25 -21 -9 -24 -20 -1
6031 -1 -10 -2 -6 -30 -17 15 -5 0 -14 18 -8 -1 6 2 21 11 2 24 22 21 17 -4 11 22 -22 20 -4 -26 -1 -12 -5 -26 -21 -22 -23 -26 -12 -36 -22
6070 -22 -3 -28 -28 -7 -27 -38 -32 3 -9 -31 -13 -2 -19 3 -10 -7 6 10 -10 -15 -7 -5 -12 -5 0 12 22 8 13 -7 24 27 -5 19 3 9 5
6107 5 21 1 -24 -22 8 -27 -31 -17 -21 -11 -25 -12 -30 -13 -25 -30 -15 -22 -13 -17 -18 -14 -11 -6 -4 -11 -4 2 -4 -2 4 23 -8 14 17 13 4 -3 7 5 31 17
6149 17 10 1 24 0 -6 -31 -17 -32 -6 -1 -6 -32 -2 4 -32 4 -7 -32 -37 -16 -21 -14 -19 -28 -45 -19 -12 -23 -21 -18 -32 -29 -13 -31 -9 5 16 -1
6187 -1 -1 10 13 1 -5 22 1 4 23 -5 10 22 0 -21 5 9 -14 7 4 -11 -15 13 -3 -13 -13 0 -9 -39 -22 -42 2 -33 -10 -12 -20 -17 -9
6224 -9 -36 12 -18 -44 -16 -11 -18 5 7 7 -22 -21 -4 5 -8 26 -6 17 32 15 5 12 45 21 19 13 11 20 20 22 -25 -9 9 -17 -21 -15 -4 -33
6262 -33 -19 -11 -30 -28 -31 -52 -49 -21 -10 -38 -8 -14 -21 -31 -15 10 -31 -20 6 16 17 1 -18 -15 1 3 -2 22 15 14 31 23 27 0 24 21 20 14 -2
$$ packed form
5992a0M2kk4LJ4j0nkK3nj8J8j2jJ0l1PJ1Ok9j3K6%jk7MMJ2Jk0Qj6J9pMJ2j5MJ9
6031arQmk4J3L2k0Nj4L2k6PPmJ9j0rK2kjmk1J5J1m4M2k4k2K5j1Pk1NjjlJ4k4J4
6070b2J9k5%K1k0j1OL5j2k2J8J1j7K2j3LJ3Mk0nQKpPNJ2J0j4Nk0L1Ll2K4j6Om
6107EJ6k0k5KL0l5mJ4mJ0j4J3j8J7j2nJ5pRmjMLNKpPOoKOJ9l1K2LmrpJ0kK6j4
6149A7prK3k4ok5J4j5K6Nnk6L0Ol6L6j1k5nK1nPnrj7K6Pj1KLj4LJ6j8K2J4J1j7
6187a%J1Lj2oK7k1LJ9k8J5J2k2k1K6Mk3K1lj5mK8j6j0%J3rl0J7k0M4l5K3kqLQ
6224ik7M8l0k6K8NpK3K%k9JJ7Rj3L4l2K3J5j7j0PL3k4kokR%Km7J6J8k6mOJ1k9
6262c3J4Qj9Klk1LK8J1k8L0opj0J6K5m1J1K6J0Jj6j9LJ6KnK4pjJ7qMk7K4ljoj6
$$ plain form
6301 -2 27 8 1 -1 11 -6 -6 -16 -40 -6 -42 -42 -33 -30 -35 -31 -25 -25 -47 -7 -25 -30 -19 -5 -30 -24 23 -21 5 23 -8 6 24 15 3 -4 16 3
6339 3 7 14 21 15 7 3 -2 9 12 4 -9 0 7 -6 0 -3 -2 -33 12 -6 -18 -10 -20 -22 -25 -29 -42 -41 -36 -2 -29 -24 -31 -47 -26 -9 -17 1 -5 24 3 -14 24
6382 24 18 0 28 11 -12 10 17 -1 14 23 23 0 17 38 -8 13 16 -7 3 4 5 -16 8 2 11 -14 0 -13 -19 -12 -16 -22 -23 -17 -3 -12 -32 -12
6420 -12 -24 4 -13 -9 -15 -13 -20 7 16 10 -11 15 9 0 10 18 6 -3 25 20 -1 32 25 32 35 20 22 -12 4 -8 -7 -14 -5 -40 -15 10 -14 -12 -17 -11 -13
6461 -13 -8 -25 -17 -8 -11 -5 -9 -16 15 -19 -13 -4 -33 -16 -1 1 -24 22 20 7 -2 20 11 -4 7 17 26 -5 41 30 17 17 15 13 22 22 10 17 3 9 11
6502 11 -34 -6 -23 -1 -30 -16 -40 -22 -31 -14 -3 -28 -46 -9 -10 -10 -6 5 10 -31 -10 10 10 5 20 13 12 21 33 11 6 28 29 3 8 24 7
6539 7 16 17 2 5 26 9 2 24 7 -12 -15 13 -5 -20 -16 -36 -29 -34 -28 -27 -24 -6 -32 -26 -20 -20 -46 -41 -12 -29 -3 -21 -35 -16 5 4 7 8 5 20
6579 20 28 0 35 18 25 29 12 32 19 15 3 9 13 0 -4 15 5 -17 -14 1 -1 -15 1 -19 -22 -11 4 -22 8 -14 -28 -11 -24 -35 -31 -20
$$ packed form
6301bK9j9pkJ2j7%j0k4L4l6%RLnMO%k2M0j8nJ1J4k5OM7m4K6J8l1J4J8rj2pK0j3
6339CMPPoqmnJ1Lqj3RPj3OlJl1M5j8j2Qj0klmj3JNL4k7Npj6K1J7qJ8oK9k1j7L8
6382B4oj8K8j7k3K2Pj8J5R%k3J7K1m6K1Lk3J0JJk1K4oRk5J4j3oPmojOJ4rk0K0
6420a2j2K8j7MoKpK7Rok1K6orJ0Qj2rK8nk1L3pPLj5Kl4J6j2JpRl5K5K5k4KnOk
6461a3Nj7QRlOmpL1l4ORk9J7J5Kk5M6kj3rK2rj5J1J0Rl1M6j1j3%kkR%j2Pj4OK
6502A1m5K8j7K2k9J4k4J8rJ7J1k5j8L7j%MJ1Nm1K1K0%nJ5pjRJ2k2nK2Jk6NJ6j7
6539GRJj5LK1j7pK2j7j9lK8j8j5Mk0PnOJLJ8k6OO%k6NK9j7K6j8j4J9K1jLJlJ5
6579B0Qk8L5j7PMj7K0j3mj2OMj3mJ9j0k2LJ5kj4J6k0lJ1J5k6L0k2j4J7j3j1MJ1
$$ plain form
6615 -20 -20 -23 -20 5 -30 -13 19 -4 5 -3 6 12 44 24 12 20 12 21 27 20 24 20 9 26 0 11 10 -5 1 6 -8 -27 -14 -18 -24 -1 -8 -29 -21 -17 -7
6656 -7 -17 -10 -1 -40 -22 -8 -6 -25 5 -13 -8 -5 5 13 0 18 -3 16 20 24 4 24 19 6 22 43 26 16 9 26 16 -10 -1 23 17 7 17
6693 17 -6 4 13 -7 -31 4 -8 -30 4 -8 -37 -59 -13 -23 -31 -18 -6 -20 -35 11 5 3 -3 -14 2 7 7 -7 -12 6 0 -2 6 28 34 26 30
6730 30 4 1 9 25 16 -7 26 3 11 10 -3 8 10 -14 -13 -14 -1 -31 -23 1 -18 -39 -2 -8 -59 -21 -33 -28 -13 -1 -10 -29 -10 8 -16 -19 20
6767 20 4 15 -5 21 15 27 33 30 20 18 13 -10 -5 15 -5 24 11 17 -1 11 18 0 15 -22 -26 -16 0 -3 -41 -22 1 -43 -37 -19 -30 -27
6803 -27 -18 -22 -45 -37 -29 -38 -35 14 -11 -8 -14 5 -28 -12 -5 -15 3 9 10 -10 8 29 24 17 31 24 6 26 8 8 3 2 11 17 19 -22 -18 9 -16 -9 -31
6844 -31 -36 -17 -25 4 -21 -29 -13 -27 -12 -15 -7 6 6 -3 -4 -26 -26 -23 -1 -7 -7 4 3 0 3 4 -2 3 12 18 46 31 18 19 12 22 -5 40 7 10 -23 14
6886 14 7 -11 -15 -22 -7 -31 -12 -22 -14 -28 -43 -64 -51 -29 -18 -13 -27 -8 -14 -17 -21 -11 -2 9 -30 1 5 -11 -17 -7 -9 10 -9 -3 3 -1 5 14 -9
$$ packed form
6615b0%lLK5l5J7L2k3RqROL2k0j2QqROpMmj1J7k6J1jj5ONj4j9J3moK3pk1QMJ0
6656gj0PRl9J8J4Kj9L0j8NLJ0Qj3J8k1J9MMk0K0nj3J6K1j7j0pJ7j0k6RK4oj0J0
6693A7k3J0Rk0k4L5j2k2L4j2k9k2M6j0qJ3J2j4j5M6okoj1J6N%j4nJ8okQK2OqM
6730C0k6lQJ6rk3L3k3Qjj3J1Kk4JjJ3l0QK4j9k1L7on1L8j2NJ5J2rj9J9J8k4lL9
6767B0j6J1k0K6oJ2Olj0knk3NK0k0K9j3Oj8J2Pj8J5l7mJ0J6ll8J9K3m4OJ8j1L
6803b7Rmk3QQrLM9k5LoJ9l3J6Pj0J8OJk0J8K1npJ4pj8K0j8%njROKm1MK7k5Pk2
6844c1nJ9qK9k5qJ6j4J5lQJ3%rjk2%LK2o%J1jlLJoNROK8j5j3JpJ0k7M5l3Ll3L7
6886A4pj8mpJ5k4J9j0Qj4j5k1J3K2J1Nj4J9olmJ0RJ1l9L1Mj6oJ0kJ9j9OOmORk3
$$ [...]
8191A5
##END NTUPLES=NMR FID
##END=
