##TITLE=H1
##JCAMPDX= 6.0         $$ Bruker NMR JCAMP-DX V2.0
##DATA TYPE= NMR SPECTRUM
##DATA CLASS= NTUPLES
##ORIGIN= UXNMR, Bruker Analytische Messtechnik GmbH
##OWNER= root
$$ XWIN-NMR		Version 3.5
$$ Mon Feb 22 12:08:11 2016 Russian Standard Time (UT+4h)  servis@DPX200
##.OBSERVE FREQUENCY= 200.131235884673
##.OBSERVE NUCLEUS= ^1H
##.ACQUISITION MODE= SIMULTANEOUS
##.ACQUISITION SCHEME= undefined
##.AVERAGES= 32
##.DIGITISER RES= 18
##SPECTROMETER/DATA SYSTEM= spect
##.PULSE SEQUENCE= zg
##.SOLVENT NAME= CDCl3
##.SHIFT REFERENCE= (INTERNAL, CDCl3, 0, 17.6849)
##AUDIT TRAIL= $$ (NUMBER, WHEN, WHO, WHERE, WHAT)
$$ ##TITLE= Audit trail, XWIN-NMR		Version 3.5
$$ ##JCAMPDX= 5.01
$$ ##ORIGIN= Bruker BioSpin GmbH
$$ ##OWNER= servis
$$ F:/spectra/data/servis-vadim/nmr/H1/1/pdata/1/auditp.txt
$$ ##AUDIT TRAIL=  $$ (NUMBER, WHEN, WHO, WHERE, WHAT)
(   1,<2016-02-22 12:06:53.14 +0400>,<servis>,<DPX200>,
      <created by zg, POWCHK disabled, PULCHK disabled
       configuration hash MD5:
       00 E9 B6 7A A2 85 ED C7 34 08 36 98 17 FE 4E 26
       data hash MD5: 16K
       C3 B4 2F FB 22 EC 39 C8 04 B9 5D 14 38 03 DD B1>)
(   2,<2016-02-22 12:07:06.45 +0400>,<servis>,<DPX200>,
      <Start of raw data processing
       efp BC_mod = 2 LB = 0.3 FT_mod = 6 PKNL = 1 PHC0 = -27.32391 PHC1 = -0.3563094 SI = 32K 
       data hash MD5: 32K
       90 22 E1 52 02 4A E9 26 8C 30 C8 75 F7 B3 62 50>)
(   3,<2016-02-22 12:07:18.51 +0400>,<servis>,<DPX200>,
      <pk PHC0 = -0.9332688 PHC1 = 0 
       data hash MD5: 32K
       81 EC 78 FC AC 7B EA 3B 83 DE E2 75 00 CF E2 A3>)
(   4,<2016-02-22 12:07:21.57 +0400>,<servis>,<DPX200>,
      <abs ABSG = 5 
       data hash MD5: 32K
       6C A8 5F 2F B8 2A CF 50 58 13 15 EC 02 80 13 0C>)
(   5,<2016-02-22 12:07:33.26 +0400>,<servis>,<DPX200>,
      <abs ABSG = 5 
       data hash MD5: 32K
       E8 AF B2 CF E0 2B 82 CA F4 37 E1 CC F7 D2 06 A8>)
$$ ##END=
$$ 
$$ hash MD5
$$ 5B BF 64 07 6C 79 F6 09 20 BD 23 70 1A 80 24 1C
##$RELAX= 
##$RELAX= 
##$RELAX= 
##$RELAX= 
##$RELAX= 
##$RELAX= 
$$ Bruker specific parameters
$$ --------------------------
##$DU= <F:/spectra>
##$EXPNO= 1
##$NAME= <H1>
##$PROCNO= 1
##$TYPE= <nmr>
##$USER= <servis-vadim>
##$AMP= (0..31)
100 100 100 100 100 100 100 100 100 100 100 100 100 100 100 100 100 100 
100 100 100 100 100 100 100 100 100 100 100 100 100 100 
##$AQSEQ= 0
##$AQ_mod= 1
##$AUNM= <au_zg>
##$AUTOPOS= <>
##$BF1= 200.13
##$BF2= 200.13
##$BF3= 200.13
##$BF4= 200.13
##$BF5= 500.13
##$BF6= 500.13
##$BF7= 500.13
##$BF8= 500.13
##$BYTORDA= 1
##$CFDGTYP= 0
##$CFRGTYP= 5
##$CHEMSTR= <none>
##$CNST= (0..31)
1 1 145 1 1 1 1 1 1 1 1 1 1 1 1 1 1 1 1 1 1 1 1 1 1 1 1 1 1 1 1 1 
##$CPDPRG= <>
##$CPDPRG1= <>
##$CPDPRG2= <>
##$CPDPRG3= <>
##$CPDPRG4= <mlev>
##$CPDPRG5= <mlev>
##$CPDPRG6= <mlev>
##$CPDPRG7= <mlev>
##$CPDPRG8= <mlev>
##$CPDPRGB= <>
##$CPDPRGT= <>
##$D= (0..31)
0 1 0 0 0 0 0 0 0 0.06 0 0 0 0 0 0 0.0002 0 0 0 0 0 0 0 0 0 0 0 0 0 0 
0 
##$DATE= 1456128412
##$DBL= (0..7)
$$ [...]
##$SUBNAM4= <"">
##$SUBNAM5= <"">
##$SUBNAM6= <"">
##$SUBNAM7= <"">
##$SUBNAM8= <"">
##$SUBNAM9= <"">
##$SW= 20.6817932712277
##$SWIBOX= (0..15)
0 0 3 0 0 0 0 0 0 0 0 0 0 0 0 0 
##$SW_h= 4139.07284768212
##$TD= 16384
##$TD0= 1
##$TE= 0
##$TE2= 300
##$TE3= 300
##$TEG= 300
##$TL= (0..7)
0 120 120 120 120 120 120 120 
##$TP= (0..7)
150 150 150 150 150 150 150 150 
##$TP07= 0
##$TPNAME0= <>
##$TPNAME1= <>
##$TPNAME2= <>
##$TPNAME3= <>
##$TPNAME4= <>
##$TPNAME5= <>
##$TPNAME6= <>
##$TPNAME7= <>
##$TPOAL= (0..7)
0.5 0.5 0.5 0.5 0.5 0.5 0.5 0.5 
##$TPOFFS= (0..7)
0 0 0 0 0 0 0 0 
##$TUNHIN= 0
##$TUNHOUT= 0
##$TUNXOUT= 0
##$USERA1= <user>
##$USERA2= <user>
##$USERA3= <user>
##$USERA4= <user>
##$USERA5= <user>
##$V9= 5
##$VALIST= <valist>
##$VCLIST= <CCCCCCCCCCCCCCC>
##$VD= 0
##$VDLIST= <DDDDDDDDDDDDDDD>
##$VPLIST= <PPPPPPPPPPPPPPP>
##$VTLIST= <TTTTTTTTTTTTTTT>
##$WBST= 1024
##$WBSW= 4
##$XGAIN= (0..3)
0 0 0 0 
##$XL= 0
##$YL= 0
##$YMAX_a= 32311
##$YMIN_a= -68646
##$ZGOPTNS= <>
##$ZL1= 120
##$ZL2= 120
##$ZL3= 120
##$ZL4= 120
##$ABSF1= 17.68489
##$ABSF2= -2.997055
##$ABSG= 5
##$ABSL= 3
##$ALPHA= 0
##$AQORDER= 0
##$ASSFAC= 0
##$ASSFACI= 0
##$ASSFACX= 0
##$ASSWID= 0
##$AUNMP= <proc_1d>
##$AZFE= 0.1
##$AZFW= 0.1
##$BCFW= 0
##$BC_mod= 2
##$BYTORDP= 0
##$COROFFS= 0
##$CY= 18.4799938201904
##$DATMOD= 1
##$DC= 0
##$DFILT= <>
##$DTYPP= 0
##$F1P= 9.9274215381318
##$F2P= -0.165520771350173
##$FCOR= 1
##$FTSIZE= 32768
##$FT_mod= 6
##$GAMMA= 0
##$GB= 0
##$INTBC= 1
##$INTSCL= 1
##$ISEN= 128
##$LB= 0.3
##$LEV0= 0
##$LPBIN= 0
##$MAXI= 10000
##$MC2= 0
##$MEAN= 0
##$ME_mod= 0
##$MI= 50
##$NCOEF= 0
##$NC_proc= -8
##$NLEV= 6
##$NOISF1= 3.799351
##$NOISF2= 2.8
##$NSP= 0
##$NTH_PI= 0
##$NZP= 0
##$OFFSET= 17.68489
##$PC= 4
##$PHC0= -28.25718
##$PHC1= -0.3563094
##$PH_mod= 1
##$PKNL= yes
##$PPARMOD= 0
##$PSCAL= 4
##$PSIGN= 0
##$REVERSE= no
##$SF= 200.129766148193
##$SI= 32768
##$SIGF1= 3
##$SIGF2= 2
##$SINO= 400
##$SIOLD= 16384
##$SREGLST= <1H.CDCl3>
##$SSB= 0
##$STSI= 32768
##$STSR= 0
##$SW_p= 4139.07284768211
##$SYMM= 0
##$S_DEV= 0
##$TDeff= 16384
##$TDoff= 0
##$TI= <>
##$TILT= no
##$TM1= 0
##$TM2= 0
##$TOPLEV= 0
##$USERP1= <user>
##$USERP2= <user>
##$USERP3= <user>
##$USERP4= <user>
##$USERP5= <user>
##$WDW= 1
##$XDIM= 32768
##$YMAX_p= 461385140
##$YMIN_p= -554100
$$ End of Bruker specific parameters
$$ ---------------------------------
##NTUPLES= NMR SPECTRUM
##VAR_NAME=  FREQUENCY,     SPECTRUM/REAL,   SPECTRUM/IMAG
##SYMBOL=    X,             R,               I
##VAR_TYPE=  INDEPENDENT,   DEPENDENT,       DEPENDENT
##VAR_FORM=  AFFN,          ASDF,            ASDF
##VAR_DIM=   32768,         32768,           32768
##UNITS=     HZ,            ARBITRARY UNITS, ARBITRARY UNITS
##FACTOR=    0.126318333923829, 1,           1
##FIRST=     3539.27304956752, 0,            0
##LAST=      -599.799798114586, 0,           0
##MIN=       -599.799798114586, -554100,     0
##MAX=       3539.27304956752, 461385140,    0
$$ Real data points
##PAGE= N=1
##DATA TABLE= (X++(R..R)), XYDATA
$$ [...]
9806A622115k6820l2644K458M3941L8292j5265n6489m1694K489K4489J6720Q084
9794A585676J0383R530m3p203q547j2750j9654j8466p939J227M008L319k457j5096
9780A521988k2653j0926J2127K3823J8660J2348J3180J0685k939j8795k3923j3850
9768A519725Q287K9952K9929J453k7569k2934O559J7656l735k1454p222J3560
9756A544207K367l0657m1140j5564J3758J9138J1609J4281K5261K4675P498q398
9744A567035o923N594J0489J601r126j0471n527j366L128P834J440k0443l5062
9731A508203j6220K1865L3082R42l5585l3903j918K0854J6547k122k1205l4533
9719A456007l1211m452K7258L4542J6229N79L208Q110j146j4876j6090o788J283
$$ y = [1622115, 1595295, 1562651, 1565109, 1609050, 1647342, 1632077, 1575588, 1533894, 1536383, 1560872, 1577592, 1585676, 1596059, 1605589, 1605546, 1598343, 1589796, 1577046, 1557392, 1538926, 1530987, 1532214, 1536222, 1539541, 1537084, 1521988, 1499335, 1488409, 1500536, 1524359, 1543019, 1555367, 1568547, 1579232, 1576293, 1557498, 1533575, 1519725, 1528012, 1557964, 1587893, 1589346, 1561777, 1538843, 1545402, 1563058, 1559323, 1537869, 1530647, 1544207, 1546574, 1515917, 1474777, 1459213, 1472971, 1492109, 1503718, 1517999, 1543260, 1567935, 1575433, 1567035, 1560112, 1565706, 1576195, 1577796, 1568670, 1558199, 1552672, 1551306, 1554434, 1562268, 1563708, 1543265, 1508203, 1491983, 1513848, 1546930, 1547872, 1512287, 1478384, 1476466, 1497320, 1513867, 1511745, 1490540, 1456007, 1424796, 1420344, 1447602, 1482144, 1498373, 1498952, 1502160, 1510270, 1509124, 1494248, 1478158, 1471370, 1472653]
9706A472653P523J6225K0816J3691M100N663J0476j409k5734l2103p684K0021
9694A504238K1224O207M955J6604J1471j6284l2970j6583O336N36k2957k4757
9682A458020J004J9328R880n427j933J0458Q740n469j1805k951Q607R660j450
9669A496662j6408k2021j1215N047Q519J391M871K0726J8814j6802n1840m1708
9657A396036O757M5518M8626L1510J1491j2902l6994m0181j6879Q859J5507R343
9645A466691M026k241j1810j1413O430K1798J2071j1602j7657K11J5379Q494o740
9632A473637p296N432R538n136k1534j5987J1209L2914K5159n024k8070k5541
9620A449301o865P571R903P013P736J4724K4474K9425K2654N397j1236j5600p398
$$ y = [1472653, 1480176, 1496401, 1517217, 1530908, 1535008, 1540671, 1551147, 1549738, 1524004, 1491901, 1484217, 1504238, 1525462, 1531669, 1536624, 1553228, 1564699, 1548415, 1515445, 1498862, 1505198, 1505734, 1482777, 1458020, 1459024, 1478352, 1488232, 1482805, 1480872, 1491330, 1500070, 1494601, 1482796, 1479845, 1488452, 1498112, 1496662, 1480254, 1458233, 1447018, 1452065, 1460584, 1461975, 1466846, 1487572, 1506386, 1489584, 1437744, 1396036, 1402793, 1448311, 1496937, 1528447, 1539938, 1527036, 1490042, 1449861, 1432982, 1441841, 1457348, 1466691, 1470717, 1468476, 1456666, 1445253, 1451683, 1473481, 1485552, 1473950, 1456293, 1456504, 1471883, 1480377, 1473637, 1466341, 1471773, 1481311, 1476175, 1454641, 1438654, 1449863, 1482777, 1507936, 1502912, 1474842, 1449301, 1442436, 1450007, 1459910, 1466923, 1474659, 1489383, 1513857, 1543282, 1565936, 1571333, 1560097, 1544497, 1537099]
9607A537099P43m603k1108k8646j1919J5041K0951o98j9666j2433J907o844k8909
9594A440915k9264o240M469j1326k3681r348J1696J3111M138O522J4301Q166p737
9581A415722j4498j1851j3646j8979j5429m182L659Q718J6183J5250n721k9582
9569A345644k7200k384J1160r9j3526j0419j393m75j202N725J2742J0465O015
9556A335053R844J6176J1448m866j9132j8932l971J3626J8346O946o482q862n676
9543A343518p737r371J60J0476J741j9340k4710r048K491j852k239J2695K0475
9530A317259K386k0777j8032O409K4124K3716J4780K906j2849k5007k3796j3874
9518A277245o454j163P300J3049P716k995q981j2578j7782j4316O012K7472K8504
$$ y = [1537099, 1537842, 1533239, 1512131, 1483485, 1471566, 1486607, 1507558, 1506860, 1487194, 1474761, 1476668, 1469824, 1440915, 1411651, 1405411, 1409880, 1398554, 1374873, 1365525, 1377221, 1390332, 1394470, 1400992, 1415293, 1423459, 1415722, 1401224, 1389373, 1375727, 1356748, 1341319, 1337137, 1340796, 1349514, 1365697, 1380947, 1375226, 1345644, 1318444, 1316060, 1327220, 1327121, 1313595, 1303176, 1301783, 1301308, 1300106, 1305831, 1318573, 1329038, 1335053, 1344897, 1361073, 1372521, 1367655, 1348523, 1329591, 1325620, 1339246, 1357592, 1364538, 1358056, 1349194, 1343518, 1335781, 1326410, 1326570, 1337046, 1338787, 1319447, 1294737, 1285689, 1288180, 1286328, 1284089, 1296784, 1317259, 1319645, 1298868, 1280836, 1287245, 1311369, 1335085, 1349865, 1352771, 1339922, 1314915, 1291119, 1277245, 1270791, 1269628, 1276928, 1289977, 1297693, 1294698, 1285717, 1273139, 1255357, 1241041, 1247053, 1274525, 1303029]
9505A303029J3267J208n963j9576l3406k8997j0175j124o888n232J5112L5099
9493A256354L3679J3157j1627k8321k5428N06K8101K5793n890k9836k1434J801
9481A236855J3401J4860J9186K0715Q077q306r820j911n691k0383k0342O173L5885
9468A288699L7881J0677j7220j9790j060J1276m25k1316k3519m585R105P81j3760
9455A256744j2721p18L398q86K614J7013K5799J7932J901j0238j8015k4519k4842
9442A233462j3077M654J4200J0559M202O981J5957J7425O738m451n387j784m299
9429A285180q658k270J2315J7805P205q473k0210l0104l5447k4404J895K1758
9417A216592K0614J0096O503P648O064O369J0575M316j8897l5825k3065M521J4696
$$ y = [1303029, 1316296, 1317504, 1311541, 1291965, 1258559, 1229562, 1219387, 1218263, 1211375, 1206143, 1221255, 1256354, 1290033, 1303190, 1291563, 1263242, 1237814, 1238320, 1266421, 1292214, 1286324, 1256488, 1235054, 1236855, 1250256, 1265116, 1284302, 1305017, 1313094, 1304788, 1294968, 1293057, 1287366, 1266983, 1246641, 1252814, 1288699, 1326580, 1337257, 1320037, 1300247, 1299187, 1310463, 1310038, 1288722, 1265203, 1260618, 1269723, 1270504, 1256744, 1244023, 1243305, 1246703, 1245817, 1248431, 1265444, 1291243, 1309175, 1311076, 1300838, 1282823, 1258304, 1233462, 1220385, 1225039, 1239239, 1249798, 1254000, 1260981, 1276938, 1294363, 1301101, 1296650, 1291263, 1289479, 1285180, 1276522, 1274252, 1286567, 1304372, 1311577, 1303104, 1282894, 1252790, 1217343, 1192939, 1194834, 1216592, 1237206, 1247302, 1253805, 1261453, 1267517, 1273886, 1284461, 1288777, 1269880, 1234055, 1210990, 1215511, 1230207]
9404A230207P027P799K0888K0285m681l0041l2119j4171R921L1594L8560J8334
9392A303603j6180l0638j3396Q567J1851P516J0834Q848j3519l7057l1772m119
9380A204538J1979M756n651m282K130P388J5642K2540J3118j0115j9548J144K9052
9367A272691K7850o832m2663m7421j9923J3719K6518J3585o650j3451n169M002
9355A216256N475M297M850J905o780j0642j155J1450J0683j094o079P35M202m797
9341A229306j3288p810K616K029m839j922P429N167n391J643K9188M1006J3416
9328A298550k2512k2659L975J0438j3339k4990K692L8980M0393Q161k3749l5124
9316A260816k8953j2453N100Q307n721j4932j802J5735R459j2290j4737Q382K3356
$$ y = [1230207, 1237234, 1245033, 1265921, 1286206, 1281525, 1251484, 1219365, 1205194, 1215115, 1246709, 1285269, 1303603, 1287423, 1256785, 1243389, 1251956, 1263807, 1271323, 1282157, 1291005, 1277486, 1240429, 1208657, 1204538, 1216517, 1221273, 1215622, 1211340, 1213470, 1220858, 1236500, 1259040, 1272158, 1262043, 1242495, 1243639, 1272691, 1300541, 1293709, 1251046, 1203625, 1183702, 1197421, 1223939, 1237524, 1230874, 1217423, 1212254, 1216256, 1221731, 1226028, 1230878, 1232783, 1226003, 1215361, 1214206, 1225656, 1236339, 1235245, 1229166, 1229901, 1234103, 1229306, 1216018, 1208208, 1210824, 1212853, 1208014, 1206092, 1213521, 1218688, 1213297, 1214940, 1244128, 1285134, 1298550, 1276038, 1253379, 1257354, 1267792, 1254453, 1229463, 1232155, 1271135, 1311528, 1319689, 1295940, 1260816, 1231863, 1219410, 1224510, 1232817, 1227096, 1212164, 1210362, 1226097, 1235556, 1223266, 1208529, 1216911, 1240267]
9303A240267P132j9800k4950o020J4455K1102J6472R351N410N200M350k35k991
9290A269743L595J4998J8677J2318M486l077j6082k7833k0143P066K7669K3659
9278A315076Q837L188K859m497j1942o710J003p914k4798k1744K701J7860Q466
9265A282385k262P860K3895J9301j690j3306q507l231m854k627Q372J7116J6571
9252A339023J3124Q582n876k5621k4618P651L8482K8710j1807l5593k2562j681
9240A307814j728j3142j5175j1402j2801q124J6573M2007L4467k181k6149j4165
9228A295994J0268J4265l692k2626k7736j6376P013K7230K4655Q27j5136j871
9216A292815K3268K6564M074j3913m106K0271K6921L775k5478k7107J484K4270
$$ y = [1240267, 1247399, 1227599, 1202649, 1196629, 1211084, 1232186, 1248658, 1258009, 1263419, 1268619, 1272969, 1272734, 1269743, 1273338, 1288336, 1307013, 1319331, 1323817, 1320740, 1304658, 1276825, 1256682, 1263748, 1291417, 1315076, 1323913, 1327101, 1329960, 1325463, 1313521, 1306811, 1307814, 1299900, 1275102, 1253358, 1256059, 1273919, 1282385, 1280123, 1287983, 1311878, 1331179, 1329489, 1316183, 1307676, 1304445, 1299591, 1296964, 1305336, 1322452, 1339023, 1352147, 1360729, 1354853, 1329232, 1304614, 1312265, 1350747, 1379457, 1367650, 1332057, 1309495, 1307814, 1306086, 1292944, 1277769, 1266367, 1253566, 1245442, 1262015, 1304022, 1338489, 1336308, 1310159, 1295994, 1306262, 1320527, 1316835, 1294209, 1266473, 1250097, 1257110, 1284340, 1308995, 1309822, 1294686, 1292815, 1316083, 1342647, 1346721, 1332808, 1328702, 1348973, 1375894, 1379669, 1354191, 1327084, 1328568, 1352838]
9204A352838J0485k1848k7398K813K7933J7072q000j1163L927R107J984L907J6429
9191A378086J7635K293q977o158l613q299m370J6087L3019K6779O360p994j2633
9178A428215j3587q196O286J7479J1018q177k3572k8269k4052r201J4025K7296
9166A389265J3822j3276k1593k355J6531R064j3103j8161Q32J6316M753j9463
9154A362632k2197K798K2826J0785j5893k0158L86J1234n354k3440j3423J5090
9142A325286L0870K4389J0489k64q487j1012l055O882N792j783j514L228l644
9129A377177j7381j2698J3469K8121R008j8121j3817J8604L8366K3078p173k3281
9117A415352k1106j3554p304j304K234K41j942L139R855L437j6776k9818j8517
$$ y = [1352838, 1363323, 1341475, 1314077, 1316890, 1344823, 1361895, 1353895, 1342732, 1346659, 1355766, 1357750, 1361657, 1378086, 1395721, 1398014, 1389037, 1382879, 1379266, 1370967, 1366597, 1382684, 1415703, 1442482, 1448842, 1440848, 1428215, 1414628, 1406432, 1412718, 1430197, 1441215, 1433038, 1409466, 1381197, 1357145, 1347944, 1361969, 1389265, 1403087, 1389811, 1368218, 1365863, 1382394, 1391458, 1378355, 1360194, 1361026, 1377342, 1382095, 1362632, 1340435, 1343233, 1366059, 1376844, 1360951, 1340793, 1341179, 1352413, 1347059, 1323619, 1310196, 1325286, 1356156, 1380545, 1391034, 1390770, 1382283, 1371271, 1368216, 1375098, 1380890, 1379107, 1377593, 1380821, 1377177, 1359796, 1347098, 1360567, 1388688, 1397696, 1379575, 1365758, 1384362, 1422728, 1445806, 1438633, 1415352, 1394246, 1380692, 1373388, 1372084, 1374318, 1374559, 1372617, 1375756, 1385611, 1389048, 1372272, 1342454, 1323937]
9104A323937N767J7300J0677M355Q320Q892l799j2925K2K0113J5209j5990l8959
9091A342919l0850p987M248N921J0391J6180J2950N151P084J7606J9740O591r103
9078A400841j4857j3705j3471j2199l592Q229Q779q956k9735k5822J1452N2650
9066A359614N5760J5581k6216l0730p834M406m994j0359O620K9949L5145K1297
9054A448239M394o540j2898j6339j7606j8548j6643o287O974O197j1561k3366
9042A336016j0767R992J0177o864j0314R148K3890J2359q163r727M353Q754l040
9029A365814j1851n688L231J346l499N068K5249L6835K6340K358j6087j8995r557
9016A400564M232J4930J6297Q115M00L076R612L054j6197k3702n235J6437J0908
$$ y = [1323937, 1329704, 1347004, 1357681, 1362036, 1370356, 1379248, 1375449, 1362524, 1362546, 1382659, 1397868, 1381878, 1342919, 1312069, 1304082, 1308330, 1314251, 1324642, 1340822, 1353772, 1358923, 1366007, 1383613, 1403353, 1409944, 1400841, 1385984, 1372279, 1358808, 1346609, 1343017, 1351246, 1360025, 1351069, 1321334, 1295512, 1306964, 1359614, 1415374, 1430955, 1404739, 1374009, 1366175, 1370581, 1365587, 1355228, 1361848, 1391797, 1426942, 1448239, 1452633, 1446093, 1433195, 1416856, 1399250, 1380702, 1364059, 1357772, 1364746, 1370943, 1359382, 1336016, 1325249, 1335241, 1345418, 1338554, 1328240, 1337388, 1361278, 1373637, 1365474, 1355747, 1360100, 1368854, 1365814, 1353963, 1348275, 1351506, 1352852, 1349353, 1354421, 1379670, 1416505, 1442845, 1445203, 1429116, 1410121, 1400564, 1404796, 1419726, 1436023, 1444138, 1444538, 1447614, 1457226, 1460280, 1444083, 1420381, 1415146, 1431583, 1442491]
9003A442491j1980j2150K1107M9846M0160P594r849l183P959J2791J8285K5861
8991A588932K5116J2677j376p757n235M056J3468J2174J486R86J9112L0510J0617
8978A704766j8932j6729J2097K1195j046j1204J5859M3751L5678J3603J4055K2967
8966A836060P351j5183K84M4442N7811K1096j4627l977L3714N3279M2775J9012
8954B082037m003j5527j720L4263O2348N8023L2249J2952J1198K0525L3568M2762
8942B368675L8796K3664J2546J1273Q326m25j264Q966R914o080j2040J0825L3662
8929B506838K0529j0635j1451K1925M4085L1815J4276J9566L2297K6294Q280K789
8917B706608J3945K6891L4179L9099M0554L3083J9215R551J1616K3911L7029L9280
$$ y = [1442491, 1430511, 1418361, 1439468, 1489314, 1529474, 1537068, 1527219, 1524036, 1531995, 1544786, 1563071, 1588932, 1614048, 1626725, 1625349, 1617592, 1612357, 1616413, 1629881, 1642055, 1643541, 1644527, 1663639, 1694149, 1704766, 1685834, 1669105, 1681202, 1702397, 1701351, 1690147, 1706006, 1749757, 1785435, 1799038, 1813093, 1836060, 1843411, 1828228, 1828512, 1872954, 1930765, 1951861, 1937234, 1933257, 1966971, 2020250, 2063025, 2082037, 2078034, 2062507, 2060787, 2095050, 2157398, 2215421, 2247670, 2260622, 2271820, 2292345, 2325913, 2368675, 2407471, 2431135, 2443681, 2454954, 2463280, 2462855, 2461591, 2470557, 2480471, 2474391, 2462351, 2473176, 2506838, 2527367, 2516732, 2505281, 2527206, 2571291, 2603106, 2617382, 2636948, 2669245, 2695539, 2703819, 2706608, 2720553, 2747444, 2781623, 2820722, 2861276, 2894359, 2913574, 2923125, 2934741, 2958652, 2995681, 3034961]
8905C034961K9868K6339M4852P1360P1933L9732J0823J7939M6753N9157M6733
8894C500450L5169M0786N0033M6843L7322L5826M2128M6380M7336N1816O0294
8883C994383O5741O5818O4601O1530N1655M1465M9188P6577R3261P1297L0611
8872D666127K2926O3976J08504J09119P6714N7185O5003P2830O2278N1150O1916
8861E417728Q8324J06230J02243Q2090O2174N8644P3796R0429R1396Q4412R1449
8850F348915J13711J27723J19858J03440R5067R5506J02628J20598J43862J53265
8840G524573J43247J34191J42736J58498J65941J69161J75869J76496J62749J49962
8830I103423J55135J66275J61139J45904J45966J64033J76084J67910J50066J36032
$$ y = [3034961, 3064829, 3091168, 3136020, 3207380, 3279313, 3319045, 3329868, 3347807, 3394560, 3453717, 3500450, 3535619, 3576405, 3626438, 3673281, 3710603, 3746429, 3788557, 3834937, 3882273, 3934089, 3994383, 4060124, 4125942, 4190543, 4252073, 4303728, 4345193, 4394381, 4470958, 4564219, 4635516, 4666127, 4689053, 4753029, 4861533, 4970652, 5047366, 5104551, 5169554, 5242384, 5304662, 5355812, 5417728, 5506052, 5612282, 5714525, 5796615, 5858789, 5917433, 5991229, 6081658, 6173054, 6257466, 6348915, 6462626, 6590349, 6710207, 6813647, 6908714, 7004220, 7106848, 7227446, 7371308, 7524573, 7667820, 7802011, 7944747, 8103245, 8269186, 8438347, 8614216, 8790712, 8953461, 9103423, 9258558, 9424833, 9585972, 9731876, 9877842, 10041875, 10217959, 10385869, 10535935, 10671967]
8820A0671967J28434J27593J32183J30976J15246R8969J03805J23019J25458J01025
8810A1858675P8025Q4600J12539J32573J31857J23042J23590J36384J50135J56348
8800A3087768J63606J86188K15980K23623K01086J83659K05793K51123K77407
8791A4996233K79091K86958L10423L23519L14523L07503L20084L37500L47375
8782A7823209L64514L96436M15937L98527L64122L51115L65853L85551L96431
8773B1261695M01192M00175L92449L88243L96627M07216M04914L94880L92053
8764B4839444L94407L89581L81470L85934M02512M12978M08634L99600L95515
8755B8410075L93877L90367L87815L92543M09787M40336M74624M96844N03849
$$ y = [10671967, 10800401, 10927994, 11060177, 11191153, 11306399, 11405368, 11509173, 11632192, 11757650, 11858675, 11936700, 12021300, 12133839, 12266412, 12398269, 12521311, 12644901, 12781285, 12931420, 13087768, 13251374, 13437562, 13653542, 13877165, 14078251, 14261910, 14467703, 14718826, 14996233, 15275324, 15562282, 15872705, 16196224, 16510747, 16818250, 17138334, 17475834, 17823209, 18187723, 18584159, 19000096, 19398623, 19762745, 20113860, 20479713, 20865264, 21261695, 21662887, 22063062, 22455511, 22843754, 23240381, 23647597, 24052511, 24447391, 24839444, 25233851, 25623432, 26004902, 26390836, 26793348, 27206326, 27614960, 28014560, 28410075, 28803952, 29194319, 29582134, 29974677, 30384464, 30824800, 31299424, 31796268, 32300117]
8746C2300117N11691N33735N62790N86217O06209O30823O57535O81661P08439
8737C7779217P39814P63927P77549Q02682Q54883R08882R26217R08546Q92749
8728D5354466Q99278R17880R41443R78903J030392J080711J123988J168109J211221
8719E4706391J243320J276645J342637J447225J557427J645801J722645J809953
8711F6752044J908009K004840K098566K192579K283364K366458K440960K498656
8703H4545476K524098K514121K481505K432775K359881K258029K130066J968641
8695A03214592J760603J516200J263479J002603P00788L51926N734k91836n57372
8686A08966717q33999j119846j372057j568431j725042j856611j955470k014304
$$ y = [32300117, 32811808, 33345543, 33908333, 34494550, 35100759, 35731582, 36389117, 37070778, 37779217, 38519031, 39282958, 40060507, 40863189, 41718072, 42626954, 43553171, 44461717, 45354466, 46253744, 47171624, 48113067, 49091970, 50122362, 51203073, 52327061, 53495170, 54706391, 55949711, 57226356, 58568993, 60016218, 61573645, 63219446, 64942091, 66752044, 68660053, 70664893, 72763459, 74956038, 77239402, 79605860, 82046820, 84545476, 87069574, 89583695, 92065200, 94497975, 96857856, 99115885, 101245951, 103214592, 104975195, 106491395, 107754874, 108757477, 109458265, 109810191, 109815925, 109524089, 108966717, 108132718, 107012872, 105640815, 104072384, 102347342, 100490731, 98535261, 96520957]
8678I6520957k043302k059209k074474k096382k120336k127167k103811k062397
8670G9833879k023918j991303j956836j926110j910361j900057j871500j821015
8662F4432779j771710j743275j731494j719603j695780j657947j612495j568906
8654E0931569j529634j490063j452171j425044j405042j374253j330219j294359
8646C9630784j273594j240454j177339j113653j083278j068101j027223r65366
8638C0681776r22525r04398q76508q28546p90902p76819p58454p17866o76396
8629B3429362o52222o30510n99895n79076n78515n71108n33601m87619m65518
8620A8331298m60211m44300m19431m09785m18625m25102m17842m02896l83381
$$ y = [96520957, 94477655, 92418446, 90343972, 88247590, 86127254, 84000087, 81896276, 79833879, 77809961, 75818658, 73861822, 71935712, 70025351, 68125294, 66253794, 64432779, 62661069, 60917794, 59186300, 57466697, 55770917, 54112970, 52500475, 50931569, 49401935, 47911872, 46459701, 45034657, 43629615, 42255362, 40925143, 39630784, 38357190, 37116736, 35939397, 34825744, 33742466, 32674365, 31647142, 30681776, 29759251, 28854853, 27978345, 27149799, 26358897, 25582078, 24823624, 24105758, 23429362, 22777140, 22146630, 21546735, 20967659, 20389144, 19818036, 19284435, 18796816, 18331298, 17871087, 17426787, 17007356, 16597571, 16178946, 15753844, 15336002, 14933106, 14549725]
8611A4549725l57724l35542l31257l40612l41527l20245k85118k55505k45100
8602A1737095k52357k61971k61342k55641k54931k50422k26853j97888j96183
8593I579507k19662k25361j94984j67310j76597j96323j84319j53001j45964j64634
8583G751352j70451j51311j35076j36625j38135j29109j24676j32697j37637j29643
8573F365992j20354j18648j16924j11023j09035j11998j09683j02107j00532j01564
8563E264124q8243o5499o4920r9160j36713j39719j08171p1742n4542o1166q1331
8552D292918r4734q4640n8111m1539m8683o5673p2965o7470n7625n1648n5513
8541C594317o7968p5155o5779n0530m6789m8065l5919k0164l1127o5461p8527
$$ y = [14549725, 14192001, 13856459, 13525202, 13184590, 12843063, 12522818, 12237700, 11982195, 11737095, 11484738, 11222767, 10961425, 10705784, 10450853, 10200431, 9973578, 9775690, 9579507, 9359845, 9134484, 8939500, 8772190, 8595593, 8399270, 8214951, 8061950, 7915986, 7751352, 7580901, 7429590, 7294514, 7157889, 7019754, 6890645, 6765969, 6633272, 6495635, 6365992, 6245638, 6126990, 6010066, 5899043, 5790008, 5678010, 5568327, 5466220, 5365688, 5264124, 5175881, 5110382, 5045462, 4946302, 4809589, 4669870, 4561699, 4489957, 4435415, 4374249, 4292918, 4198184, 4113544, 4055433, 4013894, 3965211, 3899538, 3826573, 3759103, 3701478, 3649830, 3594317, 3526349, 3451194, 3385415, 3334885, 3288096, 3240031, 3204112, 3183948, 3152821, 3087360, 3008833]
8530C008833m7854r506q173l9222o4308o1269l6102o944L507j8375n2349n7772
8518B610466l0378j5290l9599o6645n2065j3634j117j9824l3066k6647k0752k2608
8506B268841j5553J296M766j3256l3313m1134m1002l3202j2458O135l959l5758
8494B051403m7857k2826N847L371j9082k8955k0471j2625j4456j7499j6853j9087
8482A840910k7857l3634k3284R70J6153J795k8779l6979j0205J5902Q058j3444
8470A709606q303J5641J3582k1727m6381l3841r669k577n109l886p357j8028j6003
8457A565948Q89j215l6018n8997k8349K5588M0363J0307j5551j2947p602k0443
8445A461973l4977l0107r815J1468K5967K7083J0926j0683j9640j5971j2627r500
$$ y = [3008833, 2960979, 2951473, 2943300, 2904078, 2839770, 2778501, 2742399, 2735455, 2738962, 2720587, 2668238, 2610466, 2580088, 2564798, 2525199, 2458554, 2406489, 2392855, 2391738, 2371914, 2338848, 2312201, 2291449, 2268841, 2253288, 2254584, 2259350, 2246094, 2212781, 2171647, 2130645, 2097443, 2084985, 2091120, 2087161, 2051403, 2003546, 1980720, 1986567, 1989938, 1970856, 1941901, 1921430, 1908805, 1894349, 1876850, 1859997, 1840910, 1813053, 1779419, 1756135, 1757105, 1773258, 1775053, 1746274, 1709295, 1699090, 1714992, 1723050, 1709606, 1701303, 1716944, 1730526, 1708799, 1662418, 1628577, 1618908, 1616331, 1611222, 1607336, 1599979, 1581951, 1565948, 1566837, 1565622, 1529604, 1470607, 1442258, 1467846, 1508209, 1518516, 1502965, 1490018, 1482416, 1461973, 1426996, 1396889, 1387074, 1398542, 1424509, 1451592, 1462518, 1451835, 1432195, 1416224, 1403597, 1394097]
8433A394097J489R349n345l1677l5625j3260p44j7527l4488j9858J2725K8277
8421A287413K0241Q595L946P06l108l035j88K239Q446J9565K1746L532k1163k7602
8407A321333j4371k682k162J383J8749L6673L5098J3382j1565k6287l0080k6891
8395A312580j7735l282J1015J7021J2431N206N619J2640J3011j945k2110k7964
8383A316487j3654O233J5068J2777J1187J5546J8818J3716K185r729j8424j9101
8371A351109m718K0923L5893K1929p799k0223m967J3141J1729Q35P13Q589R569
8358A436723O917J4622K6713K2824L967n628K750R080k39j0075m516N881M601
8345A513620j413L706J3167O493j4252k2129l214K2458K6583P004j3155j4439
$$ y = [1394097, 1395586, 1404935, 1399590, 1367913, 1332288, 1319028, 1318284, 1300757, 1266269, 1246411, 1259136, 1287413, 1307654, 1316249, 1320195, 1320901, 1317793, 1314758, 1314570, 1316809, 1325255, 1344820, 1366566, 1370098, 1348935, 1321333, 1306962, 1304280, 1302118, 1303501, 1322250, 1358923, 1394021, 1407403, 1395838, 1369551, 1339471, 1312580, 1294845, 1291563, 1302578, 1319599, 1332030, 1337236, 1342855, 1355495, 1368506, 1366561, 1344451, 1316487, 1302833, 1309066, 1324134, 1336911, 1348098, 1363644, 1382462, 1396178, 1398363, 1388634, 1370210, 1351109, 1346391, 1367314, 1403207, 1425136, 1417337, 1397114, 1392147, 1405288, 1417017, 1417852, 1418565, 1427154, 1436723, 1443640, 1458262, 1484975, 1507799, 1511766, 1506138, 1508888, 1517968, 1517729, 1507654, 1503138, 1509019, 1513620, 1512207, 1515913, 1529080, 1535573, 1521321, 1499192, 1495978, 1518436, 1545019, 1552023, 1538868, 1524429]
8333A524429N6J4023J8604J8495J9662J9561J4088O921L378O48m970o376M279
8320A632798J7587J6730M342n51O445J0163O472J1088K7082L1553J2973l942N025
8307A777765K3722K1406J757n446R568L0275M5553N5140M9320J9047j3628j2422
8295B002057J8744L3486Q139k3487j9493J3740L8516L8632K9384K6709L0317L3325
8283B230069L1316K3431J4918J5012K5134L5204L6690L0691J9641M272n947L566
8271B463997K8693M3586L4559K0553K3907L7188L9365L1249L0451L9392M3664
8260B836604L9353L8252M4917M9384M5683L9677L5459L0316K6115K9987M0619
8249C256366M8505N2085N8241O5160O2521N2319N0041N8453O0110M6071L2406
$$ y = [1524429, 1524485, 1538508, 1557112, 1575607, 1595269, 1614830, 1628918, 1635839, 1639217, 1639865, 1634895, 1628519, 1632798, 1650385, 1667115, 1671457, 1670906, 1677351, 1687514, 1693986, 1705074, 1732156, 1763709, 1776682, 1772740, 1777765, 1801487, 1822893, 1824650, 1819204, 1828772, 1859047, 1904600, 1959740, 2009060, 2028107, 2014479, 2002057, 2020801, 2054287, 2062426, 2038939, 2019446, 2033186, 2071702, 2110334, 2139718, 2166427, 2196744, 2230069, 2261385, 2284816, 2299734, 2314746, 2339880, 2375084, 2411774, 2442465, 2462106, 2466378, 2460431, 2463997, 2492690, 2536276, 2570835, 2591388, 2615295, 2652483, 2691848, 2723097, 2753548, 2792940, 2836604, 2875957, 2914209, 2959126, 3008510, 3054193, 3093870, 3129329, 3159645, 3185760, 3215747, 3256366, 3304871, 3356956, 3415197, 3480357, 3542878, 3595197, 3645238, 3703691, 3763801, 3809872, 3842278]
8238C842278L4162M1474L9679L6720M7007N9599N0469K3405J0824K8933N6332
8227D270882O6572O0686N3675M7575L7602L2610M5975O9934Q1014P3060O4782
8216D904367O8508P1395O0253M7884N5009P5935Q5756P9781Q1151J01751J18260
8205E750050J04558P3662O4628R0451J20017J18334R0354P3734R4119J37667J68096
8194F885670J64660J40156J23263J27465J41316J48044J47058J50473J63027J74998
8184H366130J76317J70424J69313J77928J88415J90929J87726J92491K13244K39365
8174A0272282K52678K51372K53384K71900K98098L16938L30226L49690L73589
8165A2970157L88862L96132M12341M42242M66473M70863M72387M97892N45422
$$ y = [3842278, 3876440, 3917914, 3957593, 3994313, 4041320, 4100919, 4151388, 4174793, 4185617, 4214550, 4270882, 4337454, 4398140, 4451815, 4499390, 4536992, 4569602, 4615577, 4685511, 4766525, 4839585, 4904367, 4972875, 5044270, 5104523, 5152407, 5207416, 5283351, 5369107, 5448888, 5530039, 5631790, 5750050, 5854608, 5928270, 5992898, 6083349, 6203366, 6321700, 6412054, 6485788, 6579907, 6717574, 6885670, 7050330, 7190486, 7313749, 7441214, 7582530, 7730574, 7877632, 8028105, 8191132, 8366130, 8542447, 8712871, 8882184, 9060112, 9248527, 9439456, 9627182, 9819673, 10032917, 10272282, 10524960, 10776332, 11029716, 11301616, 11599714, 11916652, 12246878, 12596568, 12970157, 13359019, 13755151, 14167492, 14609734, 15076207, 15547070, 16019457, 16517349, 17062771]
8156A7062771N86169O02930O08906O25839O59291P01548P45820P88033Q23052
8147B3204359Q49185Q72662R00664R32933R64705R92043J008171J002053R71371
8138C1698146R32267R03017Q79308Q39992P78783P14033O60132O05480N32746
8129C8543904M49255L78989L29780K87709K44478K11342J98841J97074J87301
8120D1028673J66251J50060J55951J83012K09077K09485J86363J74745K05584
8111D2669201K64638L07643L19629L35102L86753M57665N07488N30519N60025
8102D6338663O21182P06484P98177Q90934R86500J084603J187027J298185J416882
8093E5328637J537555J660540J788618J911634K004582K038632J982870J805043
$$ y = [17062771, 17648940, 18251870, 18860776, 19486615, 20145906, 20847454, 21593274, 22381307, 23204359, 24053544, 24926206, 25826870, 26759803, 27724508, 28716551, 29724722, 30726775, 31698146, 32630413, 33533430, 34412738, 35252730, 36031513, 36745546, 37405678, 38011158, 38543904, 38993159, 39372148, 39701928, 39989637, 40234115, 40445457, 40644298, 40841372, 41028673, 41194924, 41344984, 41500935, 41683947, 41893024, 42102509, 42288872, 42463617, 42669201, 42933839, 43241482, 43561111, 43896213, 44282966, 44740631, 45248119, 45778638, 46338663, 46959845, 47666329, 48464506, 49355440, 50341940, 51426543, 52613570, 53911755, 55328637, 56866192, 58526732, 60315350, 62226984, 64231566, 66270198, 68253068, 70058111]
8085G0058111J495467J090515O48018J96119k68663p29471j130244j428707j642322
8076F8288823j816177j962404k056934k083982k056944j999461j928085j852552
8068E2532284j774795j686053j577761j455877j336508j230812j140647j061520
8060D1268311r82340q92621p98759p20853o63689o06877n36962m70232m24172
8051C5171806l84848l28330k59549k01243j56414j12475p1965m4274j4528L9453
8041C3637633J00516J24631J06125Q9514J04165J26126J21480R0259M5293j8156
8031C4527586j04822j99492k90901l90347n01187n96533o56565p02824p62803
8022C0322112q23903q59576q80130r14107r52119r55018r14348q63573q29682
$$ y = [70058111, 71553578, 72644093, 73292111, 73488230, 73219567, 72490096, 71359852, 69931145, 68288823, 66472646, 64510242, 62453308, 60369326, 58312382, 56312921, 54384836, 52532284, 50757489, 49071436, 47493675, 46037798, 44701290, 43470478, 42329831, 41268311, 40285971, 39393350, 38594591, 37873738, 37210049, 36603172, 36066210, 35595978, 35171806, 34786958, 34458628, 34199079, 33997836, 33841422, 33728947, 33656982, 33612708, 33598180, 33637633, 33738149, 33862780, 33968905, 34058419, 34162584, 34288710, 34410190, 34500449, 34545742, 34527586, 34422764, 34223272, 33932371, 33542024, 33040837, 32444304, 31787739, 31084915, 30322112, 29498209, 28638633, 27758503, 26844396, 25892277, 24937259, 24022911, 23159338, 22329656]
8013B2329656q11780q05732q07572p90609p26073o37611n88854n97528o05938
8004A5957959n63993n00267m72643m81216m77982m45463m15782m12437m16745
7995A1771431m03666l78396l59952l49521l33733l08447k83553k67851k60321
7986H825991k56478k55706k58254k58206k46289k22905k02191j95259j94408j85729
7976F550566j73627j75132j88492j88808j64230j36891j33009j48017j58512j55076
7966D928772j44152j29170j11912j04006j13068j22168j07857p7538o3959p9786
7956C875156j01725j05937r6128q6806q0078p2655o8750p0685o9239n7835m6521
7945C018797m8324n9630o6449o3858n8449n6781o0158o5085o2446m4802k1727
$$ y = [22329656, 21517876, 20712144, 19904572, 19113963, 18387890, 17750279, 17161425, 16563897, 15957959, 15393966, 14893699, 14421056, 13939840, 13461858, 13016395, 12600613, 12188176, 11771431, 11367765, 10989369, 10629417, 10279896, 9946163, 9637716, 9354163, 9086312, 8825991, 8569513, 8313807, 8055553, 7797347, 7551058, 7328153, 7125962, 6930703, 6736295, 6550566, 6376939, 6201807, 6013315, 5824507, 5660277, 5523386, 5390377, 5242360, 5083848, 4928772, 4784620, 4655450, 4543538, 4439532, 4326464, 4204296, 4096439, 4018901, 3954942, 3875156, 3773431, 3667494, 3571366, 3484560, 3404482, 3331827, 3263077, 3192392, 3123153, 3065318, 3018797, 2970473, 2910843, 2844394, 2780536, 2722087, 2665306, 2605148, 2540063, 2477617, 2432815, 2411088]
7934B411088j6770l8849o7058p5552o3272m6863l6000l1268l4559m2222l8181
7923A920494j6560k195k0858n4153n7216k4502k686k4526o2090o8497m1166j5680
7911A530365j3050k2258k7029k3177j2015Q16J185j8641m1921m4228k7593j6986
7899A285468k1951k5168j4765l980o847j4678j2945o458r880k2967l2439l2627
7887A080763k9060k5035j8647j1777r965j3012j4872j2797r329o667n493o443
7875I17666o327J959J7051K2246L438k8744m7539m0241j7872M151J9643K3537
7863H68968P635k4691n0544m7538j9031Q891J3986l674k6967l9422l7561k8795
7851F21257j9451q466M775J2797R225J876L819J1594P547j1815k5756j7423J656
$$ y = [2411088, 2394318, 2355469, 2288411, 2212859, 2149587, 2102724, 2066724, 2035456, 2000897, 1958675, 1920494, 1903934, 1901739, 1880881, 1826728, 1769512, 1745010, 1742324, 1717798, 1655708, 1587211, 1546045, 1530365, 1517315, 1495057, 1468028, 1444851, 1432836, 1433652, 1434837, 1416196, 1374275, 1330047, 1302454, 1285468, 1263517, 1238349, 1223584, 1219604, 1212757, 1198079, 1185134, 1178676, 1168796, 1145829, 1113390, 1080763, 1051703, 1026668, 1008021, 996244, 986279, 973267, 958395, 945598, 936269, 929602, 924109, 917666, 911339, 913298, 930349, 952595, 956033, 927289, 879750, 839509, 821637, 825788, 845431, 868968, 876603, 851912, 801368, 753830, 734799, 743690, 757676, 754002, 727035, 687613, 650052, 621257, 601806, 593340, 598115, 610912, 620137, 622013, 625832, 637426, 644973, 633158, 607402, 589979, 591635]
7838E91635Q742J018o946j0106j7450k9077k7808l279K6641L0908R23l6327m4682
7825D84192j7349J5599K1889M010q987l994M42j1811k5070j6040O096J0352q856
7812D50473k2763j2217M347N79j8617k5758r371J3316K0191Q625n819r298n525
7799C88163r346k2487k4146J337L3653L5095J854k8156k7737j4275j3910j8389
7787C01656n959J4687J7357M903L870J4346O087k6544m5409k4157R992J6966J128
7774B88923m004P803R457j2657l6646l5669r757J9986L4968L1244J7421M703m298
7761C11474j3915k0904j3650N469J2642n461k6130j9603O858K0569J1980J331
7749B70660k37k588o859N57J5198J1026j5485l1976j9924l968p749j4321j590
$$ y = [591635, 600377, 601395, 594449, 584343, 566893, 537816, 510008, 506729, 533370, 564278, 565201, 528874, 484192, 466843, 482442, 504331, 508341, 499354, 495360, 495802, 483991, 458921, 442881, 448977, 459329, 450473, 427710, 415493, 419840, 420419, 401802, 376044, 366673, 379989, 400180, 408805, 402986, 393688, 388163, 378817, 356330, 332184, 333521, 367174, 402269, 404123, 375967, 348230, 333955, 320045, 301656, 295697, 310384, 327741, 332644, 336514, 350860, 356947, 330403, 284994, 260837, 270829, 287795, 288923, 284919, 292722, 302179, 289522, 252876, 217207, 207450, 227436, 262404, 293648, 311069, 315772, 311474, 297559, 276655, 263005, 268474, 281116, 275655, 249525, 229922, 236780, 257349, 269329, 270660, 270423, 267835, 260976, 261533, 276731, 287757, 272272, 240296, 220372, 216404, 208655, 194334, 192744]
7736A92744J4779J1972N619K0016L5472J6936j9750k6686k941M677j6980k7085
7724B08773o365Q622o576j9545j912J5521m158l6492l4609n470Q514K828P786
7711A36917K3997K0359l370q251J9043M1634K9050k073k1378k3229j3944N787
7699B04542K5145J9978j1239l3336k0264O633J0780p617j8479q406O802J1180
7687A85719P013L256K350K600M400R315J4156Q461j4332l8605l3707M513L4327
7674A89466J8177j9327k2115J2829L0265M366k2390j2224Q813L761r584K817K3614
7661B08468J4986p758Q16L1984L0387j2152l7507j2134K3348K1765m624j8147
7649B39432j3473n462P045K7508L6555J7210j1526j8513m812M049j831j1112j5319
$$ y = [192744, 207523, 219495, 225114, 245130, 280602, 297538, 277788, 251102, 248161, 252838, 235858, 208773, 202408, 211030, 204454, 184909, 182997, 198518, 194360, 157868, 123259, 117789, 126303, 129131, 136917, 160914, 181273, 177903, 169652, 188695, 230329, 259379, 257306, 235928, 212699, 198755, 204542, 229687, 249665, 238426, 205090, 184826, 191459, 202239, 194622, 176143, 167737, 174539, 185719, 192732, 195988, 198338, 200938, 205338, 214653, 228809, 237270, 222938, 184333, 150626, 155139, 189466, 207643, 188316, 166201, 179030, 209295, 213661, 191271, 179047, 187860, 191621, 182037, 184854, 208468, 223454, 215696, 216512, 248496, 278883, 266731, 229224, 217090, 240438, 262203, 257579, 239432, 225959, 220497, 227542, 255050, 291605, 308815, 297289, 278776, 273964, 278013, 276182, 265070, 249751]
7636B49751j3435j799J6729K2916M710j7773j5303R195K7058K5374J6180Q147
7624C31750k980j4449j3322P59J1054Q237J212j151r74M17O423J1381K168j8058
7610C22467k6464j2329N071M634n778m821P396J1496J816m601M635J9396K5076
7597C47994K4001K5901K6758J4605n308r435J2645L9576M2917K1466k826j6276
7585E22018k3415k8113k5054j4766r224j3640j7150j1056l002k726o432o711n871
7572C54858p309n938o03k889j7503k6964j5672K164J786j3094j6193J92J6268
7559B69103J7177Q860j522j5582k7822k4179o461L746k451n423J1372L1918K8701
7546B87437J867k1194k0274j782J3853J3480M04j1648j3923j1740j3875j6655
$$ y = [249751, 236316, 234517, 251246, 274162, 278872, 261099, 245796, 254991, 282049, 307423, 323603, 331750, 328770, 314321, 300999, 301758, 312812, 321049, 322261, 321110, 320136, 320553, 326976, 338357, 340525, 322467, 296003, 283674, 288745, 293379, 287601, 282780, 290176, 301672, 303488, 298887, 303522, 322918, 347994, 371995, 397896, 424654, 439259, 433951, 424516, 437161, 476737, 519654, 541120, 538294, 522018, 498603, 470490, 445436, 430670, 421446, 407806, 390656, 379600, 376598, 373872, 367440, 360729, 354858, 347549, 341611, 341008, 338119, 320616, 293652, 277980, 280144, 281930, 268836, 252643, 252835, 269103, 286280, 295140, 293618, 278036, 250214, 226035, 219574, 223320, 220869, 215446, 226818, 258736, 287437, 289304, 268110, 247836, 246054, 259907, 273387, 273791, 262143, 248220, 236480, 222605, 205950]
7534B05950r935L348R447O846Q618J7332J7835M246o222o63O225n503k8842l9886
7520A88796l1392j7541j0735j0631j2622j2064k865J4668K7446K3626R784J692
7508A68162J377k768j4572k2726j7030j585J0696J0168l479k1313l1436k9237
7496D6257k0104j0293n73Q246J1276O422j311o848r395p193J969J2277J4420J1467
7482E6617J4631K0549J4038r69r28J4796J3318j7750l8981j5916K1553K1048j1154
7469I0852k2434J735K0508Q019j2283j7319j9448k9669k8690l927J8995J3630
7457A9969m434l986J2615J8158M708j0522j5259j2825p656r66K431j010n352l349
7443g478L118R520J5805J8810J0570o418j6751j4238r144m281J2293L6115L6008
$$ y = [205950, 196015, 199363, 208810, 215656, 224274, 241606, 259441, 263687, 257465, 256802, 263027, 257524, 228682, 188796, 157404, 139863, 129128, 118497, 105875, 93811, 90946, 105614, 133060, 156686, 166470, 168162, 169539, 166771, 152199, 129473, 112443, 110858, 121554, 131722, 128243, 106930, 75494, 46257, 26153, 15860, 15287, 23533, 34809, 41231, 39920, 33072, 23677, 16484, 18453, 30730, 45150, 56617, 71248, 91797, 105835, 104866, 103938, 118734, 132052, 114302, 75321, 59405, 80958, 102006, 90852, 68418, 70153, 90661, 98680, 86397, 69078, 49630, 19961, -8729, -12656, 6339, 19969, 15535, 11549, 24164, 42322, 47030, 36508, 21249, 8424, 768, -198, 2233, 1223, -4129, -7478, -4360, 5160, 20965, 39775, 50345, 43927, 27176, 12938, 3794, -487, 11806, 47921, 83929]
7430H3929j34l4544k6839P265K0520K946j3741j2462r056j3335j2769l420n51
7417a2191o184q7K0380K3945p294m0636l3081O797K8866Q902k2815k6152j955
7404f1505J6367J0834o90M578J8764J4876j0350k6726j2247J3859J7283m226k1488
7391d0671j6735l201K76n427p682k253L507K138m347n575M591J6090J1782p766
7377e5273k1100j5047k327Q53k190l002o467j5195j5071k74Q354j388l694K1217
7363a10604L9056R590l6239l2507J5315L4010O61k2366K990K5443l548m3225l3579
7350a55003L244O241j9041j8263J1698K1726K249k529K0923K9359M64k6641j6854
7337a42427P093Q897m734o370M551R926O716L209k094j3053k0077j2794J307P390
$$ y = [83929, 83795, 49251, 22412, 29677, 50197, 53143, 39402, 26940, 17884, 4549, -8220, -11640, -12191, -18375, -18462, 1918, 25863, 18569, -22067, -55148, -48351, -19485, -10583, -33398, -59550, -61505, -45138, -34304, -34994, -30416, -11652, 3224, -7126, -33852, -46099, -32240, -14957, -19183, -40671, -57406, -60607, -60331, -65758, -73440, -75693, -72186, -70048, -74395, -79970, -75379, -59289, -47507, -55273, -76373, -91420, -93747, -92894, -95084, -98086, -104553, -119748, -134819, -135093, -126739, -128127, -131821, -110604, -71548, -61958, -98197, -130704, -115389, -81379, -80718, -103084, -100094, -74651, -78199, -121424, -155003, -151759, -145518, -164559, -182822, -171124, -149398, -147149, -149678, -128755, -99396, -98932, -125573, -142427, -135334, -126437, -131171, -137541, -132990, -123064, -116348, -113139, -115233, -128286, -148363, -161157, -159850, -152460]
7323a52460M061J046M134J1399J6471J1467l094j1148Q03J8969J6066q631k6415
7310a17332k0448m621N394J2600J9639J6556J862q885r955j5517k8021k4895K887
7297a70736K6813K1076K074p60Q444O991k547R52J7046K4151J4939J598j0057
7284f0016k3782l3626k8382j3399l900j92O382R320k895j7244q572J8744L3865
7271a23697K6863J9940K5191K5404R580m586j888M139k989j3192q695N162J0279
7258b8489L807m347j0612j5371j1866L058J5680J2237K014L776J4562J3847k024
7245c728j1948j943J4245J6641O980J309K996p09j4586k2620q947J5599K1676
7232A4965j740l0948l5408j3004J2838K4056K2281J6142R983O245N449J616r874
$$ y = [-152460, -148399, -147353, -143219, -131820, -115349, -103882, -106976, -118124, -117321, -98352, -82286, -90917, -117332, -137780, -142401, -137007, -124407, -104768, -88212, -86350, -95235, -105190, -120707, -148728, -173623, -170736, -143923, -122847, -120773, -121533, -113089, -106098, -108645, -107693, -90647, -66496, -51557, -49959, -60016, -83798, -117424, -145806, -159205, -163105, -163297, -156915, -147595, -150490, -167734, -176306, -157562, -123697, -96834, -76894, -51703, -26299, -16719, -21305, -23193, -19054, -22043, -35235, -43930, -38768, -28489, -24682, -29029, -39641, -55012, -66878, -63820, -48140, -35903, -33889, -30113, -15551, -1704, -3728, -15676, -17619, -3374, 13267, 20247, 21556, 24552, 23843, 9257, -13363, -22310, -6711, 14965, 13225, -17723, -53131, -66135, -53297, -29241, -6960, 9182, 19165, 25410, 30859, 32475, 22601]
7219B2601j8739r117J4370K6472J4347m316n753J0756K8610L5840K9530J0249
7207A54850j3215k2787j0286Q082J0893N49j792J2265K7729K9193K0991J8083
7195B34555K4950L1167K6322J3650N080M259K545l157J124K5915N3001N2110K3647
7182D95168J813Q721K8679L8547L9076L9417L4078J8007N569R686J8494J8086
7170G55341K1283M3947O8883O8820N3089N2216O5414O8205O6945R2764J35803
7159A492710J43526J04782P9250J08988J50577J41326R2816O2997O2896N2197
7149B492065J4944k1363m2580o6885r7111j06752r1619q7769j12363j29550j08303
7138A642714p7221p9830j02596r7064o0227l9887n6579p0396m6127j1302j5280
$$ y = [22601, 3862, -5255, 9115, 35587, 49934, 45618, 39865, 50621, 79231, 115071, 144601, 154850, 141635, 118848, 108562, 116644, 127537, 128086, 126294, 138559, 166288, 195481, 216472, 234555, 259505, 290672, 316994, 330644, 335724, 339983, 342528, 339371, 340495, 366410, 419411, 471521, 495168, 496981, 505702, 534381, 572928, 612004, 651421, 685499, 703506, 709075, 718761, 737255, 755341, 776624, 820571, 889454, 958274, 1011363, 1063579, 1128993, 1197198, 1264143, 1356907, 1492710, 1636236, 1741018, 1820268, 1929256, 2079833, 2221159, 2313975, 2376972, 2439868, 2492065, 2507009, 2485646, 2443066, 2376181, 2279070, 2172318, 2080699, 1992930, 1880567, 1751017, 1642714, 1565493, 1485663, 1383067, 1286003, 1225776, 1185889, 1129310, 1058914, 1012787, 1001485, 986205]
7127I86205n3825p4133m9999j5161j1114k9914l1598m296K0246J2446j6391l3133
7115F99333k6576j5168j5873k2594k0224p828J123l133j5754k3414j7221n6J6303
7102E48918K1424J4535K529q257j5321j7473j5523j5165k1240k6749j6651J1230
7090D62257L6809L8527J9053M82l380J131K758o52p611k0089l5780m1296k5310
7077D26899L826K4192K4724J5151J0167J1815J1277J903j3587k5000k1651k858
7065D66858J6307J7107n84j5547j0966N281J5022J5763J7927K1603J4914k839
7053E60846j4950j1403l395l891p503k620P686J2041J0056R341Q815J870o346
7040E60547k334J3969K6252K3313J0013m256j2975p208J7700M4388M3516J3400
$$ y = [986205, 932380, 858247, 808248, 793087, 781973, 752059, 720461, 716165, 736411, 748857, 732466, 699333, 672757, 657589, 641716, 619122, 598898, 591070, 592193, 589060, 573306, 549892, 532671, 532615, 548918, 570342, 584877, 587406, 579149, 563828, 546355, 530832, 515667, 494427, 467678, 451027, 462257, 499066, 537593, 556646, 557128, 553748, 554879, 557637, 556985, 549374, 529285, 493505, 452209, 426899, 430725, 454917, 479641, 494792, 504959, 516774, 528051, 529954, 516367, 491367, 469716, 466858, 483165, 500272, 499688, 484141, 473175, 478456, 493478, 509241, 527168, 548771, 563685, 560846, 545896, 534493, 531098, 527207, 519704, 517084, 524770, 536811, 546867, 556208, 565023, 566893, 560547, 558213, 572182, 598434, 621747, 631760, 627504, 614529, 607321, 625021, 669409, 712925, 726325]
7028G26325r949R85K6979L2171J6911J0475J8665J5075r449k4164m744K4770K4834
7015H48884n72j0226J2489L5797K6394n068k2387j1712Q607J8762J8107J4356
7003I33431Q789o69j0800j4841r155M633J9802K5951J7532L652J010J2222K0119
6990A011676J1254l753m848R162K1425K2882K0717K0071J5002L969j571N606J5481
6977A147073J7322J8291L0880M9545N6384M6124K9390J3653j541j0251j313J9870
6965A415427K9562J7563M755J2401K6966J9031p199j1333K6118O7379O0696R613
6953A670979k8416j6104J7166J9785j0667k9323j1581J4908J6708L723P728L0203
6941A685109M1813K8075O652k815q22N816J6836K7957K7688J6269J0575J9008
$$ y = [726325, 716376, 717361, 744340, 776511, 793422, 803897, 822562, 837637, 828188, 804024, 799280, 824050, 848884, 848312, 838086, 850575, 886372, 912766, 907698, 885311, 873599, 882206, 900968, 919075, 933431, 942220, 941551, 930751, 915910, 906755, 911388, 931190, 957141, 974673, 978325, 979335, 991557, 1011676, 1022930, 1019177, 1014329, 1023491, 1044916, 1067798, 1088515, 1108586, 1123588, 1127557, 1125986, 1131592, 1147073, 1164395, 1182686, 1213566, 1263111, 1319495, 1365619, 1395009, 1408662, 1407121, 1396870, 1395557, 1415427, 1444989, 1462552, 1467307, 1479708, 1506674, 1525705, 1518506, 1507173, 1533291, 1600670, 1661366, 1670979, 1642563, 1626459, 1643625, 1663410, 1652743, 1623420, 1611839, 1626747, 1643455, 1647178, 1654906, 1685109, 1726922, 1754997, 1761649, 1758834, 1758012, 1763828, 1780664, 1808621, 1836309, 1852578, 1863153, 1882161]
6929A882161K8715K9438L0915M1321M7573L6708J9382J0158J719j4943k1555K674
6917B094266L8939M9629L5846L2668M6335M2532R229j4678K405L6570M8372L8753
6905B460866L1445K6780J1236o462p172M269J1899K1993M5614O1605M2019P115
6893B711207N273L7114N1682K8834J2235L7052P2795P2482M1529J9380K0083K9665
6881C139331M1870N7919O4977N1280L3309L5117M9212M9640L5625K9221L5985
6870C623486M1729M3952N1657N6637M2444K2718L0701O4162Q1136O2468L8859
6859D159949L8154M4855L6896K6878L4956M9655N0795M8567O2896Q1584P8014
6848D713199N9170N6132P1917P8122O4537N4000O0146O5484N5399M4289N0127
$$ y = [1882161, 1910876, 1940314, 1971229, 2012550, 2060123, 2096831, 2116213, 2126371, 2128090, 2113147, 2091592, 2094266, 2133205, 2182834, 2218680, 2251348, 2297683, 2340215, 2349444, 2334766, 2337171, 2373741, 2422113, 2460866, 2492311, 2519091, 2530327, 2523865, 2516693, 2520962, 2532861, 2554854, 2600468, 2662073, 2704092, 2711207, 2716480, 2753594, 2805276, 2834110, 2846345, 2883397, 2956192, 3028674, 3070203, 3089583, 3109666, 3139331, 3181201, 3239120, 3304097, 3355377, 3388686, 3423803, 3473015, 3522655, 3558280, 3587501, 3623486, 3665215, 3709167, 3760824, 3817461, 3859905, 3882623, 3913324, 3977486, 4058622, 4121090, 4159949, 4198103, 4242958, 4279854, 4306732, 4341688, 4391343, 4442138, 4490705, 4553601, 4635185, 4713199, 4772369, 4828501, 4900418, 4978540, 5043077, 5097077, 5157223, 5222707, 5278106, 5322395, 5372522]
6837E372522O5758P4058P3840P2799O8513N4804L8548L4754M9026P3638R5075
6826F073335J00358Q6552P0112P3103R1911R6437P4122N6624P9604J27938J50376
6815G080472J27657R6599R7247J21127J30878J15854J04409J22060J56816J74702
6805H327821J61103J36523J30868J48376J63879J53850J24807J04916J10581J30238
6795I692962J42402J39653J28898J17085J08060J08839J24458J44853J50830J40045
6785A0998085J35486J57118J93266K13780K08261J97299K05357K34731K68149
6776A2811532K86111K79791K58791K49224K71707L16711L53520L66615L67556
6767A5561558L67465L61056L50132L56745L88831M14188M02192L77912L94634
$$ y = [5372522, 5438280, 5512338, 5586178, 5658977, 5727490, 5782294, 5820842, 5855596, 5904622, 5978260, 6073335, 6173693, 6260245, 6330357, 6403460, 6495371, 6591808, 6665930, 6722554, 6802158, 6930096, 7080472, 7208129, 7304728, 7401975, 7523102, 7653980, 7769834, 7874243, 7996303, 8153119, 8327821, 8488924, 8625447, 8756315, 8904691, 9068570, 9222420, 9347227, 9452143, 9562724, 9692962, 9835364, 9975017, 10103915, 10221000, 10329060, 10437899, 10562357, 10707210, 10858040, 10998085, 11133571, 11290689, 11483955, 11697735, 11905996, 12103295, 12308652, 12543383, 12811532, 13097643, 13377434, 13636225, 13885449, 14157156, 14473867, 14827387, 15194002, 15561558, 15929023, 16290079, 16640211, 16996956, 17385787, 17799975, 18202167, 18580079, 18974713]
6758A8974713M55183N03611N05202M93594N16022N66103O03354O16209O27917
6749B3861908O50123O69029O80930P08638P67242Q34661Q76255Q90783R13409
6740C0852978R70294J043147J089656J094972J089107J109495J161417J227892
6732C9638958J303676J395256J493484J576354J643340J717549J802876J869504
6724E2440997J903266J944373K047719K218986K418567K620315K837305L089072
6716G1520600L366670L636263L866157M051313M220932M417880M662351M942260
6708A04684426N243250N572956N951087O401983O970554P711646Q631952R664798
6700A60832652J0734604J1830236J2995541J4284909J5761075J7484236J9436789
$$ y = [18974713, 19429896, 19933507, 20438709, 20932303, 21448325, 22014428, 22617782, 23233991, 23861908, 24512031, 25181060, 25861990, 26570628, 27337870, 28172531, 29048786, 29939569, 30852978, 31823272, 32866419, 33956075, 35051047, 36140154, 37249649, 38411066, 39638958, 40942634, 42337890, 43831374, 45407728, 47051068, 48768617, 50571493, 52440997, 54344263, 56288636, 58336355, 60555341, 62973908, 65594223, 68431528, 71520600, 74887270, 78523533, 82389690, 86441003, 90661935, 95079815, 99742166, 104684426, 109927676, 115500632, 121451719, 127853702, 134824256, 142535902, 151167854, 160832652, 171567256, 183397492, 196393033, 210677942, 226439017, 243923253, 263360042]
6693B63360042K1490043K3496435K5330469K6699323K6961453K5363052K1581139
6686D34281956J5959257R190887J953040n058625j1012042j5254363j7817065
6679D12243045j9377004k0587999k1550351k1975015k1684881k0806168j9582909
6672B66678718j8202461j6801842j5490120j4298131j3170806j2050313j0935145
6665A65729900r852333q822925p875301p051520o372444n817699n356108m977021
6657A09604549m679670m450224m263552m097875l941646l795524l667822l554870
6649G7153366l427577l255656l046923k844222k679185k545472k420059k290503
6641E4643769k154876k016324j890299j798519j739374j678961j590668j493515
$$ y = [263360042, 284850085, 308346520, 333676989, 360376312, 387337765, 412700817, 434281956, 450241213, 459432100, 461385140, 456326515, 445314473, 430060110, 412243045, 392866041, 372278042, 350727691, 328752676, 307067795, 286261627, 266678718, 248476257, 231674415, 216184295, 201886164, 188715358, 176665045, 165729900, 155877567, 147054642, 139179341, 132127821, 125755377, 119937678, 114581570, 109604549, 104924879, 100474655, 96211103, 92113228, 88171582, 84376058, 80708236, 77153366, 73725789, 70470133, 67423210, 64578988, 61899803, 59354331, 56934272, 54643769, 52488893, 50472569, 48582270, 46783751, 45044377, 43365416, 41774748, 40281233]
6633D0281233j429491j407090j390069j345065j278743j216642j163193j102893
6625B9948047j033975r77401r46447r25402q91478q46109q07709p79608p45343
6616B1994575o97484o51498o22210o02236n76514n46787n26334n16891n06411
6607A6748210m88220m68873m55134m43561m26835m04484l83947l72495l68154
6598A2936507l59214l37317l10963k97763l01135l05115k96548k79382k59890
6589A0189180k34130k03760j88465k01488k22782k19985j91286j64941j59158
6580H403185j65881j73255j78187j73984j52915j29003j30963j59102j74771j51999
6570F813125j17516j14094j39109j49106j21751q5858q2661j15020j46613j44628
$$ y = [40281233, 38851742, 37444652, 36054583, 34709518, 33430775, 32214133, 31050940, 29948047, 28914072, 27936671, 26990224, 26064822, 25173344, 24327235, 23519526, 22739918, 21994575, 21297091, 20645593, 20023383, 19421147, 18844633, 18297846, 17771512, 17254621, 16748210, 16259990, 15791117, 15335983, 14892422, 14465587, 14061103, 13677156, 13304661, 12936507, 12577293, 12239976, 11929013, 11631250, 11330115, 11025000, 10728452, 10449070, 10189180, 9955050, 9751290, 9562825, 9361337, 9138555, 8918570, 8727284, 8562343, 8403185, 8237304, 8064049, 7885862, 7711878, 7558963, 7429960, 7298997, 7139895, 6965124, 6813125, 6695609, 6581515, 6442406, 6293300, 6171549, 6085691, 6003030, 5888010, 5741397, 5596769]
6560E596769j13610q5319p9856q5885q3584p5436p8124r0774r4485q4115p5326
6549D650255p4536o9736o1311p0027r5626j01320o9657m2570o4013j06951j09387
6538C785121p0170m9231p0360q6577o2919l5862n2098r2435j04270q1392o1325
6527C018482n8607n1095l0796k2255l9563o0628o0210m3574l1743l2126l8512
6516B549373m6205n3436n6824n5794n4422n2433m3029k6145j4579j8837l2677
6505B094992m1283l8636l0597k5234k5175k6202k0887q061J252m985k2352l4234
6493A818598l5300l6893m3577m0668j7800Q520J3682j342j3863j3201j0609j4235
6481A613312j4688m072O579J993j4420k5444k3521j7644j7390k0379j8990j2981
$$ y = [5596769, 5483159, 5397840, 5317984, 5232099, 5148515, 5073079, 4994955, 4904181, 4809696, 4725581, 4650255, 4575719, 4505983, 4444672, 4374645, 4279019, 4177699, 4108042, 4065472, 4001459, 3894508, 3785121, 3714951, 3665720, 3595360, 3508783, 3445864, 3410002, 3357904, 3265469, 3161199, 3079807, 3018482, 2959875, 2908780, 2877984, 2855729, 2816166, 2755538, 2695328, 2651754, 2620011, 2587885, 2549373, 2503168, 2449732, 2392908, 2337114, 2282692, 2230259, 2187230, 2161085, 2146506, 2127669, 2094992, 2053709, 2015073, 1984476, 1959242, 1934067, 1907865, 1886978, 1878917, 1880169, 1875184, 1852832, 1818598, 1783298, 1746405, 1702828, 1662160, 1644360, 1652880, 1666562, 1665220, 1651357, 1638156, 1627547, 1613312, 1598624, 1594552, 1601131, 1603124, 1588704, 1563260, 1539739, 1522095, 1504705, 1484326, 1465336, 1452355]
6469A452355r633j2904j7702j7511j4288j4955j8484j5063k720M122p069k5832
6457A300316k9680j4778q34k904j3650k0059k2855k7683k9086j8752l748j022
6445A115265j4703l0654l4107k4170j1229p301j6875l0343l0055j0660J1545J8544
6433I35257J3074R016P150j818j4688j7610j0718r110j5958j7312j0015j0131
6421H57137k2080k4369m488J4187M465k2709l5472k8243k2406k6118k4202r305
6409F56397M847P588N550N041N03j0665j9076j8171j3977j3220j4821j7418k0386
6396E52192j5147N469K5863J9804q227k0989k244J5885K360k2534j9386O699J4544
6383E54289q006k8301k2326o279j544l74J2157K5190J6669j0483k9522k3715k688
$$ y = [1452355, 1442722, 1429818, 1412116, 1394605, 1380317, 1365362, 1346878, 1331815, 1329095, 1333217, 1326148, 1300316, 1270636, 1255858, 1255024, 1252120, 1238470, 1218411, 1195556, 1167873, 1138787, 1120035, 1116287, 1115265, 1100562, 1069908, 1035801, 1011631, 1000402, 993101, 976226, 945883, 915828, 905168, 916713, 935257, 948331, 957347, 964497, 962679, 947991, 930381, 919663, 910553, 894595, 877283, 867268, 857137, 835057, 810688, 806200, 820387, 824852, 802143, 766671, 738428, 716022, 689904, 665702, 656397, 661244, 668832, 674382, 679423, 679926, 669261, 650185, 632014, 618037, 604817, 589996, 572578, 552192, 537045, 542514, 568377, 588181, 579954, 558965, 556721, 572606, 574966, 552432, 533046, 539745, 554289, 546283, 517982, 495656, 489377, 487833, 487459, 499616, 524806, 541475, 530992, 501470, 477755, 475067]
6370D75067J3360J3101j199j7571k2327j2212P72K335p235j4901j2364m372J248
6357D13702M104P041P098q21j1854j2850j632M388r451k9219k6108K579K5495
6344C72472J9173j169q273k823l473r119q08K0983L0705J5427o668j4213p777
6331D04437J984J0613J4165P225k908l05J1081O978j5789k5764n756J3877J477
6318D21315k1898j4271J9379L6339K4561J3461J5745Q085j8251l4043k0846l454
6306D26122p280j7500j0595K867O41r934r002l382j1109k1269r230J6601K4265
6293C71195J1325O536J5801J0050k0712m1993k4965J0255K6159J7273L314n670
6281C78568j1408j1183m346j410m785L410K9917M5090K1314j7485k3419N003K2435
$$ y = [475067, 488427, 501528, 500329, 482758, 460431, 448219, 448991, 451326, 444091, 429190, 416826, 412454, 413702, 417806, 424847, 431945, 431124, 419270, 406420, 404788, 409176, 399725, 370506, 344398, 346977, 372472, 391645, 390476, 382203, 379380, 375907, 366788, 365980, 386963, 417668, 433095, 426427, 412214, 404437, 406421, 417034, 431199, 438424, 435516, 435211, 446292, 453270, 437481, 411717, 405961, 419838, 421315, 399417, 385146, 404525, 440864, 465425, 478886, 494631, 502716, 484465, 450422, 429576, 426122, 418842, 401342, 390747, 393614, 394255, 384321, 375319, 371937, 360828, 339559, 330329, 346930, 371195, 382520, 389056, 404857, 414907, 394195, 352202, 327237, 337492, 363651, 380924, 384238, 378568, 367160, 355977, 351631, 350221, 345436, 348846, 378763, 423853, 445167, 427682, 404263, 409266, 431701]
6268D31701Q014p912o88R629J118o500J3354M2830M3688J6970j440K517Q160L519
6254E64960K432J0165Q385r215j6749O185L9415M8773L1374J1217L102N589J9295
6241G24928M4096O1588M8730J3245q415L883L0421M1551L3179K2312K3478M1123
6229A080119P0614R4081R0008O2992M9980P6186J15686J22264R4973Q2156J13027
6218B052086J54138J52459J01935M3396Q746q891k9363n3703o9402p4081p9663
6207B197657r4932j13083j19334j08175r0500q2277q6936r2402q7017p3752o4538
6196A184711o4642o8834p0365o6747n8162m7182l8965l4745k7626j4240p319k1658
6184F64226m6328m9377j8998J6667K4432O624j0513j6234j9595k1826j3505j668
$$ y = [431701, 439715, 431803, 431115, 440744, 441862, 435362, 448716, 491546, 535234, 552204, 550764, 553281, 561441, 564960, 567392, 577557, 585942, 576727, 559978, 566163, 605578, 654351, 685725, 696942, 700044, 705633, 724928, 769024, 830612, 879342, 892587, 884172, 888055, 918476, 960027, 993206, 1015518, 1038996, 1080119, 1150733, 1244814, 1334822, 1397814, 1447794, 1523980, 1639666, 1761930, 1856903, 1939059, 2052086, 2206224, 2358683, 2460618, 2504014, 2512760, 2503869, 2474506, 2420803, 2351401, 2277320, 2197657, 2102725, 1989642, 1870308, 1762133, 1671633, 1589356, 1502420, 1410018, 1323001, 1249249, 1184711, 1120069, 1051235, 980870, 914123, 855961, 808779, 769814, 735069, 707443, 693203, 685884, 664226, 617898, 568521, 549523, 566190, 590622, 597246, 586733, 570499, 550904, 529078, 515573, 513905]
6172E13905j0081m0258n7644l6578j22R360j2270k9718k0808l002j793j5311k3177
6159B72503j6256l833K079j235p953j0043n088k03l774j2459j4437p352k029l581
6145A86339k161P643J1738k431j9637j3947J0259J9019k884k7833k4815m654l138
6132A33498k7860m7318l5247m360J3665P197q418j4325o616N363R991L539n619
6119B3490n371M114Q197k884j9125k3901j6486r770q702m670P458J9701K2995
6106d954J8797J3239P872J254o821j6004k3753k2323p846O780L288j2990j4276
6093e7737Q419K4993O922k7287l4189n651K1896J9234k404j7677k1439k2071j9374
6080a26365p612Q583J6966J2933L204k283K358J3387J6487J096k1314k6281r273
$$ y = [513905, 503824, 463566, 405922, 369344, 369222, 378582, 366312, 336594, 315786, 312784, 310991, 295680, 272503, 256247, 252414, 254493, 253258, 245305, 235262, 230174, 229971, 226197, 213738, 199301, 191949, 189920, 186339, 184178, 191821, 203559, 201128, 181491, 167544, 177803, 196822, 193938, 166105, 141290, 136636, 133498, 105638, 58320, 23073, 18713, 32378, 39575, 31157, 16832, 10216, 15579, 25570, 29109, 23490, 18119, 22233, 30430, 27546, 8421, -15480, -31966, -41736, -50438, -55108, -47650, -27949, -4954, 13843, 27082, 34954, 36208, 29387, 13383, -10370, -32693, -40539, -33759, -30471, -43461, -57737, -49318, -24325, -17403, -44690, -78879, -84530, -62634, -43400, -45804, -63481, -84920, -106991, -126365, -133977, -125394, -108428, -95495, -92291, -94574, -92216, -78829, -62342, -61246, -82560, -108841, -118114]
6067a18114N735K23j1804n465J8318L5089K8870O109j7242k8213k0659p73J4059
6054i3867J3658P764R209J2354M122j0037j1173L666J6151J3353L057j524J439
6041c1828M972J936j0393k4700k5066o406J1667O900j2917j8973j996J8521K6779
6028f1504K7184K2993N715k1449l4050j7962P993J8152J2330N257L57o096q381
6015d9461q8R909R604L726L398M576l532j5060j2958M552K0220J9689M427j4230
6001a5228k3444j6969m093j393p574j989K0572L4832K2421O95r438j7938l5185
5988e4731l5694J154L7076K0460k6638l4842L83J0051k8582m6161L941O1042N0619
5975d1922J664p440K1728K1171j9828l6270R51L7487K4866r733j7628M3J3543
$$ y = [-118114, -112379, -112156, -123960, -129425, -111107, -76018, -47148, -41039, -58281, -86494, -107153, -107926, -93867, -80209, -72445, -63236, -50882, -46760, -56797, -67970, -64304, -48153, -34800, -31743, -33267, -31828, -26856, -24920, -35313, -60013, -85079, -91485, -79818, -72918, -85835, -104808, -106804, -88283, -61504, -34320, -11327, -5612, -27061, -61111, -79073, -71080, -52928, -40598, -35341, -34984, -41080, -49461, -49549, -39640, -30036, -26310, -22912, -18336, -21868, -36928, -49886, -45334, -25114, -5425, -998, -15228, -38672, -55641, -59734, -61127, -68701, -70690, -50118, -15286, 7135, 7830, -1608, -19546, -54731, -90425, -89271, -52195, -31735, -58373, -93215, -92832, -82781, -111363, -157524, -153583, -92541, -41922, -40258, -47698, -25970, -4799, -24627, -60897, -59946, -22459, 2407, -7326, -24954, -24911, -11368]
5962a1368J6813J8852J1912j3472l9985m1550j7555J2773L4581L7362J1913k9351
5950i075m9060k8493K453N666j1778j4679M557K1548K2433J5938P086p181j7044
5937e7629q096P549K568j8499j9750Q440K9650J7456m284l386R722P109m467K283
5923c1334K1426J8369j1188k8242q812J9076J7625o603j6705M17K0480J9206J467
5910A5182j1496r567j142N82o956j3320q160L742O606l807j0606J033J8411J5594
5896c904p854k2115q516J2876J2399o502j5634o144J576n487j2452m356P817P430
5882e0866J254M949J1332J140j9255k1535p42J3448K453j2335n597J1250J1891
5869e2613J90J837J8966K5258P596j5665k4121j9134j0716k391J841m296j4237
$$ y = [-11368, 5445, 24297, 36209, 22737, -17248, -58798, -76353, -63580, -28999, 8363, 20276, -9075, -58135, -86628, -84175, -78509, -90287, -104966, -100409, -78861, -56428, -40490, -33404, -40585, -57629, -65725, -58176, -55608, -74107, -93857, -85417, -55767, -38311, -42595, -45981, -36259, -29150, -33617, -31334, -9908, 8461, -2727, -30969, -39781, -20705, -3080, -9683, -26388, -25971, -5491, 13715, 15182, 3686, -5881, -7023, -6441, -13397, -26717, -34877, -31135, -24529, -28336, -38942, -37909, -19498, -3904, -11758, -33873, -42389, -29513, -17114, -23616, -39250, -45394, -43818, -49305, -61757, -66113, -58296, -50866, -49612, -44663, -33331, -32191, -51446, -72981, -73723, -60275, -57822, -70157, -75754, -64504, -52613, -52423, -50586, -31620, -6362, 1234, -14431, -38552, -57686, -68402, -70793, -68952, -73248, -87485]
5856h7485j1046M629J0051k934r754Q403K8989J8067j8011m0314k9891m465J4175
5843a19586K1488J7998K786j4999k0568j4885j1396q906P396L2539L8397J6183
5831e3553n674m848K37j5280l5934k7584N286K0615j083k9103k6085L857K6116
5818a43033K1367L755l188M059R374K516n383Q09J3874J1153j0954k8272k3338
5805a47261r740p399j0785k439J4582K1897J5663P436J98j1785k1851j5473K911
5792a64046J2365P691N070J1228J2493K044o896n349k749n250l173O344P628n449
5778a28049j1951M212K3944J8865o570k3582j9969q409o17L762N446K871N80M457
5764a35010J0358J0511O755M780K264l543n306J312M173o496j5745l943J7895
$$ y = [-87485, -98531, -93902, -83851, -86785, -96539, -88136, -59147, -41080, -59091, -99405, -129296, -133761, -119586, -98098, -80100, -77314, -92313, -112881, -127766, -139162, -148068, -140672, -108133, -69736, -53553, -59227, -64075, -63838, -79118, -115052, -142636, -137350, -116735, -117818, -146921, -173006, -169149, -143033, -121666, -117911, -121099, -117040, -107666, -105150, -110533, -109724, -95850, -84697, -95651, -123923, -147261, -157001, -164400, -175185, -177624, -163042, -141145, -125482, -118046, -117848, -129633, -151484, -166957, -164046, -151681, -143990, -138920, -127692, -115199, -113155, -120051, -125400, -128149, -133399, -136572, -130228, -122600, -128049, -140000, -135788, -111844, -92979, -99549, -123131, -143100, -151509, -152126, -148364, -142918, -140047, -139467, -135010, -124652, -114141, -107386, -102606, -100342, -103885, -109191, -107879, -103706, -110202, -125947, -129890, -111995]
5751a11995J9784j977j8420j0190Q262J3268J09k0007l2986k6778j229K2198J9150
5738a40811l763j2985P563L5458M1848K5698M798j0589k1068k7263k8864k7804
5726a57782k4561j7653r419l047O073K2469L4525K4438l339k3084k1437j0133
5714a82950j207P005J2569N046j0618j1414P653K0146Q426q229o683L779L720
5701a52757m97P425J9695J7234L212n718r800j8504k3919j2678M799Q121J845
5688a61542N096J4244J0016m294p948k268o518j5727m600K2035K6673j098k4134
5675a50065j4887N249O239m892m850P113J7232K1767K0438P029j2208j4066N337
5662a10564J4555o804l0791k1803P223J6287M39r325L70J0074N902k063n070r280
$$ y = [-111995, -92211, -94188, -112608, -122798, -114536, -101268, -101159, -121166, -154152, -180930, -182159, -159961, -140811, -144574, -157559, -149996, -114538, -72690, -46992, -42194, -52783, -73851, -101114, -129978, -157782, -182343, -199996, -209415, -212462, -206389, -183920, -149395, -124957, -128296, -151380, -172817, -182950, -184157, -177152, -164583, -159537, -170155, -181569, -173916, -153770, -145344, -153573, -160256, -156477, -152757, -153254, -145829, -126134, -108900, -105688, -111406, -121206, -139710, -163629, -176307, -171508, -163387, -161542, -156446, -142202, -132186, -136480, -144428, -146696, -153214, -168941, -173541, -151506, -124833, -125931, -150065, -164952, -159703, -153464, -158356, -163206, -156093, -138861, -117094, -96656, -89627, -101835, -115901, -110564, -96009, -102813, -133604, -155407, -148184, -131897, -131458, -140783, -140413, -130339, -124437, -126500, -131570, -140850]
5648a40850j6179j4566j109J1291J3318J0191P244J698m851j940J3355K7281K4502
5635g0615N292j6046k4635j7050n176m676j4954j8802q343K380K119K379J3640
5622a54487J9172K20k5588k4504O79J3684M76j3975r907J586P268J2434J8829
5609a54113J3782j454k636J7665K9669J0018j9501k4094n711Q084P551L476j37
5596a17401o749j0474n329j819q915j1658M674K1280J1873q099l86L0391L6571
5583f6041J738l0907k4593j808j422j7228j7059J14Q010K309M871J9474K1373
5570a01169o33k3044k2496p313J958L802Q634J4354J0095j991p392m37R579J3039
5556a03014Q753r82j1800j4310l046J1012J1068o35n248J487J081j4016k0481
$$ y = [-140850, -157029, -171595, -172704, -161413, -148095, -137904, -130660, -128962, -133813, -135753, -122398, -95117, -70615, -65323, -81369, -106004, -123054, -128230, -132906, -147860, -166662, -175005, -172625, -170506, -168127, -154487, -135315, -135095, -160683, -185187, -184508, -170824, -170348, -184323, -194230, -192644, -185376, -172942, -154113, -140331, -141785, -144421, -126756, -97087, -87069, -106570, -130664, -136375, -128291, -120740, -117264, -117401, -124150, -134624, -139953, -141772, -150687, -162345, -157671, -136391, -124518, -132617, -133003, -102612, -66041, -64303, -95210, -119803, -121611, -123033, -140261, -157320, -157206, -149196, -146887, -142016, -122542, -101169, -101802, -124846, -147342, -154655, -152697, -148895, -140261, -125907, -115812, -117803, -125195, -125632, -116053, -103014, -94261, -95243, -107043, -121353, -124399, -113387, -102319, -102954, -108202, -106715, -105634, -119650, -140131]
5543a40131J555L0960K9849k529k8979k6253r206J188N258Q979O690l435o517
5530a32571P647K4894K5975J3077N62q285j7367k1818j4921k310P726J7921K8539
5517g0931K3905m139l1527k9195o557M005J04R053L2891L5769R34l6763l8338
5504a10789j1251J2512K3122K8214K2485k993l1572l5050j4814o5m083r216J23
5491a33377J4915K1777K4661L1812L5331K0363j0150l3175k9995p397Q551J79
5479e6505k1818l0082j2803J2857K2815J2830l455j3614j3158j900J3049J7393
5467g4391P308J9R304J7628k599m1207n2948j7318L0537M4876K3780j381j2491
5454f8883j4963j2460m09J5751K0340J0270m89l368m442p057n003r94j1074l5777
$$ y = [-140131, -138576, -107616, -77767, -80296, -109275, -135528, -144734, -143546, -138288, -129309, -122619, -126054, -132571, -124924, -100030, -74055, -60978, -60416, -68701, -86068, -107886, -122807, -125117, -117391, -99470, -70931, -47026, -51165, -82692, -111887, -118444, -114439, -114335, -105282, -72391, -36622, -35688, -72451, -110789, -122040, -109528, -86406, -58192, -35707, -38700, -70272, -105322, -120136, -120201, -124284, -133500, -133377, -118462, -96685, -72024, -40212, -4881, 15482, 5332, -27843, -57838, -65235, -56684, -56505, -78323, -108405, -121208, -108351, -85536, -72706, -76161, -89775, -102933, -104833, -91784, -74391, -67083, -67064, -57760, -40132, -42731, -83938, -136886, -154204, -123667, -78791, -55011, -56392, -68883, -83846, -96306, -96715, -80964, -60624, -50354, -50843, -54211, -58653, -65710, -70713, -71707, -82781, -118558]
5440a18558m5541j6936K7987M3869J9634j1081j8574r526j892O213K2068L1648
5428g0689J5251j6641l0343j4470M822K088j3578j5875J963K3321L2475K7565
5416e4111J3819k128j2103j2300r612j2635j6713q761J1334K5064J6729o836k4172
5403i2425k2787r587j94k219q942p914M085J5987J5105L251n636m185k00k696
5389a18357o954k375Q265Q782q215k8372l2078j8313k789M940J0413J8033J9540
5376a47480Q505l857k579O203K223j6022k4722r730R428O460j2302j5956O465
5363a93364K9621K5444k409k7455l3953k8899k3700j7198l091J3412J7838O826
5351b36928m291j960N332l35j7537k5329j3352L994R183K403o910j4291j5942
$$ y = [-118558, -164099, -181035, -153048, -109179, -89545, -100626, -119200, -128726, -130618, -124405, -102337, -70689, -55438, -72079, -102422, -116892, -112070, -109982, -123560, -139435, -137472, -114151, -81676, -54111, -40292, -42420, -54523, -66823, -76435, -89070, -105783, -114544, -103210, -78146, -61417, -68253, -92425, -115212, -124799, -124993, -127212, -136154, -144068, -139983, -123996, -108891, -105640, -111276, -115461, -115661, -118357, -125311, -127686, -119421, -110639, -118854, -147226, -179304, -197617, -200406, -195466, -185053, -167020, -147480, -138975, -142832, -145411, -139208, -136985, -153007, -177729, -187459, -178031, -171571, -183873, -199829, -193364, -163743, -138299, -140708, -168163, -202116, -231015, -254715, -271913, -275004, -261592, -243754, -236928, -241219, -243179, -237847, -238182, -255719, -281048, -294400, -290406, -281223, -278820, -285730, -300021, -315963]
5338c15963n465J1916J6480J344j1194L18K2810K7608J2516j106o021j4062k4665
5325b85484j9471N183K7077K8910J8439R282K535l435m824l501p970j5501j2649
5312b61409o44J932r340j4831m748K252r127k4013k2518j1219p830j1555j0329
5299c83379l370L038Q874J2761O500p180j0205J699Q406J356J076J5302J4004
5286c31118j9142m4802k4270J1329N370l0750l3671R626M3715L5116J5023J4590
5274c48984J8494Q509m22K524j246j6744j3066K1250M4641K4513o799k909K3922
5261b46317K9532R845m578n345o842n223J2182K6269O162l3333m3804j5405R905
5248b66952M693q945m399R060J0293J45q323j1004q248K465J7258K4736K1652
$$ y = [-315963, -321428, -309512, -293032, -291688, -302882, -302564, -279754, -252146, -239630, -240736, -246757, -260819, -285484, -304955, -299772, -272695, -243785, -225346, -216064, -213529, -216964, -221788, -225289, -233259, -248760, -261409, -262053, -260121, -269461, -284292, -289040, -286788, -295915, -319928, -342446, -353665, -361495, -373050, -383379, -386749, -383711, -374837, -362076, -355576, -362756, -372961, -371262, -362856, -361500, -360424, -345122, -331118, -350260, -395062, -419332, -408003, -402633, -433383, -467054, -457428, -413713, -378597, -363574, -348984, -330490, -321981, -322403, -319879, -321125, -337869, -350935, -329685, -285044, -260531, -267330, -270239, -246317, -216785, -206940, -211518, -216863, -223705, -228928, -216746, -190477, -184315, -217648, -261452, -276857, -266952, -262259, -271204, -275603, -266543, -256250, -256105, -264428, -275432, -283680, -281215, -263957, -239221, -217569]
5235b17569J4909O131o789j3177P11K2700K2768k998k3237j5381P073K2168K7847
5222a54844K8418J8203k652j6404j0634L253J0149J2750J7006J4055l717k2699
5210a07116k4009r513M712J1041J1252N272n164j0799p633o387j5065k1938j1741
5197a87088R273K0517J3929l4q301n741M555J2167P505l366k822J1519J9217P855
5183a00815n626j531J0480P824q084j5304n020J0640K0345K2580J6213J627j1165
5170e7836j2926j0152j2905j4564m169Q067K715j4301j6214L578K1285J9049O465
5157h1908k260q390j3669p284J5085L4511K9332M420j4371j0751P123J8931J2128
5144a7103q156k4993k6370j5625l433M842P761K719o269m755J1630K1345L673
$$ y = [-217569, -202660, -196529, -203318, -216495, -215784, -193084, -170316, -173314, -196551, -211932, -204859, -182691, -154844, -126426, -108223, -110875, -127279, -137913, -134660, -124511, -111761, -94755, -80700, -84417, -107116, -131125, -140638, -135926, -124885, -113633, -108361, -113525, -124324, -131957, -138344, -153409, -175347, -187088, -177815, -157298, -143369, -143403, -151704, -157445, -152890, -140723, -133218, -136584, -139406, -127887, -108670, -100815, -106441, -107972, -97492, -89668, -97752, -113056, -118076, -107436, -87091, -64511, -48298, -46671, -57836, -70762, -80914, -93819, -108383, -112552, -104485, -101770, -116071, -132285, -128707, -107422, -88373, -81908, -84168, -92558, -106227, -113511, -98426, -63915, -34583, -30163, -44534, -55285, -48162, -29231, -17103, -25259, -50252, -76622, -92247, -95680, -90838, -83077, -80358, -86627, -91382, -79752, -58407, -54734]
5131e4734k4412k5721K250K0523N547j6765j1182J6270L0104J3267j7546l6410
5119i8809l1997j1914N700R227O579J2470K2280J6183o101j7622l328J5085J1277
5106g0970p554j5631p000L590P377O886J972q398j5240q926M169R926O532K391
5092i0876J012J827P146J3395O581j5860l0625j7067J0256K0587Q849o148j5357
5079a06280k2198j9319L289K8789K7351L244o868R435K0863L712k0796k1289j018
5066a01085J5350J8011J1733k553k1960l0992j9098J026J0969J1134J0549O520
5054i0396m389q792M632J9023J0243j2108j5394M609J5594J66j5988n187J7922
5041h0065J8808m811k1719j4379m37j322j2237j6751j4037j2658q436P617K2844
$$ y = [-54734, -79146, -104867, -102617, -82094, -76547, -93312, -104494, -88224, -58120, -44853, -62399, -98809, -130806, -142720, -137020, -127793, -121214, -108744, -86464, -70281, -76382, -94004, -97332, -82247, -70970, -78524, -94155, -101155, -97565, -90188, -83302, -81330, -89728, -104968, -113894, -109725, -99799, -93267, -90876, -89864, -88037, -80891, -67496, -60915, -76775, -107400, -124467, -114211, -93624, -84775, -90923, -106280, -128478, -147797, -144508, -115719, -88368, -85124, -91992, -82557, -61694, -57982, -78778, -100067, -101085, -85735, -67724, -55991, -58544, -80504, -111496, -130594, -129568, -118599, -107465, -96916, -90396, -94785, -103577, -98945, -79922, -69679, -81787, -97181, -92572, -76978, -76812, -92800, -97987, -80065, -61257, -66068, -87787, -102166, -102603, -103925, -116162, -132913, -146950, -159608, -168044, -160427, -137583]
5028a37583J2145k0045l5036j3475J1903L201k3572k2210J1660L4164K0669k438
5016a60617o849m048j4062k4534j2775J2287K2762J4258O367Q633J2766J3769
5004a32043J4009R509n021j9723j9574q777m460q114m752R980K2994K5239K0703
4991a00030J3156K691m580k256J746l707j0207k267R897O64k4959l0022j791K4775
4977a26890J9151l57j222J0130L971j9489k9258j2039J1040J9728J9230K0866
4965h5139J9993O893j3324k4848k0024n688O458J0066O059j097p190r433o918
4952a24192k490k041p759j3784j3844j0398q578m390R366K6667L2180K3351J3288
4939h2624Q041j439j7075k2211o256J4387J7229N283l0Q554J5694O407j5266l1429
$$ y = [-137583, -125438, -145483, -180519, -193994, -182091, -178890, -202462, -224672, -213012, -178848, -158179, -160617, -167466, -171514, -185576, -210110, -222885, -210598, -187836, -173578, -167211, -158578, -145812, -132043, -118034, -108525, -113546, -133269, -152843, -161620, -166080, -174194, -178946, -168966, -145972, -120733, -100030, -86874, -84183, -88763, -91019, -89273, -92980, -103187, -105454, -95557, -94893, -119852, -149874, -151665, -126890, -107739, -108096, -109318, -99188, -95217, -114706, -143964, -156003, -144963, -125235, -106005, -85139, -65146, -58253, -71577, -96425, -116449, -122137, -115679, -105613, -99554, -100651, -107841, -117274, -124192, -126682, -128723, -136482, -150266, -164110, -174508, -183086, -187476, -178110, -151443, -119263, -95912, -82624, -74583, -76022, -93097, -115308, -121564, -107177, -89948, -84665, -84695, -76141, -60447, -54040, -69306, -100735]
4925a00735k7580o617J1420R720l906p051M571J2575R043J0596K5863L3647J5459
4912a2995j0890j6843o034l293j4209k5265l2599l8963l2562l978K4049K2269
4900a51313M921J1664M0664M7513J7948q357l859N417q822k7574k0760J302R852
4887h1404M632K727K464o259j3881o970M414O091P749J9499K2553J532j5912K164
4873e0601L1429K2913j5313k7629j715J3015r233k8883j1315J5688J2365q695
4861e7974j1461K475N549n013r218k471M445J1256K0877J8868n386k7548j4953
4848g0554K1845M0538K6873N827o893k3448m5245m6050j4064K0200K2523k44j7021
4835h5713j6000p481K719J6061K4366J5373m418j3506n271L790J461j582Q364
$$ y = [-100735, -128315, -134932, -123512, -113792, -117698, -124749, -120178, -107603, -98560, -87964, -62101, -28454, -12995, -23885, -40728, -46762, -50055, -64264, -89529, -122128, -161091, -193653, -197631, -173582, -151313, -146392, -134728, -94064, -46551, -28603, -36960, -40819, -35402, -44224, -71798, -92558, -91256, -81404, -76772, -74045, -71581, -77840, -91721, -98691, -94277, -88186, -80437, -60938, -38385, -36853, -52765, -50601, -19172, 3741, -11572, -39201, -40916, -27901, -37134, -66017, -77332, -61644, -49279, -57974, -69435, -66960, -61411, -66424, -75642, -78113, -73668, -62412, -41535, -22667, -28053, -55601, -70554, -48709, -8171, 18702, 24529, 17636, -5812, -51057, -97107, -111171, -90971, -68448, -68692, -85713, -101713, -109194, -106475, -90414, -66048, -50675, -55093, -68599, -73870, -70080, -68619, -70201, -61837]
4822f1837K2481K0499K716p465K273J2792N31k5761l4952j8113q64m398j5891
4809a07989j2926O95N649J294K853J0158P781k924j358J5052J9976l91k0526j2075
4795i4731J2531J9317L521p449J722J4345J1555M72J090J6793K9104J8931j1805
4782A5396l9450m0833j7793N157J0239M571K719L453k136r189n503M319K016j5009
4768h2043k7024k0420n796L56k686o185p365p519m136M015R915N494q104k2669
4754a74167k9703k1993J581K7129L2839J4350o315p553M845R530M95q932r170
4741a67064n869o960j0611j0309m459K447M650K49o585j0739j3830k0126k3758
4728b72964j2037J2101K5234J3416n843q065L176O686k18k517p12j2368l5211
$$ y = [-61837, -39356, -18857, -16141, -23606, -21333, -8541, -8010, -33771, -68723, -86836, -87700, -92098, -107989, -120915, -120220, -114571, -113277, -110424, -100266, -92485, -95409, -96767, -81715, -61739, -62130, -82656, -94731, -82200, -62883, -59362, -66811, -65089, -50744, -39189, -38717, -37627, -20834, 8270, 27201, 15396, -24054, -64887, -82680, -77523, -67284, -62713, -59994, -56541, -58677, -67866, -73369, -69050, -67034, -82043, -109067, -129487, -135283, -134927, -137613, -143798, -151163, -158682, -162818, -158803, -148888, -143394, -151498, -174167, -203870, -225863, -224282, -197153, -164314, -149964, -156279, -163832, -158987, -149457, -148962, -157894, -167064, -172933, -179893, -190504, -200813, -205272, -202825, -198175, -197926, -204511, -215250, -229080, -249206, -272964, -285001, -272900, -247666, -234250, -240093, -248158, -244982, -238296, -238514, -241031, -241743, -254111, -289322]
4715b89322l9176r777K5180L0826Q414j6079k9974l7715l8380k5070m005P272
4703d17806K467q254j5423j8022j4843m039O991O208n330j3682j2988j1957j4776
4690e21454j1529K616J2669L378j4960j7713j097J1264K223j2923o574K2525M5657
4677d85918L9902J4379n245p909k682L8k45l1K982J1576K5437L5032K9614J2341
4663c30729l994j5902k8440l4378j6011K3057M9519M0407J4526M985J4999K2614
4651b59347J7011N519o657j7263j3533J3483M2268L7760p20l4630l5383j3800
4639b65292O064J6592J9581J3775L477O28O653R692P185R384J3696L932j4048
4626a68681j0179J7620K6451o002l5078j1575L7653M5523N628k2404p679J2551
$$ y = [-289322, -328498, -338275, -313095, -282269, -273855, -289934, -319908, -357623, -396003, -421073, -425078, -417806, -415339, -423593, -439016, -457038, -471881, -475920, -468929, -462721, -468051, -481733, -494721, -506678, -521454, -532983, -530367, -517698, -514320, -529280, -546993, -548090, -536826, -534603, -547526, -554100, -531575, -485918, -446016, -431637, -436882, -444791, -447473, -447435, -447680, -447711, -444729, -433153, -407716, -372684, -343070, -330729, -334723, -350625, -379065, -413443, -429454, -406397, -356878, -316471, -301945, -296960, -281961, -259347, -242336, -236817, -243474, -260737, -274270, -260787, -218519, -180759, -181479, -216109, -251492, -265292, -259228, -242636, -223055, -209280, -205803, -205175, -198522, -188830, -181645, -172261, -158565, -154633, -168681, -178860, -161240, -134789, -140791, -175869, -187444, -149791, -104268, -98640, -121044, -128723, -116172]
4614a16172L863j0957M57K1510J6261j0212k2596j1804j665m065k900J2145K4388
4601a01747J5259p538k0813j5463l207K474J584J677L736J175p583j3029n870
4588a49345J0130K2219K2470J2480j306j0850j0097k356J492o40L418J8593K7198
4575e6594J2784r890j1715P956K0144Q416j2273k2508k0179r611P401K1671K0026
4562d4372O890Q50L734j248j4079j2570N312R962q519j4789J4988M5163L0531
4549B1853j1957k9068j2012k62j1019j7122j459J4313J1398N224J4087K5944J9341
4536B9261k217j6656j1998M548J6624J1131r008k2740j4385K663L135j2121j8301
4523d0064o227O534P561N503P316N899q84l818l224j0305j9789j0836J3657K1081
$$ y = [-116172, -112309, -123266, -122809, -101299, -85038, -95250, -117846, -129650, -131315, -135380, -138280, -126135, -101747, -86488, -94026, -114839, -130302, -133509, -131035, -129451, -127774, -124038, -122863, -130446, -143475, -149345, -139215, -116996, -94526, -82046, -83352, -94202, -104299, -106655, -105163, -105803, -102385, -83792, -56594, -43810, -53700, -65415, -57459, -37315, -28899, -41172, -63680, -83859, -93470, -86069, -64398, -44372, -37482, -36632, -32898, -34146, -48225, -60795, -55483, -45521, -54040, -68829, -53841, -8678, 21853, 9896, -19172, -31184, -31446, -42465, -59587, -61046, -46733, -35335, -30111, -16024, 9920, 29261, 27044, 10388, -1610, 2938, 19562, 30693, 21685, -1055, -15440, -12777, -9642, -21763, -40064, -46291, -39757, -32196, -26693, -19377, -13478, -14362, -18180, -21404, -31709, -51498, -62334, -48677, -27596]
4509b7596n80j8410l526K4211K7409L883j9492k7002k2004j0549jQ43j537J1303
4495f3048L3062K8571r791l5863j5103J6978P975k7274l1621K375K6400J7627
4483d9712M925Q021Q745j732p8K2130L4080J4639j2582j9254j3256j2755j0693
4470b7522N018K0631J5284o626k4881k9287j9051L857K4669K1672j338j3403l795
4457c4772r78k2191l7711j7207J8033K7625J3224N578Q601J495j3482j0923J0944
4444e1764K3756J3379k646o641j097N471P301l978k8275m3859l2040r577n922
4431a35892j5010o869J7276K5557J3452J3270L3853L8960P839k6277k7433r506
4419g0780m193q004J207J8324K1004J0962Q868J6316J4884j200j7987k3776j7167
$$ y = [-27596, -28176, -46586, -50112, -25901, 1508, 5391, -14101, -41103, -63107, -73656, -73657, -72814, -74351, -63048, -29986, -1415, -11206, -47069, -62172, -45194, -37219, -64493, -96114, -93739, -67339, -49712, -44787, -36766, -28021, -29753, -29831, -7701, 26379, 41018, 28436, 9182, -4074, -16829, -27522, -22504, -1873, 13411, 6785, -18096, -47383, -66434, -62577, -37908, -16236, -17574, -30977, -34772, -35750, -57941, -95652, -112859, -94826, -67201, -53977, -48399, -39798, -38303, -51785, -62708, -51764, -28008, -14629, -17275, -23916, -25013, -19542, -12241, -16219, -44494, -88353, -120393, -129970, -135892, -150902, -157771, -140495, -114938, -101486, -88216, -54363, -15403, -7564, -33841, -61274, -70780, -74973, -82977, -81770, -63446, -42442, -31480, -22612, -6296, 8588, 7388, -10599, -34375, -51542]
4406e1542l60J5956J2234j3202l0165j5529P653K512k0999j8072J9342M5444K6916
4393a9812j0526k2435n175R542L383r362o266J5290L4814K8626l659l3465l3080
4380e2125r222O809J393p530k183R600J0557j55r090o463O218J7804J3434r208
4366c0161k8169j9163P779J6008n429k3053q264J9837K5050P343m406m38J391
4353d1675q720j8470j7731j1919o461J188R511J1835J0984J6341K3423J6879j780
4340a6595j1923o715m635j6220k2646n547K1110L0600K0464P897k43q526j2270
4327b5249k245J1970Q889j1530k4412j5376J600R441J0449J1865P945o964k0768
4314d4385j7925m292o51j3901k8636k6825n356K4410M5042M3494K3323M202K6
$$ y = [-51542, -51902, -35946, -23712, -36914, -67079, -82608, -74955, -72443, -93442, -111514, -92172, -46728, -19812, -30338, -52773, -57948, -48406, -45023, -54385, -60651, -45361, -10547, 18079, 14420, -19045, -52125, -61347, -54538, -53145, -60675, -62858, -53258, -42701, -42856, -51946, -58409, -52191, -34387, -20953, -30161, -58330, -77493, -69714, -53706, -59135, -82188, -90452, -70615, -45565, -38222, -42628, -43066, -41675, -50395, -68865, -86596, -98515, -104976, -103788, -94277, -82442, -71458, -55117, -31694, -14815, -16595, -28518, -35233, -39868, -56088, -78734, -84281, -63171, -32571, -12107, -4210, -4453, -12979, -25249, -27494, -15524, -6635, -18165, -42577, -57953, -56353, -46912, -36463, -24598, -16653, -23617, -44385, -62310, -66602, -67253, -81154, -109790, -136615, -141971, -117561, -72519, -29025, -5702, -1500, -1474]
4301a474J914n152j5088r153R588J4145n610k2782j1328J3093J4257j0884k6703
4288e5177r788J8963K5028N645j2340j1226q63J724l695l714Q437K2981K3728
4275I703O103j5577k1229p785N303j50j5468j5790K345J1145q887l4465k7277
4262a12029R286K9068O245k6833k3465J4953M5556M2385K0217K231p919j5192
4250a5497j7857j4611j0226m421R380K6200K8225J1732l603m957n010j3393j2925
4237b6963R450K8389J2324k2021k7021N699L2655K2517n684k1850k6135k9932
4225d8572k6973j0831K274k959j1922k895J5564J9062P874K388N825L297m619
4212e2487j5J7728K5977J4983K202P32k46j0257j7261r427L244P495Q607J3630
$$ y = [-1474, 440, -4712, -19800, -28953, -19365, -5220, -10830, -33612, -44940, -31847, -17590, -28474, -55177, -64965, -46002, -20974, -15329, -27669, -38895, -39758, -38034, -41729, -45443, -37006, -14025, 9703, 15806, 229, -21000, -28785, -23482, -23632, -39100, -54890, -52545, -41400, -50287, -84752, -112029, -102743, -73675, -67430, -94263, -117728, -102775, -57219, -14834, 5383, 7614, -305, -15497, -33354, -47965, -58191, -62612, -53232, -27032, 1193, 12925, 9322, 4365, -645, -14038, -26963, -17513, 10876, 23200, 1179, -25842, -20143, 12512, 35029, 29345, 7495, -18640, -48572, -75545, -86376, -84102, -87061, -98983, -101878, -86314, -67252, -59378, -56990, -51165, -47868, -52487, -52502, -34774, -8797, 6186, 8388, 9120, 8874, -1383, -18644, -28071, -24827, -17332, -8725, 4905]
4198D905J0525j0860l0108j8884J2519K2338m281l2206k4284R478K8603J4419
4186a7836j3482k6955j8131Q88J3310J0096k830p554P223K8900L2029R969j5179
4173D48k0445q794J726M689N496K430j1348k7386k5803o103O994m10r290J930
4159h5866K2595K7093J4257M563N560O293L243N093J0119M975q819j2439j624
4146d957L829o712j6060q320N414P757J680j948m824r145l596J5215K4491O014
4132H838j8747j5412J0698K1710L187k0361k6178j6892J97K3868M0550K8371n726
4119C4103k2631l317K2027J7957p209k0935j4810n378j188J944J431q181j5832
4106b2019m782J7805K5969J1637n427q037k437l008j2131k1224j9960l098J9231
$$ y = [4905, 15430, 4570, -25538, -44422, -31903, -9565, -13846, -46052, -70336, -60858, -32255, -17836, -31318, -58273, -76404, -75516, -62206, -52110, -54940, -62494, -55271, -26371, 5658, 15627, 448, -19997, -28791, -27065, -22376, -16880, -14450, -25798, -53184, -78987, -85090, -78096, -78506, -87796, -85866, -63271, -36178, -21921, -17358, -11798, -5505, -2262, 2831, 12950, 17925, 9106, -3333, -4957, -1128, -7840, -23900, -32220, -26806, -19049, -17369, -19317, -24141, -33286, -36882, -21667, 2824, 8838, -9909, -25321, -14623, 7087, 10274, -10087, -36265, -53157, -52960, -29092, 11458, 39829, 34103, 11472, 8155, 30182, 48139, 40930, 19995, 5185, -193, -1381, 563, 1994, -6187, -22019, -26801, -8996, 16973, 28610, 23183, 15146, 12709, 9701, -2430, -23654, -43614, -46712, -27481]
4093b7481K1240q847l9681k4257L5144P7057N4159n827l7675k1512L081P09j5960
4080A0150j6407K42R896L456j662Q274K0514J5284j713l764J7710L5282J9821
4067A17083j7806l8919k8639j2243j3201j8924o819J4074J5281m505j5266j340
4055a1224J6343J4763J868j812L801M635n80k134j336p915j7608j4766M10P902
4041g653k644j6622j6659m296R130J8393K1406J4677K914k72P260R250k951j3939
4027A7994j0297m791j1326j3667Q230L3121K1122j9981l6083o085K4115J0815
4015A3167k2887k6771P87J9346J2989N934J3850K0011Q513j0428k0288j9477j1910
4002a7164K334J5487J1473q832j8489K288L5118M3234J7306j3810j8218L695K2456
$$ y = [-27481, -6241, -15088, -54769, -79026, -43882, 33175, 87334, 81507, 43832, 22320, 25401, 26110, 10150, -6257, -6015, 3881, 7337, 5675, 13949, 34463, 49747, 48034, 44270, 61980, 97262, 117083, 99277, 60358, 31719, 19476, 6275, -12649, -19468, -5394, 9887, 5382, -9884, -11224, 5119, 19882, 21750, 19938, 23739, 28374, 27794, 25660, 24324, 16409, -1199, -15965, -15555, -7653, -10297, -26919, -43578, -47874, -38744, -20351, 1055, 15732, 18646, 18374, 25634, 34884, 31933, 17994, 7697, 2906, -8420, -22087, -13857, 19264, 40386, 20405, -15678, -21763, 2352, 13167, -9720, -36491, -35704, -16358, -3369, 2565, 16415, 36426, 44939, 34511, 14223, -5254, -17164, -14830, 657, 12130, 3298, -15191, -12903, 22215, 65449, 82755, 68945, 50727, 54422, 76878]
3989G6878J3778j3990k9697j7090N134Q633p290j8347j1359J200M962L378O160
3976B2350J2902J6984J4747M780j0141j6483j134K4747L1381R814j3044j2239
3964H4664J398L317o130q594j280K019k642n913n432p526r830l228Q684J2217
3950F1724O576M436Q213O645j606k565Q147J5199P358o767j6556k5075l4788l4315
3936c374j5732O989J3794N908K202J1969K4389K4340R563p994j3285k679J0386
3923F6476R081n941j7094j3415l053K088K305K769J122o872j6432j8351r874M957
3909b234J9463K4236J2987n311j1768k965K265q319j9786j3602K323P215N71j169
3895C906N214P117J807N64N229M002m240m237Q380J5641N680o354k339R017O279
$$ y = [76878, 90656, 76666, 46969, 29879, 35013, 43646, 36356, 18009, 6650, 7850, 12812, 16190, 22350, 35252, 52236, 66983, 71763, 61622, 45139, 44005, 68752, 100133, 109947, 96903, 84664, 86062, 89379, 83249, 74655, 73375, 75394, 72752, 66839, 61407, 53881, 44051, 40823, 49507, 61724, 68300, 72736, 80949, 87594, 85988, 83423, 91570, 106769, 114127, 107360, 90804, 65729, 30941, -3374, -19106, -12117, 1677, 7585, 9787, 21756, 46145, 70485, 80048, 72054, 58769, 56090, 66476, 75557, 69616, 52522, 39107, 36054, 38142, 40447, 43216, 44338, 37466, 21034, 2683, -7191, -2234, 17229, 41465, 54452, 49141, 37373, 34408, 36673, 28354, 8568, -5034, -2711, 4504, 5075, 3906, 9120, 16237, 18044, 18608, 23837, 27839, 23599, 19362, 27742, 43383, 49063, 42709, 40370, 49387, 55666]
3880E5666j0140j8512q391O722J2110J0483J0098P177o490k3964k6115p636J2122
3867A3130J3392K757J776J2945J5994K095q722K002J9858J6858p754k8220k9518
3854B6593k1301j4755q775m252j0094k4304k6726m350K7677M2427L0720N581j4433
3841D008j7640k921J9301L2995K9037J0289j3925l1188k8320n104J5575R331j5857
3828E581k6910j1032Q672J0785M120M489O794L44p434m744K452L321K674P398
3814F510Q019l016j0614j282P885m484k2762j5634J0815K1154P528l414j477o253
3800g025k1306j9831O896K7553J9948N636R015J5659L289j3758q205J1224J1913
3787D1008j1390l0671k5957n722J1483J4791L854r237p558P195J1664l451j3667
$$ y = [55666, 45526, 27014, 18623, 25345, 37455, 47938, 58036, 65213, 58723, 34759, 8644, 1008, 13130, 26522, 29279, 31055, 44000, 59994, 62089, 53367, 55369, 75227, 92085, 84331, 56111, 26593, 5292, -9463, -18238, -22490, -32584, -56888, -83614, -87964, -60287, -17860, 12860, 18441, 4008, -13632, -16553, 2748, 35743, 64780, 75069, 61144, 29956, 1636, -3468, 12107, 21438, 5581, -21329, -32361, -23689, -12904, -8784, -4295, 2499, 2843, -4591, -9335, -6883, -3562, -888, 6510, 14529, 11513, 899, -383, 7502, 3018, -19744, -35378, -24563, -3409, 4119, 705, -772, -7025, -28331, -48162, -41266, -13713, 6235, 11871, 20886, 36545, 39834, 26076, 17871, 29095, 41008, 29618, -1053, -27010, -32732, -21249, -6458, -2604, -11841, -19399, -12204, -540, -3991, -17658]
3774a7658J010J8732P807k0658k8921j0854M691L250k192n859j5719k2554n276
3761i4201K4527K6627m599k3554j589K8647K5587l01j2699p138l501k892O667
3748c8419J5227K657k0931k4474l970J3659J5013J3785J6108P780j2948k1925
3736c8438n751J3712J1019o263j3287n436J268j209m083P41R661J4561J1611L048
3722h846l841k034O269J0836P641L954L403k567j6708k1201m86K6850K4301j0280
3708A7291l4201j6396J7285J9340j1970l1650j3131J7981K6541J5219P841P627
3696B1777J414p328k458J1069R660q851j8717q767l89p700j0337J0000L1651K3295
3682D4319n235j6869k948R736N002l356k382K87l427p623q563j2982j9650j3863
$$ y = [-17658, -16648, 2084, 9891, -10767, -39688, -50542, -45851, -42601, -44793, -50652, -66371, -88925, -94201, -69674, -43047, -47646, -71200, -72789, -44142, -18555, -18856, -31555, -38693, -42194, -45086, -38419, -23192, -20535, -41466, -65940, -69910, -56251, -41238, -27453, -11345, -3565, -16513, -38438, -44189, -30477, -19458, -25721, -39008, -44444, -43176, -44385, -48468, -47727, -38066, -23505, -11894, -8846, -12687, -14721, -8452, 2384, 10025, 13979, 17382, 14815, -1893, -23094, -23580, 3270, 27571, 17291, -16910, -33306, -16021, 3319, -8651, -40301, -53432, -35451, -8910, 6309, 14150, 21777, 23191, 15863, 13405, 24474, 34134, 25283, 6566, -2201, -2590, -10290, -20627, -10627, 21024, 44319, 39084, 22215, 19267, 29003, 34005, 30649, 28267, 28554, 25127, 17504, 8941, -4041, -23691, -37554]
3668c7554P156K2429J5049l890j3010q196Q39Q256J2124P661n403j6631j7035
3655b8205r528N9J0943J8553J2958k904r429J509J0817J413j3339j1598J078L493
3641a4180l819j912J0258J2317j873j1756j343J7710K4177J3372l026j1964q330
3628A9631J827N210l448j2583j0429m055o498j2151n882P998J0693J620j031N410
3614c688L074j0329j2000O089J8548P119q266l342J0038O438r296j2798k724L05
3600a0832q333j0803J735J6885K2151J7355N730p843j1791j368O157p339k8017
3587a6313k5945l133O530q629j8807k905J5142O013j4933j0881J7243L0712J0687
3574a5219j6171j8611k567M058o371j3558j331J8680K2622N978j1362j1645Q8
$$ y = [-37554, -30398, -7969, 7080, 3190, -9820, -18016, -17177, -8921, 3203, 10864, 5461, -11170, -28205, -37733, -37674, -26731, -8178, 4780, 1876, -7553, -6044, 4773, 6186, -7153, -18751, -17673, -14180, -17999, -19911, -9653, 2664, 791, -10965, -12308, 5402, 29579, 42951, 39925, 27961, 19631, 21458, 26668, 23220, 10637, 208, -3847, -10345, -22496, -28378, -20380, -9687, -8067, -9098, -3688, -614, -10943, -22943, -16854, 1694, 8813, 547, -2795, 7243, 13681, 4385, -8413, -11137, -10832, -19165, -29968, -28233, -11348, 10803, 28158, 33888, 26045, 14254, 12886, 19043, 11704, -16313, -42258, -45391, -38861, -47490, -66297, -69202, -54060, -48047, -62980, -73861, -56618, -25906, -15219, -31390, -50001, -52568, -48510, -54881, -68439, -69770, -51090, -28468, -22490, -33852, -45497, -45409]
3561d5409Q232R434J0538J0356J382j0358p043J2633K4941J2994p743j1333K026
3548A0650R316p89j4733j5550l107J0101J3445O049l369m344K787N855j669r213
3534E429n610O55n770j8020j1682J7684M1811L4994O448j5750k0910j9874k0720
3521a1315j8787j0699k542O93K592O604Q792O358O266J5442K5433J8466p460k9218
3507A0625k3614J825J4931j258k5603k5302J384K3127J6916l623j0028K231J1975
3494f414N224p486j1136q172q970j0728k088J4197K0293Q853m992m888N360J1911
3480I64J1898J0589N489q864k2581j6228J0571L2584K9284R376l657n1J1621J9097
3466I0092J5124j373k1822l0468k0430l958J839l892p107J518J5667K0157N041
$$ y = [-45409, -37177, -27743, -17205, -6849, -5467, -15825, -22868, -10235, 14706, 27700, 19957, 8624, 10650, 19966, 19177, 4444, -11106, -14213, -4112, 9333, 15382, 12013, 7669, 10456, 16311, 14642, 5429, -181, 474, -5296, -23316, -34998, -17314, 24497, 59491, 65939, 50189, 29279, 9405, -11315, -30102, -40801, -43343, -42650, -40058, -33454, -24662, -18304, -12038, 3404, 28837, 47303, 39843, 10625, -12989, -11164, 3767, 2509, -23094, -48396, -47012, -23885, -6969, -10592, -20620, -18389, -6414, -1190, -8676, -19812, -27984, -36954, -47682, -49770, -35573, -15280, -6427, -11419, -16307, -10947, 964, 12862, 23451, 28940, 20076, -2505, -18733, -8162, 24422, 53706, 63082, 59425, 59374, 70995, 90092, 105216, 103843, 82021, 51553, 31123, 27165, 29004, 25112, 18005, 19523, 35190, 55347, 60388]
3453F0388k2014l5601j6008K2287M0626K4238K224L571J3463O19k7299l2282n974
3440B8238J7354J3814j10l450l081j0534j5165m775Q960J0107M944M873J151j6598
3426C5728l2749k6640q631l330o615N456K9544L5108J4393m433k877M051K584
3413D1589M789J8820K5269Q962j0236p409N814J449j6158j6497O380K3060J3421
3400I9253o464j2236l643L954M196J693o57l819o980p978o365k154M060P976M946
3385G5782k321p227j1126k0465k9673k1689O035K9719K6860O103n690M79R834
3372E6621J0852Q975J0570J0805N036j369l410n098q429m923R730K1723J4599
3359A25682o403k0125j6801n321M923J2872J5064L877j6009k4324r546J3635K2015
$$ y = [60388, 38374, 2773, -13235, 9052, 49678, 73916, 76140, 79711, 93174, 93793, 66494, 34212, 28238, 45592, 59406, 59296, 55846, 52765, 42231, 27066, 22291, 31251, 41358, 46302, 51175, 52326, 35728, 2979, -23661, -32292, -35622, -42237, -36781, -7237, 27871, 42264, 37831, 34954, 39005, 41589, 46378, 65198, 90467, 99429, 89193, 81784, 87598, 89047, 72889, 56392, 62772, 85832, 99253, 92789, 80553, 76910, 80864, 85060, 86753, 86096, 82277, 75297, 67319, 60954, 58800, 62860, 70836, 75782, 73461, 66234, 55108, 34643, 4970, -16719, -10684, 19035, 45895, 51998, 46308, 46787, 56621, 67473, 76448, 87018, 97823, 102859, 101490, 98080, 92982, 84553, 79630, 89360, 111083, 125682, 119279, 99154, 82353, 77032, 81955, 94827, 109891, 113768, 97759, 73435, 63889, 77524, 99539]
3346I9539J1440l723j1741j2475r609n703l899n377n803j585K434p10q061r282
3332C5445m68J2130K1287K4192J9399O474r915k1293k2399j4231j883P714R299
3319F5751M434p37m763j0244j1790J287K2505K5725Q97k3928j8542M875J1377
3306F6847k088o127Q986J8600Q171m753p321j3879l0040k8501Q016M6178M1424
3293A05513J662k5429j9419m528k259k934P562K1081K0721M181j6112k5696j7575
3280D6768R42J1243L814p765n368P058J1121K393p336j1708j3455r668M595J8786
3266E1420J5812J58n104P400J9543J6283L045r944j9648k1206q141J1324J7440
3253G8382M976j1363k0583k4258k0554m374J2852J0680p032j4342m405L111K556
$$ y = [99539, 110979, 107256, 95515, 83040, 73431, 67728, 63829, 58452, 52649, 51064, 53498, 52788, 44727, 35445, 34977, 47107, 68394, 92586, 111985, 118459, 108544, 87251, 64852, 50621, 48738, 56452, 65751, 70185, 69448, 64685, 54441, 42651, 43938, 66443, 92168, 93065, 69137, 50595, 55470, 66847, 64759, 58632, 67618, 86218, 94389, 89636, 82315, 68436, 38396, 9895, 17911, 64089, 105513, 107175, 81746, 62327, 57799, 55540, 52606, 60168, 81249, 101970, 106151, 90039, 64343, 46768, 47710, 58953, 62767, 55002, 49634, 56692, 67813, 70206, 62870, 51162, 37707, 28039, 32634, 51420, 67232, 67390, 62286, 69686, 89229, 105512, 108557, 98613, 78965, 57759, 49618, 60942, 78382, 83358, 71995, 51412, 27154, 6600, 2226, 15078, 25758, 18726, 4384, -21, 3090, 5646]
3240E646J2005L0067K5824o415k5431n991J8053J0846n409N955K7623J9245q931
3227A03087j4009M023P291p300m894J6542J6994j2148k7164n646J5719N416j1349
3214H6562p92K1671K0849k501k2571l0313l0455j8796M879K0066J2100k052k515
3201E6132j052j5537k9396j3938K0754L5628J9221L5J915J7158K7492K6159J4128
$$ y = [5646, 17651, 47718, 73542, 67127, 41696, 35705, 53758, 64604, 59195, 65150, 92773, 112018, 103087, 89078, 93101, 100392, 93092, 88198, 104740, 121734, 109586, 82422, 76776, 92495, 97911, 86562, 85770, 107441, 128290, 125789, 103218, 72905, 42450, 23654, 28533, 48599, 60699, 58647, 56132, 55080, 39543, 10147, -3791, 16963, 52591, 71812, 71847, 73762, 90920, 118412, 144571, 158699]
$$ [...]
##END NTUPLES=NMR SPECTRUM
##END=
