##TITLE=H1
##JCAMPDX= 6.0         $$ Bruker NMR JCAMP-DX V2.0
##DATA TYPE= NMR FID
##DATA CLASS= NTUPLES
##ORIGIN= UXNMR, Bruker Analytische Messtechnik GmbH
##OWNER= root
$$ XWIN-NMR		Version 3.5
$$ Mon Feb 22 11:29:55 2016 Russian Standard Time (UT+4h)  servis@DPX200
##.OBSERVE FREQUENCY= 200.131235884673
##.OBSERVE NUCLEUS= ^1H
##.DELAY= (6, 6)
##.ACQUISITION MODE= SIMULTANEOUS
##.ACQUISITION SCHEME= undefined
##.AVERAGES= 32
##.DIGITISER RES= 18
##SPECTROMETER/DATA SYSTEM= spect
##.PULSE SEQUENCE= zg
##.SOLVENT NAME= CDCl3
##.SHIFT REFERENCE= (INTERNAL, CDCl3, 0, 16.5164)
##AUDIT TRAIL= $$ (NUMBER, WHEN, WHO, WHERE, WHAT)
$$ ##TITLE= Audit trail, XWIN-NMR		Version 3.5
$$ ##JCAMPDX= 5.01
$$ ##ORIGIN= Bruker BioSpin GmbH
$$ ##OWNER= servis
$$ F:/spectra/data/servis-vadim/nmr/H1/1/audita.txt
$$ ##AUDIT TRAIL=  $$ (NUMBER, WHEN, WHO, WHERE, WHAT)
(   1,<2016-02-22 11:28:52.15 +0400>,<servis>,<DPX200>,
      <created by zg, POWCHK disabled, PULCHK disabled
       configuration hash MD5:
       00 E9 B6 7A A2 85 ED C7 34 08 36 98 17 FE 4E 26
       data hash MD5: 16K
       F9 1D BC 55 79 5D 22 FA EC F9 C8 AF EA FB 4E 4B>)
$$ ##END=
$$ 
$$ hash MD5
$$ F4 77 36 87 45 F7 80 4F 3C 67 42 64 76 54 E7 D9
##$RELAX= 
##$RELAX= 
##$RELAX= 
##$RELAX= 
##$RELAX= 
##$RELAX= 
$$ Bruker specific parameters
$$ --------------------------
##$DU= <F:/spectra>
##$EXPNO= 1
##$NAME= <H1>
##$PROCNO= 1
##$TYPE= <nmr>
##$USER= <servis-vadim>
##$AMP= (0..31)
100 100 100 100 100 100 100 100 100 100 100 100 100 100 100 100 100 100 
100 100 100 100 100 100 100 100 100 100 100 100 100 100 
##$AQSEQ= 0
##$AQ_mod= 1
##$AUNM= <au_zg>
##$AUTOPOS= <>
##$BF1= 200.13
##$BF2= 200.13
##$BF3= 200.13
##$BF4= 200.13
##$BF5= 500.13
##$BF6= 500.13
##$BF7= 500.13
##$BF8= 500.13
##$BYTORDA= 1
##$CFDGTYP= 0
##$CFRGTYP= 5
##$CHEMSTR= <none>
##$CNST= (0..31)
1 1 145 1 1 1 1 1 1 1 1 1 1 1 1 1 1 1 1 1 1 1 1 1 1 1 1 1 1 1 1 1 
##$CPDPRG= <>
##$CPDPRG1= <>
##$CPDPRG2= <>
##$CPDPRG3= <>
##$CPDPRG4= <mlev>
##$CPDPRG5= <mlev>
##$CPDPRG6= <mlev>
##$CPDPRG7= <mlev>
##$CPDPRG8= <mlev>
##$CPDPRGB= <>
##$CPDPRGT= <>
##$D= (0..31)
0 1 0 0 0 0 0 0 0 0.06 0 0 0 0 0 0 0.0002 0 0 0 0 0 0 0 0 0 0 0 0 0 0 
0 
##$DATE= 1456126131
##$DBL= (0..7)
120 120 120 120 120 120 120 120 
##$DBP= (0..7)
150 150 150 150 150 150 150 150 
##$DBP07= 0
##$DBPNAM0= <>
##$DBPNAM1= <>
##$DBPNAM2= <>
##$DBPNAM3= <>
##$DBPNAM4= <>
##$DBPNAM5= <>
##$DBPNAM6= <>
##$DBPNAM7= <>
##$DBPOAL= (0..7)
0.5 0.5 0.5 0.5 0.5 0.5 0.5 0.5 
##$DBPOFFS= (0..7)
0 0 0 0 0 0 0 0 
##$DE= 6
##$DECBNUC= <off>
##$DECIM= 32
##$DECNUC= <off>
##$DECSTAT= 4
##$DIGMOD= 1
##$DIGTYP= 9
##$DL= (0..7)
0 120 120 120 120 120 120 120 
##$DP= (0..7)
150 150 150 150 150 150 150 150 
##$DP07= 0
##$DPNAME0= <>
##$DPNAME1= <>
##$DPNAME2= <>
##$DPNAME3= <>
##$DPNAME4= <>
##$DPNAME5= <>
##$DPNAME6= <>
##$DPNAME7= <>
##$DPOAL= (0..7)
0.5 0.5 0.5 0.5 0.5 0.5 0.5 0.5 
##$DPOFFS= (0..7)
0 0 0 0 0 0 0 0 
##$DQDMODE= 0
##$DR= 18
##$DS= 0
##$DSLIST= <SSSSSSSSSSSSSSS>
##$DSPFIRM= 0
$$ [...]
##$SUBNAM0= <"">
##$SUBNAM1= <"">
##$SUBNAM2= <"">
##$SUBNAM3= <"">
##$SUBNAM4= <"">
##$SUBNAM5= <"">
##$SUBNAM6= <"">
##$SUBNAM7= <"">
##$SUBNAM8= <"">
##$SUBNAM9= <"">
##$SW= 20.6817932712277
##$SWIBOX= (0..15)
0 0 3 0 0 0 0 0 0 0 0 0 0 0 0 0 
##$SW_h= 4139.07284768212
##$TD= 16384
##$TD0= 1
##$TE= 0
##$TE2= 300
##$TE3= 300
##$TEG= 300
##$TL= (0..7)
0 120 120 120 120 120 120 120 
##$TP= (0..7)
150 150 150 150 150 150 150 150 
##$TP07= 0
##$TPNAME0= <>
##$TPNAME1= <>
##$TPNAME2= <>
##$TPNAME3= <>
##$TPNAME4= <>
##$TPNAME5= <>
##$TPNAME6= <>
##$TPNAME7= <>
##$TPOAL= (0..7)
0.5 0.5 0.5 0.5 0.5 0.5 0.5 0.5 
##$TPOFFS= (0..7)
0 0 0 0 0 0 0 0 
##$TUNHIN= 0
##$TUNHOUT= 0
##$TUNXOUT= 0
##$USERA1= <user>
##$USERA2= <user>
##$USERA3= <user>
##$USERA4= <user>
##$USERA5= <user>
##$V9= 5
##$VALIST= <valist>
##$VCLIST= <CCCCCCCCCCCCCCC>
##$VD= 0
##$VDLIST= <DDDDDDDDDDDDDDD>
##$VPLIST= <PPPPPPPPPPPPPPP>
##$VTLIST= <TTTTTTTTTTTTTTT>
##$WBST= 1024
##$WBSW= 4
##$XGAIN= (0..3)
0 0 0 0 
##$XL= 0
##$YL= 0
##$YMAX_a= 30906
##$YMIN_a= -60694
##$ZGOPTNS= <>
##$ZL1= 120
##$ZL2= 120
##$ZL3= 120
##$ZL4= 120
##$ABSF1= 10
##$ABSF2= 0
##$ABSG= 5
##$ABSL= 3
##$ALPHA= 0
##$AQORDER= 0
##$ASSFAC= 0
##$ASSFACI= 0
##$ASSFACX= 0
##$ASSWID= 0
##$AUNMP= <proc_1d>
##$AZFE= 0.1
##$AZFW= 0.1
##$BCFW= 1
##$BC_mod= 2
##$BYTORDP= 0
##$COROFFS= 0
##$CY= 12.5
##$DATMOD= 1
##$DC= 2
##$DFILT= <>
##$DTYPP= 0
##$F1P= 11.0000006437302
##$F2P= -0.999999642372123
##$FCOR= 0.5
##$FTSIZE= 0
##$FT_mod= 4
##$GAMMA= 1
##$GB= 0
##$INTBC= 1
##$INTSCL= 1
##$ISEN= 128
##$LB= 0.3
##$LEV0= 0
##$LPBIN= 0
##$MAXI= 10000
##$MC2= 0
##$MEAN= 0
##$ME_mod= 0
##$MI= 0
##$NCOEF= 0
##$NC_proc= 0
##$NLEV= 6
##$NOISF1= 0
##$NOISF2= 0
##$NSP= 1
##$NTH_PI= 0
##$NZP= 0
##$OFFSET= 16.51637
##$PC= 1
##$PHC0= -29.40711
##$PHC1= -0.3563094
##$PH_mod= 0
##$PKNL= yes
##$PPARMOD= 0
##$PSCAL= 4
##$PSIGN= 0
##$REVERSE= no
##$SF= 200.13
##$SI= 32768
##$SIGF1= 0
##$SIGF2= 0
##$SINO= 400
##$SIOLD= 32768
##$SREGLST= <1H.CDCl3>
##$SSB= 0
##$STSI= 0
##$STSR= 0
##$SW_p= 4139.07284768211
##$SYMM= 0
##$S_DEV= 0
##$TDeff= 0
##$TDoff= 0
##$TI= <>
##$TILT= no
##$TM1= 0
##$TM2= 0
##$TOPLEV= 0
##$USERP1= <user>
##$USERP2= <user>
##$USERP3= <user>
##$USERP4= <user>
##$USERP5= <user>
##$WDW= 1
##$XDIM= 8192
##$YMAX_p= 0
##$YMIN_p= 0
$$ End of Bruker specific parameters
$$ ---------------------------------
##NTUPLES= NMR FID
##VAR_NAME=  TIME,          FID/REAL,        FID/IMAG
##SYMBOL=    X,             R,               I
##VAR_TYPE=  INDEPENDENT,   DEPENDENT,       DEPENDENT
##VAR_FORM=  AFFN,          ASDF,            ASDF
##VAR_DIM=   8192,          8192,            8192
##UNITS=     SECONDS,       ARBITRARY UNITS, ARBITRARY UNITS
##FACTOR=    0.0002416,     1,               1
##FIRST=     0,             0,               0
##LAST=      1.9789456,     0,               0
##MIN=       0,             -60694,          0
##MAX=       1.9789456,     30906,           0
$$ Real data points
##PAGE= N=1
##DATA TABLE= (X++(R..R)), XYDATA
$$ [...]
$$ plain form
513 3444 -5409 -434 3815 -3293 -1709 5869 -328 -6421 891 2439 -3694 850 4828 -3897 -5033
528 -5033 4455 2530 -3633 1925 3142 -4789 -1727 5610 -192 -3742 3301 1184 -5881 510 5620
543 5620 -1934 -2581 3948 -783 -5126 3150 4927 -3097 -1473 2589 -3230 -2759 5641 1747 -5803 -77
559 -77 3113 -3403 -698 5893 -666 -5212 2396 2967 -3088 1199 4574 -3043 -3685 3351 347 -3519
575 -3519 2985 2765 -5599 -2619 4157 -315 -2028 3824 254 -5752 963 5260 -1449 -1455 3465 -1683
591 -1683 -4539 3384 3756 -3532 -917 2990 -2621 -2523 4355 1353 -3676 1250 1903 -4230 -301 5612
607 5612 -738 -4467 1635 679 -4006 1794 4804 -3041 -3826 2629 468 -1981 3640 2389 -4571 -944
623 -944 4100 -1026 -1819 3920 221 -5063 761 3264 -2654 -883 3790 -1842 -4480 2673 2816 -2541
$$ packed form
513C444q853M975M249p108J584P578o197o093P312J548o133M544L978q725j136
528e033R488j925o163N558J217p931L062P337n802l550P043k117p065O391N110
543E620p554o47O529m731m343Q276J777q024J624M062n819M71Q400l894p550N726
559g7L190o516K705O591o559m546P608N71o055M287L375p617o42P036l004l866
575c519O504k20q364K980O776m472j713N852l570o006O715M297o709oM920n148
591a683k856P923L72p288K615L907n611R8O878l002n029M926O53o133L929N913
607E612o350l729O102r56m685N800L010p845p85O455k161k449N621j251o960L627
623i44N044n126p93N739l699n284N824K503n918J771M673n632k638P153J43n357
$$ plain form
639 -2541 726 2756 -3596 -2547 4561 1677 -3071 870 855 -3910 274 4738 -1238 -3283 2302 352
655 352 -3598 2101 4112 -2732 -2241 2946 -700 -3018 2942 2387 -3651 -1121 2136 -1925 -884 4185
671 4185 -52 -4506 1041 2913 -1815 521 3727 -2190 -3797 2932 2277 -2610 727 2201 -3414
686 -3414 -2095 3520 251 -2724 1994 1278 -3860 -215 3757 -914 -1768 2530 -675 -3813 2050 3439
702 3439 -2694 -1652 2324 -1550 -2355 3633 2024 -3726 -535 2623 -1414 -680 3452 -314 -3348 1378
718 1378 1654 -2688 406 3324 -2044 -3003 2357 834 -2558 1792 2707 -3065 -1823 3158 380 -1737
734 -1737 2094 495 -3707 353 3409 -1350 -1891 1929 -808 -2943 2155 2493 -2623 -725 2498 -1559
750 -1559 -2067 3154 1331 -2994 345 1895 -2541 -930 3556 -25 -3023 944 1008 -2085 1256 3102
$$ packed form
639b541L267K030o352J049P108k884m748L941j5m765M184M464n976k045N585j950
655C52l950N699K011o844M91N187l646k318N960n55o038K530L257m061J041N069
671D185m237m454N547J872m728K336L206n917j607O729o55m887L337J474n615
686c414J319N615l269k975M718p16n138L645L972m671q54M298l205l138N863J389
702C439o133J042L976l874q05N988j609n750L191L158m037P34M132l766l034M726
718A378K76m342L094K918n368r59N360j523l392M350R15n772J242M981k778k117
734a737L831j599m202M060L056m759n41L820k737k135N098L38n116J898L223m057
750a559n08N221j823m325L339J550m436J611M486l581k998L967O4l093L341J846
$$ plain form
766 3102 -2112 -2294 2559 656 -2014 1890 1723 -3369 -1086 3123 -456 -2120 1926 473 -3216 349
782 349 2520 -1400 -722 2499 -1009 -2987 1865 2142 -1970 -19 1794 -2305 -1866 3125 1048 -2726
798 -2726 353 1309 -2204 -29 3381 -616 -2679 1475 1102 -2028 914 2452 -1880 -1702 1931 -321
814 -321 -1924 2124 1598 -2946 -803 2318 -836 -1020 2791 275 -3429 334 2458 -1082 -416 1941
830 1941 -1476 -2580 1948 1527 -2117 161 1709 -2048 -1266 2866 454 -2250 1114 1224 -2503 -143
846 -143 2998 -524 -1896 1338 -98 -2469 1396 2733 -1722 -1595 1583 -421 -1277 2409 1274 -2743
862 -2743 -394 2001 -1020 -798 2372 -246 -2915 716 1687 -1731 -254 2276 -1066 -2277 1481 1020
878 1020 -1498 910 1497 -2358 -1294 2539 422 -1553 1194 404 -2724 200 2924 -618 -1535 1436
$$ packed form
766C102n214j82M853j903k670L904j67n092K283M209l579j664M046j453l689L565
782C49K171l920O78L221l508j978M852K77m112J951J813m099M39M991k077l774
798b726L079R56l513K175L410l997k063M154l73l130K942J538m332J78L633k252
814c21j603M048n26m544K143L121l154j84L811k516l704L763K124l540O66K357
830A941l417j104M528m21l644K278J548l757P82M132k412k704L364J10l727K360
846a43L141l522j372L234j436k371L865J337m455J27L178k004q56L686j135m017
862b743K349K395l021K22L170k618k669L631R71l418J477K530l342j211L758m61
878A020k518K408N87l855J064L833k117j975K747p90l128K924K724l542r17K971
$$ plain form
894 1436 -100 -2012 1426 2060 -1748 -781 1762 -932 -1691 1990 1053 -2264 -101 1292 -1583 -509
910 -509 2640 -44 -2480 710 1155 -1414 681 2335 -1514 -2195 1621 848 -1485 866 1142 -2220
926 -2220 -945 2062 -192 -1343 1532 498 -2333 241 2156 -858 -762 1864 -426 -2273 1180 1880
942 1880 -1298 -413 1267 -1252 -1201 2278 910 -2066 42 1100 -1414 -195 2327 -449 -2158 854
958 854 668 -1745 370 1844 -1346 -1499 1464 16 -1566 1359 1502 -1909 -802 1751 -257 -736
974 -736 1743 164 -2357 363 1867 -928 -577 1472 -844 -1913 1522 1483 -1565 -165 1423 -1159
990 -1159 -1086 1876 515 -1573 621 853 -1797 -327 2112 -343 -1534 937 205 -1688 815 1954
1006 1954 -1275 -1310 1284 -59 -1118 1380 861 -2086 -483 1600 -600 -912 1445 72 -1898 525
$$ packed form
894A436j536j912L438O34l808R67K543k694p59L681r37l317K163J393k875J074
910e09L149k684k436L190M45k569K095J654l849o81L816p73k333K351K76l362
926b220J275L007k254j151K875j034k831K574J915l014R6K626k290j847L453P00
942A880l178Q85J680k519N1L479j368k976K108J058k514J219K522k776j709L012
958H54j86k413K115J474l190j53K963j448j582K925J43l411J107K553k008m79
974g36K479j579k521K720J504k795L51K049k316j069L435l9l048J400J588k582
990a159P3K962j361k088K194K32k650J470K439k455j191K471p32j893K503J139
1006A954l229l5K594j343j059K498n19k947J603K083k200l12K357j373j970K423
$$ plain form
1022 525 1391 -1020 -122 1762 -638 -1599 1263 959 -1204 496 1269 -1601 -1173 1776 410 -1398 565
1039 565 505 -1645 54 1905 -636 -1362 1044 129 -1481 831 1381 -1444 -858 1336 -474 -1294 1341
1056 1341 915 -1596 -161 1185 -838 -420 1876 84 -1813 451 1061 -964 121 1415 -1040 -1520
1072 -1520 1233 685 -1209 427 969 -1389 -580 1746 47 -1227 970 647 -1564 -7 1539 -551
1088 -551 -838 990 -309 -1574 849 1309 -1175 -542 969 -772 -951 1614 736 -1676 -110 1039
1104 1039 -880 -360 1469 -281 -1538 730 831 -1075 199 1407 -849 -1084 1196 356 -992 888
1120 888 1041 -1499 -689 1351 -150 -845 990 67 -1803 149 1525 -616 -736 944 -357 -1237 994
1137 994 1056 -1134 -218 1029 -773 -848 1285 331 -1347 310 837 -1131 -265 1607 -120 -1272 591
$$ packed form
1022E25Q66k411Q98J884k400r61K862l04k163J700P73k870M28K949j366j808J963
1039E65o0k150J699J851k541p26K406r15j610K312N50k825N86K194j810q20K635
1056A341m26k511J435J346k023M18K296j792j897K264O10k025J085J294k455m80
1072a520K753n48j894J636N42k358Q09K326j699j274K197l23k211J557J546k090
1088e51k87J828j299j265K423M60k484O33J511j741j79K565q78k412J566J149
1104A039j919N20J829j750j257K268J01j906J274J208k256k35K280q40j348J880
1120H88J53k540Q10K040j501o95J835r23j870J952J376k141j20J680j301q80K231
1137I94O2k190R16J247j802p5K133r54j678J657N27j968Q66J872j727j152J863
$$ plain form
1154 591 469 -936 554 1367 -967 -1049 957 140 -811 854 643 -1470 -316 1343 -286 -728 1083
1171 1083 185 -1364 369 1135 -787 -384 1117 -485 -1357 756 758 -995 -9 763 -1058 -723 1413
1188 1413 347 -1125 357 524 -1093 79 1506 -432 -1187 715 335 -1063 452 1098 -875 -658
1204 -658 970 -159 -843 972 709 -1139 -159 924 -560 -420 1188 -34 -1493 265 881 -708
1220 -708 -148 927 -678 -1091 959 681 -904 166 754 -892 -511 1145 8 -950 534 410 -1172
1237 -1172 -45 1155 -426 -705 824 -39 -1110 659 1147 -782 -517 796 -287 -656 997 421
1253 421 -1220 -88 818 -543 -316 1053 -190 -1128 561 701 -833 58 1043 -549 -922 784 274
1270 274 -833 425 661 -1058 -562 981 -1 -681 631 181 -1094 206 1146 -470 -599 691 -134
$$ packed form
1154E91j22j405J490Q13k334q2K006q17r51J665k11k113J154J659j629m42J811
1171A083q98j549J733P66j922M03J501j602q72K113Kj753R86P72j821L35K136
1188A413j066j472J482J67j617J172J427j938p55J902l80j398J515O46j973K17
1204f58J628j129o84J815k63j848R80J083j484J40J608j222j459J758O16j589
1220g08N60J075j605m13K050k78j585J070N88j646L81J656j137r58J484j24j582
1237a172J127J200j581k79J529q63j071J769M88j929K65J313j083l69J653n76
1253D21j641J132R06j361K27J369j243r38J689J40j534Q91R85j592l73J706n10
1270B74j107J258K36j719M96J543r82o80J312m50j275J300R40j616j29J290q25
$$ plain form
1287 -134 -865 653 749 -913 -318 837 -407 -678 908 357 -932 125 628 -673 -174 1073 -158
1304 -158 -974 390 325 -768 273 880 -786 -815 805 242 -714 451 534 -916 -209 1021 -116 -631
1322 -631 667 172 -962 231 826 -558 -337 777 -315 -917 657 677 -697 -28 641 -619 -499
1339 -499 1040 296 -923 101 484 -653 -50 925 -335 -864 504 319 -674 309 747 -646 -473 785
1357 785 -36 -678 620 494 -930 -243 742 -248 -390 720 -13 -1003 227 765 -402 -157 663 -411
1375 -411 -691 726 442 -756 22 563 -606 -368 849 33 -752 352 377 -730 -48 876 -230 -613
1393 -613 485 44 -677 427 740 -654 -486 557 -133 -453 716 304 -921 -53 763 -297 -308 717
1411 717 -10 -762 337 544 -534 -84 631 -390 -651 551 261 -594 229 465 -746 -344 841 76
$$ packed form
1287a34p31J518R6j662N95J155j244k71J586n51j289J057N03j301M99J247j231
1304a58q16J364o5j093J041O07j666k9J620n63r56J165Q3j450P07J230j137n15
1322f31J298m95j134J193N95j384K21J114j092o02J574K0j374O69O69j260J20
1339d99J539p44j219J024L83j137O03R75j260n29J368j85r93R83M38j393J73J258
1357G85q21o42J298j26j424O87R85r90j42J110p33r90J230N38j167K45Q20j074
1375d11k80J417k84j198P78N41j169K38J217q16p85J104K5j107O82R24j106l83
1393f13J098m41p21J104L13j394J68J043o90l20J169m12j225Q68Q16j060j1J025
1411G17p27p52J099K07j078M50P15j021k61J202k90q55Q23K36j211M02J185p65
$$ plain form
1429 76 -583 356 167 -719 99 822 -334 -567 451 3 -606 414 534 -600 -238 568 -248 -452 624
1448 624 274 -697 67 494 -464 -183 776 -89 -782 264 400 -456 105 600 -470 -537 621 288 -475
1467 -475 299 349 -679 -163 698 -129 -521 430 143 -714 80 626 -349 -296 541 -116 -634 438 530 -501
1487 -501 -100 443 -363 -336 705 172 -694 40 414 -388 -54 652 -190 -613 388 314 -490 132 554 -390
1507 -390 -401 498 2 -467 381 345 -609 -181 565 -133 -291 509 3 -679 199 613 -315 -214 441 -200 -503
1528 -503 477 347 -551 -81 412 -362 -280 567 52 -534 221 284 -512 -52 617 -159 -465 331 51 -499 250
1549 250 518 -470 -367 461 10 -323 401 215 -603 -34 573 -182 -259 414 -27 -558 212 381 -402 -90
1569 -90 447 -256 -494 393 307 -387 108 356 -431 -238 588 94 -439 147 174 -450 71 558 -253 -412 345
$$ packed form
1429G6o59R39j89q86Q18P23j156k33J018m48o09J020J20j134L62Q06q16k04J076
1448F24l50r71P64M27r58K81R59q65o93J046J36q56N61M95j070o7J158l33p63
1467d75P74N0j028N16Q61q27l92R51k87q57P94N46r75N3Q37o57n18J072R2j031
1487e01M01N43q06K7J041n33q66P34L74q02L34P06q42m23J001p4q04O22M22r44
1507c90j1Q99m96m69Q48l6r54M28P46o98j58Q00n06o82Q78M14r28J01O55o41l03
1528e03R80j30q98M70M93p74Q2Q47n15n86P55O3p96M60O69p76l06P96k80n50P49
1549B50K68r88J03Q28m51l33P24j86q18N69O07p55p7O73m41n31P70J69p83L12
1569i0N37p03k38Q87q6o94M95K48p87J93Q26m94n33N86K7o24N21M87q11j59P57
$$ plain form
1590 345 96 -410 263 406 -451 -196 451 -108 -334 413 204 -508 -40 387 -276 -132 500 -70 -550 198
1610 198 339 -312 64 408 -339 -380 468 196 -425 112 275 -440 -143 479 -89 -389 240 154 -459 54 450
1631 450 -204 -222 365 -54 -410 323 389 -393 -175 304 -191 -234 459 164 -489 35 358 -232 -76 420 -103
1652 -103 -411 277 238 -347 70 384 -280 -288 390 57 -304 253 248 -431 -135 457 -26 -228 276 15 -481 108
1674 108 413 -241 -222 251 -143 -342 311 238 -399 -61 319 -219 -220 395 76 -423 115 229 -313 -46 424
1695 424 -96 -365 181 131 -270 173 335 -335 -253 352 61 -254 225 151 -412 -36 402 -142 -253 277 13
1716 13 -395 114 276 -267 -105 304 -146 -319 277 224 -294 24 193 -297 -178 423 23 -376 94 157 -276
1737 -276 58 408 -161 -296 263 132 -264 162 281 -275 -124 313 -75 -240 309 142 -387 -2 303 -162
$$ packed form
1590C45k49n06O73J43q57K55O47n59k26P47k09p12M68M27o63J44O32n70m80P48
1610A98J41o51L76L44p47m1Q48k72o21N37J63p15K97O22n68l00O29q6o13N13L96
1631D50o54j8N87m19l56P33O6p82K18M79m95m3O93k95o53N24L23n90J56M96n23
1652a03l08O88l9n85M17L14o64qO78l33l61N57no79K96N92m83k02N04k61m96N89
1674A08L05o54J9M73l94j99O53p3o37L38L80n38jO15l19m99N38J14n42K67M70
1695D24n20k69N46n0m01M43J62o70Q2O05k91l15M79p4n63L76M38n44j11N30k64
1716A3m08N09J62n43J62M09m50j73N96n3n18L18J69m90J19O01m00l99M70O3m33
1737b76L34L50n69j35N59j31l96M26J19n56J51M37l88j65N49j67n29L85L05m65
$$ plain form
1757 -162 -117 334 -50 -418 125 279 -211 -55 209 -229 -269 275 122 -334 -4 174 -297 -93 347 -57 -274
1778 -274 166 104 -334 34 344 -159 -200 213 -33 -264 194 267 -286 -130 253 -80 -136 304 51 -357 37
1799 37 256 -168 -74 279 -76 -320 170 171 -277 -26 272 -205 -209 257 62 -226 141 137 -318 -108 304 -53 -207
1822 -207 148 -6 -325 93 310 -197 -173 213 -38 -216 233 196 -258 -36 275 -118 -139 266 71 -258 81
1843 81 175 -219 -11 305 -77 -278 152 128 -173 85 232 -248 -191 215 30 -230 82 64 -288 -44 247 -125
1865 -125 -212 203 17 -272 105 211 -199 -106 222 -105 -234 200 139 -228 -26 149 -178 -99 291 32 -246
1886 -246 82 125 -187 25 253 -135 -192 191 89 -178 103 172 -232 -115 221 -44 -190 169 114 -270 -31
1907 -31 218 -94 -106 159 -34 -288 117 187 -154 -59 176 -165 -170 239 80 -223 24 172 -173 -93 257 -49
$$ packed form
1757a62M5M51l84l68N43J54m90J56K64m38m0N44j53m56L30J78m71K04M40m04k17
1778b74M40o2m38L68L10n03m1M13k46k31M58P3n53J56L83l33n6M40k53m08L94
1799C7K19m24R4L53l55k44M90Jm48K51K98m77mM66j95k88L67mm55K10M12l57j54
1822b07L55j54l19M18K17n07K4L86k51j78M49l7m54K22L11l93k1M05j95l29L39
1843H1R4l94K08L16l82k01M30k4l01K58J47m80N7M06j85k60L12j8l52K44K91l72
1865a25q7M15j86k89L77J06m10R3L28l27j29M34o1l67K02J75l27P9L90k59k78
1886b46L28M3l12K12K28l88n7L83j02k67K81O9m04J17L36k65j46L59n5l84K39
1907c1K49l12j2K65j93k54M05P0l41R5K35l41nM09j59l03K47J48l45Q0L50l06
$$ plain form
1929 -49 -188 120 116 -202 34 256 -124 -157 162 14 -156 174 172 -216 -96 201 -30 -143 196 56 -278 16
1951 16 226 -143 -112 175 -76 -218 125 116 -198 -15 159 -163 -149 182 27 -200 59 98 -222 -54 233 -37
1973 -37 -184 86 34 -198 94 229 -129 -118 143 -11 -135 180 124 -209 -4 165 -86 -118 201 40 -208 62
1995 62 131 -146 -35 209 -62 -214 107 102 -143 30 129 -192 -124 190 4 -181 80 58 -182 -13 210 -77
2017 -77 -154 123 15 -175 59 150 -137 -77 163 -63 -166 166 93 -175 14 133 -103 -41 229 2 -192 93
2039 93 126 -129 15 159 -116 -150 146 66 -160 46 105 -167 -94 159 -33 -153 125 38 -213 -12 163 -83
2061 -83 -110 128 -50 -196 102 149 -135 -54 114 -74 -113 139 69 -164 15 120 -116 -35 178 -12 -148 91
2083 91 69 -144 29 196 -79 -93 107 1 -128 103 105 -177 -78 150 -29 -87 105 11 -208 34 154 -101 -85
$$ packed form
1929d9j39L08ml18K36K22l80l3L19j48j70L30kl88J20K97k31j13L39j40l34K94
1951A6K10l69L1K87k51j42L43rl14J83J74l22J4L31j55k27K59L9l20J68K87k70
1973c7j47K70n2k32K92J35l58J1K61j54j24L15n6l33K05J69k51l2L19j61k48K70
1995F2O9k77J11K44k71j52L21nk45J73R9l21O8L14j86j85K61k2k40J69K23k87
2017g7p7K77j08j90K34R1k87O0K40k26j03L32p3k68J89J19k36O2K70k27j94K85
2039I3L3k55J44J44k75l4K96q0k26K06N9k72P3K53j92j20K78q7k51K01J75k46
2061h3k7K38j78j46K98M7k84Q1J68j88l9K52p0k33J79J05k36Q1K13j90j36K39
2083I1k2k13J73J67k75j4K00j06j29K31Kk82R9K28j79n8J92r4k19K42J20k55J6
$$ plain form
2106 -85 136 -59 -171 110 93 -155 6 109 -106 -114 141 39 -137 18 64 -139 -2 169 -17 -137 85 51
2128 51 -131 81 151 -120 -111 136 -2 -107 93 93 -149 -5 148 -56 -82 148 43 -155 44 128 -95 -11 140
2151 140 -79 -156 89 78 -137 10 72 -122 -87 132 4 -138 36 59 -151 -12 139 -62 -93 138 40 -143
2173 -143 54 113 -128 -45 114 -49 -100 149 87 -126 5 94 -70 -27 151 -23 -168 41 81 -104 -20 103 -76
2196 -76 -117 106 42 -127 29 69 -151 -81 130 -36 -121 49 9 -187 -23 108 -53 -99 81 -39 -125 78 108
2219 108 -136 -36 107 -59 -61 139 61 -128 36 73 -74 -23 143 -11 -93 79 49 -78 24 96 -85 -102 96
2242 96 16 -87 76 52 -152 -59 126 -44 -62 85 -13 -137 46 96 -93 -83 80 -49 -107 66 46 -124 -3
2265 -3 101 -69 -71 106 30 -119 52 66 -109 15 126 -32 -78 70 49 -88 56 84 -114 -54 96 -8 -98 88
$$ packed form
2106h5K21j95j12K81j7k48J61J03k15qK55j02j76J55M6k03J37J71j86j20K22l4
2128E1j82K12P0k71RK47j38j05K00%k42J44J53k04k6K30j05j98J99Q4k23Q4J51
2151A40k19p7K45j1k15J47O2j94L5K19j28j42J74K3k10J39J51k01l1K31r8j83
2173a43J97N9k41Q3J59j63n1K49o2k13J31Q9j64M3J78j74j45K09M0j85Q4J23j79
2196g6m1K23o4j69J56M0k20P0K11j66q5J70m0j96J64J31j61m6J80j20q6K03L0
2219A08k44J00J43j66kK00p8j89J64L7j47N1J66j54q2J72l0j27J02P2j81j7J98
2242I6q0j03J63k4k04R3J85j70j8J47r8j24J83N0j89J0J63j29n8J73k0j70J21
2265cJ04j70kJ77p6j49J71J4j75J24J11j58m6J48k1j37J44K8j98O0J50j04r0J86
$$ plain form
2289 88 25 -136 -19 99 -40 -70 102 -20 -150 15 55 -91 -26 90 -71 -119 73 63 -105 16 61 -98 -53
2312 -53 119 12 -94 43 56 -90 12 120 -58 -43 92 18 -88 55 104 -66 -28 101 -29 -64 78 52 -125
2335 -125 -10 91 -83 -25 119 -36 -143 52 54 -88 -26 78 -76 -79 73 22 -84 20 46 -84 -49 89 -32
2358 -32 -88 48 36 -130 24 120 -83 -58 75 -8 -86 80 71 -79 -38 100 -34 -63 96 30 -104 28 90 -63
2382 -63 -10 96 -15 -73 70 35 -86 17 80 -69 -93 96 11 -83 42 34 -126 -43 113 -40 -81 61 29 -94
2406 -94 48 74 -60 -30 66 -20 -71 69 43 -71 10 74 -50 -42 91 12 -59 54 66 -41 -5 115 -53 -79 66
2431 66 37 -77 40 79 -79 -28 83 7 -81 56 17 -98 -22 85 -55 -57 65 -8 -104 5 38 -78 -23 71 -82
2456 -82 -75 81 24 -87 7 43 -84 -14 98 3 -91 28 45 -52 27 86 -17 -43 69 28 -65 52 67 -61 -25 82
$$ packed form
2289H8o3j61J17J18j39l0J72j22j30J65M0j46O5J16j61m8J92j0j68J21M5j59M5
2312e3J72j07j06J37J3j46J02J08j78J5J35p4j06J43M9j70L8J29j30l5J42k6j77
2335a25J15J01j74N8J44j55j07J95Kj42O2J04j54lJ52n1j06J04K6j30L5J38j21
2358c2n6J36j2j66J54R6k03K5J33q3p8J66rj50M1J38j34k9J59o6j34J32O2j53
2382f3N3J06j11n8J43l5j21J03O3j49k4J89q5r4J25qj60Q3J56j53m1J42l2j23
2406i4J42K6j34L0R6q6n1J40k6j14Q1O4j24QJ33p9p1J13J2j07L6J20j68k6J45
2431F6k9j14J17L9j58N1J11p6q8J37l9j15P6J07j40kJ22p3r6J09L3j16N5R4j53
2456h2PJ56n7j11R4L6j27P0J12r5r4J19J7r7P9N9j03k6J12m1r3J17J5j28L6J07
$$ plain form
2482 82 -18 -48 48 15 -102 -3 67 -31 -27 60 -8 -77 35 53 -69 -11 53 -59 -68 49 -3 -86 30 31 -79 -32 84
2509 84 -5 -83 38 35 -71 40 79 -25 -39 75 -5 -57 70 52 -85 -28 91 -23 -49 91 0 -89 20 35 -60
2534 -60 1 67 -10 -67 37 4 -75 16 53 -93 -56 69 11 -64 47 31 -77 0 90 -34 -62 54 19 -38 40 70 -38
2561 -38 -30 81 15 -27 64 50 -34 36 79 -44 -15 84 23 -45 33 51 -49 18 65 -34 -57 51 37 -60 6 46 -58 -43
2589 -43 33 -35 -53 19 1 -81 -22 55 -54 -49 59 -16 -82 29 50 -50 -15 44 -29 -34 73 20 -55 0 32 -38 5 72 -16
2618 -16 -49 32 42 -43 22 65 -18 -36 23 20 -32 28 20 -70 -12 68 -30 -53 24 15 -80 6 58 -56 -40 31 -29 -56 51 1 -47
2649 -47 -24 50 -34 -40 61 6 -48 12 51 -59 18 51 -20 -27 55 45 -52 21 62 -41 -31 33 16 -34 38 42 -48 -10 79 -15
2679 -15 -25 31 -1 -60 19 38 -63 -25 66 -36 -44 23 -7 -54 -2 11 -36 -44 47 15 -67 14 24 -42 5 61 3 -42 39 21
$$ packed form
2482H2j00l0R6l3j17R9P0r8MQ7o8o9J12J8j22N8O4j12rJ17n2q3J16Jj10M7J16
2509H4q9p8J21lj06J11L9j04j4J14q0n2J27j8j37N7J19j14k6J40r1q9J09J5r5
2534f0O1O6p7n7J04l3p9R1L7j46L7J25n8p5J11j6j08P7R0j24k8J16l5n7P8L0j08
2561c8QJ11o6m2R1j4q4P0M3j23K9R9o1o8P8J8j00O7M7r9k3J08j4r7O6M0j04J5
2589d3P6o8j8P2j8q2N9P7j09NJ08p5o6J11K1j00L5N9p3nJ07n3p5N5L2p0M3O7q8
2618a6l3Q1J0q5O5M3q3j8N9ln2O0qr0N8Q0r8k3P7rr5Q6N2j14J6P1o0k7J07n0m8
2649d7K3P4q4oJ01n5n4O0L9j10P7L3p1pQ2j0r7P3M1j03J0O4j7n0P2Mr0L8Q9r4
2679a5j0N6l2n9P9J9j01L8R1j02qO7l0m7N2J3m7qR1l2q2Q1J0o6M7N6n8m5Q1j8
$$ plain form
2709 21 -24 34 59 -30 5 76 -15 -5 46 33 -34 14 47 -6 -15 57 2 -69 13 49 -47 -2 57 -37 -37 29 4 -33 12 26 -42
2740 -42 -17 62 -1 -47 13 20 -42 6 40 -19 -12 54 15 -49 49 27 -29 -19 36 -24 5 49 36 -7 7 43 -27 12 59 5 -51
2771 -51 17 25 -28 1 51 -23 -31 34 1 -49 21 21 -61 -12 45 -32 -50 38 8 -53 8 33 -29 -29 23 -8 -23 45 38 -45 11 37 -17
2804 -17 -6 60 34 -25 41 38 -28 8 77 0 -19 48 38 0 29 54 -17 -19 39 12 -36 40 31 -45 6 45 -18 -27 33 -7 -56 5
2836 5 20 -56 -29 17 -9 -49 17 5 -42 7 6 -39 -16 58 -13 -43 7 10 -33 5 55 -15 -16 18 3 -12 24 23 -23 -10 24 5 -24
2869 -24 40 10 -37 -22 24 -54 -10 38 -18 -52 2 7 -42 11 10 -30 -41 35 -1 -39 -3 6 -27 -10 34 -4 -22 58 36 -21 30 54
2901 54 1 3 37 15 -14 51 35 -7 44 60 -4 2 49 33 -20 16 43 -9 3 25 -14 -9 25 8 -32 7 5 -24 -19 20 -20 -42 2
2934 2 -3 -47 -22 10 -29 -36 17 -27 -53 22 35 -27 -22 18 -12 -13 22 14 -28 0 40 -13 4 53 0 -22 38 42 -21 -4 48 3 -32 24
$$ packed form
2709B1m5N8K5q9L5P1r1J0N1j3o7M8L3n3rP2n5p1Q2L6r6M5N9r4%O6k5l7M5J4o8
2740d2K5P9o3m6O0Po2M8L4n9PO6l9o4R8k2n6J0N5o0K9M4j3m3J4L6p0L9M7n4n6
2771e1O8Qn3K9N0p4qO5l3n0P0%q2M9N7p7j8Q8l0o1O1K5o2%N2l1j5O8pq3N6K6n4
2804a7J1O6k6n9O6lo6L6O9p7j9O7j0l8K9K5p1kN8k7m8P6rp6N1L9o3rO0m0m9O1
2836EJ5p6K7M6k6m0O6j2m7M9jm5K3P4p1l0N0Lm3L8N0p0jL4j5j5L6jm6J3L4j9k9
2869b4O4l0m7J5M6p8M4M8n6l4N4Nm9N3jm0j1P6l6l8L6Rl3J7M4l8j8Q0k2n7N1K4
2901E4n3KL4k2k9O5j6m2N1J6o4OM7j6n3L6K7n2J2K2l9NL4j7m0L9kk9NL9m0k2M4
2934Bnm4K5L2l9pN3m4k6P5J3o2NM0l0jL5qm2K8M0n3J7M9n3k2O0Mo3J7N2m5l5N6
$$ plain form
2968 24 16 -29 14 41 -45 -19 22 -17 -27 33 19 -37 6 18 -18 -34 20 -38 -27 7 33 -31 3 27 2 -18 31 1 -3 3 9 -32
3000 -32 -2 34 -24 -27 24 21 -18 21 12 -3 -5 20 2 3 10 34 -27 8 20 -12 -22 6 -21 -47 -5 -10 -37 -24 20 -23 -51 17 -11 -26
3034 -26 -21 -5 -38 -30 3 -15 -50 0 11 -28 4 -1 -13 -11 31 -6 -11 -15 21 -3 4 31 -27 -21 32 24 -14 -28 15 -21 11 2 -3 -43 -13 17
3070 17 -28 -15 16 -24 -45 -6 -8 -58 -15 -2 -59 -45 5 -27 -31 -6 -10 -46 -23 11 -13 -16 16 9 -44 3 28 -19 -17 40 10 -1 54
3103 54 13 -18 6 38 -19 -4 35 6 -20 5 8 -20 -22 18 -11 -28 3 3 -62 13 7 -29 -6 14 -20 -35 -22 -29 -20 -2 7 -22 -15 2
3137 2 -23 -25 23 8 -17 -17 20 -13 -18 20 25 8 11 12 -3 9 17 19 -8 27 19 -29 12 17 -16 -39 26 -16 -28 -3 -10 -27 2 -6 -20 -13 4
3174 4 -7 -39 -27 -9 -15 -2 -4 -15 -37 2 -13 -44 -15 13 -12 -23 15 -2 -34 19 25 4 14 4 24 7 17 9 -38 16 13 -7 9
3207 9 3 14 -17 4 17 -20 -23 35 -22 -17 7 -14 -35 -11 19 -12 -22 -5 -41 -20 -6 -7 -27 12 29 -11 -2 7 5 -14 15 8 -11 -1 38
$$ packed form
2968B4qm5M3K7q6K6M1l9j0O0j4n6M3J2l6j6N4n8J1L4K6o4L4K4k5k0M9l0mOOm1
3000c2L0L6n8lN1ll9L9rj5kK5j8JPK4o1L5J2l2j0K8k7k6M2nk7J3M4m3k8O8k8j5
3034b6NJ6l3QL3j8l5N0J1l9L2nj2KM2l7nmL6k4PK7n8ON3ql8j4M3l6L2rnm0L0L0
3070A7m5J3L1m0k1L9kn0M3J3n7J4N0l2mK5ml6K3L4k4lL2pn3M7K5m7KN7l0j1N5
3103E4m1l1K4L2n7J5L9k9k6K5Lk8kM0k9j7L1%o5P5ol6K3K0l4j5J3pRJ8Rk9PJ7
3137Bk5kM8j5k5%L7l3nL8Nj7LJj5J2QKk7L5qm8M1Nl3k3O5m2j2K5pj7K9qj4PJ7
3174Dj1l2J2J8oJ3kj1k2L9j5l1K9K8k5j1L8j7l2N3Ok1J0j0K0j7J0qm7N4lk0J6
3207IoJ1l1K1J3l7lN8n7NK4k1k1K4L0l1j0J7l6K1J4jk0L9J7m0RRkj9K9pj9J0L9
$$ plain form
3242 38 -1 16 26 16 2 34 -1 -30 -5 37 -7 -12 9 5 -11 15 4 -12 8 12 -7 -37 -9 -12 -46 -4 -11 -54 -23 23 -1 -11 -11
3275 -11 -8 -32 -7 20 -34 -32 33 -11 -36 -11 4 -23 -6 24 13 -6 27 13 10 -3 18 23 4 37 5 12 39 29 -15 26 3 12 0
3308 0 13 25 -3 3 18 -14 -38 -20 -11 -18 -4 -10 -13 -10 -5 -20 -23 17 -16 -29 -1 24 3 -4 7 -11 -21 29 35 -14 7 6 -7 15 21 -11 -22
3345 -22 7 35 -22 18 27 9 -7 14 2 -26 7 21 1 -12 18 -3 -43 -31 -14 -49 -6 5 -15 -11 -4 -6 -30 -1 -15 -19 -5 26 3
3378 3 -44 21 -9 -22 31 24 -33 5 21 -9 3 21 3 -10 -9 38 10 -3 26 21 -13 12 14 -25 -4 0 -7 -26 11 17 -19 1 15 -34
3412 -34 -12 8 -29 -37 -17 -32 -41 -34 4 -34 -40 -18 -9 -40 -7 3 -17 5 13 -11 -12 9 -18 -11 24 38 -12 -7 41 -7 -20 22 19 -12 10
3447 10 12 -21 -20 22 -2 -34 -2 3 -22 -14 31 -12 -29 17 7 -7 -10 4 -12 -17 11 5 -25 5 -5 -24 -1 10 -23 -6 24 -10 -11 11
3481 11 18 4 -2 41 2 -9 22 19 -6 24 29 21 7 11 29 -17 7 5 -15 14 30 -1 11 -2 18 -20 7 20 -13 -13 18 -20 -11 -30 -17
$$ packed form
3242C8l9J7J0j0j4L2l5k9K5M2m4nK1mj6K6j1j6K0Mj9l0K8ll4M2pm3L1M6k4j0%
3275a1Lk4K5K7n4KO5m4k5K5J5k7J7L0j1j9L3j4lj3K1Nj9L3l2PK7j0m4M1k3Rj2
3308@J3J2k8OJ5l2k4J8RpJ4olLNj5lM0l3j3K8K5k1pJ1j8j0N0Om9K1jj3K2Ol2j1
3345b2K9K8n7M0Rj8j6K1j2k8L3J4k0j3L0k1m0J2J7l5M3J1k0MPkk4K9j4mJ4L1k3
3378Cm7O5l0j3N3pn7L8J6l0J2J8j8j3JM7k8j3K9nl4K5Kl9K1Mpj9L7Ol6K0J4m9
3412c4K2K0l7qK0j5rPL8l8oK2Rl1L3J0k0K2Qk4jK1k7PL5J4n0NM8m8j3M2ll1K2
3447A0Kl3JM2k4l2L2Nk5QM5m3j7M6j0j4lJ4j6nK8ol0L0j0j9K3J1l3J7L0l4jK2
3481A1Pj4oM3l9j1L1lk5L0Nqj4MJ8m6K4kk0K9J6l1J2j3K0l8K7J3l3%L1l8Rj9J3
$$ plain form
3516 -17 -27 -1 7 -17 -28 -9 -12 -52 -9 -23 -2 -14 16 -6 -6 28 -18 -16 18 22 -15 24 18 9 -17 -2 16 5 21 29 -2 -10 24 21 -5
3551 -5 -1 6 -9 6 17 -20 -16 30 0 -34 0 -3 -40 -3 0 -7 -30 1 6 -22 4 20 6 1 0 -8 6 26 16 13 9 50 -1 3 0 -7 10 34
3589 34 40 6 7 6 4 -15 46 13 -9 -5 15 -19 -13 19 2 -35 -3 8 -40 2 -1 -21 -36 -5 0 -35 -1 -7 -28 12 -5 -28 -12 10 3
3624 3 -4 8 21 -18 -4 25 13 -28 6 15 0 11 16 26 -3 14 32 -2 9 13 -4 14 15 -22 -16 12 12 -8 -2 3 -30 -29 12 -2 -29 -11
3660 -11 -8 -35 7 -18 -7 -19 1 9 -24 -12 17 -17 -15 7 0 -7 2 -9 -15 18 18 -9 0 16 10 0 -2 -2 -1 -2 0 2 -7 -2 4 -16 1 -9 -13 -14 4
3701 4 -14 -39 -26 17 -22 -5 -8 -8 -23 11 -16 -14 -5 -13 -35 -7 2 -14 6 13 15 -17 1 13 -32 -11 -11 1 -8 18 31 -7 9 27 23 13
3737 13 14 -9 -5 4 13 0 11 20 -7 -11 0 6 -15 9 -3 -25 -44 13 -24 -21 -20 -7 -20 -16 10 -1 -7 -30 -17 -52 -17 -19 -44 -12 16 -11
3773 -11 -11 3 3 9 6 2 -26 11 13 -11 -13 5 8 -10 3 52 -24 10 -3 -25 -3 -1 2 -6 -2 14 -14 -25 -1 3 -31 -17 16 -3 -21 35 -4
$$ packed form
3516a7j0K6Qk4j1J9lm0M3j4K1j2L0k2%L4m6KL4Ml7L9ork6J5J8j1J6Ql1qL4lk6
3551eMPj5J5J1l7MM6l0l4L4ll7L7Lpk3L1Nk8K6J6j4njqJ4K0j0lmM1n1MlpJ7K4
3589C4Ol4Jjkj9O1l3k2MK0l4OL2j7l7L2J1m8M2lk0j5L1Nl5L4ok1M0j7k3J6K2p
3624CpJ2J3l9J4K9j2m1L4Rj5J1NJ0k9J7J8l4J1Mj7J8Jl7OK8%k0ONl3JM1j4k7J8
3660a1Lk7M2k5J1j2K0Ql3J2K9l4KK2ppRj1oL3%k7RJ6oj0k%JjKKrNOk0J7j0mjJ8
3701Dj8k5J3M3l9J7l%j5L4k7KRqk2K8Rj6K0PKl2J8J2m5K1%J2rK6J3l8J6J8mj0
3737A3Jk3MRRj3J1Rk7mJ1Ok1K4j2k2j9N7l7LJJ3j3MK6j1ok3J3l5L5kk5L2K8k7
3773a1%J4%Olmk8L7Kk4kJ8Lj8J3M9p6L4j3k2K2KLqMJ6k8j1K4Ml4J4L3j9j8N6l9
$$ plain form
3810 -4 -29 14 1 -16 -11 11 1 2 22 2 -13 23 34 -2 13 9 7 9 31 29 -4 13 22 21 12 13 21 -7 -2 7 -13 2 18 -9 -25 18 -7
3847 -7 -17 5 -1 -38 -14 13 -4 -29 -9 -3 -45 -27 -5 -15 -16 -7 -1 -24 -6 -4 -27 -5 17 -6 -13 12 13 6 9 17 21 5 10 2 2 37 33 3 22
3886 22 33 -2 3 43 12 -9 -1 23 -14 -10 10 -7 -12 7 -12 -16 -8 -15 -8 8 4 -4 2 6 -4 -10 11 16 -9 -22 1 3 -17 12 13 0 0 9 6 9
3926 9 15 16 -25 -8 8 -11 1 21 35 -20 10 8 1 19 5 -12 1 -7 10 -28 -3 -1 -25 -23 15 -11 -22 12 -5 -2 11 2 -13 4 6 -7
3962 -7 -2 16 6 2 25 18 -3 -11 -8 25 -19 7 24 -1 -2 22 17 -4 14 -5 -1 13 18 16 -10 17 -4 -9 1 -16 2 -12 0 -36 -18 -10 -16
3999 -16 -22 -2 -9 -5 -23 3 -14 -21 0 -2 -5 -5 -4 -18 -10 7 -14 -29 -9 -5 -16 7 21 0 -3 4 -6 5 -9 -9 -8 -23 14 -9 -1 -32 17 -17
4037 -17 -1 12 22 -1 12 -18 -10 -13 3 -11 11 -4 -15 -16 11 0 -30 2 -9 -6 -2 14 -6 -12 1 5 -12 17 11 21 11 25 6 2 37
4072 37 18 1 12 22 2 -17 0 22 8 0 -7 -7 0 -19 -18 -20 -8 16 -15 -28 -10 -33 -18 -4 -30 -34 0 -11 -13 -14 -18 -36 -13 -4 -28 -15
$$ packed form
3810dk5M3j3j7NK2j0JK0k0j5L6J1l6J5mkKK2kl3J7RjrJQk8NRk0J5J6k7j6M3k5
3847gj0K2ol7K4K7j7k5K0Om2J8K2j0jROk3J8Kk3K2K2k3pK5JpLQMj6Nq%L5ml0J9
3886B2J1l5NM0l1k1QK4l7MK0j7nJ9j9mQpPJ6mqOMj0oK1Nk5j3K3Kk0K9Jj3%RlL
3926IOJm1J7J6j9J2K0J4n5L0kpJ8j4j7J3qJ7l8K5Kk4KL8k6j1L4j7LJ3rj5J7Kj3
3962gNJ8j0mK3pk1qLL3m4K6J7k5jK4nk1J8j9MJ4Nkk6K7k1nJ0j7J8j4J2l6J8Qo
3999a6oK0pMj8K6j7pK1kl%Jj4QJ7k1j5K0Mj1K3J4k1lPj0J1j4%Jj5L7k3Ql1M9l4
4037a7J6J3J0k3J3l0QlJ6j4K2j5j1jK7j1l0L2j1LMJ6k0oJ3Mj7K9oJ0j0J4j9mL5
4072C7j9j7J1J0k0j9J7K2j4qp%Pj9JkJ2K4l1j3J8k3J5J4k6mL4j1kjmj8K3Rk4J3
$$ plain form
4108 -15 -6 6 -13 -21 6 -8 -9 19 29 9 6 28 9 -9 27 10 12 18 29 21 9 21 4 9 20 11 -11 22 33 -10 -13 23 -2 -13 -12 -13
4144 -13 -22 -16 10 4 -1 -1 -6 -10 -8 10 -11 -7 -3 17 -2 -1 -8 -4 -21 39 3 -7 27 -11 -17 -21 12 -5 -4 -12 -1 -8 16 0 -4 -11 5 -7 12 6 -7
4185 -7 -2 23 1 -9 15 -13 -4 -6 10 21 -16 -45 8 -13 -30 1 -26 -16 11 13 -6 10 11 15 4 41 -6 -6 25 9 9 11 31 11 12 15
4221 15 39 -10 27 29 5 22 31 9 -9 49 24 -16 20 21 1 -12 10 -2 7 14 -6 -11 -16 0 7 -26 -13 -2 -24 -11 3 -2 -5 4 4 -14
4257 -14 8 21 6 12 20 7 17 1 21 14 0 27 11 12 38 -6 -5 7 0 -2 8 11 1 -12 5 -11 -22 -13 -5 -17 -8 11 -2 -1 -7 -32 -5
4294 -5 -21 -6 -1 -9 4 -19 -15 -20 8 7 21 10 4 9 16 -6 17 34 17 9 22 23 18 20 36 7 29 8 24 12 22 12 4 -34 -1 5 -3 -22
4332 -22 27 3 -27 -13 -32 -32 -11 -8 -36 -12 -19 -6 -25 3 -25 -24 -10 15 -4 -16 20 20 -15 18 11 5 -17 43 9 -13 29 3 16 14
4366 14 39 7 6 9 4 10 29 14 -28 17 21 12 7 -1 -14 -9 -5 -6 -13 19 2 -5 -22 6 -15 -31 4 -16 -6 -11 2 10 6 -3 16 -6 1 1 16 17
$$ packed form
4108a5RJ2j9qK7j4jK8J0k0lK2j9j8L6j7KOJ1qj2J2j7NJ1rk2L3J1m3lL6k5j1Jj
4144a3rOK6on%nmKJ8k1MMK0j9JpMj7O0l6j0L4l8omL3j7JqJ1pK4j6mpJ6j2J9oj3
4185gNK5k2j0K4k8RkJ6J1l7k9N3k1j7L1k7J0K7Kj9J6JMj1L7m7%L1j6%KK0k0JL
4221A5K4m9L7Kk4J7Rk2j8N8k5m0L6Jk0j3K2j2RPk0nnJ6Pl3J3J1k2J3J4nlR%j8
4257a4K2J3j5OQj3J0j6K0pj4K7j6JK6m4JJ2pkJ0Lj0j3J7j6j1RQj2RJ9j3Jok5K7
4294ej6J5NqJ3k3MnK8jJ4j1oNPk2K3J7j7qJ3JnKJ6k9K2k1J6j2J0j0ql8L3Oqj9
4332b2M9k4l0J4j9%K1Lk8K4pJ3j9K8k8JJ4K5j9j2L6%l5L3pok2O0l4k2M2k6J3k
4366A4K5l2jLnOJ9j5m2M5Mrnqj3NMjpL2j7pj7K8k1j6L5k0J0nJ3QmrJ9k2P%J5J
$$ plain form
4406 17 25 -1 9 30 19 14 6 31 -4 1 10 25 1 6 -2 6 -15 -4 -15 0 6 2 -24 3 5 0 -8 0 -16 -6 -8 10 -11 0 6 -36 -5 -8 1
4445 1 -1 -5 1 -2 -3 14 15 -17 -6 11 -7 10 26 2 28 26 28 26 11 28 24 18 15 30 11 33 15 -1 32 15 -14 -4 16 4 2 19 2
4482 2 -1 3 7 -4 3 -22 -1 -10 13 12 -8 -2 -14 -22 -17 -3 -14 4 6 19 -7 3 26 24 18 6 6 9 21 25 -7 -2 30 20 22 33 11 11 -24 9
4522 9 13 -18 32 11 -15 -13 8 -6 -25 10 1 -12 9 -24 9 13 9 -11 -10 -5 -6 15 18 5 -12 -14 8 7 12 7 19 14 27 10 -3 -5 19 -3
4560 -3 1 9 -1 -30 -11 22 -8 1 15 16 -7 3 38 -9 -2 7 -14 -26 -10 17 -10 -13 2 -25 -18 -27 0 -14 14 -4 -9 -7 -10 -13 -6 12 -11 18
4598 18 -2 13 11 20 4 -20 17 26 15 12 15 25 8 -6 30 6 -9 15 17 -11 3 24 20 13 16 11 -19 7 4 -23 1 18 -9 -20 8 12
4634 12 -9 -6 28 -8 7 8 1 18 19 19 -16 9 17 15 0 37 -10 9 16 43 15 36 12 16 8 22 17 12 20 16 14 7 3 -10 -10 7 3 -9 12 12
4674 12 -20 0 4 9 -17 -6 6 4 -6 1 -29 3 -15 -8 -5 -18 -6 -16 -20 -11 -14 -35 -9 0 23 20 14 -11 -15 13 25 -28 15 8 -5 -2 3 10 17
$$ packed form
4406A7Qk6J0K1j1nqK5l5NRJ5k4NqQk1J1j1J5Omk6K7KnqQj6J0kJ8k1J1Om2L1lR
4445AkmOljJ7Jl2J1J7j8J7J6k4K6kKkj5J7molJ5j9K2j8j6L3j7k9J0K0j2kJ7j7
4482BlMMj1Pk5K1rK3jk0Oj2qNJ4j1J8KJ3k6J0K3koj2%LJ2Ml2NL2j0KJ1k2%l5L3
4522IMl1N0k1k6KK1j4j9L5rj3K1l3L3Mmk0JNjK1Lj3j7kK2jNnJ2nJ3j7j3kK4k2
4560cMQj0k9J9L3l0RJ4Jk3J0L5m7PRk1j2J6K7k7lJ5k7PrK7j4K8j8nKllPJ8k3K9
4598A8k0J5kRj6k4L7Rj1lLJ0j7j4L6k4j5K4Kk8J4K1mpLnl0K6lk7K4J7k7j1K8M
4634A2k1LL4l6J5JpJ7J%l5K5Qkj5L7m7J9PK7k8K1k4MqJ4nnQmkpmj3%J7mj2K1%
4674A2l2K0MNk6J1J2kj0Pl0L2j8PLj3J2j0mRlk1K6RK3lok5mK8J2n3M3pj3LNPP
$$ plain form
4713 17 0 10 16 -7 8 5 12 -1 -25 -10 2 3 -11 7 20 13 -11 32 4 -9 -1 14 -5 1 19 9 -6 -9 2 4 -7 11 -4 -11 -5 12
4749 12 27 2 8 3 0 -7 18 -14 -14 12 -3 -18 7 -9 12 -12 19 12 12 -16 -14 -4 -11 -4 6 -5 -2 18 1 -4 -23 6 -5 10 -3 6 -5
4786 -5 -16 -12 8 5 -4 31 5 -1 18 3 -2 24 38 18 14 19 15 2 8 35 -1 13 -2 7 -2 18 6 5 13 5 -6 -15 18 -3 10 0 2 -18 7
4825 7 6 -26 -6 1 6 -14 -7 -7 -4 -17 -1 -2 -5 10 29 -5 -8 0 8 -17 12 13 9 15 20 22 10 31 8 10 17 4 -19 -6 -4 11 14 24 -9 5 6
4866 6 -5 -2 -11 8 -8 14 2 2 -13 7 3 12 -5 16 -3 6 6 0 -14 -1 32 25 -1 15 2 -5 9 38 28 26 19 4 13 16 11 25 26 29 34 -3
4906 -3 11 3 -7 -14 -8 -11 12 1 -5 9 -8 -10 -19 14 8 -12 -10 -6 -25 -14 17 -5 -26 -23 -1 5 -16 -10 -21 -28 2 26 8 -2 7 21 7 12 14
4945 14 7 -1 6 9 26 24 1 31 21 12 27 28 10 12 14 12 13 4 22 13 14 6 16 -1 -7 -17 -9 3 -12 5 -8 -3 12 -6 11 9 2 -10 -8 -21 -2
4986 -2 -2 13 28 -8 26 5 5 18 20 0 0 4 20 -31 -5 6 3 7 -6 3 6 -5 -6 -9 5 10 -5 -19 5 -9 -5 -9 -2 -23 -6 -11 -20 -17 -10 -1 3
$$ packed form
4713A7j7J0Ok3J5lPj3k4J5J2Jj4J8J3pk4M3k8j3QJ5j9OJ8j0j5lJ1Kj1J8j5pOJ7
4749A2J5k5OnlpK5l2%K6j5j5K5j6K1k4L1p%k8KJ0pPJ0j1LK0j7nj9K9j1J5j3Rj1
4786ej1MK0lrL5k6oJ9j5nK6J4k0mNmj3OK7l6J4j5RrK0j2jQqj1rL3k1J3j0Kk0K5
4825Gjl2K0PNk0P%Lj3J6jlJ5J9l4lQQk5K9JmONKj2K1k3KPj3k3J3KJ5LJ0l3J4J
4866Fj1LrJ9j6K2j2%j5K0mRj7K1j9R%oj4J3L3pk6J6j3pJ4K9j0kpj5RLnJ4JLNl7
4906cJ4qj0pOlK3j1oJ4j7krL3ok0KMj9J1L1k2k1LK2Ok1Oj1pL0K4j8j0RJ4j4NK
4945A4pqPLJ7kk3L0j0rJ5Jj8KKkJrJ8rJqJ0j7oj0QJ2j5J7j3NJ5j8J7kpj2Kj3J9
4986b%J5J5l6L4k1%J3Kk0%MJ6n1K6J1lMj3RLj1jlJ4Nj5j4K4j4MmPk1J7nrLPRM
$$ plain form
5027 3 1 -20 -17 3 7 12 18 9 9 10 34 5 25 20 14 11 13 0 -5 -1 11 24 26 20 4 27 6 1 8 -2 12 30 27 16 5 1 -21 -7 23 -9 -1
5068 -1 10 -2 -26 -11 -10 -22 -16 15 12 -2 -8 -22 -19 -3 15 -7 2 -6 13 -21 11 3 0 -10 -1 -19 -8 -2 -4 -24 10 1 5 -11 10 11 9 19 -2
5107 -2 15 -22 -13 3 -5 5 2 -24 15 -4 -11 -11 2 -11 1 -6 -6 -6 11 -8 -13 2 2 -5 21 28 18 27 9 28 7 13 -1 15 25 30 20 37
5145 37 18 30 12 17 18 28 18 -10 -12 8 20 -8 12 5 9 13 -21 -14 16 -2 -28 -10 18 -3 6 -3 -9 -20 -4 -3 -20 -13 13 -9 4 -9
5181 -9 -10 -9 -10 6 14 20 22 10 23 -1 0 15 9 6 29 -12 25 27 6 2 -1 22 13 23 -3 18 10 -16 -1 15 16 4 14 8 31 -25 2 2 5 -8
5221 -8 -13 -17 -2 20 2 -7 3 17 -16 -1 -1 0 19 14 10 22 5 19 -7 0 20 1 8 14 -1 7 2 -1 11 3 13 1 1 8 -13 -6 0 -14 -17 -6
5261 -6 3 1 22 12 13 -20 4 -11 -17 0 9 -16 0 4 6 1 24 19 7 12 18 30 34 18 32 21 19 13 30 30 12 21 4 25 9 18 13 1 -6 0 -13
5302 -13 -5 5 20 -1 17 -2 21 -3 19 -4 20 -4 -21 8 15 5 -16 -13 -4 14 7 2 1 15 9 -15 30 32 -4 6 -1 1 17 16 3 21
$$ packed form
5027Ckk1LK0MNOr%JK4k9K0nolKj3nMJ2J3Koj6K3k1nPj0J4J8lj1j1mk2J4L0l2Q
5068aJ1j2k4J5Jj2OL1lj4oj4LJ6J8k2RqJ9l4L2qlj0Rj8J1Okk0L4rMj6K1JkJ0k1
5107bJ7l7RJ6qJ0lk6L9j9p%J3j3J2p%%J7j9nJ5%pK6Pj0Rj8J9k1Oj4J6J0Nj0J7
5145C7j9J2j8NJJ0j0k8kK0J2k8K0pMMl4PL0j8k6J8K8k1Rroj1J6Jj7PK6k2J3j3
5181ijJjJ6QOKj2J3k4JJ5olK3m1L7Kk1mlK3rJ0k6K1qk6J5J6Jj2J0oK3n6K7%Lj3
5221hnmJ5K2j8rJ0J4l3J5%JJ9nmJ2j7J4k6PK0j9POj5QnlJ2qJ0j2%Pk1POj4lJ1
5261fRkK1j0Jl3K4j5oJ7Rk5J6MKnK3nj2NOJ2Mj6J4j1koJ7%j8Rj7K1j6Rnj2pOj3
5302a3QJ0J5k1J8j9K3k4K2k3K4k4j7K9Pj0k1LRJ8pnjJ4ok4M5Kl6J0pKJ6jj3J8
$$ plain form
5338 21 20 6 16 28 27 24 19 11 5 12 1 9 -5 -2 6 8 2 -14 -8 10 -2 -5 8 -1 2 -1 -4 -4 -5 -32 1 14 -12 -6 14 18 -8 18 7 13 3 7
5380 7 24 5 17 17 19 3 36 19 13 36 4 15 14 23 19 11 3 5 -14 -2 8 -3 -6 -7 -23 -1 2 -33 2 -20 12 -18 16 -14 0 18 -4
5417 -4 -15 -20 1 -19 6 16 1 1 8 15 12 10 16 -7 10 12 13 13 19 25 3 -12 8 19 1 24 18 29 8 3 8 -17 11 -4 9 12 14 9 -10 -14
5457 -14 -2 -27 -17 2 -2 -9 -30 -7 3 -11 -10 14 10 28 16 1 1 19 20 3 6 -3 1 -1 4 23 34 10 10 10 -12 -4 11 7 -6 5 1 -9
5495 -9 -31 -3 -6 1 -6 -1 12 -4 -7 -16 3 -12 0 -15 3 -20 -8 -23 -10 -17 -12 -18 -5 -2 -16 2 -7 12 6 30 7 15 7 23 -1 49 8 -2
5533 -2 14 25 20 31 11 10 16 18 14 18 2 31 19 3 31 -1 1 -11 17 -12 13 -14 8 -7 -14 -3 5 -1 1 -3 1 -21 11 -7 1 25 9 6
5571 6 22 10 -5 26 22 -8 11 -24 17 14 13 12 12 15 6 4 16 1 12 -1 6 -5 -2 1 -6 -6 -9 -1 -12 10 -26 -17 -7 16 2 -29 -3 -1 9
5610 9 11 -11 14 6 16 4 1 17 17 11 4 27 -9 6 10 5 -4 16 6 16 30 22 22 23 -1 10 20 8 9 15 26 23 2 4 4 15 13 -4 8 -14
$$ packed form
5338B1jj4J0J2jlnqoPj1Qj4LQKoj6OJ8j2lJ3rLll%jk7L3J3k6OK0Mk6K6j1Oj0M
5380GJ7j9J2%Kj6L3j7oK3l2J1jRmqqKj9J2J0j1ljj6K2Ll5L5k2L2l0L4l0J4J8k2
5417dj1nK1k0K5J0j5%PPlkOk3J7KJ%OOk2j5K0J1j8K3oJ1k1nNk5K8j5J3LKnj9m
5457a4J2k5J0J9mpk1K3J0j4JK4mJ8j2j5%J8Jj7LrMkNJ9J1k4%%k2QJ5mj3J1mj0
5495ik2K8lPpNJ3j6lrJ9j5J2j5J8k3J2j5J3pNoJ3Lj4J8rJ9oK4k3QqJ6k4N0m1j0
5533bJ6J1nJ1k0jOKmMj6K9j2j6K8l2Kj2K8k9K5k7K2j5pJ1QoKmMk2L2j8QK4j6l
5571FJ6j2j5L1ml0J9l5M1ljj%LrkJ2j5J1j3Pj1LLp%lQj1K2l6RJ0K3j4l1K6KJ0
5610IKk2K5qJ0j2lJ6%opK3l6J5MnrK0j0J0J4q%Jk4J1J0j2JOJ1lk1K%J1kj7J2k2
$$ plain form
5650 -14 -1 -2 21 10 17 -14 -8 -17 9 -2 18 -2 1 2 23 14 24 14 9 12 1 8 19 14 26 2 13 27 3 -4 15 20 17 6 11 -4 13 15
5688 15 14 -6 10 -5 -17 0 12 -4 -14 -17 0 8 22 10 -2 5 -3 6 3 7 20 10 20 9 -1 15 8 7 20 8 33 17 5 34 1
5723 1 26 26 7 37 13 12 11 11 30 20 26 24 6 23 -11 17 18 -1 7 -6 -3 -7 4 7 -7 -9 -27 15 -15 -18 2 6 -3 5 -5 17 9 11 -5 2
5763 2 1 5 12 17 23 -6 -3 -3 -7 10 13 15 32 14 9 23 19 -1 10 6 32 19 23 -13 9 13 4 6 0 18 13 17 10 -19 14 13 -9 -17 23 16 13 -10 4
5806 4 6 -2 31 2 39 -6 6 26 -12 5 -1 -1 5 -5 34 14 14 -7 28 16 6 3 5 1 15 -21 -9 -6 -5 4 -8 2 -5 5 -10 8 -9
5843 -9 -23 -10 15 -7 6 0 8 3 -9 7 -6 -16 5 8 18 -5 4 -4 27 5 14 -18 2 -2 -6 6 9 10 13 7 12 11 32 10 24 17 15 10 9 4 -3
5884 -3 36 31 11 8 1 -5 5 -6 -18 7 -4 7 -13 -7 -9 -3 10 -21 -1 5 -4 1 -7 21 15 8 -8 -16 6 -4 10 4 8 -6 9 -3 -12 21 4
5923 4 7 7 11 2 -4 -17 15 -1 -33 -10 -19 -6 -2 11 -12 -15 -14 -10 -12 2 -13 -16 -2 -18 -6 -5 -10 -6 6 9 -11 6 -4 10 12 7 11 -2 0 -13 -14
$$ packed form
5650a4J3jK3j1Pl1OrK6j1K0k0LJK1rJ0j0nLj1PJ1nJ2k4J1J4k4pJ9Nlj1Nj5J7K
5688A5jk0J6j5j2J7J2j6j0lJ7QJ4j2j2PqRlMJ3j0J0j1j0J6pjJ3j2K5j6j2K9l3
5723AK5%j9L0k4jj%J9j0Okj8J7l4K8Jj9Qj3LmJ1Lj4kj8M2l0lK0MrQj0K2qKj6P
5763BjMPNOk9L%mJ7LKJ7j8nJ4mk0J1mK6j3Ml6K2MrKoJ8nMpk9L3jk2qM0plk3J4
5806DKqL3k9L7m5J2K0l8J7o%Oj0L9k0%k1L5j2j0lKmJ4l6J2LJRj2J0pJ0j5J8j7
5843ij4J3K5k2J3oQnj2J6j3j0K1LJ0k3RqL1k2Rl2K0mmJ2LJLoNjK1k2J4pknjnp
5884cL9nk0lpoJ0j1j2K5j1J1k0OkOJ3l1K0OrNqK8opj6qK2j0J4oMj4J5j2rL3j7
5923DL%Mroj3L2j6l2K3rJ3MJ3k3lJMkJ4j5lJ4j6J2JnMJ2Lk0J7j0J4KnMj3Kj3j
$$ plain form
5964 -14 16 -3 0 32 11 3 17 0 7 3 23 16 13 14 8 7 -5 2 21 12 -9 -5 -5 -4 -8 -5 -13 -10 -16 -11 1 -5 -12 -7 -3 -19 -8 2 10 14 29 1 -7 4
6008 4 31 1 5 21 20 8 4 9 21 15 -1 6 7 11 6 0 5 6 9 16 28 15 -2 13 -3 14 -4 9 8 -1 -4 -11 -1 1 -10 -4 1 7 17 9 10 8 -5
6051 -5 15 4 24 18 20 15 20 5 25 -1 26 7 -5 20 8 16 3 11 26 -4 -4 -8 -11 7 -25 -9 -18 26 -10 -23 -5 -7 4 6 3 14 -10
6088 -10 -1 7 5 -1 3 -5 -16 -3 16 -12 4 -1 -7 -3 -29 16 -2 16 10 -2 3 -6 9 13 2 1 12 5 -2 14 -5 1 15 6 36 -3 9 6 11 10 -9
6129 -9 -10 -25 -19 -7 11 14 5 -3 6 -11 -5 3 3 -3 -9 0 -30 13 28 -11 6 10 1 -3 12 13 20 -19 13 7 -2 7 -17 1 0 16 5 3 -7 11 4 5 -11
6172 -11 -3 12 28 -5 -11 12 -5 -12 12 1 -10 -4 -13 -6 4 3 10 -1 10 1 -13 22 33 14 14 4 3 26 16 5 15 3 1 16 15 24 4
6209 4 10 33 29 15 13 35 26 34 16 43 22 33 23 11 4 35 20 -6 -10 -30 5 2 -16 15 9 -8 3 4 -30 -5 -4 -23 3 -14 2 -6 -9
6246 -9 -8 12 -3 7 13 15 7 3 16 24 -4 1 18 -5 43 9 7 26 -5 -15 1 -1 -13 12 -3 -7 17 15 20 -7 -6 5 1 -21 -8 -1 6 13 -15
$$ packed form
5964a4L0j9LL2k1qJ4j7PmK0plJojj2PJ9rk1M%JmLqLoNJ2opNMj6J1J0QMJ5k8qJ1
6008DK7l0MJ6jj2mNJ2oj6PJMnoNJLPJ2j3j7J5j6J7j8J3jrlpJ0Kj1ONOJ0qJkj3
6051eK0j1K0oKnNj5K0k6K7j9j2K5j2Qj3QJ5l0%mlJ8l2J6rM4l6j3J8kJ1KlJ1k4
6088a0RQkoMqj1J3J9k8J6noMk6M5j8J8oj2NrJ5Mj1jJ1ppJ6j9OJ4rL0l9J2lNjj9
6129ijj5OJ2J8LrqRj7OQ%ooRl0M3J5l9J7MrmJ5JPl9L2orRk4J8jJ6j1kj0J8pJj6
6172a1QJ5J6l3oK3j7pK4j1j1OrPJ0jPj1J1rj4L5J1j9%j0jK3j0j1J0j2kJ5jRk0
6209DOK3mj4kK2rQj8K7k1J1j0j2pL1j5k6mk0L5lj8L1oj7J1Jl4K5Jj9K6j7J6ql
6246iJK0j5J0OKqmJ3Qk8NJ7k3M8l4kJ9l1j0J6kj2K5j5mK4kNk7JJ1mk2J3PPPk8
$$ plain form
6285 -15 -3 -13 -13 15 20 2 5 -1 0 -5 2 10 -8 9 -4 14 -4 32 -1 17 6 -15 47 5 -2 25 30 5 5 -20 30 7 15 17 5 -1 -4 12
6323 12 -9 -8 -6 4 -13 -21 1 -13 -12 -10 -8 11 -24 0 6 12 -3 -13 -12 -11 -18 6 9 0 -8 -12 16 5 18 30 9 28 23 7 29 13 -4 18
6361 18 5 7 19 -10 9 13 1 0 -10 -2 1 0 -4 -9 2 3 -12 -12 0 -8 -8 0 6 2 7 -4 17 0 7 13 4 -9 -6 1 -1 0 -18 -1 16 29 10 13
6403 13 17 31 -6 8 -7 13 6 -6 14 -4 -6 0 3 -8 -16 2 -6 5 -9 20 -8 -19 11 -9 3 -3 -4 -17 -17 20 5 8 2 -8 22 -22
6439 -22 -20 -25 15 -4 -19 -8 24 -9 7 35 20 8 26 11 11 20 4 15 27 24 -2 24 11 28 27 14 -6 8 9 2 -18 3 12 -4 8
6474 8 -4 -3 -14 3 1 -14 -17 -5 -1 -8 -1 -21 -5 -18 30 8 -7 11 4 -4 15 0 -6 14 -8 14 18 17 5 14 -4 -10 -8 6 -7 -3 -4 -15 10
6513 10 -11 -18 8 -7 -15 11 -1 -3 -7 -4 -3 2 4 11 16 -1 2 8 8 3 -25 -7 -13 -2 10 -7 13 -14 24 11 22 4 1 -4 7 11 28 9 4 6
6553 6 11 12 19 20 3 24 -23 7 -5 -11 0 -5 12 -11 -26 -28 -6 -9 -2 13 -33 -30 -4 -12 -17 -34 -24 -12 7 0 -3 -6 -5 -25 -10 0 -20 -9 -3
$$ packed form
6285a5J2j0%K8Nj8LoJnPQj8J7j3J8j8L6l3J8j1k1O2m2pK7Nk5%k5N0k3QKj2olJ6
6323A2k1JKJ0j7qK2j4JKKJ9l5K4OOj5j0JJpK4LrqmK8j1J3J2k1J9nj6K2j6j7K2
6361A8j3KJ2k9J9Mj2jj0QLjmnJ1Jj5%J2q%QOmNj1K1j7POrj3LPkJj8J7J7J3j9L
6403A3MJ4l7J4j5K0pj2K0j8kOLj1qJ8qJ1j4K9k8j1L0k0J2ojj3%L7j5Loj0L0m4
6439b2KnM0j9j5J1L2l3J6K8j5j2J8j5%Rj6J1J2lk6K6j3J7jj3k0J4Jpk0K1Rj6J2
6474Hj2Jj1J7kj5lJ2MpPk0J6j3M8k2j5J8pqJ9j5oK0k2K2Mjj2Rj8oKJ4j3Mjj1K5
6513A0k1pK6j5qK6j2kmLJNKPNj7LO%nk8J8oJ1J2j7K0k7L8j3J1j8lnJ1MJ7j9nK
6553FNJPJj7K1m7L0j2oJ1nJ7k3j5kK2lPJ5m6LK6qnj7J0J2J9pllJk0J5J0k0J1O
$$ plain form
6592 -3 2 -5 -9 8 11 -24 -4 -5 18 21 -1 -7 -17 18 4 6 3 21 -4 3 -3 -14 -18 -11 -21 -27 -9 8 -2 -19 17 18 -5 -24 -14 -5 21 -1 -17
6631 -17 -13 -4 11 -4 9 1 33 1 3 9 -1 19 -2 -10 20 -7 4 15 12 -1 4 -2 2 14 -14 -22 -3 -15 -21 -6 -15 -11 -21 -15 -14 2 -9 8
6669 8 -35 -3 -15 -6 -8 -23 -18 5 -3 -7 -10 3 0 0 5 6 8 13 13 3 19 12 0 5 -2 27 18 16 6 24 27 29 32 12 8 13 18 -18 11 -6 21 -2 4
6712 4 16 13 22 2 -20 23 -5 -21 -6 1 -7 -4 -32 -20 -3 -11 6 10 11 11 -9 3 3 -10 8 11 10 -11 13 0 10 0 -7 13 1 -14 6
6749 6 29 2 13 5 -3 5 -13 10 2 -17 -24 -23 -14 -19 -23 -3 -15 -7 8 11 -16 -3 -3 -12 8 -11 1 -2 -5 3 -13 -3 10 14 14 4 8 8 -6 -8 14
6790 14 18 -7 25 19 -11 3 14 16 15 6 3 16 21 7 4 -20 21 19 18 -5 3 -1 -22 -13 10 0 -1 -11 -10 -33 -33 -13 7 -1 15 -10 -3 4 4 -1 8
6831 8 -18 13 -13 8 -11 3 2 25 11 12 13 23 -19 4 -3 9 0 0 7 3 5 6 16 -12 18 -1 9 -10 -19 -2 -8 19 -1 6 0 -25 2 12
6869 12 -9 -2 11 1 -13 18 3 -6 7 -18 6 -3 11 13 5 2 1 -2 4 7 11 17 -16 19 36 -6 4 6 16 -11 8 15 -21 10 -12 -20 -19 12
$$ packed form
6592cNpmJ7Ll5K0jK3Lk2oj0L5j4KlJ8k5Poj1mPj0oJ8J7j0j7L6Jk3j9J0RK6k2j6
6631a7MRJ5j5J3qL2l2KOj0K0k1qL0k7J1J1lj3NoMJ2k8qJ9j2oJ5rMj0OJJ6j1J7
6669Hm3L2j2Rkj5NK3qmlJ3l%NJKN%j0J6pj2NpK9rkj0J8LKLk0mNNl6K9j7K7k3O
6712DJ2lRk0k2M3k8j6J5PqLk8J2J7qJ7MJ%k0J2%j3J8Ljk1K4j3J0j0pK0j2j5K0
6749FK3k7J1qqQj8K3qj9pJRnmK0j2QJ5Lk7J3%rK0j9J2llQj6J0J3M%j0M%j4kK2
6790A4Mk5L2ol0J4J1KjrlJ3Nj4lk4M1kjk3Qmk1RK3j0jj0Jk3%K0K0qJ6k5PP%nR
6831Hk6L1k6K1j9J4jK3j4JJJ0m2K3pJ2r%PmKJJ0k8L0j9J0j9rJ7oK7k0Pok5K7J0
6869A2k1PJ3j0j4L1j5rJ3k5K4rJ4KqljlOLMOl3L5J7m2J0KJ0k7J9Pl6L1k2qJL1
$$ plain form
6907 12 -1 -11 1 13 10 -5 -8 -6 -7 21 6 -9 7 0 -6 -8 -3 -20 3 0 -9 -14 -29 -25 7 3 2 10 23 21 9 5 23 12 30 8 -3 14 3
6946 3 -8 13 6 12 -8 1 17 -1 7 25 -15 2 1 -12 -2 -16 3 2 -12 3 1 5 -2 6 -2 -20 -11 9 5 14 20 -6 17 -3 -14 -1 6 29 -6
6985 -6 28 21 3 -4 22 -7 12 11 7 -5 6 4 -10 6 9 1 5 -2 -12 -15 4 2 -15 1 -4 -3 10 -8 -23 -12 3 -14 -24 18 3 -7 9
7022 9 -12 2 12 18 6 5 5 -1 16 -13 33 27 9 10 4 4 14 9 20 1 -3 10 -1 21 10 12 9 3 6 12 21 -9 14 1 -8 21 2 -14 -24
7061 -24 0 -14 6 2 -9 -3 -10 -13 -9 4 -4 -5 -1 53 -24 -2 7 15 12 12 -5 19 2 2 17 6 -4 13 -2 20 13 6 5 9 -3 19 12 -11 42
7100 42 -26 14 6 -11 -18 -9 -15 -12 -2 -7 -6 4 -20 -21 -28 2 -16 -12 -3 -6 8 -6 -21 -7 0 7 -11 1 -3 9 15 17 1 8 33 -5 4 6 -5 2 28
7141 28 0 13 14 -1 8 7 -4 -1 -9 -22 -13 -2 -11 -7 3 -8 6 -12 -18 -8 -11 13 11 -5 -1 8 27 12 -7 24 -20 -3 11 3 4 12 -12 2
7179 2 13 1 8 12 11 22 9 11 14 6 6 9 15 1 -2 15 -15 -4 7 2 9 -19 -10 12 7 13 -14 -28 -1 3 7 5 -5 -8 4 5 3 3 12 18 -10 -3 23
$$ packed form
6907A2j3j0J2J2lj5lKjK8j5j5J6pokNj7K3lrnj5ML2mjQJ3kj2mJ8j1J8k2j1J7j1
6946Cj1K1pOk0RJ6j8QJ8m0J7jj3J0j4J9jj4J5kMpQqj8RK0mROk6K3k0j1J3PK3l5
6985fL4pj8pK6k9J9jmj2J1kj4J6LqMpj0lJ9kj7J6nJJ3j8j5J1J5j7j0M2j5j0J6
7022Ik1J4J0Oj2j%oJ7k9M6oj8Jo%J0nJ1j9mJ3j1K2j1KloLORl0K3j3rK9j9j6j0
7061b4K4j4K0mj1OplMJ3qjMN4p7K2RQl%j7K4j7%J5j1j0J7j5K2ppjMj2K2pk3N3
7100D2o8M0qj7pRoLJ0nJJ0k4jpL0j8MRlJ4j4j5J4PPj8J2mJ2OKj6PK5l8RKj1PK6
7141B8k8J3Jj5Rjj1Lqj3RJ1rMJ0j1J4j8oJ0lK4kj6MRJ9j5j9L1m4J7J4qJQk4J4
7179BJ1j2PMjJ1j3KLq%LOj4lJ7l0J1J1nPk8RK2nOk7j4K7MMkj0lJ2Jk%ROk8PK6
$$ plain form
7222 23 -16 17 2 12 -2 14 21 -7 6 5 13 -17 -9 1 9 2 -11 13 0 10 10 -7 -17 23 2 -5 -1 4 -19 -23 -16 -28 -7 -15 -15 -25 -4
7259 -4 -19 -2 -31 4 -4 17 0 7 0 -3 7 13 3 -1 -20 18 18 -6 16 21 12 11 6 9 32 -4 31 8 -4 -15 9 3 26 3 -11 7 -15
7296 -15 -8 12 6 10 5 4 11 14 13 -16 -11 -12 -15 -9 -9 11 -14 0 -15 -2 -6 -31 -9 -12 4 8 -2 -7 -13 5 -3 -5 -2 -4 5 -18 6 -17 -14 -2 11 -11
7338 -11 -1 -9 -22 1 -3 -13 -33 -5 -6 -2 -16 17 -18 -3 -12 -27 -2 -22 -10 3 -6 -3 0 4 20 16 4 14 25 14 -1 8 -1 -13 1 0 3
7375 3 16 15 -10 10 26 -24 24 10 10 -2 -7 16 -1 15 -9 3 9 20 -45 -6 -11 6 -1 2 -3 -5 -11 -27 -3 -18 -4 -13 13 -5 4 -17 -4
7412 -4 7 -1 13 -15 -2 8 -7 0 -6 -8 7 -7 9 -1 6 1 -7 10 18 -9 20 19 4 30 -5 2 -15 -4 -11 0 -13 -5 -6 13 -12 6 9 23
7450 23 -13 2 -4 19 2 9 17 2 3 7 17 -9 0 0 4 7 -3 6 10 -4 15 15 8 18 -1 1 10 -1 12 -10 3 -14 8 -3 -16 -1 -23 -6
7488 -6 16 -1 -11 -26 -21 2 -12 -3 -23 -1 3 -10 -6 -4 -25 -11 -4 -9 -4 -19 -31 -13 9 5 -23 19 10 -13 0 12 16 3 8 3 -3 28 17 12
$$ packed form
7222B3l9L3j5J0j4J6Pk8J3jQl0QJ0Qpj3K4j3J0%j7j0M0k1pMNk3mPj2K1q%j0K1
7259dj5J7k9L5qK1j7PplJ0Oj0mj9L8%k4K2NrjnLK3l6L5k3j2j1K4oK3k3j4J8k2
7296a5PK0oMnjPLjk9NjlO%K0k5J4j5J3mk5K2lJ6Mj0noJ8qkLkRk3K4k3LJ2J3k2
7338a1J0qj3K3mj0k0K8jMj4L3l5J5rj5K5k0J2J3rLLMJ6mj2J0J1j1j5Rrj2J4jL
7375CJ3jk5K0J6n0M8j4%j2nK3j7J6k4J2OJ1o5L9nJ7pLnkoj6K4j5J4rK6j8Rk1J3
7412dJ1qJ4k8J3J0j5PokJ5j4J6j0PnqJ7Qk7K9jj5K6l5Pj7J1pJ1j3QjJ9k5J8LJ4
7450B3l6J5oK3j7PQj5JMJ0k6R%MLj0RMj4J9%pJ0j9KRj1J3k2J3j7K2j1j3J5k2J7
7488fK2j7j0j5NK3j4Rk0K2Mj3MKk1J4PnNj5j2J8K2mk8M2rk3J3J2Mj3NnoL1j1n
$$ plain form
7526 12 10 4 4 27 6 17 -1 5 6 -1 5 14 11 -7 8 19 6 10 -10 -7 19 3 -13 16 -5 -18 3 1 -15 -1 17 -1 -3 -5 2 -2 21 6
7564 6 2 0 2 3 13 13 -12 28 -11 15 14 5 1 -14 -30 9 7 -2 13 -7 -2 3 5 -3 -30 -4 -16 -11 -7 -27 -3 -1 -2 -14 0 -8 -25 0 4 -15 20
7605 20 -19 -8 -1 13 -3 -13 -29 11 4 15 8 8 -7 10 3 8 0 21 4 21 17 26 -7 1 -24 -2 7 2 -7 -16 -7 14 -4 -7 -29 5 -13 -10 -2
7644 -2 -16 0 -14 -3 -12 7 -13 -7 6 -7 0 -18 -13 10 -9 -14 -8 -12 5 8 -8 0 -6 -28 1 3 -21 -22 -17 -11 -12 10 -6 -6 -4 -9 11 -15 -20 5
7684 5 8 -11 2 0 -9 -17 3 22 -18 -2 6 -11 -1 0 -7 -7 -3 -14 6 -1 17 3 11 7 11 -4 12 12 6 -7 22 15 17 7 -4 -2 11 -29 -14 0
7724 0 8 4 -4 -7 -6 -36 -7 -2 -13 -8 -21 -3 -23 -13 -31 -11 3 -34 -26 -7 -7 -3 -7 -23 -3 -20 -3 -2 8 -1 -12 1 -13 -9 -6 9 4 -12 8
7763 8 -8 -11 -1 5 12 -16 0 29 14 12 -15 1 10 1 13 15 14 2 -5 25 -5 13 5 -21 -12 -9 -25 -5 -6 -15 -6 -1 16 -18 -7 -10 -11 -6 11 1
7803 1 -17 5 -1 1 6 -2 6 2 -3 12 -10 8 -27 -6 4 3 4 -3 -9 13 8 -20 -13 -5 -10 -14 -4 -11 -7 -8 -21 -12 12 -12 -22 -5 -10 -23 -25 -12 -2 -17
$$ packed form
7526A2ko%K3k1J1j8OJpORlj8J5J1j3Mk0LK6j6j6K9k1j3K1kj6J4J8j8kkPmK3j5
7564FmkKJJ0%k5M0l9K6jrmj5j6L9krJ5k0NNKqk7K6j2NMk0K4Kjj2J4qj7K5Mj9L5
7605B0l9J1PJ4j6j0j6M0pJ1p%j5J7pNqK1j7J7mRl3Qk5K2RnrrRK1j8lk2L4j8LQ
7644bj4J6j4J1rJ9k0OJ3j3Pj8NK3j9nOmJ7Lj6Qok2K9Kk4jNOjK2j6%KnK0k6nK5
7684ELj9J3krqK0J9m0J6Qj7J0Jp%Mj1K0pJ8j4QmMj5J6%oj3K9pKj0j1KJ3m0J5J4
7724@QmqlJl0K9Nj1Nj3J8k0J0j8K0J4l7QJ9%Mmj6K0j7J7JJ0rj1J3j4MLJ5nj6K0
7763Hj6lJ0OPk8J6K9j5kk7J6RrJ2Kjj2pL0l0J8qk6RLj6K0jrRNJ7l4J1ljNJ7j0
7803Aj8K2oKNqQmnJ5k2J8l5K1J0jJpoK2nk8PQnmJ0pMjj3RK4k4j0J7nj3kJ3J0j5
$$ plain form
7845 -17 -11 12 -12 3 11 -15 6 -6 -24 -3 -22 23 3 33 31 -2 -4 -9 13 2 26 10 2 -9 3 0 7 11 6 2 3 4 5 10 5 -9 -7 -1 -2 -25
7885 -25 -20 -9 0 -12 -31 2 -14 -10 -5 -10 -3 -7 -17 -9 -4 -6 -5 -13 8 21 11 19 23 0 14 23 10 -17 -16 9 14 17 -13 -7 -24 -23 -6 -14 -8 17 -2
7926 -2 3 -24 -9 -5 -3 -14 3 -5 -7 -8 4 6 -6 -1 -5 17 1 2 2 -17 3 25 -2 19 0 20 18 17 32 39 5 4 34 8 20 -9 10 15 3
7965 3 9 3 11 -8 13 1 1 18 11 11 -5 11 -8 -10 -2 -15 -27 -2 -15 0 -12 -1 -17 -14 5 -7 5 15 1 -12 -4 -9 8 14 4 2 7 15
8003 15 11 13 -3 -3 3 -3 16 -10 8 10 6 7 16 -4 20 -14 0 -17 8 -3 16 10 14 -13 -6 -15 -11 2 -7 13 12 9 -4 -9 10 -5 4 4 0 14 -1
8044 -1 -5 9 19 12 -2 -1 -3 9 11 -7 35 20 -1 3 -10 4 6 -10 -10 -9 3 11 1 -21 18 11 -5 -6 -17 -17 13 -2 -14 -5 4 -15 -6 -7 -14 10
8084 10 -5 0 -13 -14 -18 16 3 -10 -6 -14 -22 -7 15 1 15 9 -18 -3 20 -6 17 4 -5 -2 0 -10 16 10 -18 17 -15 -6 -28 -29 -3 -3 -1 4
8122 4 20 7 -21 -17 10 0 -15 -22 -2 1 -15 -15 10 -6 -17 -2 7 2 -14 5 -20 0 -19 -4 9 4 3 -5 -5 6 -1 9 -5 10 -8 13
$$ packed form
7845a7OK3k4J5Qk6K1j2j8K1j9M5k0L0kl3knK2j1K4j6qj1J2lPMnmJJJNnj4KOjk3
7885b5NJ1Rj2j9L3j6MNnPmj0QNkJqK1J3j0QMk3J4Rj3k7JK5NLl0Oj7JJ7qOK5j9
7926bNk7J5MKj1J7qkjJ2Kj2NmK2j6J%j9K0K2k7K1j9K0kjJ5Pl4jL0k6J2k9J9Nj2
7965COoQj9K1j2%J7p%j6J6j9kQj3j2K5j3J5j2J1j6LJ9j2J2J0j4j3QnJ7Oj0kNQ
8003A5mKj6%OoJ9k6J8KmJRk0K4l4J4j7K5j1J9oMk7PrMJ3rK0jlj3nJ9j5R%mJ4j5
8044amJ4J0pj4JkJ2Kj8M2j5k1Mj3J4Kj6%JJ2Qj0k2L9pj6jj1%L0j5j2RRj9RjpK4
8084A0j5Nj3jmL4j3j3MqqJ5K2j4J4ok7J5K3k6K3j3rLKj0K6ok8L5l2Rk2jK6%KN
8122DJ6j3k8MK7j0j5pK0Lj6%K5j6j1J5Rnj6J9k5K0j9J5J3njq%J1pJ0j4J5j8K1
$$ plain form
8158 13 0 -6 4 2 4 -13 0 7 -2 -7 9 -14 5 0 -1 -6 -9 2 -1 -27 -12 7 -13 -22 -7 -16 -3 4 3 -13 -7 13 12
$$ packed form
8158A3j3oJ0kKj7J3PrnJ6k3J9njnlJ1lk6J5J9k0rJ5rJ3Pjj6OK0j
8191A2
$$ Imaginary data points
##PAGE= N=2
##DATA TABLE= (X++(I..I)), XYDATA
$$ plain form
0 0 0 0 0 0 0 0 0 0 0 0 0 0 0 0 0 0 0 0 0 0 0 0 0 0 0 0 0 0 24 -32 32 -32 32 -32 32 -32 33 -61 64 -64 64 -65 96 -96
44 -96 97 -121 128 -129 160 -161 193 -193 225 -255 278 -306 342 -382 418 -479 543 -628 731 -862
64 -862 1054 -1345 1803 -2730 5157 -24665 -60694 -72 14045 -172 13958 19036 -15665 -11756
78 -11756 16754 10331 2036 19299 2118 -23294 3051 25348 -1163 -3713 17096 -4699 -24688
91 -24688 8417 21899 -4158 -2442 8022 -16325 -15063 20798 13387 -17537 -5442 4570 -15669
104 -15669 -5020 21718 2387 -18417 -1357 -112 -12767 8824 18359 -12895 -14859 12019 -1003
117 -1003 -15888 14099 19236 -17104 -15714 11200 2459 -4139 14468 4386 -17273 403 13654
130 13654 -3010 3806 17942 -8438 -20250 12698 16818 -10521 -1767 11969 -11637 -14758 12094
$$ packed form
0@%%%%%%%%%%%%%%%%%%%%%%%%%%%%K4n6O4o4O4o4O4o4O5r4J25j28J28j29J61j92
44i6J93k18K49k57K89l21L54l86M18m80N33n84O48p24Q00q97J022j171J359j593
64h62J916k399L148m533P887k9822l6029O0622J4117j4217J4130N078l4701L909
78a1756K8510o423q295J7263j7181k5412K6345K2297k6511k550K0809k1795j9989
91b4688L3105J3482k6057J716J0464k4347J262L5861p411l0924J2095J0012k0239
104a5669J0649K6738j9331k0804J7060J245j2655K1591R535l1254j964K6878j3022
117a003j4885K9987N137l6340J390K6914q741o598J8607j0082k1659J7676J3251
130A3654j6664O816J4136k6380j1812L2948M120k7339Q754J3736k3606l121K6852
$$ plain form
143 12094 5678 -12183 3833 5978 -16789 -5128 17602 -600 -12694 6349 1183 -15841 3957
156 3957 16267 -7456 -10131 6869 -4662 -9662 15502 11288 -16363 -4230 15589 -2609 -7132
169 -7132 15307 6363 -14833 -334 9802 -5517 -80 12410 -5799 -12883 7756 3726 -11604
182 -11604 6503 14077 -12932 -12394 13714 5459 -10611 4453 5683 -13218 -2411 13699 -3357
195 -3357 -9737 7141 -538 -13130 6406 12513 -10185 -6759 11136 -2076 -9809 10118 7206
208 7206 -11990 -804 8947 -8603 -5059 15407 1460 -15532 2683 9563 -7006 405 13141
221 13141 -4293 -10604 8580 6249 -6570 4827 6108 -12901 -4704 14117 -828 -11955 6148
234 6148 4735 -13641 -1717 12775 -2784 -7121 7203 -649 -10230 6568 9686 -8311 -3589
$$ packed form
143A2094o416j7861J6016K145k2767J1661K2730j8202j2094J9043n166j7024J9798
156C957J2310k3723k675J7000j1531n000K5164m214k7651J2133J9819j8198m523
169g132K2439q944k1196J4499J0136j5319N437J2490j8209p084K0639m030j5330
182a1604J8107P574k7009N38K6108q255j6070J5064J230j8901J0807J6110j7056
195c357o380J6878p679j2592J9536O107k2698L426J7895j3212p733J9927k912
208G206j9196J1186R751j7550L544K0466j3947j6992J8215O880j6569P411J2736
221A3141j7434o311J9184k331j2819J1397J281j9009Q197J8821j4945j1127J8103
234F148j413j8376J1924J4492j5559m337J4324p852r581J6798L118j7997M722
$$ plain form
247 -3589 7448 -6506 -7710 12741 6209 -13281 -2385 7845 -4866 -1059 12446 -1810 -12168
260 -12168 5343 7487 -7111 1895 10254 -8070 -10627 8349 4067 -7700 4469 6361 -10757
273 -10757 -4824 10214 160 -4280 9034 673 -14153 1994 13421 -3752 -6463 6295 -3163
286 -3163 -10798 6540 8885 -7754 -3550 5593 -5292 -3796 11877 2998 -10736 1847 6607 -7645
300 -7645 -1272 12732 -705 -10894 2287 2705 -6701 4521 10032 -7307 -8401 6807 1985 -4482
314 -4482 8116 5514 -11998 -4766 9486 16 -4266 6334 -800 -11556 1543 7889 -5191
327 -5191 -2211 8167 -3946 -9882 6945 8055 -5722 -164 5600 -7275 -5693 10026 4290 -6591
341 -6591 1569 1493 -9208 1087 12588 -1658 -8513 4613 2524 -6760 4458 9411 -5782 -6086
$$ packed form
247c589J1037j3954j204K0451o532j9490J0896J0230j2711L807J3505j4256j0358
260a2168J7511K144j4598R006Q359j8324k557J8976m282j1767J2169J892j7118
273a0757N933J5038j0054m440J3314q361j4826J6147J1427j7173k711J2758r458
286c163p635J7338K345j6639M204R143j0885J496J5673q879j3734J2583M760j4252
300g645O373J4004j3437j0189J3181M18r406J1222N511j7339j094J5208m822o467
314d482J2598k602j7512P232J4252r470m282J0600p134j0756J3099O346j3080
327e191K980J0378j2113n936J6827J110j3777N558N764j2875J582J5719n736j0881
341f591Q160p6j0701J0295J1501j4246o855J3126k089r284J1218M953j5193l04
$$ plain form
355 -6086 5349 -1238 -5590 6894 4303 -9726 -2818 5865 -4117 -3171 9321 725 -10933 438
369 438 6684 -2737 792 7027 -5470 -8953 5893 5295 -5086 1838 4867 -7778 -4802 9008
383 9008 2680 -5526 3528 3088 -7349 29 8686 -1427 -4053 5179 -1221 -8613 4148 8464 -5125
398 -5125 -4584 4458 -2453 -4717 7635 4798 -7761 -2061 4422 -3561 -1084 8202 -1239 -9433 1840
413 1840 4261 -5760 -245 7169 -3728 -7089 4393 2542 -4460 3993 5628 -6569 -3644 7263
427 7263 1044 -3589 5334 1955 -8410 -5 8179 -1367 -3730 3977 -1464 -6105 4800 5970 -5351
442 -5351 -2171 4903 -3514 -5058 6182 3045 -6751 -411 3558 -5103 -2363 6819 -42 -5951 2259
457 2259 2110 -4815 2500 7317 -4069 -5770 4880 2086 -4143 3244 3686 -6510 -2673 6143 -391
$$ packed form
355f086J1435o587m352J2484k591j4029O908Q683r982R46J2492q596j1658J1371
369D38O246r421L529O235j2497l483J4846n98j0381O924L029j2645K976J3810
383I008o328q206R054m40j0437P378Q657j0113k626R232o400p392J2761M316j3589
398e125N41R042o911k264J2352k837j2559N700O483p983K477R286r441q194J1273
413A840K421j0021N515P414j0897l361J1482j851p002Q453J635j2197K925J0907
427G263o219m633Q923l379j0365Q405Q184r546k363P707n441m641J0905J170j1321
442e351L180P074q417j544J1240l137r796O340L969q661K740R182o861n909Q210
457B259j49o925P315M817j1386j701J0650k794o229P387M42j0196L837Q816o534
$$ plain form
472 -391 -3667 4323 1047 -6576 1455 6329 -2781 -2145 5582 -1088 -6275 3319 4588 -3928 -373 3805
488 3805 -4660 -4100 6344 2195 -5905 685 3082 -4791 -731 6945 -1097 -6158 2198 2078 -4123
503 -4123 1672 4587 -4477 -3741 4572 -100 -4289 4238 4008 -5520 -1668 5313 -775 -2124 5328 1037
519 1037 -6279 717 4761 -2272 -943 4141 -2941 -5577 4059 3797 -4366 -545 3304 -3632 -2480
534 -2480 5614 959 -4845 1714 2434 -4857 -338 6020 -1316 -4461 2812 784 -4677 2315 5531
549 5531 -3105 -3270 3040 -721 -2483 4899 2409 -6147 -1262 4388 -1881 -2116 4601 -334 -6097 1440
565 1440 4327 -2606 -600 4236 -2014 -4043 3773 2656 -3123 1640 3259 -4650 -2959 5028 1156
580 1156 -3452 1733 668 -5430 181 5738 -1240 -3566 2417 -180 -4036 2905 4561 -3491 -2478
$$ packed form
472c91l276P990l276p623Q031M874r110O36P727o670n187R594J269q516L555M178
488C805q465N60J0444m149q100O590K397p873M060P676q042n061Q356j20o201
503d123N795K915r064P36Q313m672m189Q527k30r528L852O981o088j349P452m291
519A037p316O996M044p033J329N084p082k636R636k62q163L821L849o936J152
534b480Q094m655n804O559P20p291M519O358p336l145P273k028n461O992L216
549E531q636j65O310l761j762P382k490q556M885N650o269k35O717m935n763P537
565A440K887o933K006M836o250k029P816j117n779M763J619p909J691P987l872
580A156m608N185j065o098N611N557o978k326N983k597l856O941J656q052J013
$$ plain form
595 -2478 3283 -951 -2793 3791 2072 -4257 -167 2925 -2697 -871 5375 -86 -5257 1191 2732
610 2732 -2786 675 4464 -2841 -4890 2646 2078 -2454 1569 2030 -4512 -1794 4693 277 -2717 2860
626 2860 1246 -4474 514 4644 -1555 -2103 3246 -736 -4522 2255 3736 -2872 -1362 2482 -2438
641 -2438 -2715 4454 2379 -3923 -468 2019 -2424 -114 4663 -801 -4351 1625 1793 -3048 982 4012
657 4012 -2566 -3361 2989 973 -2819 2175 2946 -3427 -1877 3029 -394 -1578 3042 154 -4856 329
673 329 3759 -1502 -1271 2810 -1489 -3862 2918 3522 -2580 -606 2605 -2124 -2099 3787 1347 -3298
689 -3298 727 1857 -3224 -858 3963 -402 -2955 1688 535 -3211 1599 3915 -2437 -2727 2479
704 2479 -3 -2432 2657 2109 -4053 -1530 3186 -457 -1615 2640 211 -3533 996 2843 -1860
$$ packed form
595b478N761m234j842O584j719o329M090L092n622J826O246n461n171O448J541
610B732n518L461L789p305k049P536n68m532M023M61o542K718O487m416k994N577
626B860j614n720M988M130o199n48N349l982l786O777J481o608J510L844m920
641b438k77P169k075o302L455K487m443K310M777n464l550N976J68m841M030L030
657D012o578p95O350k016l792M994P71o373J550M906l423j184M620k888n010N185
673C29L430n261K31M081m299k373O780O04o102J974L211m729K5N886k440m645
689c298M025J130n081K366M821m365k553M643j153l746M810K316o352k90N206
704B479k482k429N089n48o162K523M716l643j158M255k429l744M529J847m703
$$ plain form
719 -1860 -422 3226 -1284 -3336 2261 1980 -2580 406 2545 -2766 -2497 3251 1212 -2468 972 1202
735 1202 -2886 160 3970 -686 -2724 1652 518 -2570 1536 2777 -2671 -1944 2422 -552 -2399
750 -2399 2489 1783 -3227 -528 2588 -1412 -1304 3275 443 -3554 397 2024 -1645 112 2576 -1886
766 -1886 -2917 2417 1649 -2184 842 2115 -2592 -1256 3655 580 -2595 1276 1280 -2790 -78 2965
782 2965 -996 -1895 1799 -362 -2968 1527 2780 -1941 -1152 1905 -1173 -1829 2939 1523 -3162 -548
798 -548 1925 -1446 -733 2845 -464 -3310 1017 2003 -1671 91 2509 -1376 -2087 2142 910 -1829
814 -1829 1346 1790 -2749 -1375 2684 -4 -1729 1818 587 -3295 78 3227 -535 -1355 1635 -528
830 -528 -2330 1864 2170 -2165 -839 1784 -1389 -1714 2457 780 -2809 191 1730 -1854 -562 3011
$$ packed form
719a860J438L648m510k052N597k81m560K986K139n311K69N748k039l680L440K30
735A202m088L046L810m656k038M376j134l088M106J241n448P27M366k974j847
750b399M888p06n010K699L116m000J08M579k832l997L951J627l669J757K464m462
766a886j031N334p68l833L026J273m707J336M911l075l175L871Mm070K712L043
782B965l961q99L694k161k606M495J253m721P89L057l078o56M768j416m685K614
798e48K473l371P13L578l309k846M327R86l674J762K418l885p11M229j232k739
814a829L175M44m539J374M059k688j725L547j231l882L373L149l762q20K990k163
830e28j802M194L06m335J326K623l173l25M171j677l589L000J539l584J292L573
$$ plain form
846 3011 -127 -2545 955 948 -1884 873 2723 -1701 -2386 1587 578 -1458 1534 1338 -2680 -791
862 -791 2661 -49 -1197 1950 346 -2738 552 2484 -1232 -1036 1962 -626 -2570 1227 1652 -1628
878 -1628 -158 1428 -1781 -1439 2647 959 -2138 317 888 -2119 -107 2948 -486 -2469 921 644
894 644 -1790 886 2214 -1563 -1406 1915 86 -1562 1716 1542 -2199 -615 1833 -769 -983 2122
910 2122 86 -2858 262 1877 -1041 -162 1983 -1151 -2322 1742 1766 -1457 64 1332 -1675 -1158
926 -1158 2168 306 -1922 681 737 -2197 -232 2324 -595 -1547 1326 137 -2109 919 2255 -1294
942 -1294 -1223 1317 -463 -1253 1879 1107 -2301 -479 1693 -648 -473 2147 -32 -2252 768 1598 -1217
959 -1217 -91 1871 -997 -1900 1299 672 -1684 562 1435 -1886 -1286 1897 335 -1260 1043 472
$$ packed form
846C011l138k418L500pk832K757J850m424o85L973j009k036K992j96m018J889
862g91L452k710j148L147j604l084L290J932l716J96K998k588j944L797M25l280
878a628J470J586l209L42M086j688l097K455N71l007K012L055l434j983L390k77
894F44k434K676J328l777J57L321j829j648L278j74l741J584K448k602k14L105
910B122k036k944L120J615k918Q79K145l134j171M064K4l223J521J268l007N17
926a158L326j862k228K603N6k934J965K556k919r52K873j189k246L028J336l549
942a294P1K540j780p90L132p72l408J822K172k341J75K620k179k220L020Q30k815
959a217J126J962k868r03L199o27k356K246Q73l321O00L183j562j595K303n71
$$ plain form
975 472 -2130 164 2295 -621 -1299 1124 -259 -1844 1189 1736 -1683 -955 1473 -557 -1233 1694
991 1694 936 -1744 92 1304 -1168 -499 2112 9 -1961 598 880 -1374 341 1899 -1083 -1697
1007 -1697 1372 755 -1125 844 1050 -1793 -708 1905 -40 -1363 946 333 -1950 77 1589 -887
1023 -887 -882 1342 -344 -1787 1041 1462 -1182 -176 1325 -1031 -1226 1838 930 -1635 45 968 -1145
1040 -1145 -208 1895 -355 -1692 889 832 -1234 444 1566 -1185 -1196 1408 201 -1380 899 1026
1056 1026 -1654 -670 1368 -376 -846 1438 234 -1930 249 1608 -629 -406 1270 -613 -1555 1149
1072 1149 1109 -1339 -235 998 -1070 -889 1594 305 -1534 460 978 -1246 -253 1735 -209 -1207
1088 -1207 833 278 -1306 667 1545 -1051 -1049 1068 -141 -948 1288 872 -1739 -446 1411 -381 -702
$$ packed form
975D72k602K294K131k916o78K423j383j585L033N47l419P28K428k030o76K927
991A694p58k680J836J212k472O69K611k103j970K559K82k254J715J558k982o14
1007a697L069o17j880J969K06k843J085K613j945j323K309o13k283K027J512k476
1023h87NK224j686j443K828M21k644J006J501k356j95L064r08k565J680R23k113
1040a145R37K103k250j337K581n7k066J678J122k751j1K604j207j581K279J27
1056A026k680R84K038j744m70K284j204k164K179J359k237K23J676j883r42K704
1072A149m0k448J104J233k068J81K483j289j839J994N18k224R93J988j944r98
1088a207K040n55j584J973Q78k596KK117j209q07K236m16k611J293J857j792l21
$$ plain form
1105 -702 1216 13 -1644 452 1178 -981 -374 1232 -632 -1346 1054 781 -1067 328 1083 -1205
1121 -1205 -824 1557 407 -1078 595 455 -1484 -13 1730 -437 -1269 720 131 -1163 703 1212
1137 1212 -1104 -680 1126 -240 -928 1125 609 -1394 -33 1105 -764 -571 1413 32 -1541 336
1153 336 933 -717 123 1242 -778 -1270 1034 687 -899 375 699 -1266 -547 1444 27 -1114 681
1170 681 445 -1302 104 1361 -507 -731 1027 -19 -1251 679 1138 -934 -456 830 -626 -808
1186 -808 1265 526 -1366 -79 797 -742 -152 1385 -249 -1387 653 830 -866 117 1131 -712
1202 -712 -933 943 266 -912 596 828 -1114 -458 1138 -143 -644 955 217 -1378 161 1238 -493
1219 -493 -616 760 -374 -1121 830 910 -978 -310 814 -578 -645 1084 325 -1085 261 688 -887
$$ packed form
1105g02J918j203j657K096P26k159O07J606j864p14K400k73j848J395P55k288
1121a205L81K381j150j485J673j40j939J471J743k167q32J989n89j294J866N09
1137A212k316M24J806j366o88K053n16k003J361J138j869J93J984j381j573J877
1153C36N97j650Q40J119k020m92K304l47j586J274L24j965P19J991j417j141J795
1170F81k36j747J406J257j868k24J758j046j232J930M59k072M78J286j456j82
1186h08K073p39j892J287Q76j539N90J537j634j138K040J77j696R83J014j843
1202g12k21J876o77j178J508K32j942O56J596j281n01J599p38j595J539J077j731
1219d93j23J376j134p47J951Q0j888O68J124j392o7J729p59j410J346M27j575
$$ plain form
1236 -887 -216 1212 -221 -1006 582 332 -983 392 1197 -733 -857 869 192 -678 764 611 -1109
1253 -1109 -241 1099 -193 -574 824 1 -1187 369 960 -706 -350 973 -344 -1041 692 664 -801
1270 -801 71 787 -801 -687 1035 272 -909 238 376 -946 2 1121 -361 -905 587 262 -788
1287 -788 486 866 -820 -554 929 -17 -723 703 549 -959 -161 846 -389 -369 982 70 -1063
1304 -1063 309 748 -562 -1 853 -575 -943 794 528 -832 18 552 -814 -423 981 8 -888
1321 -888 370 400 -835 62 954 -384 -619 671 -28 -894 485 836 -726 -400 673 -302 -568 913
1339 913 466 -966 -48 779 -335 -222 879 -136 -915 435 581 -624 -21 702 -520 -685 735
1356 735 238 -713 330 598 -800 -394 890 -3 -619 442 109 -971 82 899 -382 -547 488
$$ packed form
1236h87O71J428j433p85J588k50j315J375Q05j930j24J726o77q70J442j53j720
1253a109Q68J340j292l81J398q23j188J556N91j666L56J323j317o97J733k8j465
1270h01Q72P16j588J14J722p63j181J147J38j322R48J119j482n44J492l25j050
1287g88J274L80j686K66J483r46p06J426j54j508P98J007j235K0J351r12j133
1304a063J372M39j310N61Q54j428l68J737k66j360Q50N34j366L91J404r73q96
1321h88J258L0j235Q97Q92j338k35J290o99q66J379L51j562L26J073r75k66J481
1339I13m47j432R18Q27j114J13J101j015p79J350J46j205O03P23j222j65J420
1356G35m97r51J043K68j398M06J284q93o16J061l33j080J053Q17j281j65J035
$$ plain form
1373 488 -200 -727 611 604 -754 -225 697 -296 -482 787 237 -847 127 610 -558 -199 853 -112 -757
1392 -757 353 356 -549 262 751 -557 -627 654 189 -521 420 337 -926 -269 825 -156 -582 478 85
1411 85 -834 179 695 -445 -326 603 -174 -672 498 473 -615 -61 490 -561 -457 798 204 -761 101
1430 101 374 -541 13 866 -190 -716 424 315 -506 264 610 -539 -390 624 -14 -550 466 397 -692
1449 -692 -93 638 -255 -330 657 22 -844 159 587 -442 -179 469 -394 -671 513 376 -588 -9 394
1468 394 -492 -230 746 44 -624 286 344 -632 -27 682 -241 -515 423 61 -625 258 609 -483 -328 506
1488 506 -69 -354 610 285 -709 -42 572 -231 -231 573 -79 -694 287 495 -442 -85 565 -302 -518 472 234
1509 234 -501 150 393 -594 -336 549 -15 -469 275 103 -653 85 661 -273 -431 424 40 -457 406 471
$$ packed form
1373D88o88n27J338pj358N29R22r93j86J269n50j084R74M83j168L59J052r65o45
1392g57J110Lr05Q11M89j308p0J281m65p10R41q3j263O57J094r81m26J060l93
1411H5r19J013N16j140J19R29p77m98J170k5j088N54N51j051J04J255n94r65Q62
1430A01K73r15N54Q53j056n26J140j09q21P70L46j149J49J014o38n36J016o9j089
1449f92N99P31q93p5R87o35q66J003M28j029K63O48q63k77J184j37r64N79M03
1468C94q86K62R76p02o68R10N8r76O05P09r23k74R38l62o86Q83L51j092J55Q34
1488E06n75k85R64l25r94O67O14q03%Q04o52o15R81K08r37L57O50q67k16R90k38
1509B34p35O51K43r87K58Q85n64m54P44j72p56P38N76r34j58Q55l84m97Q63O5
$$ plain form
1529 471 -516 -230 473 -163 -371 493 180 -597 90 442 -366 -152 618 -18 -585 257 307 -396 86 529
1549 529 -412 -494 474 178 -434 184 259 -588 -169 588 -66 -440 323 101 -581 102 469 -364 -317 397 -111
1570 -111 -552 315 376 -436 -109 372 -293 -293 561 194 -507 74 344 -304 -19 559 -176 -521 336 270 -369
1591 -369 100 412 -353 -313 448 55 -398 268 291 -477 -124 452 -137 -295 367 -18 -610 96 453 -262 -174
1612 -174 327 -224 -421 398 322 -465 -64 320 -303 -232 491 35 -470 118 261 -377 -50 469 -152 -359 305
1633 305 120 -361 236 472 -340 -256 395 1 -279 334 186 -514 -61 417 -125 -223 320 -53 -461 186 341
1654 341 -340 -105 340 -221 -380 320 147 -379 76 275 -390 -223 448 56 -378 175 140 -361 76 504
1674 504 -177 -325 267 40 -298 244 321 -376 -168 378 -69 -261 354 161 -406 45 344 -212 -164 398 -11
$$ packed form
1529D71r87K86P03o36k08Q64l13p77O87L52q08K14P70o36n67Q42N0p03M82M43
1549E29r41q2R68k96o12O18P5q47M19P57o54l74P63k22o82O83L67q33M7P14n08
1570a11m41Q67O1q12L27M81o65%Q54l67p01N81K70o48K85N78p35l45Q57o6o39
1591c69M69L12p65M0P61l93m53O66K3p68L53N76n89j58O62l85n92P06L57p15Q8
1612a74N01n51j97Q19p6p87M01L84o23P1P23m56n05N88J43o38L27N19o21k07O64
1633C05j85m81N97K36q12Q4O51l94k80O13j48p00M53M78n42r8N43l73m08O47J55
1654C41o81K35M45n61j59P00j73n26M55J99o65J67O71l92m34N53l5n01M37M28
1674E04o81j48N92k27l38N42P7o97K08N46m47j92O15j93n67M51K99n56M8N62m09
$$ plain form
1695 -11 -440 126 255 -252 -1 320 -316 -355 320 156 -315 90 189 -397 -110 447 -59 -360 187 131 -383
1716 -383 46 346 -192 -212 290 -39 -335 231 279 -267 -55 260 -154 -157 390 114 -429 23 278 -190 -61
1737 -61 374 -107 -385 194 237 -275 47 292 -228 -231 306 33 -277 172 186 -377 -99 347 -121 -245 233 22
1759 22 -410 85 338 -192 -193 223 -70 -256 278 222 -318 -62 264 -170 -154 339 45 -341 105 220 -245 -10
1781 -10 365 -98 -293 197 102 -270 132 289 -258 -175 260 10 -206 198 88 -369 -30 330 -108 -198 207
1802 207 -5 -315 149 250 -250 -132 244 -132 -292 234 156 -274 26 202 -229 -118 326 45 -269 113
1822 113 136 -250 51 325 -168 -267 196 80 -210 134 206 -243 -130 307 -27 -177 205 111 -272 15 224
1843 224 -142 -101 237 -66 -331 123 185 -180 -3 199 -182 -231 238 139 -241 22 133 -235 -83 255 -70
$$ packed form
1695a1m29N66J29n07K51L21o36l9O75j64m71M05R9n86K87N57n06l01N47n6n14
1716c83M29L00n38k0N02l29k96N66M8n46K12L15m14lN47k76n43M52K55m68J29
1737f1M35m81k78N79M3n12L22K45n20lN37k73l10M49J4n63K78M46m68j24M78k11
1759B2m32M95K53n30jM16k93j86N34n6n40K56L26m34J6M93k94l86M46J15m65K35
1781a0L75m63j95M90r5l72M02J57n47Q3M35k50k16M04j10m57L39L60m38r0M05
1802B07k12l10M64J01n00J18L76l76j60N26p8m30L00J76m31J11M44k81l14L82
1822A13K3l86L01K74m93r9M63j16k90L44P2m49J13M37l34j50L82r4l83K87K09
1843B24l66M1L38l03k65M54O2l65J77K02l81m9M69r9l80K63J11l68J52L38l25
$$ plain form
1864 -70 -251 125 87 -232 54 284 -134 -138 212 4 -229 183 236 -227 -70 203 -83 -121 264 78 -298 10
1886 10 210 -121 -44 232 -101 -248 152 154 -218 -11 208 -190 -170 205 25 -229 84 143 -263 -90 260 -35
1908 -35 -169 160 11 -263 71 249 -145 -134 154 -43 -170 217 152 -231 -45 214 -75 -125 235 55 -224
1929 -224 93 195 -160 -25 258 -87 -192 138 83 -152 93 182 -203 -170 211 20 -172 100 69 -289 -29
1950 -29 229 -109 -174 111 -26 -210 83 154 -199 -84 176 -112 -181 175 139 -187 40 136 -128 -62 259 26
1972 26 -230 71 126 -151 23 216 -124 -193 149 65 -166 104 132 -139 -70 216 -29 -160 139 103 -245 -26
1994 -26 194 -123 -117 168 -42 -242 92 139 -134 -32 122 -134 -136 173 78 -200 18 143 -138 -31 226 -57
2016 -57 -168 128 104 -159 65 217 -77 -98 161 14 -154 140 157 -188 -64 161 -60 -96 168 12 -243 20
$$ packed form
1864g0j81L76l8l19K86K30m18mL50k08k33M12N3m63J57K73k86l8L85j86l76L08
1886A0K00l31P7K76l33j47M00Kl72K07K19l98K0L75j80k54L13N9m06J73L50k95
1908c5j34L29j49k74L34J78l94J1K88j97j27L87o5l83J86K59k89n0L60j80k79
1929b24L17J02l55J35K83l45j05L30n5k35K45Q9l85L3L81j91j92K72l1l58K60
1950b9K58l38o5K85j37j84K93P1l53J15K60k88o9L56l6l26K27R6k64O6L21k33
1972B6k56L01N5k77J74J93l40o9L42q4k31K70K8k71O9K86k45j31K99l6l48K19
1994b6K20l17OK85k10k00L34M7k73J02J54k56kL09r5k78K18J25k81J07K57k83
2016e7j11K96k4k63K24J52k94k1K59j47j68K94J7l45J24K25k21l6K64j56k55K63
$$ plain form
2038 20 193 -80 -54 155 -70 -221 115 104 -172 -46 144 -149 -129 148 6 -151 59 102 -173 -29 204 -23
2060 -23 -137 128 26 -174 54 205 -109 -88 139 2 -106 154 122 -140 -8 168 -33 -67 167 30 -164
2081 -164 78 109 -136 -40 141 -85 -169 112 63 -135 36 108 -159 -103 148 12 -138 50 44 -185 2 155 -94
2104 -94 -130 122 21 -162 86 132 -145 -60 149 -42 -113 147 90 -152 37 108 -100 -54 195 0 -149 50 96
2127 96 -112 14 141 -68 -122 139 46 -136 21 58 -146 -63 125 -65 -151 101 40 -164 -1 127 -79 -78 124
2150 124 -29 -149 78 121 -118 -33 99 -87 -94 171 66 -166 24 127 -86 -26 162 -1 -114 133 89 -101
2172 -101 31 168 -87 -90 110 10 -106 114 119 -156 -51 142 -2 -56 107 11 -143 49 134 -70 -74 93 -61
2195 -61 -125 88 73 -133 -17 104 -93 -86 123 31 -112 66 71 -118 -16 171 -24 -73 96 46 -81 96 134 -84
$$ packed form
2038B0J73k73K6K09k25j51L36j1k76J26J90k93K0K77j42j57K10M3k75J44K33k27
2060b3j14K65j02k00K28J51l14K1K27j37j08K60l2k62J32J76k01l4K34j37j94
2081a64K42L1k45R6J81k26q4K81m9j98J71P2k67N6K51j36j50J88ok29J87J53k49
2104i4l6K52j01j83K48M6k77Q5K09j91p1K60n7k42J89P1k08M6K49j95j49J99M6
2127I6k08J26J27k09n4K61r3j82J57L7k04Q3J88j90q6K52o1k04J63J28k06JK02
2150A24j53j20K27M3k39Q5J32j86pK65j05k32J90J03k13O0J88j63j13K47m4j90
2172a01J32J37k55lK00j00j16K20Nk75J05J93j44n4J63r6j54J92Q5k04mJ67j54
2195f1o4K13j5k06J16J21j97PK09r2j43J78Nj89J02J87j95m9J69n0j27J77L8k18
$$ plain form
2219 -84 -59 146 45 -75 114 64 -131 -4 118 -49 -78 108 -5 -140 59 69 -101 -35 119 -86 -124 87
2241 87 24 -112 34 63 -132 -64 130 8 -113 43 74 -124 11 130 -73 -101 90 26 -98 87 96 -90 -6
2264 -6 107 -11 -72 115 66 -109 32 87 -64 -19 144 -18 -127 48 67 -83 2 85 -84 -94 75 18 -123 27
2288 27 33 -130 -42 82 -33 -109 66 13 -136 -12 102 -84 -55 96 -46 -120 68 76 -108 -23 80 -49 -59 118
2312 118 35 -118 39 111 -30 1 130 -17 -103 84 83 -93 29 109 -69 -67 81 2 -99 65 60 -111 -36 83
2336 83 -51 -86 50 -36 -126 26 80 -91 -71 59 -47 -110 70 54 -85 6 73 -51 -29 120 13 -72 47 58
2360 58 -95 19 126 -29 -89 87 26 -64 60 80 -62 -64 83 -5 -84 65 23 -99 6 91 -44 -48 79 -15 -112
2385 -112 31 48 -96 -26 83 -62 -89 43 38 -104 2 42 -78 -30 110 -3 -78 66 49 -84 30 106 -50
$$ packed form
2219h4K5K05j01j20J89n0j95J27J22j67k9J86j13j35J99J0j70O6J54k05l8K11
2241H7o3j36J46K9j95O8J94j22j21J56L1j98J35J19k03k8J91o4j24J85Rj86Q4
2264fJ13j18o1J87m9j75J41N5j51M5J63j62j09J75J9j50Q5Q3j69j0J69n7j41J50
2288B7Oj63Q8J24j15p6J75n3j49J24J14j86K9J51j42p4J88Qj84Q5J03j29j0J77
2312A18q3j53J57P2j41L1J29j47q6J87jj76J22Q0j78KJ48p9j01J64nj71P5J19
2336H3j34l5J36q6r0J52N4j71K0J30j06o3J80j6j39R1O7j24K2J49j07q5J19J1
2360E8j53J14J07j55o0J76o1r0J24K0j42kJ47q8p9J49m2j22J05Q5j35mJ27r4r7
2385a12J43J7j44P0J09j45k7J32nj42J06M0j20M8J40j13p5J44j7j33J14P6j56
$$ plain form
2408 -50 -44 82 19 -66 51 71 -66 -2 95 -29 -53 77 51 -97 14 58 -49 -39 87 -47 -82 53 54 -81 -23
2433 -23 74 -92 -72 98 12 -115 6 22 -94 -34 65 -24 -49 57 47 -87 32 78 -49 -34 79 14 -72 76 78
2458 78 -62 -6 81 -14 -1 79 35 -68 34 85 -47 -13 63 -13 -72 80 23 -69 -13 61 -76 -51 46 -23 -77 6 1 -88
2486 -88 -43 79 -57 -58 39 -22 -92 17 71 -89 -29 60 -7 -53 59 65 -75 10 78 -37 -20 85 27 -71 53 48 -62
2513 -62 8 98 3 -48 77 47 -33 44 48 -69 -56 57 -29 -60 42 -7 -73 -5 48 -54 -62 41 8 -75 19 47 -79 -37
2541 -37 49 -51 -65 50 19 -48 2 33 -46 -8 103 -25 -67 42 47 -60 38 72 -37 -49 79 3 -49 67 50 -67
2567 -67 6 55 -25 -58 59 10 -78 13 40 -58 -24 51 -34 -72 27 33 -75 -32 39 -58 -42 43 9 -60 14 47 -58 -15 75
2596 75 9 -13 41 34 -44 37 90 -28 -6 40 9 -34 61 37 -51 5 61 -21 -20 58 9 -58 49 33 -39 -5 34 -30 -65 35
$$ packed form
2408e0OJ26o3q5J17K0j37O4R7j24k4J30k6j48J11M4j07J0J26j34l5J35Jj35N8
2433b3R7j66K0J70q6j27J21J6j16O0R9q9k5J06j0j34J19M6j27J5J13o5q6J48K
2458G8j40N6Q7r5J3Q0m4j03J02N1j32L4P6p6n9J52n7r2N6P4j37K5R7o9n4Q3nq9
2486h8M5J22j36jR7o1p0J09N4j60O0Q9o7m6J12Oj40Q5O8j15J7J05n8r8J24nj10
2513f2P0R0r5n1J25l0q0P7Mj17J3J13q6l1J02m9o6O8N3j02qJ03l3q3R4K8j26M2
2541c7Q6j00j4J15l1o7N0L1p9L8J11j28m2J09Nj07R8L4j09j2J28p6n2J16j7j17
2567f7P3M9q0l3J17m9q8R1K7r8L4P5q5l8R9Oj08M3P1r7J6Q5l4o9P4L3j05M3R0
2596G5o6k2N4pp8Q1N3j18K2M6l1m3R5k4q8N6N6q2JP8m9o7J07j6p2L4L9o4l5J00
$$ plain form
2626 35 1 -58 8 38 -62 -44 56 -20 -58 3 12 -61 -17 41 -33 -55 26 -1 -49 56 65 -36 -20 81 -24 -41 59 21
2654 21 -40 33 48 -9 -14 70 -6 -56 31 13 -33 8 52 -54 -53 45 14 -65 24 22 -78 -10 46 -24 -60 0 -5 -83 -6 32 -50
2685 -50 -27 30 -15 -56 26 33 -50 9 55 -34 -22 58 21 -44 0 31 -27 -4 55 -13 -46 33 55 -18 3 46 -22 -1 39 -7 -19
2716 -19 32 27 -42 -18 12 -37 -60 11 -16 -80 -28 -4 -42 -55 14 -42 -68 1 13 -62 -10 34 -35 -30 45 6 -33 19 14 -28 6 61
2748 61 8 14 57 39 -37 23 61 -21 -17 45 -5 10 45 44 -31 7 59 -22 -9 46 -20 -44 14 37 -34 -20 28 -37 -44 25 8 -26
2780 -26 8 39 -49 -28 50 -2 -25 37 18 -37 22 53 -16 12 56 15 -14 34 34 -34 1 54 -4 2 35 44 -13 19 43 -23 -21 54
2812 54 -4 -38 30 12 -27 -33 24 -14 -34 10 -16 -51 -5 2 -76 -26 34 -3 -20 24 8 -34 -1 34 -64 -11 41 29 -40 40 38 -14
2844 -14 40 46 6 -4 64 37 -28 38 67 -28 12 51 -18 -34 33 12 -30 11 22 -27 -9 16 -22 -37 -18 13 -72 -37 -9 -44 -47
$$ packed form
2626C5l4n9O6L0j00J8J00p6l8O1Rp3M4N8p4k2Q1k7m8J05Rj01J6J01j05j7J00l8
2654B1o1P3J5n7nQ4p6n0Q7j8m6M1M4j06JR8l1p9Q9kj00O8N6p0l6O0np8P7L8q2
2685e0K3N7m5m1Q2Pq3N9M6q9J2Q0l7o5M4L1n8K3N9o8l3P9K2p3K1M3o8K1M0m6j2
2716a9N1no9K4L0m9k3P1k7o4N2K4l8j3O9n6k6O9J2p5N2M4o9NP5l9l9N2nm2L4N5
2748F1n3OM3j8p6O0L8q2MO2n0J5L5jp5L8N2q1J3N5o6k4N8K3p1J4M8o5pO9j7l4
2780b6L4L1q8K1P8n2k3O2j9n5N9L1o9K8M4m1k9M8%o8L5N3n8OL3Rn7L2K4o6KP5
2812E4n8l4O8j8l9oN7l8k0M4k6l5M6Pp8N0O0l7j7M4j6m2L3L5r8N3N2j2o9Q0kn2
2844a4N4Om0j0O8k7o5O6K9r5M0L9o9j6O7k1m2M1J1m9J8K5l8j5J9L1q5L5K8l5l
$$ plain form
2875 -47 16 -20 -64 2 15 -32 -4 23 -11 -13 40 7 -36 12 21 -33 -8 26 20 -17 23 31 -10 21 38 5 7 47 16 -20 35 20 -16
2908 -16 -20 33 16 -17 33 11 -46 -20 32 -49 -35 14 -24 -42 18 14 -48 -2 16 -18 -44 6 -1 -31 5 39 -27 -15 32 6 -34 36
2940 36 29 -33 30 48 4 -25 37 12 -19 38 33 -37 5 55 4 -15 30 35 -32 7 6 -34 -8 27 -25 -55 16 4 -25 -8 22 -40
2972 -40 -29 30 12 -43 19 4 -9 6 35 6 -22 23 13 -26 24 42 -15 -3 43 11 -5 36 29 7 10 45 3 -16 46 12 -28
3003 -28 26 40 -9 -2 48 -22 -31 14 22 -17 8 1 -30 -18 0 -9 -47 -4 -8 -28 -19 9 -9 -26 7 -6 -18 8 14 -21 -15 30 -10 -15 26
3038 26 14 -37 8 34 -5 5 48 8 3 36 16 -38 -1 39 13 -21 5 -3 -20 -16 13 -37 -14 4 -22 -42 -18 -25 -40 6 20 -24
3070 -24 -21 -9 -15 -45 0 6 -18 -12 27 -11 -13 27 -4 -12 -4 33 -12 -10 37 6 -18 59 4 -8 13 33 -24 -1 44 33 -10 17 8 -29 -8
3105 -8 26 1 -21 23 -8 -30 12 -27 -19 -2 5 -24 -28 2 -13 -20 -34 1 -31 -5 13 1 -19 -4 -3 -30 13 17 -28 -18 27 19 2 23
$$ packed form
2875d7O3l6m4O6J3m7K8K7l4kN3l3m3M8Rn4K5L4ol7M0Qm1L1J7l3KM0l1l6N5j5l6
2908a6mN3j7l3N0k2n7K6N2q1J4M9l8j8O0mo2M6J8l4k6N0pl0L6L4o6J2M7k6m0P0
2940C6po2O3J8m4k9O2k5l1N7np0M2N0n1j9M5No7L9jm0K6L5n2l0P1j2k9J7L0o2
2972d0J1N9j8n5O2j5j3J5K9k9k8M5j0l9N0J8n7J2M6l2j6M1pk2LL5m2j9O2l4m0
3003b8N4J4m9PN0p0rM5Ql9K5pl1J2J8rl8M3mk0RK8j8j7L3j3j2K6Ol5OM5m0nM1
3038B6j2n1M5K6l9J0M3m0nL3k0n4L7M0k6l4K6qj7MK9n0K3J8k6k0K4pj5M6J4m4
3070b4LJ2ol0M5Ok4OL9l8kM0l1qQL7m5KM7l1k4P7n5j2K1K0n7K3M5j1m3K7rl7K1
3105hL4k5k2M4l1k2M2l9QJ7Pk9mL0j5pj4L5l2K6J8j2k0J5Jk7M3Mm5J0M5qj7K1
$$ plain form
3139 23 23 0 -3 41 13 -17 37 23 -18 5 10 -20 -13 10 3 -7 2 10 -7 -20 -2 -21 -24 1 -4 -43 -21 1 -43 -4 11 -10 -31 8 0
3174 0 -24 3 9 -33 -7 15 -2 -10 25 30 1 2 41 31 -1 53 10 -21 32 45 20 14 19 3 7 -8 12 -32 -19 29 -35 -19 1 6 -11
3209 -11 -21 3 -58 -44 -2 2 -29 1 2 -34 -11 6 -15 -16 9 -12 -18 7 -14 -28 -1 18 10 -13 31 12 7 15 28 7 19 26 -8 -4 25
3244 25 18 -33 4 17 6 -14 21 7 -26 -22 -3 -32 -21 -11 -42 -31 -15 -24 -32 5 -30 -26 -34 -11 -32 -9 15 -12 -39 4 -9 -19 1
3277 1 27 6 -11 -7 11 -23 9 15 -14 -25 15 13 -9 8 35 -12 -16 5 -1 -5 21 26 -15 0 3 -42 -24 3 -35 -36 -12 9 -42 -49 -8 -30
3313 -30 -36 -22 3 -4 -1 3 -43 10 14 -2 1 18 5 -14 8 22 8 -3 26 16 -18 42 35 -10 6 27 7 -1 31 25 -8 -17 8 -12 5
3348 5 -12 -13 -23 3 21 -10 -9 7 2 -23 -21 -30 -15 5 -2 -24 -15 13 -11 -23 -4 -1 -18 26 18 -5 4 30 9 -17 32 14 -14 7 48 -9
3384 -9 2 40 -4 -2 24 18 1 21 13 10 -14 33 -1 -20 -1 -9 -19 1 8 -30 -19 -4 -2 -24 -19 -8 -29 -9 16 -11 -24 15 -4 -10 -15 7
$$ packed form
3139B3%k3lM4k8l0N4j4m1K3Nl0PK3pj0RQj7j3J8j9lK5nl9K2K2m4L9J5k1k1L9q
3174@k4K7Om2K6K2j7qL5Nk9JL9j0l2N4m3l1N3J3k5oNj6Mj5K0m4J3M8o4J6K0Nj7
3209a1j0K4o1J4M2Ml1L0Jl6K3J7k1jK5k1oK5k1j4K7J9qk3M4j9nQJ3k1J2Pl4MK9
3244B5pn1L7J3j1k0L5j4l3MJ9k9J1J0l1J1J6rqL7l5MqK3k1K3K4k7k7M3j3j0K0
3277AK6k1j7MJ8l4L2Ok9j1M0kk2J7K7m7mK1omK6Nm1J5Lm5J8K7l8jK4K1n1pM1k2
3313c0oJ4K5pLMm6N3Mj6LJ7j3j9K2J4j4j1K9j0l4O0pm5J6K1k0qL2ol3rK5k0J7
3348Ej7jj0K6J8l1JJ6nk5KrJ5K0pk2RK8k4j2J9Lj7M4qk3RK6k1k6M9j8k8K1M1n7
3384iJ1L8m4KK6oj7K0qlk4M7l4j9J9qj0K0Pl8J1J5Kk2NJ1k1K0K5k7j3L9j9onK2
$$ plain form
3420 7 1 -12 35 26 9 2 18 5 10 23 0 -1 41 4 -5 -2 30 -8 -5 19 4 -27 -4 12 -15 10 -3 -12 -22 -15 -28 -22 -13 -4 -22 -22 -17 -26 -19
3459 -19 15 10 -34 -11 -11 -35 -8 12 -5 -22 2 22 -19 16 26 31 2 31 34 10 2 25 8 8 27 4 -3 11 19 -3 -9 0 2 -4 4 -1 -29
3496 -29 -1 -10 -22 -18 10 -16 -48 -21 -1 -10 -4 -12 -36 -34 1 -33 -7 -4 -18 -18 -7 3 2 -31 25 16 -4 9 1 2 -19 19 12 23 20 21 -22 -20
3534 -20 5 -21 -12 1 -1 -21 -25 -8 -42 -13 -5 -32 -44 1 -24 -41 -9 -11 -46 -25 -20 -27 -58 1 -9 -22 -13 2 -21 -27 -6 6 -6 -11 4
3569 4 -31 17 20 5 -12 31 28 -1 -5 29 7 -14 17 1 2 27 2 -2 9 15 4 -16 -3 3 -28 -3 12 -26 -3 -8 -25 -33 -12 -17 -41 -10
3605 -10 -19 -54 -19 -4 -17 -43 -11 -24 -34 1 -18 -28 -35 10 -5 -12 22 21 10 19 13 14 -13 4 5 -24 16 14 12 -14 18 2 -27 9 -6
3640 -6 -23 -13 -6 -15 -25 6 -48 -49 -4 -24 -31 -38 -24 -44 -25 -9 -12 -43 -12 11 -42 -14 13 -30 -22 -2 20 -43 6 25 12 9 10 4 -15 -3
3676 -3 4 -11 6 14 -19 -46 14 -18 -19 -14 -15 -25 -31 -20 -26 -22 -39 -28 -35 -32 -4 -37 -37 -43 -26 -21 -24 -21 -32 -19 -7 -28 -20 3 14 -29 -22 7 -17
$$ packed form
3420Goj3M7rj7pJ6j3NJ3k3jM2l7rLL2l8LK4j5l1K3J6k7K5j3rj0Pj3ORRj8%NrP
3459a9L4nm4K3%k4K7K0j7j7K4K0m1L5J0Nk9K9Lk4qK3j7%J9k3pJ4Qk2oRKoQnk8
3496b9K8rj2MK8k6l2K7K0rOqk4KL5l4K6Lj4%J1J0jl3N6rk0J3qJk1L8pJ1lJm3K
3534b0K5k6RJ3kk0mJ7l4K9Qk7j2M5k5j7L2kl5K1Npl1N9j0j3RJ5k3oK1J2j2nJ5
3569Dl5M8Lj5j7M3lk9mL4k2k1L1j6JK5k5mJ1Oj1k0J3Ol1K5J5l8K3nj7qK1nk4L1
3605a0rl5L5J5j3k6L2j3j0L5j9j0pM5j5pL4jj1RoJk7J7Jk9M0kkk6L2j6k9L6j5
3640fj7J0Prj0L1n4jM5k0ppJ4k0J9J6ll1L1K3n3K8K7m3QK0K2o3M9J9j3lJoj9J2
3676cPj5J7Ql3k7O0l2jNjj0oJ1oMj7J1pLK8l3%oJ7NlLj1J3J2k1QK3J1m3PK9k4
$$ plain form
3715 -17 3 15 -7 -10 -2 -9 -16 9 23 -16 -1 13 6 -32 -5 1 -14 -19 9 -2 -14 -2 0 -24 -10 -11 -23 -11 -25 -15 -60 -32 -13 -46 -39
3750 -39 -16 -10 -1 -2 -19 -63 -4 -9 -21 6 2 -8 -14 11 -1 -22 -8 -1 -14 0 8 -6 -18 3 -20 -16 -1 23 5 -5 2 -20 -43 -4 -21
3785 -21 -16 -36 -1 -18 -19 -1 -27 -50 -23 -13 -44 -39 2 -17 -50 -32 -12 -26 -12 10 -19 -23 -14 21 -30 -5 -4 -22 18 3 3 -7 10 25
3819 25 0 -2 36 0 3 49 13 19 22 15 -26 3 30 -22 -6 0 -5 -17 -14 -11 -23 -11 -16 -28 -6 -30 -20 -27 -31 -7 -15 -24 -14 -37 -43 -14 -9 -29
3857 -29 22 25 -1 -14 18 11 2 -5 16 -8 -1 39 15 2 29 10 5 22 22 -14 -10 10 26 -18 -29 -9 -19 -3 2 -12 -33 -6 -23 -25 -23 -12
3893 -12 -37 -48 -26 -11 -32 -13 -14 -40 -29 18 -2 -25 14 5 15 2 22 -21 5 -5 0 -14 -1 15 0 -1 34 -11 5 48 27 -14
3925 -14 10 7 -9 2 -20 -5 -20 -14 -13 -30 -14 -13 -46 -14 -22 -31 -33 -13 -46 -60 -33 -9 -23 -32 -4 -14 -18 -9 1 -15 10 29 -4 -14 2
3960 2 14 -9 22 11 -3 -7 41 -16 -10 15 35 -2 1 36 -27 -29 34 34 0 -13 -27 -13 -10 -11 -20 -30 0 -1 -9 -10 -7 -27 -15 -14 -8 -11 -20 -6 -14
$$ packed form
3715a7K0J2k2lQppK5J4l9J5J4pl8K7Oj5nK8j1j2J2Kk4J4jj2J2j4J0m5K8J9l3P
3750c9K3ORjj7m4N9nj2K7mj0oK5j2k1J4Pj3J4Qj4j2K1k3MJ5K4j8j0Pk2k3L9j7
3785b1Nk0L5j7jJ8k6k3K7J0l1NM1j9l3J8K0j4J4K2k9mRL5n1K5Jj8M0j5%j0J7J5
3819B5k5kL8l6LM6l6OLpm1K9K7n2J6Onj2LLj2J2nj2K2k4J0pmK4qrJ0k3oK9Nk0
3857b9N1Lk6j3L2prpK1k4PM0k4j3K7j9nJ7%l6MK0J6m4j1K0j0J6Nj4k1K7j7kKJ1
3893a2k5j1K2J5k1J9jk6J1M7k0k3L9rJ0j3K0m3K6j0Nj4J3J6j5jL5m5J6M3k1m1
3925a4K4lj6J1k2J5j5OJj7J6Jl3L2qrkK0l3j4K7K4j4rK8j0mRJ0j6K5J9l3j0J6
3960BJ2k3L1j1j4mM8n7OK5K0l7LL5o3kO3%l4j3j4J4Ljrj0L0jqjLk0J2JOlrJ4q
$$ plain form
3999 -14 -23 20 6 -27 6 3 5 6 27 1 4 6 -5 8 2 18 12 1 9 -12 13 28 0 -24 0 -14 -31 -15 -12 -41 -21 -17 -24 -35 -40 -25 -38
4036 -38 -40 -11 -20 -31 -30 -6 -19 -25 -8 -28 -16 7 -18 -6 -14 -10 -20 0 -3 -40 -1 17 6 -20 5 15 -3 -18 24 9 -4 11 1 -21
4070 -21 3 -10 -18 7 7 -12 -18 -13 -6 -37 -15 -6 -26 -14 -22 -7 -26 -41 -22 -51 -12 19 -13 6 -5 -27 -52 -27 -28 -35 -31 27 -15 -21 -5 15
4106 15 -5 -13 6 19 -1 -14 6 -11 13 13 -20 -11 21 -4 -34 9 8 4 -10 -6 -37 -28 -22 -24 -29 -30 8 -58 -35 -16 4 -17 -7 -20 -36 -19
4142 -19 1 -17 -30 0 -29 -11 4 -14 -17 9 12 -1 0 27 20 6 13 12 9 20 7 -6 -8 -11 36 -10 3 2 7 1 6 -12 -28 1 -20 -29 -23 -8
4180 -8 -26 -26 -19 -17 -28 -23 1 -38 -17 -21 -5 -10 -7 6 -38 -13 -5 -6 -23 19 5 -12 -19 17 -10 8 17 -8 13 21 37 -10 16 -10 6 -17 -13
4217 -13 7 -11 -10 -24 -28 -12 -18 -27 -27 -12 -30 -46 -13 -4 -42 -21 -22 -29 -22 -20 4 -32 3 4 -22 1 -6 1 -15 0 -1 -2 7 7 7 -16 44 21 -11
4256 -11 18 8 0 10 21 -9 -6 15 9 -10 -10 12 -36 -12 11 -24 -27 -4 -1 -16 -33 -56 -24 -39 -21 -41 -23 -24 -12 -18 -43 8 -37 -24
$$ packed form
3999a4rM3j4l3L3lKJK1k6LKj1J3oJ6oj1Qk1K5J5k8k4K4j4j7J6Lk9K0Mpj1nJ5j3
4036c8kK9rj1JK4j3oJ7k0J2K3k5J2qMj0K0ll7L9J8j1k6K5J0j8j5M2j5j3J5j0k2
4070b1K4j3qK5%j9oNPl1K2Rk0J2qJ5j9j5J9k9L9L1l2J9j1k2k5K5jpMN8m2oJ6K0
4106A5k0qJ9J3k0j3K0j7K4%l3RL2k5l0M3jmj4Ml1ROknjL8o6K3J9K0k1J0j3j6J7
4142a9K0j8j3L0k9J8J5j8lK6Lj3JK7pj4PjlJ1j3j3klM7m6J3jNoNj8j6K9k1rOJ5
4180hj8%PKj1NK4l9K1mJ6nLJ3m4K5Qjj7M2j4j7pL6k7J8Rk5K1QJ6m7K6k6J6k3M
4217a3K0j8Jj4mJ6or%J5j8j6L3Rl8K1jpPKK4l6L5Jk6K3pPj6J5jjR%%k3O0k3l2
4256a1K9j0qJ0J1l0LK1oj9%K2m8K4K3l5lK3Lj5j7k3L2j5J8k0J8jJ2ok5N1m5J3
$$ plain form
4290 -24 -16 -20 -20 9 0 -41 -23 20 -8 -19 5 34 18 7 20 3 -20 -2 12 -16 28 -10 -40 -5 8 7 -19 11 -8 -3 -3 -10 1 -16
4324 -16 -10 -30 -27 -25 -20 -54 -39 -12 -20 -27 3 -42 -19 -14 -6 -14 -23 -2 -23 1 10 8 -7 15 1 -16 0 20 3 -16 17 16 2 14 6 9 -14 6
4362 6 -16 -11 4 -7 -6 -17 1 -16 -39 -26 -21 -20 -29 -19 -36 -31 -13 -21 -26 -13 -11 -24 -4 -5 -26 -16 -5 -19 -33 -2 -1 -1 -18 2 -3 2 -6 1 -19
4401 -19 8 44 -21 24 5 9 5 21 4 7 3 15 0 -1 -2 -21 -30 -29 -24 -24 0 -4 -17 -33 -15 -25 -16 -13 6 -38 -34 -13 -32 -28 3 -7 -27 -28
4439 -28 10 9 -14 -11 8 -3 5 22 -4 -10 22 -8 -7 9 30 -2 -6 6 -5 5 -1 12 -1 -1 -11 -13 -6 -8 1 -8 1 3 -39 -18 -25 -41 -13 2
4477 2 -10 -25 -29 -18 -45 -23 -11 -14 -1 4 -6 -16 -7 -7 -14 -10 18 -11 6 15 12 -2 15 26 0 -9 34 -1 -4 33 10 1 6 10 -2 -25 -6 -20
4515 -20 -19 -23 -28 -36 -34 -10 -29 -11 -30 -34 -36 -18 16 -36 -12 -4 -8 -31 13 -9 -2 4 21 -14 -14 10 -15 2 11 4 7 -17 -3 -14 -20 3 -11 -17 12
4554 12 1 -6 -14 12 11 -25 6 -17 -9 -35 -1 -4 -22 0 -14 8 6 -10 -27 -35 0 -24 -26 -15 -23 -48 -38 -17 -32 -22 -8 -1 -8 -6 3 -12 -20
$$ packed form
4290b4Qm%K9rm1J8M3k8j1K4K9j6j1J3j7k3J8J4k8M4l8l0L5J3jk6L0j9N%pJ1j7
4324a6Ok0LKNl4J5K7qpL0m5K3NQqrK1k1K4Rkj5K2j4j7J6K0j7j9L3jj4J2qLk3K0
4362Fk2NJ5j1Jj1J8j7k3J3NJrJ0j7NJ8qnJ3Kj3K0jk1J0J1j4j4L1J%j7K0nNqPk0
4401a9K7L6o5M5j9MmJ6j7LmJ2j5jjj9rJN%K4mj3j6J8j0RLJ9m4MK1j9ML1j0k0j
4439b8L8jk3LJ9j1QJ7k6oL2l0JJ6K1l2mJ2j1J0oJ3j3%j0kPkRrRKm2K1pj6K8J5
4477Bj2j5mJ1k7K2J2lJ3Nj0j0R%pMK8k9J7Rlj4J7J1k6rM3l5lL7k3rNMj2k3J9j4
4515b0JmnqKK4j9J8j9mkJ8L4n2K4Qmk3M4k2POJ7l5%K4k5J7RpLk4J4j1oK3j4oK9
4554A2j1pqK6jl6L1k3Qk6L4lj8K2j4K2kj6j7qL5k4kJ1qk5J0K1j5J0J4PpKRj5q
$$ plain form
4591 -20 17 -6 -2 18 17 2 30 9 11 -8 18 13 -21 9 22 -7 -4 -6 -27 -25 -3 4 -13 4 -14 -58 -6 -16 -5 0 -28 -12 -10 -22 0
4626 0 -15 -23 -40 -36 -24 -14 -21 -10 -10 5 -17 -16 -3 -20 2 3 22 -19 -8 16 14 -11 10 21 21 20 -9 10 -11 2 -9 -38 0 -33 -28 -14
4662 -14 -16 -10 -9 1 -15 -24 -15 -17 -32 -39 -8 -21 -44 -2 -22 -40 -23 -13 -23 -2 -25 -12 -10 -7 -2 -5 -9 3 6 -19 -1 -5 -1 13 5 -11 18 1
4700 1 -18 -5 15 -13 3 10 0 -22 -25 -6 -23 -27 -3 10 -32 -31 -20 -46 -17 -21 -8 -36 -21 5 -14 -13 -12 -8 -31 -20 11 -18 7 12 -2
4735 -2 5 15 24 2 17 2 -10 14 30 4 1 22 19 -2 -2 13 8 -1 30 7 13 6 -2 -27 2 -16 -34 -28 -15 -14 -33 -47 -24 -25 -22 -13 -35 -26 -21
4774 -21 -35 -21 -14 6 -1 6 7 14 0 8 7 -6 6 2 0 -4 11 18 8 11 27 9 0 25 -2 16 24 1 -7 2 -22 -5 -23 -12 -3 -21 -8 8 -39
4813 -39 -6 -9 -20 -36 -7 -1 -8 -21 -1 -20 -26 -22 4 -5 0 13 -16 23 23 12 -16 32 -3 0 1 -23 -21 21 30 -12 2 18 5 -31 0 11
4849 11 -10 -26 -1 -14 -14 20 3 -35 -19 -25 -27 -45 -14 -19 -35 -17 -14 -18 -22 -14 -13 -10 -16 -13 -23 -23 -9 -10 -7 -6 21 27 16 24 -8 -3 13 10 -20 -9
$$ packed form
4591b0L7k3MK0jj5K8k1Kj9K6nl4L0J3k9Lkk1KK2Pj7J7j8m4N2j0J1Nk8J6Kj2K2
4626@j5qj7MJ2J0pJ1%J5k2JJ3j7K2JJ9m1J1K4kk5K1J1%jk9J9k1J3j1k9L8l3NJ4
4662a4kOJJ0j6rRkj5pL1j3k3M2k0j8J7J0j0K1k3J3KLNlmJ2Lk5J8mMJ4qj6K9j7
4700Aj9J3K0k8J6Pj0k2lJ9j7mK4J3m2JJ1k6K9mJ3k8J5K6j9JJMk3J1L1k9K5Nj4
4735bPJ0Rk2J5j5j2K4J6k6lK1lk1%J5nrL1k3Opqk5K9j8j8OJ3Jj9j4K3jLRk2RN
4774b1j4J4PK0pPJPj4Qjj3J2mkmJ5Pj0LJ6j8rK5k7J8Qk3qRk4J7j8J1Rj8J3J6m7
4813c9L3lj1j6K9Opj3K0j9oMK6rNJ3k9L9%j1k8M8l5LJk4KM2Rm2J4J6j3l6L1J1
4849A1k1j6K5j3%L4j7l8J6okj8L1nj6J8LmmQJLoLj0%J4jLJK7Oj1Ql2NJ6ll0J1
$$ plain form
4889 -9 -2 2 15 15 1 -4 21 -14 -14 -4 5 -14 -10 -3 -27 -38 -14 -37 -19 -28 -18 -25 -28 -30 -40 -20 0 -30 -24 -5 -6 -20 -15 -22 -37 -10 -5 8 1 -2
4929 -2 16 3 -15 -10 8 -23 -2 6 -4 -5 -9 4 6 4 6 -6 -11 7 2 -7 -4 -7 -9 -34 -13 -22 -18 -14 -53 -35 -15 -31 -39 -20 -11 -46 -28 2 -25 -6
4969 -6 -26 -2 3 -27 16 -8 -17 5 -1 0 17 -9 -7 -17 3 -1 -41 7 1 -3 28 16 -13 -10 -6 -21 -5 -15 -12 -12 -21 -17 -38 -13 -3 -11 -21 -51
5007 -51 -14 -18 -36 -14 -38 -2 -25 -27 -23 -20 7 -32 -9 -12 -23 -41 -21 -12 -17 4 -16 -13 -7 12 -4 8 -1 5 10 -2 2 14 -12 -15 -3 -1 1 -9
5045 -9 1 -13 -2 -15 -21 -17 -28 -17 -7 -11 -31 -42 -1 -18 -33 -42 -10 -34 -9 -6 -12 -9 -14 4 -19 -8 11 -7 -22 -24 -18 1 6 9 -3 16 15
5082 15 -6 10 2 6 1 10 2 3 -5 -1 6 -13 -6 -4 -18 -14 -10 -34 4 -9 -21 -30 -42 -38 -25 -41 -5 -26 -16 0 -6 -8 -24 2 -10 -2 -6 2 -31 4
5122 4 -15 -12 2 0 -9 4 2 19 -4 9 23 -3 -6 15 9 -2 3 9 20 -8 -5 -15 -20 11 8 -12 -9 -21 -16 -37 1 -28 -31 -8 -18 -27 -23 -19 -12 -25
5162 -25 7 -16 -15 7 6 -7 -10 16 -9 4 10 -7 28 8 10 21 -12 16 13 24 18 29 12 9 -2 23 -17 3 -2 -33 -4 -12 -14 -16 -26 -17 3
$$ packed form
4889iPMJ3%j4nK5l5%J0Rj9MPk4j1K4k3J8rJ0plkj0K0K0l0OJ9jj4Npj5K7NJ3pl
4929bJ8j3j8NJ8l1K1Qj0jmJ3KkKj2nJ8nrLlkk5K1rMMl9J8K0j6qJ9Rl5J8L0k7J9
4969fk0K4Nl0M3k4rK2oJJ7k6Kj0K0mm0M8omL1j2k9LMj5J6j0L%rMk1K5J0qj0l0
5007e1L7mj8K2k4L6k3kMLK7l9K3lj1j8K0RnK1k0LOJ9j6J2rONj2MJ2k6lJ2KKj0
5045iJ0j4J1j3oMj1J1J0mk0j1M1j7j5rL2k4K5LoLnJ8k3J1J9j8j5kOJ9NLj2J9j
5082A5k1J6qMnRqJqMPj9PKj4MMk4L8j3j2rj2MJ3j6L6k1J0J6okj6K6j2QmQl3L5
5122Dj9LJ4krJ3kJ7k3J3J4k6lK1oj1NOJ1k8Lj0nL1lk0Lj2Nk1L8k9lK3j0rMMPj3
5162b5L2k3JK2jj3lK6k5J3Oj7L5k0KJ1l3K8lJ1oJ1j7lj1K5m0K0nl1K9qkkj0RK0
$$ plain form
5199 3 -25 -19 -34 -14 -28 -20 -26 -15 -15 -9 -21 -17 -10 -3 -10 -37 -3 -4 -7 1 -10 16 7 -12 16 -28 6 5 12 19 21 4 18 14 11 18 2 11 21 4 -4 -2
5241 -2 -18 -9 -8 0 -15 6 -4 2 -32 -28 -10 -5 -11 -8 -5 -12 -10 -13 -14 1 -10 -30 -21 4 7 14 20 -1 15 10 10 -5 -6 32 13 7 -2 17 8 -9 -18 1 16
5284 16 14 0 -9 -11 -7 -19 -12 -21 -14 -14 -22 -18 -11 -14 -28 -23 -19 -8 -10 -22 -26 -20 -18 -9 -5 -41 -11 -6 0 3 -9 7 7 13 4 -8 4 19 18 20 22 36 11 32 15
5329 15 5 8 -3 9 -11 9 -8 -3 -19 5 -5 3 8 0 -10 -19 -27 -20 -24 2 -31 -18 -17 -24 -15 -32 -7 -21 -16 -23 -8 -9 -13 -12 4 6 6 5 -2 11 -22
5370 -22 -16 1 13 -8 1 -3 2 10 -5 18 9 -10 -5 -13 -4 5 4 3 -12 -15 -12 -16 -5 -3 -4 -7 -14 -14 -21 -17 -16 -41 -8 -22 15 13 -15 5 23 3 -24 -24 2
5413 2 1 2 -6 -1 -14 1 22 16 5 29 6 12 15 -5 6 1 6 5 6 9 1 -15 -1 -29 -49 -25 16 -22 -2 -26 -14 -34 -35 -11 -42 -19 -13 13
5451 13 -19 -3 -16 -21 -33 -17 -16 1 -8 -16 -8 -7 12 13 11 5 8 15 7 0 22 9 20 -10 1 2 2 7 -5 -7 3 4 -14 -8 -25 -32 0 -35 -42 -31 -22
5492 -22 -5 -24 -21 -33 -11 -4 -15 -15 -32 -13 -12 -14 -17 -18 9 -20 -24 -9 11 -31 9 -22 8 0 3 9 0 8 6 16 9 0 0 19 -3 8 27 -3 1
$$ packed form
5199Ck8Oj5K0j4QoJ1%Oj2MPPpk7L4jlQj1K6rj9K8m4L4jPPKj7J4mlPj6RJ0j7qK
5241bj6RJQj5K1j0Ol4MJ8NoLLpKljJ5j1k0RK5LPOk1J6n%j5jL8j9orJ9rj7rJ9J5
5284A6kj4rkMj2PrP%qMPlj4NMJ1kj2mOKRMl6L0NOLj2J6%Orj2J2J5jKKJ4k5K1j7
5329A5j0Lj1J2k0K0j7Nj6K4j0QNqj0rqPmK6l3J3JpRj7K5j4NpJ5jmJJ6K%jpJ3l3
5370b2OJ7J2k1RmNQj5K3rj9NqRRjjj5lLmJ1Kjlp%pMJk5L3j4L7kk8K0J8k0k7%K6
5413BjJqNj3J5K1oj1K4k3OLk0J1nNjJLqj6J4k8k0K4M1l8K0k4J2k0jK4l1K3OK6
5451A3l2J6j3nj2J6JJ7rqQJJ9JkoLPqpK2j3J1l0J1J%Nj2kJ0Jj8Oj7pL2l5pJ1R
5492b2J7j9Lj2K2Pj1%j7J9JkljK7k9mJ5K0m2M0l1L0qLOrQkJ0pr%J9k2J1J9l0M
$$ plain form
5531 1 -8 -13 -15 -21 0 20 -25 -20 -28 -34 -11 -15 -27 -32 -14 -13 -4 -20 -39 -1 -28 -12 -1 -4 -2 -23 -17 -13 14 18 20 -6 11 8 -9 27 -14 5 12 12 23
5572 23 30 2 21 9 7 12 -8 -16 11 -8 -10 3 -1 -20 17 -1 -15 7 -14 6 -12 -19 -1 -22 -17 -7 -19 -14 -10 -30 -18 -26 -15 11 -1 1
5608 1 -6 -2 11 0 -5 5 -12 -2 -15 1 15 -4 1 15 26 -6 1 5 -9 -8 -6 -13 -13 -13 -25 -40 -28 -23 -40 -35 -17 -15 -9 -5 -6 -11 -14 -28 -14 -10 -16
5649 -16 -2 -11 -1 -11 8 -12 19 11 2 4 21 0 4 7 2 -6 3 15 -10 -3 11 -13 -1 -4 -20 0 4 2 -10 -11 -13 -6 -16 -19 -23 -2 -16 -22 -30 -19
5689 -19 -41 -26 -2 -26 -20 -24 5 -21 0 -3 -16 -13 -12 -2 -9 5 -15 7 -3 1 12 -7 -4 -4 -2 -5 14 31 1 -2 0 -3 14 -8 -5 15 0 5
5727 5 0 -7 -2 -6 1 17 -11 -16 -8 -17 -20 -20 -14 -11 -30 -14 -12 -19 -9 -20 -3 -18 13 -5 -27 9 -6 14 12 -3 9 15 5 1 8 9 3 -11 1 13 -12
5768 -12 -11 -27 5 -9 -17 2 -9 -22 -9 -6 -20 -11 -33 -24 -32 -12 -5 -22 -22 -18 -12 -23 -24 -28 -36 -26 -10 -25 5 -21 -35 -26 -12 -5 3 7 -1 -13 -7 -8
5808 -8 23 -9 2 -18 -4 -4 -17 -9 -5 -15 3 5 -6 1 -25 -7 6 -5 -22 -3 -5 -10 -19 -15 -18 -12 -32 -46 -19 -15 -21 2 -1 -12 -31 -4 -18 -9
$$ packed form
5531ArnkoK1K0m5NqoK3mj2nJ8JRj6j9L8k7J6J1lKk1OMK7MKk6J7lj7L6m1J9P%J1
5572B3Pk8J9j2kNk0qK7j9kJ3mj9L7j8j4K2k1K0j8pJ8k1NJ0j2NMk0J2qJ1K6j2K
5608ApMJ3j1nJ0j7J0j3J6J4j9NJ4J1l2PMj4JKp%%j2j5J2Nj7NJ8KOMjnlj4J4Mo
5649a6J4rJ0j0J9k0L1qrKJ7k1MLnqRJ2k5PJ4k4J2lj6K0Mkj2jkPj0lmK1j4oqJ1
5689a9k2J5K4k4OmK9k6K1lj3LJJ0pJ4k0K2j0MJ1j9L%KlJ9J7l0lKlJ7k2LK0j5N
5727EnpNmPJ6k8nQrl%OLj9J6KpJ0j1J7j5L1j8k2L6j5K0kj5J2Oj0mPJoj4J2J2k5
5768a2Jj6L2j4qJ9j1j3J3Lj4Rk2RqK0Pj7%MOj1jmqJ0J6j5L0k6j4RJ4PQMqj2Oj
5808hL1l2J1k0J4%j3QMj0J8Kj1Pk6J8J3j1j7J9knrMlOk0j4K7MoK3lj1j9K7j4R
$$ plain form
5846 -9 -3 -21 -4 -12 -7 -15 -7 -13 -4 12 -1 8 -13 -6 4 -3 7 3 3 4 6 -13 -25 -23 -12 -3 -25 -28 -13 -12 -6 -9 -19 -28 -20 -19 -23 -15 -9 -15 -32 -29 -48 -7 -25
5891 -25 -26 -9 -30 -15 -3 -26 -20 -4 3 -12 0 -5 5 -10 -3 13 0 4 -6 10 19 9 9 15 20 -24 11 -13 -13 -14 -16 -14 -24 -23 -23 -16 -35 -19 -25
5930 -25 -47 -32 -34 -43 -24 -9 -13 -12 -20 -36 -31 -18 -12 -13 -18 -18 -34 -16 4 15 -17 -6 20 -2 8 4 7 -1 6 -3 -1 18 18 3 -23 -6 -26 -26 -11
5969 -11 -17 -19 5 -7 -16 -16 -36 -7 -18 -9 -30 -14 -16 -21 -18 -18 -30 -5 -11 -15 -2 6 -12 6 14 14 12 14 3 10 13 -8 10 0 1 7 13 3 1 4 8 9 16
6012 16 10 -5 -13 -37 -49 -33 -28 0 -14 16 -31 -19 -5 -14 -10 -23 -41 -16 -13 -24 -29 -17 -15 -16 -21 -33 -10 1 -1 -16 0 -21 -15 1 8 -8 -1
6049 -1 -10 -11 10 7 2 -7 -12 23 12 -14 -6 9 0 -17 -10 -5 0 -14 -10 -22 -28 -27 -9 -7 -28 -25 -21 -19 -20 -43 -28 -23 -24 -10 -11 1 -18 -8 -4 -2 -6 -25 -6
6092 -6 4 -14 -2 -3 -30 -22 0 1 3 -20 -1 13 16 -4 -15 -1 -5 -5 -4 -10 3 -28 -2 -8 -1 -15 -20 -43 -1 -13 -34 -55 -33 -19 -30 -25 -30 -31
6130 -31 -28 -21 -25 -22 -31 -26 -12 -8 -1 -17 -9 -1 -1 -18 -19 -2 -7 3 -4 -3 -7 -7 -25 15 2 2 -21 -8 11 3 -15 -26 -18 -21 -32 -37 -2 -24 -7 -20 -18 -18
$$ packed form
5846iOj8J7qNqQoRJ6j3Rk1PJ0pJ0m%JKj9j2KJ1Rk2lJ5JOlj0rQJmQOoj7Lj9M1j8
5891b5jJ7k1J5J2k3OJ6Pj5J2nJ0j5PJ6j3Mj0J6Rj0%ONm4L5k4%jkKj0J%Pj9J6o
5930b5k2J5krJ9J5mJqj6NJ3Ojn%j6J8K0J1l2J1K6k2J0mLqPrKJ9%j5k6J7k0%J5
5969a1okK4j2r%k0K9j1Rk1J6knL%j2K5omJ3Qj8J8Q%kKj1PLk1J8j0JOOj0kLMJP
6012A6oj5qk4j2J6NK8j4L0m7J2J4rMj3j8K5Lj1nJ2Kjnj2K3J1kj5J6k1OJ6Pj6P
6049arjK1lnrnL5j1k6QJ5rj7PNNj4Mj2oJJ8Kk1LMKjk3J5NjJ4jJ2j9J0MKmj9J9
6092fJ0j8J2jk7QK2JKk3J9J4Lk0j1J4m%JoJ3l1K6oPj4nk3M2j2k1k1K2J4j1Nnj
6130c1LPmLrNJ4MPj6QQ%j7jJ7nJ0pJm%j8M0j3%k3J3J9qj8j1Qlj1nL5k2J7j3K%
$$ plain form
6172 -18 -27 -18 -16 -35 -15 -29 -49 -39 -60 -35 -52 -21 -7 -23 4 -4 -13 -12 -17 -12 0 -26 -11 -6 15 10 25 28 1 -8 0 -18 -10 -3 0 19 -5 -16
6210 -16 -8 -32 -4 -27 -9 -24 -15 -39 -24 -21 -16 -20 -19 -14 -36 -18 -33 -33 -26 -14 -27 -37 -26 -33 -5 -4 3 -13 -23 5 5 -10 4 8 8 12 2 -33
6248 -33 -8 -10 10 1 -12 15 -15 -9 9 -8 -37 -1 -11 -8 -51 -10 -16 -13 -9 -14 -18 -13 -27 7 -37 -18 -31 -48 7 -21 -28 -23 8 -25 -32 -11 -2
6285 -2 4 -2 0 10 14 -11 -9 8 4 4 -2 0 -4 22 -17 2 -16 -15 5 -3 0 -6 7 1 -20 7 11 -16 -9 -14 -43 -33 -19 -30 -16 -13 -36 -11 -2 -25 -18
6326 -18 -29 -11 -4 -26 -36 -15 -27 -17 -31 -24 -2 -20 -5 -7 0 -7 18 1 18 12 3 -2 5 -21 -20 -13 -11 -10 -13 -11 -8 -23 -10 -20 -38 -17 -25 -23 -41
6365 -41 -32 -17 -21 -26 -36 -28 -14 7 -39 -24 -39 -54 -14 -38 -4 -15 -11 -2 -7 -28 -6 -14 -1 8 7 -13 4 3 -4 8 9 5 -6 -24 -1 -3 1 -5 -27
6404 -27 1 -8 13 -24 -12 4 -6 -21 -32 -22 -1 15 -8 -23 -32 -24 -24 -16 -9 -15 -20 -13 -7 -12 -30 -39 -36 -35 -45 -9 -5 -3 5 9 5 -16 -3 14 -3 -9
6444 -9 -4 5 14 -3 -1 5 -14 9 9 -4 -19 -18 -3 -24 3 4 -21 -33 -23 -26 -15 -18 -40 -37 -23 -54 -24 -14 -11 -12 -29 -27 -10 -5 -14 -20 0 10 -13
$$ packed form
6172a8rRKj9K0j4k0J0k1K5j7L1J4j6K7qrJnNJ2k6J5NK1nJ5Lk7rQj8QPLJ9k4j1
6210a6Qk4K8k3J8j5Rk4J5LNmJNk2J8j5%PJ2j3j0J1pK8JPj6j0K8%j5J4M%Mj0l5
6248c3K5kK0rj3K7l0OJ8j7k9L6j0Lm3M1oLMnmNj4L4m4J9j3j7N5k8pNL1l3pK1R
6285bOoKJ0Mk5KJ7m%oKmK6l9J9j8JK0qLoJ3ok1K7Mk7Pnk9J0J4j1J4Lk3K5Rk3P
6326a8j1J8Pk2j0K1j2J0j4PK2j8J5kPpK5j7J7ornPk6JPKJlKLj5J3j0j8K1qKj8
6365d1RJ5mnj0QJ4K1m6J5j5j5M0k4L4j1MRnk1K2qJ3Rjk0J7jpJ2Jmj1j8K3kMok2
6404b7K8rK1l7J2J6j0j5j1J0K1J6k3j5rQ%QPonPOnj8rLJj0L6MKQMmk1J3J7j7o
6444iNRRj7KOj9K3%j3j5JJ5k1K7Jk5j2J0lJ1lk2LJ4l1L0J0Ljj7KJ7NroK0J0k3
$$ plain form
6483 -13 -12 -1 -9 -2 3 7 4 9 16 5 13 -6 -14 -16 -3 -11 -9 3 -23 -5 -21 -1 -10 -30 -11 -4 -25 -39 -29 -21 -25 -29 -14 -31 -6 -16 -12 9 -23 -10
6523 -10 -7 -35 -43 -9 -6 -19 -9 -16 6 -7 -12 -1 -2 22 -4 5 10 4 -17 6 -19 -15 -11 -16 -5 3 -21 -1 -7 -29 -12 -26 -19 -38 -16 -31 -17 -32
6561 -32 -25 -20 -25 -34 -20 -15 -20 -26 -32 -18 -19 7 -2 -22 -18 -8 -24 19 -17 5 24 17 6 11 -1 4 5 0 0 32 2 -5 -18 -8 4 15 4 -8 5
6600 5 -2 1 -9 -7 -15 -26 -13 -21 -29 -41 -32 -28 -16 -26 -47 -29 -14 -35 -28 -20 0 -12 -35 -13 6 -17 -25 -2 -8 -26 -12 -24 -26 -1 -5 -6 2 -7 10
6639 10 -9 -6 -17 -18 -23 -20 1 -10 -1 0 -5 -18 -28 -31 -20 -51 -39 -18 -14 -37 -25 -14 -25 -33 -29 -37 -14 -25 -26 -33 -22 -28 -14 -32 -5 -7 -27 -16
6677 -16 -13 -7 2 0 -13 -10 -4 3 4 8 -5 5 7 0 -9 -15 -19 4 -12 0 -25 -11 -21 -4 -13 -20 -7 -32 -25 -34 -43 -43 -34 -9 -54 -29 -19 -26 -14 -4 -14
6718 -14 -18 -14 -6 -7 -12 9 -25 -5 -6 -12 5 8 10 11 8 -9 21 -4 19 22 5 11 14 8 -3 -25 -10 -9 -38 -44 -36 -19 -6 -33 -18 -26 -21 -17 -46 -8 -47
6759 -47 -39 -39 -41 -23 -12 -14 -26 -17 -17 -29 -18 -7 3 9 -4 18 -15 -6 -6 -3 -10 -32 -11 -6 -1 4 10 -22 -10 -1 5 -9 2 -17 12 -3 -1 -24 -11
$$ packed form
6483a3JJ1qPNMlNPj1Qj9qkJ3qKJ2k6J8j6K0rk0J9Pk1j4J0QmmJ5j7K5j0MK1l2J3
6523a0Lk8qL4Lj3J0pK2j3nJ1jK4k6RNok1K3k5MMnJ1Qk4K0ok2J7j4Pj9K2j5J4j5
6561c2PNnrJ4NnooJ4jK6rk0MJ0j6M3l6K2J9pj1Nj2NJn%L2l0pj3J0J2J1j1j2J3
6600EpLj0Kqj1J3qqj2RMJ2j0k1J8J5k1PQK0j2k3K2J9k3qK3oj8J4j2kK5mjQrJ7
6639A0j9Lj1jnLK1j1RJnj3j0lJ1l1J2K1Mk3J2J1j1qMqK3j1jpJ1oJ4j8K7kk0J1
6677a6LORkj3LOPJMj3J0KpromK3j6J2k5J4j0J7rpJ3k5Prr%RK5m5K5J0pJ2J0j0
6718a4mMQjnK1l4K0joJ7LKJlj7L0k5K3Lj7OLoj1k2J5Jk9oQJ7J3k7J5qNMk9L8l9
6759d7Q%kJ8J1kj2R%j2J1J1J0Oj3K2l3R%Lpk2K1NNNOl2J2ROj4J1j9K9j5Kk3J3
$$ plain form
6798 -11 -12 -17 -13 -8 -6 -10 -19 -10 -20 -24 -13 -36 -24 -12 -6 -11 3 -28 9 -12 11 -13 13 8 -9 13 12 -19 -8 -2 -8 -14 26 -1 6 3 -1 -14 9 -8
6838 -8 -3 -2 2 8 -6 -30 -9 -30 -16 -7 -8 8 -42 -14 -23 -6 -14 -22 -18 -18 -28 -32 -19 -8 -5 -9 -11 4 -11 -8 -16 4 -10 6 1 -3 7 16 -6 25 7
6879 7 -4 17 10 -3 8 5 -1 -2 -25 -3 -7 -9 -17 -14 -20 -5 -1 -10 -23 -10 -24 -19 -14 -7 -24 -28 -4 -24 -39 -38 -37 -25 -31 -4 -23 5 -15 -1 -1 27
6919 27 1 -21 4 -5 10 -1 2 2 -27 2 -10 -1 1 -2 12 15 4 -10 -7 -11 4 -5 -14 -13 -9 -26 -27 -13 -19 -24 -35 -12 -38 -2 -41 -22 -16 -41 -18
6958 -18 -8 -16 -3 -25 -11 -4 -5 -24 -19 16 -2 -12 -8 2 10 -10 12 -6 -1 7 3 -16 -8 1 14 28 -6 -19 -7 6 -32 -4 -22 -29 -7 -10 -19
6995 -19 -37 -27 -41 -22 -25 -24 -11 -44 -29 -24 -19 -11 -12 -34 -5 -18 -10 -19 -5 2 -3 -1 3 -4 -9 19 1 9 7 8 2 -7 14 2 0 1 -7 -9 12 -8 6 -25
7037 -25 -25 -2 -10 -3 -11 -18 -21 -29 -14 -7 -13 -31 -29 -15 -18 -15 -28 -26 -48 -33 -24 -24 -1 -2 -11 -27 -10 -16 2 -14 9 15 12 14 11 22 14 -8 4 3 -13 6
7079 6 -12 -2 -7 -12 -18 -6 -9 -32 -49 -29 -24 -28 -18 -37 -55 -8 -2 -22 -20 -32 -36 -6 -18 -31 -33 -28 8 -19 8 -7 -19 -20 3 1 2 -6 8 -8
$$ packed form
6798a1jnMNKmrRj0mJ1k3J2J2OnJ4l1L7k1K3k4K6nj7K2jl1J1OooM0k7Plmj3K3j7
6838hNJMOj4k4K1k1J4RjJ6n0K8rJ7qqM%j0mJ3J1LmkJ5j5LqK0j4J6nmJ0Rk2L1j8
6879Gj1K1pj3J1lojk3K2mkqLoJ5Mrj3J3j4NNPj7mK4k0j5JJJ2oK7j9K8k0J4%K8
6919B7k6k2K5rJ5j1L%k9K9j2RKlJ4Lj1j4LmJ5rrJMj7jJ4onj1K3k6L6l9J9Ok5K3
6958a8J0qJ3k2J4Pjj9NL5j8j0MJ0Qk0K2j8NQmj9QRJ3J4l4j3J2J3l8K8j8pK2lr
6995a9j8J0j4J9lJJ3l3J5NNQjk2K9j3QrJ4PnKMpnK8j8QkJorK1j2kJqkK1k0J4l1
7037b5%K3qPqplqJ5Poj8KJ4lLj3Kk2J5R%K3jrj6J7oJ8j6K3OlKlJ1qk2J2jj6J9
7079Fj8J0nnoJ2lk3j7K0NmJ0j9j8M7Ok0Kj2mL0j2j3kNL6k7K7j5j2jK3kJqJ4j6
$$ plain form
7117 -8 9 3 7 -7 6 1 10 9 -11 2 -3 9 -10 7 -7 -15 -2 -17 -32 -14 -19 -11 -14 -28 -14 -18 -9 -21 -31 -40 -3 -15 -29 -36 -5 -2 -26 -10
7155 -10 4 -4 -17 -9 -3 10 -7 -5 -17 10 0 11 5 -6 -6 4 2 -1 -9 2 23 6 -3 9 8 15 -1 18 9 -22 -23 -23 -20 -24 -17 -1 -26 -34 -46 -50
7195 -50 -34 -30 -19 -25 -22 -6 -7 -30 2 -12 -17 -18 -7 -5 -26 4 5 -16 13 23 -6 11 21 -15 11 4 -6 -5 20 -16 0 -4 -10 -21 -11 -6 -22
7232 -22 -6 -14 -10 -26 1 -22 -25 -5 -25 -12 -30 -28 -31 -43 -19 -23 -26 -26 -27 -15 -44 13 -14 -6 -8 -17 -26 -6 -1 -17 -5 -9 0 -6 6 17 0 -18 20
7271 20 -12 -2 -5 5 -24 -16 -25 -12 -17 -22 -15 11 -2 -23 -20 -39 1 -18 -33 -49 -19 11 -10 -22 -13 -14 -17 -23 -20 -12 -33 -2 -8 -9 -11 -21 -14 -7 1 -2
7311 -2 9 -4 10 -5 21 3 0 -7 7 -4 9 4 -5 -3 1 -6 6 -25 -20 -41 -21 -16 -32 -11 6 -40 -43 -29 -27 -43 -19 -20 -22 -16 -15 -8 5 -2 -56
7350 -56 -4 -7 -28 -8 -16 -8 -7 -27 -12 7 4 -12 -3 -13 0 0 3 23 15 7 -18 -11 3 -9 -22 7 -16 -21 -4 -3 -24 -21 -12 4 -12 -15 -41 -16
$$ packed form
7117hJ7oMj4J3nRjk0J3nJ2j9J7j4qJ3j5j5J8nQlj4J4mRj2j0rL7j2j4pL1Lk4J6
7155a0J4qj3QOJ3j7Kj2K7j0J1oj1%J0klqJ1K1j7rJ2jPj6J9rl1j%LmPJ6k5qj2m
7195e0J6MJ1oLJ6jk3L2j4njJ1Kk1L0Jk1K9J0k9J7J0l6K6pj0JK5l6J6moj1J0Nj6
7232b2J6qMj6K7k3lK0k0J3j8Klj2K4ml%jJ2k9N7k7QkrrK0Nj6J2mRoJ2J1j7j8L8
7271B0l2J0lJ0k9QrJ3nnPK6j3k1Lj9M0j9j5j6L0L0k1j2RjloLQk1L1ojkj0PPQl
7311bJ1j3J4j5K6j8lpJ4j1J3nrKMpJ2l1Nk1K0Nj6K1J7m6lJ4Kj6K4jkOJPJ3pn4
7350e6N2lk1K0qQJk0J5J9lj6Rj0J3%LK0qqk5PJ4j2j3K9k3nJ7Jk1LRJ6j6lk6K5
$$ [...]
8191A9
##END NTUPLES=NMR FID
##END=
