##TITLE=H1
##JCAMPDX= 6.0         $$ Bruker NMR JCAMP-DX V2.0
##DATA TYPE= NMR SPECTRUM
##DATA CLASS= NTUPLES
##ORIGIN= UXNMR, Bruker Analytische Messtechnik GmbH
##OWNER= root
$$ XWIN-NMR		Version 3.5
$$ Mon Feb 22 11:30:14 2016 Russian Standard Time (UT+4h)  servis@DPX200
##.OBSERVE FREQUENCY= 200.131235884673
##.OBSERVE NUCLEUS= ^1H
##.ACQUISITION MODE= SIMULTANEOUS
##.ACQUISITION SCHEME= undefined
##.AVERAGES= 32
##.DIGITISER RES= 18
##SPECTROMETER/DATA SYSTEM= spect
##.PULSE SEQUENCE= zg
##.SOLVENT NAME= CDCl3
##.SHIFT REFERENCE= (INTERNAL, CDCl3, 0, 17.6849)
##AUDIT TRAIL= $$ (NUMBER, WHEN, WHO, WHERE, WHAT)
$$ ##TITLE= Audit trail, XWIN-NMR		Version 3.5
$$ ##JCAMPDX= 5.01
$$ ##ORIGIN= Bruker BioSpin GmbH
$$ ##OWNER= servis
$$ F:/spectra/data/servis-vadim/nmr/H1/1/pdata/1/auditp.txt
$$ ##AUDIT TRAIL=  $$ (NUMBER, WHEN, WHO, WHERE, WHAT)
(   1,<2016-02-22 11:28:52.15 +0400>,<servis>,<DPX200>,
      <created by zg, POWCHK disabled, PULCHK disabled
       configuration hash MD5:
       00 E9 B6 7A A2 85 ED C7 34 08 36 98 17 FE 4E 26
       data hash MD5: 16K
       F9 1D BC 55 79 5D 22 FA EC F9 C8 AF EA FB 4E 4B>)
(   2,<2016-02-22 11:28:54.46 +0400>,<servis>,<DPX200>,
      <Start of raw data processing
       efp BC_mod = 2 LB = 0.3 FT_mod = 6 PKNL = 1 PHC0 = -30.24149 PHC1 = -0.3563094 SI = 32K 
       data hash MD5: 32K
       E6 69 3A F4 D6 36 8E C0 5D 9A F5 E4 F0 8C DA B4>)
(   3,<2016-02-22 11:29:12.25 +0400>,<servis>,<DPX200>,
      <pk PHC0 = 0.8343773 PHC1 = 0 
       data hash MD5: 32K
       0A ED CF 4B 43 75 10 C9 10 3D F9 D0 5C 03 C2 2C>)
(   4,<2016-02-22 11:29:17.82 +0400>,<servis>,<DPX200>,
      <abs ABSG = 5 
       data hash MD5: 32K
       60 DB EB 1D F7 10 72 7A F0 8E 52 9C 38 1A E7 DC>)
(   5,<2016-02-22 11:29:34.70 +0400>,<servis>,<DPX200>,
      <abs ABSG = 5 
       data hash MD5: 32K
       36 35 BD D0 E3 F6 C5 0E 2D 43 5C A7 62 74 65 63>)
$$ ##END=
$$ 
$$ hash MD5
$$ 67 0D 23 DD E7 F1 1E 82 C5 B1 FF 35 1D 76 8C 81
##$RELAX= 
##$RELAX= 
##$RELAX= 
##$RELAX= 
##$RELAX= 
##$RELAX= 
$$ Bruker specific parameters
$$ --------------------------
##$DU= <F:/spectra>
##$EXPNO= 1
##$NAME= <H1>
##$PROCNO= 1
##$TYPE= <nmr>
##$USER= <servis-vadim>
##$AMP= (0..31)
100 100 100 100 100 100 100 100 100 100 100 100 100 100 100 100 100 100 
100 100 100 100 100 100 100 100 100 100 100 100 100 100 
##$AQSEQ= 0
##$AQ_mod= 1
##$AUNM= <au_zg>
##$AUTOPOS= <>
##$BF1= 200.13
##$BF2= 200.13
##$BF3= 200.13
##$BF4= 200.13
##$BF5= 500.13
##$BF6= 500.13
##$BF7= 500.13
##$BF8= 500.13
##$BYTORDA= 1
##$CFDGTYP= 0
##$CFRGTYP= 5
##$CHEMSTR= <none>
##$CNST= (0..31)
1 1 145 1 1 1 1 1 1 1 1 1 1 1 1 1 1 1 1 1 1 1 1 1 1 1 1 1 1 1 1 1 
##$CPDPRG= <>
##$CPDPRG1= <>
##$CPDPRG2= <>
##$CPDPRG3= <>
##$CPDPRG4= <mlev>
##$CPDPRG5= <mlev>
##$CPDPRG6= <mlev>
##$CPDPRG7= <mlev>
##$CPDPRG8= <mlev>
##$CPDPRGB= <>
##$CPDPRGT= <>
##$D= (0..31)
0 1 0 0 0 0 0 0 0 0.06 0 0 0 0 0 0 0.0002 0 0 0 0 0 0 0 0 0 0 0 0 0 0 
0 
##$DATE= 1456126131
##$DBL= (0..7)
$$ [...]
##$SUBNAM4= <"">
##$SUBNAM5= <"">
##$SUBNAM6= <"">
##$SUBNAM7= <"">
##$SUBNAM8= <"">
##$SUBNAM9= <"">
##$SW= 20.6817932712277
##$SWIBOX= (0..15)
0 0 3 0 0 0 0 0 0 0 0 0 0 0 0 0 
##$SW_h= 4139.07284768212
##$TD= 16384
##$TD0= 1
##$TE= 0
##$TE2= 300
##$TE3= 300
##$TEG= 300
##$TL= (0..7)
0 120 120 120 120 120 120 120 
##$TP= (0..7)
150 150 150 150 150 150 150 150 
##$TP07= 0
##$TPNAME0= <>
##$TPNAME1= <>
##$TPNAME2= <>
##$TPNAME3= <>
##$TPNAME4= <>
##$TPNAME5= <>
##$TPNAME6= <>
##$TPNAME7= <>
##$TPOAL= (0..7)
0.5 0.5 0.5 0.5 0.5 0.5 0.5 0.5 
##$TPOFFS= (0..7)
0 0 0 0 0 0 0 0 
##$TUNHIN= 0
##$TUNHOUT= 0
##$TUNXOUT= 0
##$USERA1= <user>
##$USERA2= <user>
##$USERA3= <user>
##$USERA4= <user>
##$USERA5= <user>
##$V9= 5
##$VALIST= <valist>
##$VCLIST= <CCCCCCCCCCCCCCC>
##$VD= 0
##$VDLIST= <DDDDDDDDDDDDDDD>
##$VPLIST= <PPPPPPPPPPPPPPP>
##$VTLIST= <TTTTTTTTTTTTTTT>
##$WBST= 1024
##$WBSW= 4
##$XGAIN= (0..3)
0 0 0 0 
##$XL= 0
##$YL= 0
##$YMAX_a= 30906
##$YMIN_a= -60694
##$ZGOPTNS= <>
##$ZL1= 120
##$ZL2= 120
##$ZL3= 120
##$ZL4= 120
##$ABSF1= 17.68489
##$ABSF2= -2.997055
##$ABSG= 5
##$ABSL= 3
##$ALPHA= 0
##$AQORDER= 0
##$ASSFAC= 0
##$ASSFACI= 0
##$ASSFACX= 0
##$ASSWID= 0
##$AUNMP= <proc_1d>
##$AZFE= 0.1
##$AZFW= 0.1
##$BCFW= 0
##$BC_mod= 2
##$BYTORDP= 0
##$COROFFS= 0
##$CY= 18.4799938201904
##$DATMOD= 1
##$DC= 0
##$DFILT= <>
##$DTYPP= 0
##$F1P= 9.9274215381318
##$F2P= -0.165520771350173
##$FCOR= 1
##$FTSIZE= 32768
##$FT_mod= 6
##$GAMMA= 0
##$GB= 0
##$INTBC= 1
##$INTSCL= 1
##$ISEN= 128
##$LB= 0.3
##$LEV0= 0
##$LPBIN= 0
##$MAXI= 10000
##$MC2= 0
##$MEAN= 0
##$ME_mod= 0
##$MI= 50
##$NCOEF= 0
##$NC_proc= -8
##$NLEV= 6
##$NOISF1= 3.799351
##$NOISF2= 2.8
##$NSP= 0
##$NTH_PI= 0
##$NZP= 0
##$OFFSET= 17.68489
##$PC= 4
##$PHC0= -29.40711
##$PHC1= -0.3563094
##$PH_mod= 1
##$PKNL= yes
##$PPARMOD= 0
##$PSCAL= 4
##$PSIGN= 0
##$REVERSE= no
##$SF= 200.129766148193
##$SI= 32768
##$SIGF1= 3
##$SIGF2= 2
##$SINO= 400
##$SIOLD= 16384
##$SREGLST= <1H.CDCl3>
##$SSB= 0
##$STSI= 32768
##$STSR= 0
##$SW_p= 4139.07284768211
##$SYMM= 0
##$S_DEV= 0
##$TDeff= 16384
##$TDoff= 0
##$TI= <>
##$TILT= no
##$TM1= 0
##$TM2= 0
##$TOPLEV= 0
##$USERP1= <user>
##$USERP2= <user>
##$USERP3= <user>
##$USERP4= <user>
##$USERP5= <user>
##$WDW= 1
##$XDIM= 32768
##$YMAX_p= 403444209
##$YMIN_p= -2204340
$$ End of Bruker specific parameters
$$ ---------------------------------
##NTUPLES= NMR SPECTRUM
##VAR_NAME=  FREQUENCY,     SPECTRUM/REAL,   SPECTRUM/IMAG
##SYMBOL=    X,             R,               I
##VAR_TYPE=  INDEPENDENT,   DEPENDENT,       DEPENDENT
##VAR_FORM=  AFFN,          ASDF,            ASDF
##VAR_DIM=   32768,         32768,           32768
##UNITS=     HZ,            ARBITRARY UNITS, ARBITRARY UNITS
##FACTOR=    0.126318333923829, 1,           1
##FIRST=     3539.27304956752, 0,            0
##LAST=      -599.799798114586, 0,           0
##MIN=       -599.799798114586, -2204340,    0
##MAX=       3539.27304956752, 403444209,    0
$$ Real data points
##PAGE= N=1
##DATA TABLE= (X++(R..R)), XYDATA
$$ [...]
9986A293989j3452k2370k6704j4049L848Q461J259k447j49m629j8939k6480j4397
$$ 1293989 1280537 1258167 1231463 1217414 1221262 1229723 1230982 1228535 1228386 1223757 1204818 1178338 1163941
9973A163941N434J1021r00j3797j6677j6014j8754j7637m344J1769J3550K275
$$ 1163941 1169375 1180396 1179496 1165699 1149022 1133008 1114254 1096617 1092273 1104042 1117592 1119867
9961A119867k298Q307J7412Q324j0637k0910k2432k7665l2825k0360O856J9838
$$ 1119867 1117569 1125876 1143288 1151612 1140975 1120065 1097633 1069968 1037143 1016783 1023639 1043477
9949A043477M680j3007m362J9671K6659J2464K607P212P030q579k0419j2459q53
$$ 1043477 1048157 1035150 1030788 1050459 1077118 1089582 1092189 1099401 1106431 1097852 1077433 1064974 1064121
9936A064121p406k2453k0733l138N885j311o359N53M013q002k0985j5870R61P586
$$ 1064121 1056715 1034262 1013529 1010391 1016276 1014965 1008606 1009159 1013172 1005170 984185 968315 969276 976862
9922I76862j532j0114l578J4665K9471K7538O915j9279l1750k5392j5937j7486
$$ 976862 975330 965216 961638 976303 1005774 1033312 1040227 1020948 989198 963806 947869 930383
9910I30383k0299n918J9599K7286M716k4168k9410j1923L758M463J10L372J3048
$$ 930383 910084 904166 923765 951051 955767 931599 902189 890266 894024 898487 898597 901969 915017
9897I15017K0111J8837P832j1032k9287l4338k1510m42J4740J8443J3966N976
$$ 915017 935128 953965 961797 950765 921478 887140 865630 865188 879928 898371 912337 918313
9885I18313j517l134M217J5033J8607J0781j327q187q192p246j0546j7149k1195
$$ 918313 916796 913662 917879 932912 951519 962300 960973 952786 944594 937348 926802 909653 888458
9872H88458j6862l874J0107J4402N501q247j4501r492r63J179n027j3054j4811
$$ 888458 871596 867722 877829 892231 897732 889485 874984 865492 864529 865708 860681 847627 832816
9859H32816o802Q175K2279K5865J3393j0470l1173l4418j9120K77O966j873j3365
$$ 832816 826014 834189 856468 882333 895726 885256 854083 819665 800545 800822 807788 805915 792550
9846G92550j3972l781O305R229Q829J1002J2771N891r129j9402j4716k056K588
$$ 792550 778578 774797 781102 790331 799160 810162 822933 828824 819695 800293 785577 783521 786109
9833G86109l769o966K235J2044O195r749j3915M5J2892Q165m073l882Q653J5792
$$ 786109 782340 775374 777609 789653 795848 786099 772184 772229 785121 793286 789213 785331 793984 809776
9819H09776R326p95m515l994n505j0959j9933k9138k8669j1646J0246J6373O572
$$ 809776 819102 818307 813792 809798 804293 793334 773401 744263 715594 703948 714194 730567 737139
9806G37139L042J4575J9875K664j6617r498J3646J6878n620k1102j0758K300o804
$$ 737139 740181 754756 774631 777295 760678 751180 764826 781704 776084 754982 744224 746524 739720
9793G39720k4403k1429K014K1005K3691J9205J3136l2j8841k9918k5468j0680
$$ 739720 715317 693888 695902 716907 740598 759803 772939 772907 754066 724148 698680 688000
9781F88000P830K5527L1473J5571j1069k2334j1692k168j0898k2764j5914K791
$$ 688000 695830 721357 752830 768401 757332 734998 723306 721138 710240 687476 671562 674353
9769F74353J0142M127M182J6770K5335J8304N598p39m410j2464j9519j7023p819
$$ 674353 684495 688622 692804 709574 734909 753213 758811 758072 753662 741198 721679 704656 696837
9756F96837R64J0635K2940K6733R805j7461k7336q676J7088K1878M337j2033r539
$$ 696837 697801 708436 731376 758109 767914 750453 723117 714441 731529 753407 757744 745711 736172
9743G36172N091J3406P730m314j3122j6871j7188j2754k875O822R961R217J2585
$$ 736172 741263 754669 762399 758085 744963 728092 710904 698150 695275 702097 712058 721275 733860
9730G33860J9638K0543J1116k51n359o765r124q915j845O742R329Q079Q207N564
$$ 733860 753498 774041 785157 784906 779547 772782 763658 754743 752898 759640 768969 777048 785255 790819
9716G90819n619j7621j7800r613p487j1319o527P463J1689n60r297l77Q721k459
$$ 790819 785200 767579 749779 740166 732679 721360 714833 722296 733985 733425 724128 723751 732472 730013
9702G30013j9841j4148J1369K3305Q218r224n692R410J5191R992L383n671k0872
$$ 730013 710172 696024 707393 730698 738916 729692 724000 733410 748601 758593 761976 756305 735433
9689G35433k8832j0879K5883M9064L7881O582j4621j1963M225J5940J3750Q04
$$ 735433 706601 695722 721605 770669 808550 815132 800511 788548 792773 808713 822463 823267
9677H23267j2597j8786j9428k0633k1259j2501O592K0301J2842q758k0016r455
$$ 823267 810670 791884 772456 751823 730564 718063 724655 744956 757798 749040 729024 719569
9665G19569P811J3069R142J0361J5599R352j0128k1880r297J6851L2579K8293
$$ 719569 727380 740449 749591 759952 775551 784903 774775 752895 743598 760449 793028 821321
9653H21321J1694q427k7699l9320l5618j8423M21J0731J1606Q709Q115J0621R845
$$ 821321 833015 824588 796889 757569 721951 703528 703949 714680 726286 734995 743110 753731 763576
9640G63576J571m372N797K3328J9778j0381l0971j2177K0768K1015q750k0714
$$ 763576 765147 760775 766572 789900 809678 799297 768326 756149 776917 797932 789182 768468
9628G68468K602K3565J3241m908m41J3899J2210M395J3661K6676J2164k0680k8050
$$ 768468 771070 794635 807876 802968 802527 816426 828636 833031 846692 873368 885532 864852 836802
9615H36802K969L4742L3099P825j1657j3366l644O520N071j2640l0880k6681j697
$$ 836802 839771 874513 907612 915437 903780 890414 886770 893290 898361 885721 854841 828160 826463
9602H26463J7531J5353K789o316j1763j3595p144k8q843k8377l0569p691J0986
$$ 826463 843994 859347 862136 855820 844057 830462 823318 823290 814447 786070 755501 747810 758796
9589G58796L203j3211j3328m720o358j1070j777J1741P133j0108j4405k556L881
$$ 758796 761999 748788 735460 730740 724382 713312 711535 723276 730409 720301 705896 703340 707221
9576G07221l942j2340j2364q762j536J3721K5987J7258n841j6001n362M639j075
$$ 707221 703279 690939 678575 669813 668277 681998 707985 725243 719402 703401 698039 702678 701603
9563G01603j2074j5969j4926j0489K128J5039R327j3030k4868j3758O73K962N503
$$ 701603 689529 673560 658634 648145 650273 665312 674639 661609 636741 622983 623656 626618 632121
9550F32121J7422K0662K995j2845m016J2314Q413m986P73J7642J2178j3846k1227
$$ 632121 649543 670205 673200 660355 656339 668653 677066 672080 672853 690495 702673 688827 667600
9537F67600K653K1866R159j3369j3474J843L990j0468j9542j2381j000K334M59
$$ 667600 670253 692119 701278 687909 674435 676278 680268 669800 650258 637877 636877 639211 639670
9524F39670J767O779P779j584j6195k0531o204J3267J6359K070r814q799n857
$$ 639670 641437 648216 655995 654411 638216 617685 611481 624748 641107 643177 633363 624564 618707
9511F18707r152p850O470K0050J6945N322L389Q968N725n917q310K552Q783j023
$$ 618707 609555 601705 608175 628225 645170 650492 653881 662849 668574 662657 654347 656899 665682 664659
9497F64659j4503j5262m500O471J2207J1485J556j3959k0696j0459L634K820r989
$$ 664659 650156 634894 630394 636865 649072 660557 662113 648154 627458 616999 620633 623453 613464
9484F13464j3423J411J8065J8224N730k054J270O360M191l838j1506j4229r157
$$ 613464 600041 601452 619517 637741 643471 641417 642687 649047 653238 649400 637894 623665 614508
9471F14508K300J0380N254p207r128L588J1670K91j5572j1692P295J4287L631
$$ 614508 616808 627188 632442 625235 616107 619695 631365 631656 616084 604392 611687 625974 629605
9458F29605J281K1307L8057K2175j3559l0411j7558l007r675k4564k1359K516
$$ 629605 630886 652193 690250 712425 698866 668455 650897 647890 638215 613651 592292 594808
9446E94808K4172K3735M651j3379j6802j0784p220l961J1406L3615L4686L067
$$ 594808 618980 642715 647366 633987 617185 606401 599181 595220 606626 640241 674927 677994
9434F77994k9201k4764M356J3610n944j6818k92J1731o138k4252n449K8630K7552
$$ 677994 648793 624029 628385 641995 636051 619233 618941 630672 624534 600282 594833 623463 651015
9421F51015p022k3554k911J4417k631k6951k0332P329J9705J0222J322K397K672
$$ 651015 643993 620439 617528 631945 629314 602363 582031 589360 609065 619287 620609 623006 625678
9408F25678m55K977J1824J2109J701n199j913J952k13k150L06R30l541o195k979
$$ 625678 625223 628200 640024 652133 653834 648635 646722 648674 648461 646311 646617 647547 644006 637811 634832
9393F34832l01k964o002m470n94L428Q339R826J496r896q726L363M959j0622j9584
$$ 634832 634531 631567 625565 621095 620501 623929 632268 642094 643590 633694 624968 628331 633290 622668 603084
9378F03084m417J3592M801j9486j9926J2295M1520L7416J0983r940j7555k0909
$$ 603084 598667 612259 617060 597574 577648 589943 631463 668879 679862 669922 652367 631458
9366F31458k2985j8856p832O395K1784L4134L4113J8050l405j5498j3953m505
$$ 631458 608473 589617 581785 588180 609964 644098 678211 696261 692856 677358 663405 658900
9354F58900M694N525m986j5378p897J4507K3345J486k7904k9333l098J7979J5708
$$ 658900 663594 669119 664133 648755 640858 655365 678710 680196 652292 622959 619861 637840 653548
9341F53548M556M32j722r373j4707j0376m796n553l697O946J0097r195l1699k4259
$$ 653548 658104 658536 656814 647441 632734 622358 617562 612009 608312 615258 625355 616160 584461 560202
9327E60202R701L0885K0944O786J2743J8801m691m1250m5367j0116K0770J6104
$$ 560202 569903 600788 621732 628518 641261 660062 655371 614121 568754 558638 579408 595512
9315E95512k575k072J1430J0956k410m847M654J611j7817k3822o70K2450J1510
$$ 595512 592937 590865 602295 613251 610841 605994 610648 612259 594442 570620 569950 592400 603910
9302F03910k1626l5426j5314J1805J7209K210j2311j1462L013J6396J3168n653
$$ 603910 582284 546858 531544 543349 560558 562768 550457 538995 542008 558404 571572 565919
9290E65919j8580o974K0192L6135K7629L927k0557l4895k6467R070M8239N3562
$$ 565919 547339 540365 560557 596692 624321 628248 607691 572796 546329 555399 603638 657200
9278F57200J8250k1065k8512r707M983J860q784j4812j2843l579O859O027r380
$$ 657200 675450 654385 625873 616166 621149 623009 614225 599413 586570 582991 589850 595877 586497
9265E86497k2370j5425K773O994r608k6096k1163K689K5152K9532J7082N370R673
$$ 586497 564127 548702 551475 558469 548861 522765 501602 504291 529443 558975 576057 581427 591100
9252E91100K1943J7659q759k9736k0961K592R906J212K185J6482J9126R04j5432
$$ 591100 613043 630702 621943 592207 571246 573838 583744 584956 587141 603623 622749 623653 608221
9239F08221j4316r968j3639r923J1148K6268J2881j0141q919J2530K0231L524
$$ 608221 593905 583937 570298 560375 571523 597791 610672 600531 591612 604142 624373 627897
9227F27897j4184j7252j7612k6196l2002k0828L769K6840L5296K2352m872k1329
$$ 627897 613713 596461 578849 552653 520651 499823 503592 530432 565728 588080 583208 561879
9215E61879p541K0785K8378Q636r248p503m049j5212k4484j2636N676N525n959
$$ 561879 554338 575123 603501 612137 602889 595386 591337 576125 551641 539005 544681 550206 544247
9202E44247m292P196L744j3037j2736J1510K5010L445k6819k5339N146K6211J8922
$$ 544247 539955 547151 550895 537858 525122 536632 561642 565087 538268 512929 518075 544286 563208
9189E63208L596M037J5632J8082N227r306j0599J403J3125J1213m036j8220j7263
$$ 563208 566804 570841 586473 604555 609782 600476 589877 591280 604405 615618 611582 593362 576099
9176E76099k143J3092J7336J2510P209M738R72p645j7532k0419j1536M930J8125
$$ 576099 573956 587048 604384 616894 624103 628841 629813 622168 604636 584217 572681 577611 595736
9163E95736J8634N591j3075k6975l0091k2296o599J1925K4499K1760M435j1737
$$ 595736 614370 619961 606886 579911 549820 527524 520925 532850 557349 579109 583544 571807
9151E71807j0291N478J5253Q436k428k949L87n627j2421J025K9305L7319Q773
$$ 571807 561516 566994 582247 590683 588255 585306 585693 580066 567645 568670 597975 635294 644067
9138F44067k4105k0791J2087L1476J7298p010j4995j0146p703p562l040J54n845
$$ 644067 619962 599171 611258 642734 660032 653022 638027 627881 620178 612616 609576 609730 603885
9125F03885j2105m632J0476J3232p68j5151j6965q912L169J6352K1448Q803r625
$$ 603885 591780 587148 597624 610856 610088 594937 577972 569060 572229 588581 610029 618832 609207
9112F09207o313K0232L2060J540m3065n0828j7478J1856R385j430Q836K8527K8016
$$ 609207 602894 623126 655186 656726 613661 562833 545355 557211 566596 565166 574002 602529 630545
9099F30545Q233m242m82K636l616o306K255Q580J497p385k536R547J0386k776
$$ 630545 638778 634536 634054 636690 633074 626768 629023 637603 639100 631715 629179 638726 649112 646336
9085F46336j6050k0631j8812j0864O376K5440K9517J4724j835m561J001O57n931
$$ 646336 630286 609655 590843 579979 586355 611795 641312 656036 654201 649640 650641 651298 645367
9072F45367q052l643k356r315j7271j6859o430R528K4079K9241K2028J0680O422
$$ 645367 637315 633672 631316 622001 604730 587871 581441 590969 615048 644289 666317 676997 683419
9059F83419P225p7j7766k8777j8545L601J5435Q678n459j3402j1153j890P100
$$ 683419 690644 690567 672801 644024 625479 629080 644515 653193 647734 634332 623179 621289 628389
9046F28389N856q592k2974j8801M452K6060K7053Q987j1944k0900j2476P045K1384
$$ 628389 634245 625653 602679 583878 588330 614390 641443 650430 638486 617586 605110 612155 633539
9033F33539J7269J07j1815j1561j0232j5259j7224p934K910L151j835p04K985
$$ 633539 650808 650915 639100 627539 617307 602048 584824 576890 579800 582951 581116 580412 583397
9020E83397M75o29J2227K8372K3077l293k0781j1200R082J7225J2817O057k013
$$ 583397 583872 583243 595470 623842 646919 643626 622845 611645 620727 637952 650769 656826 654813
9007F54813j0820r493N798J7237P756j2932k3732k2521k0264j5665j154J3090
$$ 654813 643993 634500 640298 657535 665291 652359 628627 606106 585842 570177 569023 582113
8995E82113R859k095M047K8505L8399J6485j1541j4365M108K0339K6572K7470
$$ 582113 591972 589877 593924 622429 660828 677313 665772 651407 655515 675854 702426 729896
8983G29896J8024p420l2510l2468q886J1985J5711J2170R756J607j3403j7927
$$ 729896 747920 740500 707990 675522 666636 678621 694332 706502 716258 717865 704462 686535
8971F86535o70K0908K0954P97j3753q598L042N350M174J3944K9351K8321N828
$$ 686535 685865 706773 727727 728524 714771 706173 709215 714565 718739 732683 762034 790355 796183
8958G96183j1927j5K8641L7521J5270j0346j2568R90Q334P574J0348J4061P705
$$ 796183 784256 784241 812882 850403 865673 855327 842759 843749 852083 859657 870005 884066 891771
8945H91771j51J0845L4105L5198J464l4099l6876j6371m417n033L824K6217L7914
$$ 891771 891620 902465 936570 971768 973232 939133 902257 885886 881469 876436 880260 906477 944391
8932I44391K3888m13j4330j6846j4273k625K0165L7520L0545O665o912J157J4136
$$ 944391 968279 967866 953536 936690 922417 919792 939957 977477 1008022 1014687 1007775 1008932 1023068
8919A023068J5392J2203J9134K8691J8043j4115l5660j7932K5226N0995L8260
$$ 1023068 1038460 1050663 1069797 1098488 1116531 1102416 1066756 1048824 1074050 1125045 1163305
8908A163305R221l489M115J1945Q510K929O973J9386L0246L1217J9828K054q080
$$ 1163305 1172526 1169037 1173152 1185097 1193607 1196536 1203509 1222895 1253141 1284358 1304186 1306240 1298160
8895A298160k49J8993L2604L2971K6266J8008Q403L858J5204L6108M1307K0872
$$ 1298160 1297911 1316904 1349508 1382479 1408745 1426753 1435156 1439014 1454218 1490326 1531633 1552505
8883A552505L21O580K6426K4989k61j4215L211K8731L3255K2608K0430K9206L3208
$$ 1552505 1552826 1559406 1585832 1610821 1610560 1596345 1599556 1628287 1661542 1684150 1704580 1733786 1766994
8870A766994K9161K7711K8575K0397P222J0128L4597N7747N9366M6637L3874J6658
$$ 1766994 1796155 1823866 1852441 1872838 1880060 1890188 1924785 1982532 2041898 2088535 2122409 2139067
8858B139067j1981l2797j6326L3069P4278P6884N2016K8603J8983K0628L3332
$$ 2139067 2127086 2094289 2077963 2111032 2185310 2262194 2314210 2342813 2361796 2382424 2415756
8847B415756N4178O6205N5162L4516L1989M9867O0963N1019M2291N8493Q4290
$$ 2415756 2469934 2536139 2591301 2625817 2657806 2707673 2768636 2819655 2861946 2920439 3004729
8836C004729Q4993N9093M2539N5666P2327N8693K4674J1625L4229O0188N4801
$$ 3004729 3089722 3148815 3191354 3247020 3319347 3378040 3402714 3414339 3448568 3508756 3563557
8825C563557K6051J0765K6573N4107O4358M9720K5513J0867J2446K1318K2853
$$ 3563557 3589608 3600373 3626946 3681053 3745411 3795131 3820644 3831511 3843957 3865275 3888128
8814C888128J3201N680J5373L8681N6870O0346N8243N9943N9297M6647K8079K0734
$$ 3888128 3901329 3907009 3922382 3961063 4017933 4078279 4136522 4196465 4255762 4302409 4330488 4351222
8802D351222L2114N2926O8446P0759O3693O1257P4693R4304R4608O9357M9862
$$ 4351222 4383336 4436262 4504708 4575467 4639160 4700417 4775110 4869414 4964022 5033379 5083241
8791E083241O8736J12512J35107J18645R4760R7970J22236J37743J31459J14318
$$ 5083241 5151977 5264489 5399596 5518241 5613001 5710971 5833207 5970950 6102409 6216727
8781F216727J01944J03446J18156J31056J24224J04037R9690J20307J35591J21660
$$ 6216727 6318671 6422117 6540273 6671329 6795553 6899590 6999280 7119587 7255178 7376838
8771G376838J03025J15005J42052J38195J03012Q7580J15715J47225J41480J15790
$$ 7376838 7479863 7594868 7736920 7875115 7978127 8065707 8181422 8328647 8470127 8585917
8761H585917J08681J18533J18320J08965J14360J33014J37024J20544J12037J29597
$$ 8585917 8694598 8813131 8931451 9040416 9154776 9287790 9424814 9545358 9657395 9786992
8751I786992J54894J64579J62788J66400J76566J82624J83093J86823J98401K13414
$$ 9786992 9941886 10106465 10269253 10435653 10612219 10794843 10977936 11164759 11363160 11576574
8741A1576574K25476K31802K35118K42639K57646K71333K72271K65723K71383
$$ 11576574 11802050 12033852 12268970 12511609 12769255 13040588 13312859 13578582 13849965
8732A3849965K96468L23251L32258L27749L29260L44955L64778L76078L76180
$$ 13849965 14146433 14469684 14801942 15129691 15458951 15803906 16168684 16544762 16920942
8723A6920942L72231L76774M00256M39887M78567N02491N16444N34312N59480
$$ 16920942 17293173 17669947 18070203 18510090 18988657 19491148 20007592 20541904 21101384
8714B1101384N85457O11582O43706O79127P06140P22681P40858P64988P79197
$$ 21101384 21686841 22298423 22942129 23621256 24327396 25050077 25790935 26555923 27335120
8705B7335120P69674P48598P38451P38109P24382O87507O43029O00371N41668
$$ 27335120 28104794 28853392 29591843 30329952 31054334 31741841 32384870 32985241 33526909
8696C3526909M51154L50496K77948K34976J79876Q1034m4935j58524k41827l03679
$$ 33526909 33978063 34328559 34606507 34841483 35021359 35102393 35057458 34898934 34657107 34353428
8686C4353428l57147m10827m71123n32673n73758n81588n77082n92653o28151
$$ 34353428 33996281 33585454 33114331 32581658 32007900 31426312 30849230 30256577 29628426
8677B9628426o52706o51225o42913o46560o52993o45736o28055o12878o02430
$$ 29628426 28975720 28324495 27681582 27035022 26382029 25736293 25108238 24495360 23892930
8668B3892930n94703n95265o04392o05193n84690n57136n46301n52266n56288
$$ 23892930 23298227 22702962 22098570 21493377 20908687 20351551 19805250 19252984 18696696
8659A8696696n52107n49109n46925n31218m98893m67373m52021m49186m46939
$$ 18696696 18144589 17595480 17048555 16517337 16018444 15551071 15099050 14649864 14202925
8650A4202925m39713m28252m16654m11397m12140m04851l78705l47428l34288
$$ 14202925 13763212 13334960 12918306 12506909 12094769 11689918 11311213 10963785 10629497
8641A0629497l36115l26131k97411k76716k82219k92171k75696k36730k05267
$$ 10629497 10293382 9967251 9669840 9393124 9110905 8818734 8543038 8306308 8101041
8632H101041j97185k03756k11663k12937k02056j83123j74836j89053k08757k06827
$$ 8101041 7903856 7700100 7488437 7275500 7073444 6890321 6715485 6526432 6317675 6110848
8622F110848j83268j62643j56018j49113j32372j19297j23718j36398j38144j25427
$$ 6110848 5927580 5764937 5608919 5459806 5327434 5208137 5084419 4948021 4809877 4684450
8612D684450j11119j06809j12979j20652j16527r4079o5813n5976p2766r5286
$$ 4684450 4573331 4466522 4353543 4232891 4116364 4022285 3956472 3900496 3827730 3732444
8602C732444r7584p9726o4297o6164p8059q5894q5661q0087o8670n1432l8312
$$ 3732444 3634860 3555134 3490837 3424673 3346614 3260720 3175059 3094972 3026302 2974870 2936558
8591B936558m2528o1541p5160p0305n8933n8992o4674n5331l3254k7013m6876
$$ 2936558 2894030 2832489 2757329 2687024 2628091 2569099 2504425 2449094 2415840 2388827 2341951
8580B341951o2736m7837k2653k4222m6117m8362k4099j3060l7048o2348n0970
$$ 2341951 2279215 2231378 2208725 2184503 2138386 2090024 2065925 2052865 2015817 1953469 1902499
8569A902499j7992n923k2251l6690l0921j8950j9076l1227m4822n0783m4801l3050
$$ 1902499 1884507 1878584 1856333 1819643 1788722 1769772 1750696 1719469 1674647 1623864 1579063 1546013
8557A546013l1173m3091m8636l1450r777j3623l7363m6698l2470k2120k9660l1403
$$ 1546013 1514840 1471749 1423113 1391663 1381886 1368263 1330900 1284202 1251732 1229612 1199952 1168549
8545A168549j0323R014j832k7682l3230j7487r342j7257j9735p022J853o779j8121
$$ 1168549 1158226 1167240 1165408 1137726 1104496 1087009 1077667 1060410 1040675 1033653 1035506 1028727 1010606
8532A010606j4547k605K307J269K887J089j6479m2174n1314l4996j3987j1637
$$ 1010606 996059 993454 995761 997030 999917 1001006 984527 942353 891039 856043 842056 830419
8520H30419k3890k7407j2635M139M506o817j0201l59N876m412j8033j2079J1812
$$ 830419 806529 779122 766487 770626 775132 768315 758114 757755 763631 759219 741186 729107 740919
8507G40919K5155Q943k0106k9901j2564Q851J1828m94j0452j1230j0583j4299
$$ 740919 766074 775017 754911 725010 712446 721297 733125 732631 722179 710949 700366 686067
8495F86067j8352j8496j6712j3737m787R824J7848R249p533j5001j0406q051j6990
$$ 686067 667715 649219 632507 618770 613983 623807 641655 650904 643371 628370 617964 609913 592923
8482E92923k7955k6378r718J1509K2898J5905k452j0332N482K6593K0601j4197
$$ 592923 564968 538590 528872 540381 563279 579184 576732 566400 571882 598475 619076 604879
8470F04879m1679l4808r251M192J41q317j7751k8268k3888P910M3383M3547R000
$$ 604879 563200 528392 519141 523333 523474 515157 497406 469138 445250 453160 496543 540090 549090
8457E49090j8605j5020j276k953j2875j1933k120J768m017j3567k1741k0409j898
$$ 549090 530485 515465 514189 511236 498361 486428 484308 486076 482059 468492 446751 426342 424444
8444D24444K1538K2651j491j8294o666R749J711j7194j4609N949J2284m457k2009
$$ 424444 445982 468633 467142 448848 442182 451931 453642 436448 421839 427788 440072 435615 413606
8431D13606k6426k3517j3419R513L0195K3428l372j4354j70Q415n669j6512K39
$$ 413606 387180 363663 350244 359757 389952 413380 410008 395654 395484 403899 398230 381718 381957
8418C81957K7787L8188L2538K3947P071k3608m6219l6629p679Q938R479J4411
$$ 381957 409744 447932 480470 504417 511488 487880 441661 405032 397353 406291 415770 430181
8406D30181K5319K0530m990k6473k3634m749J0825J5099R734j154r236o216L728
$$ 430181 455500 476030 471040 444567 420933 416184 427009 442108 451842 450688 441452 435236 438964
8393D38964N893o209k2196k6818j4186Q937K7229K7683J3566K083J500R92p124
$$ 438964 444857 438648 416452 389634 375448 384385 411614 439297 452863 454946 456446 457438 450314
8380D50314j0239K336J4747O495j1730j2937R36N05k2445l9030k5125O001K4110
$$ 450314 440075 442411 457158 463653 451923 438986 439922 440427 417982 378952 353827 359828 383938
8367C83938J6068q352k7556k0963J0691L6759K9983O842N492K3904J9494j9648
$$ 383938 400006 391654 364098 343135 353826 390585 420568 427410 432902 456806 476300 456652
8355D56652m7344k7435J0004J5114r431k2220p876J3487K8424M0368M2833K1646
$$ 456652 409308 381873 391877 406991 397560 375340 367464 380951 409375 449743 492576 514222
8343E14222j3190l0650j9857j925M174L359N923R051N625l494j2073j3317k553
$$ 514222 501032 470382 450525 448600 452774 456133 462056 471107 476732 473238 461165 447848 445295
8330D45295J4246J9694O276q679n451R150J4634R038N020K452p430j6220p156
$$ 445295 459541 479235 485511 476832 471381 480531 495165 504203 509223 511675 504245 488025 480869
8317D80869J2532J9197J2378J3826K4982K1596j617j7406r680L590O574J0483
$$ 480869 493401 512598 524976 538802 563784 585380 583763 566357 556677 560267 566841 577324
8305E77324K2811K4858M905j4529r385R935K0560K1085J7442Q23k8560l9739j1116
$$ 577324 600135 624993 629898 615369 605984 615919 636479 657564 675006 675829 647269 607530 596414
8292E96414K5590K2672j3473l1742j1081J6483K0464R665M654O118O526Q288J4261
$$ 596414 622004 644676 631203 599461 588380 604863 625327 634992 639646 645764 652290 660578 674839
8279F74839J7070J0669Q01l184K639J6757K9884K6684N609r311K259K2245J6669
$$ 674839 691909 702578 703379 700195 702834 719591 749475 776159 781768 772457 774716 796961 813630
8266H13630r821j5839J4397M5532M2509J6321j939n890p355n231J0482L3888M6618
$$ 813630 803809 787970 802367 847899 890408 906729 904790 898900 891545 886314 896796 930684 977302
8253I77302M1077K3199j82k0381k2907l591J8553K3757J9981K7806M2743L9299
$$ 977302 1018379 1041578 1041396 1021015 998108 994517 1013070 1036827 1056808 1084614 1127357 1166656
8241A166656J4498q98J2905L2274K3510n805j5282J0916M1714M3465K4489J5716
$$ 1166656 1181154 1180256 1193161 1225435 1248945 1243140 1227858 1238774 1280488 1323953 1348442 1364158
8229A364158K1587J8567M82o033J6294M3671M3133J8468j77n03M578O639J0997
$$ 1364158 1385745 1404312 1404794 1398761 1415055 1458726 1501859 1520327 1520150 1519647 1524225 1530864 1541861
8216A541861J7329J7137J2747J5759K4423K4891J6654J3606J9095K5031L5064
$$ 1541861 1559190 1576327 1589074 1604833 1629256 1654147 1670801 1684407 1703502 1728533 1763597
8205A763597N7865P6203O0463K0743M296K5626M1784K1094n820K802L5210N2909
$$ 1763597 1821462 1897665 1958128 1978871 1983167 2008793 2050577 2071671 2065851 2068653 2103863 2156772
8193B156772N1564N1704N3878M8463M8993O8546Q1662O0299L1649M3997Q5383
$$ 2156772 2208336 2260040 2313918 2362381 2411374 2479920 2561582 2621881 2653530 2697527 2782910
8182B782910R7689O9291M8501N7446O0427L8553L0221O3107J02267J08169R9264
$$ 2782910 2880599 2949890 2998391 3055837 3116264 3154817 3185038 3248145 3350412 3458581 3557845
8171C557845J10789J31016J29240J16423J24729J47656J52913J41476J42706J57664
$$ 3557845 3668634 3799650 3928890 4045313 4170042 4317698 4470611 4612087 4754793 4912457
8161D912457J57961J42273J45784J82943K21542K29072K12708J97988J95907K07240
$$ 4912457 5070418 5212691 5358475 5541418 5762960 5992032 6204740 6402728 6598635 6805875
8151F805875K34822K72242K98133K99740K90284K89474K98228L05081L06085L04132
$$ 6805875 7040697 7312939 7611072 7910812 8201096 8490570 8788798 9093879 9399964 9704096
8141I704096K97027K81496K64879K58565K59742K51918K27368J99301J84148J77629
$$ 9704096 10001123 10282619 10547498 10806063 11065805 11317723 11545091 11744392 11928540 12106169
8131A2106169J60090J26412R7821R5518J12277J22853J15641R8436P8864N9862
$$ 12106169 12266259 12392671 12490492 12586010 12698287 12821140 12936781 13035217 13114081 13173943
8121A3173943N2061O5263Q4589Q2786O3684O2958R2422J17111J09808R4878J06074
$$ 13173943 13226004 13291267 13375856 13458642 13522326 13585284 13677706 13794817 13904625 13999503 14105577
8110A4105577J31147J39433J40581J66820K10831K34232K34105K47734K85798
$$ 14105577 14236724 14376157 14516738 14683558 14894389 15128621 15362726 15610460 15896258
8101A5896258L13906L15477L23426L64999M17464M48036M62955M85089N10724
$$ 15896258 16210164 16525641 16849067 17214066 17631530 18079566 18542521 19027610 19538334
8092A9538334N20981N14803N00647M73011M24276L63161K96415K10176R5663k5564
$$ 19538334 20059315 20574118 21074765 21547776 21972052 22335213 22631628 22841804 22937467 22911903
8082B2911903j31028k33489l53738m72493n48145n75063n85732n97334n95106
$$ 22911903 22780875 22547386 22193648 21721155 21173010 20597947 20012215 19414881 18819775
8073A8819775n72918n51875n45068n35114n04616m65604m39601m24510m00014
$$ 18819775 18246857 17694982 17149914 16614800 16110184 15644580 15204979 14780469 14380455
8064A4380455l57772l12613k86275k85547k93241k81473k40865j93841j68950
$$ 14380455 14022683 13710070 13423795 13138248 12845007 12563534 12322669 12128828 11959878
8055A1959878j66164j61340j40731j13500r1206p4296o0833n0135l4959r160J3668
$$ 11959878 11793714 11632374 11491643 11378143 11286937 11212641 11151808 11101673 11066714 11057554 11071222
8044A1071222J0621j4547k8149j0995J4060J5153m557j6053q404k526k0708n6940
$$ 11071222 11081843 11067296 11039147 11028152 11042212 11057365 11052808 11036755 11028351 11025825 11005117 10948177
8032A0948177q4110q6996q3001j04247j57160k10594k34537k38392k51103k73487
$$ 10948177 10864067 10777071 10694070 10589823 10432663 10222069 9987532 9749140 9498037 9224550
8022I224550k80131k66747k60545k74637k86603k78915k68183k70847k69618k44371
$$ 9224550 8944419 8677672 8417127 8142490 7855887 7576972 7308789 7037942 6768324 6523953
8012F523953k12589k04412k14682k15582k04184k00071k03357j93925j70875j55495
$$ 6523953 6311364 6106952 5892270 5676688 5472504 5272433 5069076 4875151 4704276 4548781
8002D548781j52418j44141j29586j31039j51348j59803j37940j08674r9576j04186
$$ 4548781 4396363 4252222 4122636 3991597 3840249 3680446 3542506 3433832 3334256 3230070
7992C230070j02147r4126r1942r2778q8066q3112q4464q2156o8215n9141p2936
$$ 3230070 3127923 3033797 2941855 2849077 2761011 2677899 2593435 2511279 2443064 2383923 2310987
7981B310987r4448r2760o7820n0834n8935p6472q3328p6552n9525l4244j2106
$$ 2310987 2216539 2123779 2055959 2005125 1946190 1869718 1786390 1709838 1650313 1616069 1603963
7970A603963j0351k7434m0119l4706k4410k5963l5975m2371m3717m3257l7333
$$ 1603963 1593612 1566178 1526059 1491353 1466943 1440980 1405005 1362634 1318917 1275660 1238327
7959A238327k5317k0230l2395m9417m9458l1338j6060j8268k9438l2313k2617
$$ 1238327 1213010 1192780 1160385 1110968 1061510 1030172 1014112 995844 966406 934093 911476
7948I11476j1853j2561k3349k9162j9110k875j338j8839l5582l3789k0635j5102
$$ 911476 899623 887062 863713 834551 815441 812566 811228 792389 756807 723018 702383 687281
7936F87281k1159k6660k3222j4564p972p654j3496j8506j3259j420j234j9428
$$ 687281 666122 639462 616240 601676 593704 586050 572554 554048 540789 539369 538135 518707
7924E18707l4335k2790N104J9498J2480J402n789j8767l5414l5627j5526R67P
$$ 518707 484372 461582 466686 486184 498664 500066 494277 475510 440096 404469 388943 389910 389917
7911C89917o0J5220K4375K482l3137m2343j7980Q643J4369O945j05p713j8641
$$ 389917 389857 405077 429452 431934 398797 356454 338474 347117 361486 368431 368326 360613 341972
7898C41972k5819k3316j5206p028N4L072k757j4115k0094j5305m108P070J2341
$$ 341972 316153 292837 277631 270603 270657 273729 270972 256857 236763 221458 217350 224420 236761
7885B36761N535j0578j9544j1204n51p202k1967j9101O29R154k702j0269L228
$$ 236761 242296 231718 212174 200970 200419 193217 171250 152149 152778 161932 159230 148961 152189
7872A52189K0827K3537J8427J4855J352k7294m5067k8921J179J0752L791R080
$$ 152189 173016 196553 214980 229835 231187 203893 158826 129905 131084 141836 145627 154707
7860A54707K4019J6332j7368l8780k5814m609l801j0163K278K2845J7873j5788
$$ 154707 178726 195058 177690 138910 113096 108487 104686 94523 96801 119646 137519 121731
7848A21731m2011l2118J644K5155J9899m900k6677k8875j2166O984J1477J022
$$ 121731 79720 47602 49246 74401 94300 89400 62723 33848 21682 28666 40143 41165
7836D1165q236m479M102J768r740j1548K845J3306J792j6625j2978J0423K0715
$$ 41165 32929 28450 32552 34320 24580 13032 15877 29183 30975 14350 1372 11795 32510
7823C2510L597j6481j5988m232J954P807J9359J7800j0654l7517k4692J5697L5773
$$ 32510 36107 19626 3638 -594 1360 9167 28526 46326 35672 -1845 -26537 -10840 24933
7810B4933K1911O089N121l333k9788m3670k0756J5773L0576K4035J6419J0076
$$ 24933 46844 52933 58054 54721 24933 -18737 -39493 -23720 6856 30891 47310 57386
7798E7386j478p846J669J1644K559j3859j3264j332l398j8493k0046k169R840
$$ 57386 55908 48062 49731 61375 63934 50075 36811 35479 32081 13588 -6458 -8627 1213
7785A213J627q723k824R643R099n045j7491j8046r714k840n254j2263q494J1226
$$ 1213 2840 -5883 -8707 936 10035 4990 -12501 -30547 -40261 -43101 -48355 -60618 -69112 -57886
7771e7886K8388K2519P88j2237j0334r169j5080j5113l186P556P590N757J0511
$$ -57886 -29498 -6979 -6191 -18428 -28762 -37931 -53011 -68124 -71310 -63754 -56164 -50407 -39896
7758c9896J4751J0809M256Q91m599j4502j7221n303Q145O957l219l798Q398J7415
$$ -39896 -25145 -14336 -10080 -9189 -13788 -28290 -45511 -50814 -42669 -35712 -38931 -42729 -34331 -16916
7744a6916J1962J55k901M416P344o254k6041k7030l413J7011P784j6295j8322
$$ -16916 -4954 -4799 -7700 -3284 4060 -2194 -28235 -55265 -58678 -41667 -33883 -50178 -68500
7731f8500N141J8454K930j4020k861K3313L2369J9453J982j4513l3887m3400k4349
$$ -68500 -63359 -44905 -41975 -55995 -58856 -35543 -3174 16279 18261 3748 -30139 -73539 -97888
7718i7888J2067L0218J6515m967j0082m017k067j799Q260K3501K4560L131k3766
$$ -97888 -85821 -55603 -39088 -44055 -54137 -58154 -60221 -62020 -53760 -30259 -5699 -2568 -26334
7705b6334k9289n904K2729K4301m406l0113k1545J2090L3724K3901k455k2658
$$ -26334 -55623 -61527 -38798 -14497 -18903 -49016 -70561 -58471 -24747 -846 -3301 -25959
7693b5959l0354k8661j7342J823J8072K1940J6642J0356L124q822j9660j6760
$$ -25959 -56313 -84974 -102316 -100493 -82421 -60481 -43839 -33483 -30359 -39181 -58841 -75601
7681g5601J290J8697K0318J0204M781R512J2164K900q998q011M552J3107J0110
$$ -75601 -74311 -55614 -35296 -25092 -20311 -10799 1365 4265 -4733 -12744 -8192 4915 15025
7668A5025J388r249k3253l3073k4640j502J2746O655k893P42R255J0109J1265
$$ 15025 16413 7164 -16089 -49162 -73802 -75304 -62558 -55903 -58796 -58054 -48799 -38690 -27425
7655b7425K2305K8591J2470j2708j9909j0396o654r904q7K2902L4206K4949J3125
$$ -27425 -5120 23471 35941 23233 3324 -7072 -13726 -23630 -23717 -815 33391 58340 71465
7642G1465O078j1185l6593l7125K148M5119M8409J6346j4334k5430k4217j5157
$$ 71465 77543 66358 29765 -7360 -5212 39907 88316 104662 90328 64898 40681 25524
7630B5524K551J5423N000k0344k7542j095L3026L5934J158l6098l5927K089L7421
$$ 25524 28075 43498 48498 28154 612 -483 32543 68477 69635 33537 -2390 -301 37120
7617C7120L6049R951n129j594k904j6433j8525J589J6990M575j6430j4755O199
$$ 37120 73169 83120 77991 76397 73493 57060 38535 40124 57114 61689 45259 30504 36703
7604C6703K0796K1495J6667N327j3089j8339M627K9904K0201j3541k4093j27J7494
$$ 36703 57499 78994 95661 100988 87899 69560 74187 104091 124292 110751 86658 86531 104025
7591A04025J681k0351j2990J4406K6005R858j4287k4680j6748j500L235j1181
$$ 104025 105706 85355 72365 86771 112776 122634 108347 83667 66919 65419 68654 57473
7579E7473k9804k7570k528J9334J8760N718j134r1J99j817k683l322o110j0075
$$ 57473 27669 99 -2429 16905 35665 41383 40249 40158 40357 38540 35857 32535 26425 16350
7565A6350j3891j4563l531K0865L8273K5740n303j7595r31J1984m041k9043l0996
$$ 16350 2459 -12104 -15635 5230 43503 69243 63940 46345 45414 57398 53357 24314 -6682
7552f682j1653M895R390Q240M158J44P191K4044K6388K530j8197n018K2336K0021
$$ -6682 -18335 -13440 -4050 4190 8348 8492 15683 39727 66115 68645 50448 45430 67766 87787
7538H7787j1067k6319p293J3246O421j2272j5926o947j809l6O851J2691O978l348
$$ 87787 76720 50401 43108 56354 62775 50503 34577 27630 25821 25785 32636 45327 52305 48957
7524D8957l520M906P876J758m101n044o549j1782j5284j1156j86J2009J9158J7648
$$ 48957 45437 50343 58219 59977 55876 50832 44283 32501 17217 6061 5875 17884 37042 54690
7510E4690J0182M568M684M775k181j2170j2765P6J3024Q753j2021k8050k1406
$$ 54690 64872 69440 74124 78899 76718 64548 51783 51859 64883 73636 61615 33565 12159
7497A2159M43J4161R789n07m041l972o921p328L219J8796K4138J3130o644k2481
$$ 12159 12602 26763 36552 36045 32004 28032 21111 13783 17002 35798 59936 73066 66422 43941
7483D3941k2351j791K5018L1940J1497j2356j5836n460R36N383J5584J6500p363
$$ 43941 21590 19799 44817 76757 88254 75898 60062 54602 55538 60921 76505 93005 85642
7470H5642l1650j7974K1234L1737L93k1575n0K6357R138l1478l8925o670J9120
$$ 85642 53992 36018 57252 88989 89382 67807 67757 94114 103252 71774 32849 26179 45299
7457D5299J3030k420m397j478o690j2307o926M757J1952J1517L853r910k1058
$$ 45299 58329 55909 51512 50034 43344 31037 24111 28868 40820 52337 56190 46280 25222
7444B5222j8184l574Q590J2352J3400J1756K5j6850j9751k073J7894K0666Q129
$$ 25222 7038 3464 12054 24406 37806 49562 49587 32737 12986 10913 28807 49473 57602
7431E7602n491j1431o990P335K1089J7844k231j6197p732Q745Q559q156j9835
$$ 57602 52111 40680 33690 41025 62114 79958 77727 61530 53798 62543 71102 62946 43111
7418D3111j6103p617m006r03O191J0824P105J551L814J2559J9514K2139K2516
$$ 43111 27008 19391 15385 14482 20673 31497 38602 40153 43967 56526 76040 98179 120695
7405A20695J7255P87k0066k6678j0401J3931K3749J3032o195k0774k4994j6903
$$ 120695 137950 138737 118671 91993 81592 95523 119272 132304 126109 105335 80341 63438
7393F3438P08J5936J7281R326O516R593L871j4023k5657j7969m519l885j0277
$$ 63438 64146 80082 97363 106689 113205 122798 126669 112646 86989 69020 64501 60616 50339
7380E0339n056J1306J9594J0537n706j7134k0011j3003J481J1051O262m94J1435
$$ 50339 45283 56589 76183 86720 81014 63880 43869 30866 32347 43398 49660 49166 60601
7367F0601L6520M3601J7698j8021l2009j9795R30J5307J7906O480j4940l2153
$$ 60601 97121 140722 158420 140399 108390 88595 89525 104832 122738 129218 114278 82125
7355H2125l2952k1342j1436r416q243R90J7084K8416K4264O957j0201j8649k0950
$$ 82125 49173 27831 16395 6979 -1264 -274 16810 45226 69490 76447 66246 47597 26647
7342B6647j8186m422J5845K1198L578j0239N363L0289K5425m112j5808j32N934
$$ 26647 8461 4039 19884 41082 44660 34421 39784 70073 95498 91386 75578 75446 81380
7329H1380j2517j9429O611K8764J2633j3728q617J1481N389j5700q395K2024K8863
$$ 81380 68863 49434 56045 84809 97442 83714 75097 86578 91967 76267 67872 89896 118759
7316A18759P727L341K4802K4007j8278n0121k9326Q631J0635j0208n725K2160
$$ 118759 126486 129827 154629 178636 160358 110237 80911 89542 100177 89969 84244 106404
7304A06404K7475p45k1867r374J3838J8193Q488M383O131M07j3809k2575j5450
$$ 106404 133879 133134 111267 101893 115731 133924 142412 146795 152926 153333 139524 116949 101499
7291A01499K990J8252J9156P973k660m468q57K738O839R563J615j7646k8354j1703
$$ 101499 104489 122741 141897 149870 147210 142742 141885 144623 151462 161025 162640 144994 116640 104937
7277A04937K0507L5739K0563n359j7583j3642n743j91N812J3664J8886J6188N383
$$ 104937 125444 161183 181746 176387 158804 145162 139419 139228 145040 158704 177590 193778 199161
7264A99161p478j5143j6513j6010j3428j874J6861K3646M248k3361k3895P888
$$ 199161 191683 176540 160027 144017 130589 128715 145576 169222 173470 150109 126214 134102
7252A34102L4038K1164j3298k3094M192L0119J7184k2221m4087k8112N093K8545
$$ 134102 168140 189304 176006 152912 157104 187223 204407 182186 138099 109987 115080 143625
7240A43625L7915L9615L0681P807j5159j8516k608J3359J6546R970o97j2556j7676
$$ 143625 181540 221155 251836 259643 244484 225968 223360 236719 253265 263235 262538 249982 232306
7227B32306q423O389Q493k777q967k151N479Q139J7104L2799L3623J2207l308
$$ 232306 223883 230272 238765 235988 227021 224870 230349 238488 255592 288391 322014 334221 330913
7214C30913R127K5771J2581j7689k4397n644r09k3925l7106r744L3362M5903K0480
$$ 330913 340040 365811 378392 360703 336306 330662 329753 305828 268722 258978 292340 338243 358723
7201C58723q450r270J7735M8093N6526L7816J1498K47L144K002p232q500N934
$$ 358723 350273 341003 358738 406831 463357 501173 512671 512918 516062 518064 510832 502332 508266
7188E08266K2593L0039L3933L8433L3516J4909j631j449R370J9292K9138L9766
$$ 508266 530859 560898 594831 633264 666780 681689 680058 678609 687979 707271 736409 776175
7176G76175M0724K9601K5184M0470N8735N9125N0267N3064O4423O7033O3216O7362
$$ 776175 816899 846500 871684 912154 970889 1030014 1080281 1133345 1197768 1264801 1328017 1395379
7164A395379P3638O6288N6930P2973J07581J21554J03726Q8768R7518R8868N9878
$$ 1395379 1469017 1535305 1592235 1665208 1772789 1894343 1998069 2086837 2184355 2283223 2343101
7153B343101L424k0870o501M967j7236o0159r3712j04409r7103q2634p2260p2898
$$ 2343101 2346525 2325655 2319154 2324121 2306885 2246726 2153014 2048605 1951502 1868868 1796608 1723710
7141A723710q0858q5466q0148o6193m9038l7121l8868n1625n8052m4718k1568
$$ 1723710 1642852 1557386 1477238 1411045 1362007 1324886 1286018 1234393 1176341 1131623 1110055
7130A110055j1844k3664m2144m9449m2493l0185k2253k2544k6704k6410k0611
$$ 1110055 1098211 1074547 1032403 982954 940461 910276 888023 865479 838775 812365 791754
7119G91754j8376k3286k2891p269Q551P61k5681l9006k5786r975j3381k0126l503
$$ 791754 773378 750092 727201 719932 728483 729244 703563 664557 638771 628796 615415 595289 591786
7106E91786K7060L4958Q517k2915k9299j3897J342N509J562p047j8165k5854k4484
$$ 591786 618846 653804 662321 639406 610107 596210 597552 603061 604623 597576 579411 553557 529073
7093E29073j5107k546Q579J1989L684p339m569J1855K0113P790o547o75J5371
$$ 529073 513966 511420 519999 531988 535672 528333 523764 535619 555732 563522 556975 556300 571671
7080E71671J4781l014j3749j0791j3374k5806k2678P260L2767K2879m909j2136
$$ 571671 586452 583438 569689 558898 545524 519718 497040 504300 537067 559946 555037 542901
7068E42901O24K55j7692j7723J4919M1551K3775j7518l0381n497J4889K580j7178
$$ 542901 543525 543780 526088 508365 523284 564835 588610 571092 540711 535214 550103 552683 535505
7055E35505q105K1344L2225J3305o633o815l663j5680k5055l938L3975M3933J4042
$$ 535505 527400 548744 580969 594274 587641 580826 577163 561483 536428 532490 566465 610398 624440
7042F24440j5114p601K0150K9213J2952m222p962n658l771L53N041L992o43k460
$$ 624440 609326 601725 621875 651088 664040 659818 651856 646198 642427 642780 647821 651813 651170 648710
7028F48710n274j4828k0354o554J7884K7451J6198L033j134n357j2490q514J1245
$$ 648710 643436 628608 608254 601700 619584 647035 663233 666266 665132 659775 647285 638771 650016
7015F50016K9134L0780K2353J1641m164j9018j2903J4454K9267Q063k3046k1073
$$ 650016 679150 709930 732283 743924 739760 720742 707839 722293 751560 759623 736577 715504
7003G15504J4814M4500L9363Q957j9829k8585j5251N848J4324O648J594J1780
$$ 715504 730318 774818 814181 823138 803309 774724 759473 765321 779645 786293 787887 799667
6991G99667K3509K0366J0285Q261Q638K9p382O82J0758J269j5332p750K0766L3767
$$ 799667 823176 843542 853827 862088 870726 870755 863373 864055 874813 876082 860750 853000 873766 907533
6977I07533J8456K032M068J0772Q863Q845J7652K0436Q905m44L468M448j1104
$$ 907533 925989 928021 932089 942861 951724 960569 978221 998657 1007562 1007118 1010586 1015034 1003930
6964A003930k6204j8601N300K3462K8072K2905Q966p126p802J1875L1243L3327
$$ 1003930 977726 959125 964425 987887 1015959 1038864 1047830 1040704 1032902 1044777 1076020 1109347
6952A109347K8920L2105L3301K1121J0124J6971K6325J3370j2389j9403j084K2340
$$ 1109347 1138267 1170372 1203673 1224794 1234918 1251889 1278214 1291584 1279195 1259792 1258708 1281048
6940A281048M1197O0752P2986O0652L0860J0733O435n59j3004r808J2613K7066
$$ 1281048 1322245 1382997 1455983 1516635 1547495 1558228 1564663 1564104 1551100 1541292 1553905 1580971
6928A580971J9393J2606K6587M2577L3806R706Q33J3162K4807K1807J2990R969
$$ 1580971 1600364 1612970 1639557 1682134 1715940 1725646 1726479 1739641 1764448 1786255 1799245 1809214
6916A809214J2213J5802K3272L8024N4219N7669L9745J1707n42J5735M2160N1020
$$ 1809214 1821427 1837229 1860501 1898525 1952744 2010413 2050158 2061865 2061323 2077058 2119218 2170238
6904B170238M0672L2385L4267L1595J8375J3499L0674N1582M8774K4054N432J1463
$$ 2170238 2210910 2243295 2277562 2309157 2327532 2341031 2371705 2423287 2472061 2496115 2501547 2513010
6892B513010L3647N1130N1360L8021K6055K6147L1036K4341N768m016J0115L7994
$$ 2513010 2546657 2597787 2649147 2687168 2713223 2739370 2770406 2794747 2800515 2796499 2806614 2844608
6880B844608N8653O3072N4393L8015K2120J6690K0476J9279Q125L601K0467M6195
$$ 2844608 2903261 2966333 3020726 3058741 3080861 3097551 3118027 3137306 3145431 3149032 3169499 3215694
6868C215694N4158L6440J0781j32J2810M0086N8746N1792K9671K0286L1028L9024
$$ 3215694 3269852 3306292 3317073 3316941 3329751 3369837 3428583 3480375 3510046 3530332 3561360 3600384
6856C600384K9596K1095L2463M9055M7990L8920M7124O8469P6064O5389N8152
$$ 3600384 3629980 3651075 3683538 3732593 3780583 3819503 3866627 3935096 4011160 4076549 4134701
6845D134701O3048O6181O1868O0904O4821O2620N6833O1855P2841O9836N7934
$$ 4134701 4197749 4263930 4325798 4386702 4451523 4514143 4570976 4632831 4705672 4775508 4833442
6834D833442O5431R2252J01537P9963O4127Q0556J00035Q8015O5710P5522J09955
$$ 4833442 4898873 4991125 5092662 5172625 5236752 5317308 5417343 5505358 5571068 5646590 5756545
6823E756545J24873J10427R8139J00727R5553P6703P6476J12989J52086J50266
$$ 5756545 5881418 5991845 6089984 6190711 6286264 6362967 6439443 6552432 6704518 6854784
6813F854784J14049Q8205R5882J16322J21079J11168J09118J24056J38158J32164
$$ 6854784 6968833 7057038 7152920 7269242 7390321 7501489 7610607 7734663 7872821 8004985
6803H004985J15020J13055J29669J36286J15215R1462R8766J27097J34283J07143
$$ 8004985 8120005 8233060 8362729 8499015 8614230 8705692 8804458 8931555 9065838 9172981
6793I172981Q0112Q6547J18480J46354J56119J52184J41865J33332J35998J48481
$$ 9172981 9253093 9339640 9458120 9604474 9760593 9912777 10054642 10187974 10323972 10472453
6783A0472453J56710J55154J57156J72068J86856J87013J82942J95380K23130
$$ 10472453 10629163 10784317 10941473 11113541 11300397 11487410 11670352 11865732 12088862
6774A2088862K46123K55412K59388K62933K62138K60862K71556K95121L18453
$$ 12088862 12334985 12590397 12849785 13112718 13374856 13635718 13907274 14202395 14520848
6765A4520848L36789L59209L85098L96882L89719L88587M16265M58906M85914
$$ 14520848 14857637 15216846 15601944 15998826 16388545 16777132 17193397 17652303 18138217
6756A8138217M93747N04203N24156N36365N34009N36136N57003N84572O06201
$$ 18138217 18631964 19136167 19660323 20196688 20730697 21266833 21823836 22408408 23014609
6747B3014609O34328O84048P41371P80934Q05987Q42081Q94683R43432R81181
$$ 23014609 23648937 24332985 25074356 25855290 26661277 27503358 28398041 29341473 30322654
6738C0322654J027650J094063J163297J221950J285888J371132J461165J531957
$$ 30322654 31350304 32444367 33607664 34829614 36115502 37486634 38947799 40479756
6730D0479756J594597J681287J796283J913022K019329K133935K272487K426623
$$ 40479756 42074353 43755640 45551923 47464945 49484274 51618209 53890696 56317319
6722E6317319K588205K768585K977090L199509L416014L627960L852748M103233
$$ 56317319 58905524 61674109 64651199 67850708 71266722 74894682 78747430 82850663
6714H2850663M383726M692945N018632N345360N685418O087890O595331P200554
$$ 82850663 87234389 91927334 96945966 102291326 107976744 114064634 120659965 127860519
6706A27860519P868056Q589658R393151J0299108J1295159J2352750J3440475
$$ 127860519 135728575 144318233 153711384 164010492 175305651 187658401 201098876
6699B01098876J4515478J5531589J6468328J7321704J8042292J8502228J8548141
$$ 201098876 215614354 231145943 247614271 264935975 282978267 301480495 320028636
6692C20028636J8073440J7021754J5351748J3048753J0163782O786539K969557
$$ 320028636 338102076 355123830 370475578 383524331 393688113 400474652 403444209
6685D03444209j257165n742858j0114902j3884689j6680943j8385397j9088886
$$ 403444209 402187044 396444186 386329284 372444595 355763652 337378255 318289369
6678C18289369j8987839j8327652j7359826j6268519j5128749j3960310j2811125
$$ 318289369 299301530 280973878 263614052 247345533 232216784 218256474 205445349
6671B05445349j1758572j0841551j0034140r295221q613337p991743p420145o885236
$$ 205445349 193686777 182845226 172811086 163515865 154902528 146910785 139490640 132605404
6663A32605404o393170n959502n584724n256851m971644m732543m532214m350192
$$ 132605404 126212234 120252732 114668008 109411157 104439513 99706970 95174756 90824564
6655I0824564m172063l999836l838342l678959l504295l308547l108320k928837
$$ 90824564 86652501 82652665 78814323 75135364 71631069 68322522 65214202 62285365
6647F2285365k778988k644580k508061k367136k227837k089821j953233j832497
$$ 62285365 59506377 56861797 54353736 51986600 49758763 47668942 45715709 43883212
6639D3883212j742238j670796j590966j500277j424561j372555j316291j235660
$$ 43883212 42140974 40470178 38879212 37378935 35954374 34581819 33265528 32029868
6631C2029868j155277j107982j081981j040155r80512r37132r20797q98974q47536
$$ 32029868 30874591 29766609 28684628 27644473 26663961 25726829 24806032 23907058 23059522
6622B3059522p88407p54017p38361p09338o56974o04753n76213n69061n63675
$$ 23059522 22271115 21517098 20778737 20069399 19412425 18807672 18231459 17662398 17098723
6613A7098723n44440n10005m71012m41179m26192m18863m06377l83507l59255
$$ 17098723 16554283 16044278 15573266 15132087 14705895 14287032 13880655 13497148 13137893
6604A3137893l49598l60072l74669l68870l38236l06298k95943l00979k97965
$$ 13137893 12788295 12428223 12053554 11684684 11346448 11040150 10744207 10443228 10145263
6595A0145263k79037k57103k42563k33215k27183k27369k29732k24030k10327
$$ 10145263 9866226 9609123 9366560 9133345 8906162 8678793 8449061 8225031 8014704
6586H014704j98856j90083j73213j50040j39905j50799j64131j61396j49348j43607
$$ 8014704 7815848 7625765 7452552 7302512 7162607 7011808 6847677 6686281 6536933 6393326
6576F393326j42357j34699j24363j25205j37054j42629j29308j04546q9220r8322
$$ 6393326 6250969 6116270 5991907 5866702 5729648 5587019 5457711 5353165 5263945 5165623
6566E165623j23941j38331j24456j01561j02350j24383j30406j04669p7904p7998
$$ 5165623 5041682 4903351 4778895 4677334 4574984 4450601 4320195 4215526 4137622 4059624
6556D059624q6708p4378n2269n3001p4799q4943p2052n7189n4119n3680n0575
$$ 4059624 3972916 3898538 3846269 3793268 3718469 3633526 3561474 3504285 3450166 3396486 3345911
6545C345911n3373o2082o4054n7783n4946n5443m7147l3131l0163l6605l3140
$$ 3345911 3292538 3230456 3166402 3108619 3053673 2998230 2951083 2917952 2887789 2851184 2818044
6534B818044k0451k1957m0569m9096l6920k9077m0991n1709m5744m4435o4784
$$ 2818044 2797593 2775636 2735067 2685971 2649051 2619974 2578983 2527274 2481530 2437095 2372311
6523B372311q0537o1475k4770p659j0586r012m262j7441m2644n1421m1597l9537
$$ 2372311 2291774 2230299 2205529 2197870 2187284 2178272 2174010 2156569 2113925 2062504 2020907 1981370
6511A981370n2087n6280m2940l2963l9746m8471m5344l8772l8486l8239l1426
$$ 1981370 1929283 1873003 1830063 1797100 1757354 1708883 1663539 1624767 1586281 1548042 1516616
6500A516616k2948j7028j3718k1083m5264o5496n1499j3637J092k1774l8373j5099
$$ 1516616 1493668 1476640 1462922 1441839 1396575 1331079 1279580 1265943 1267035 1245261 1206888 1191789
6488A191789J5011K502m0168n6698k9622J354K815j2219j7068j1008r791j8002
$$ 1191789 1206800 1209302 1169134 1112436 1082814 1084168 1086983 1074764 1057696 1046688 1036897 1018895
6476A018895k7344l0901k7743k0118j2680j0201j4063k4065l9738n3917n2344
$$ 1018895 991551 960650 932907 912789 900109 889908 875845 851780 812042 758125 705781
6465G05781l0435m128Q517J0255J5104K3302K4170J8631J6582J3177p408l9934
$$ 705781 675346 671218 679735 689990 705094 728396 752566 771197 787779 800956 793548 753614
6453G53614n4350l5009l401J1448Q069K944J061n311j7430k7662l1955l0265j8511
$$ 753614 699264 664255 660854 672302 680371 683315 684376 679065 661635 633973 602018 571753 553242
6440E53242N247K8472L2701J6422j846o333q32P55o750j5713j6689q867N79N524
$$ 553242 558489 586961 619662 636084 634238 627905 627073 627828 621078 605365 588676 579809 580388 585912
6426E85912O611O271J549j0986k4227k4680j1074J827L752J635K702j737j9571
$$ 585912 592523 598794 600343 589357 565130 540450 529376 531203 534955 536590 539292 537555 517984
6413E17984l5348k6834o38J2703J973j0458n536N473N323n12r20o043k8460m9455
$$ 517984 482636 455802 455164 467867 469840 459382 453846 459319 464642 464130 463210 457167 428707 379252
6399C79252l8111j994J6439J129j4887m392R847n489l6230m0839j6583l559k0632
$$ 379252 341141 339147 355586 356715 341828 337436 347283 341794 305564 264725 248142 244583 223951
6386B23951l7182k3651K856Q043p135j3130m08Q041n772k7859l2176j4272N513
$$ 223951 186769 163118 165974 174017 166882 153752 153344 161385 155613 127754 95578 81306 86819
6373H6819Q404r34k242J1743K1928P836j8673k3545N65J7882j412l4741l6022
$$ 86819 95223 94289 92047 103790 125718 133554 114881 91336 91901 109783 108371 73630 37608
6360C7608o57K9498K6051P997N857J8349K2289Q418j1316k2771k1041r205K721
$$ 37608 36951 66449 92500 100497 106354 124703 146992 155410 144094 121323 100282 91077 93798
6347I3798L457o228j2737r496p305j5185k2230j3065O991J8097J2703J271n712
$$ 93798 97255 91027 78290 68794 61489 46304 24074 11009 18000 36097 48800 50071 44359
6334D4359o765k451N906J0410L626p142n916Q567J8006Q165j2636k4387j7659
$$ 44359 37594 35143 41049 51459 55085 47943 42027 50594 68600 76765 64129 39742 22083
6321B2083n76J1152Q112m913j4119j2659p615n975j883J0362J8482O676j4623
$$ 22083 21507 32659 40771 35858 21739 9080 1465 -4510 -6393 3969 22451 29127 14504
6308A4504j6549O253K4491J5124p946j9089j6835j4146r347O300K0780J0597k0857
$$ 14504 -2045 4208 28699 43823 35877 16788 -47 -14193 -23540 -17240 3540 14137 -6720
6295f720m0501k8831m704L670n184j2474q236J859J1214J8411K1020J6057P606
$$ -6720 -47221 -76052 -80756 -77086 -82270 -94744 -102980 -101121 -89907 -71496 -50476 -34419 -26813
6282b6813M494Q332J0427K889j1425k1646j8657k239J8065K8640K1904L170j2963
$$ -26813 -22319 -13987 -3560 -671 -12096 -33742 -52399 -54638 -36573 -7933 13971 17141 4178
6269D178j3898J522K1877L1087K1821L878m527K908J3395J3183P021R766K1897
$$ 4178 -9720 -8198 13679 44766 66587 70465 65938 68846 82241 95424 102445 112211 134108
6256A34108K7306J8060P226R216J9549K5598K6967K9495K7008R695j1222j0521
$$ 134108 161414 179474 186700 195916 215465 241063 268030 297525 324533 334228 323006 312485
6244C12485J3897L3142K7749J5140J9878L5402L8991L1647L4628N1617O3616O2864
$$ 312485 326382 359524 387273 402413 422291 457693 496684 528331 562959 614576 678192 741056
6232G41056O3805P3916Q0085P4334O8998P3224P7121P4086P6465R0880J00154
$$ 741056 804861 878777 958862 1033196 1102194 1175418 1252539 1326625 1403090 1493970 1594124
6221A594124R1361P9688P8272O6759K4635k2475l2864j5271j7547m9580o9418
$$ 1594124 1685485 1765173 1843445 1910204 1934839 1912364 1879500 1864229 1846682 1797102 1727684
6210A727684n7491n1411q0456j12699j06408p7718p0806q5764q6363o6345n6653
$$ 1727684 1670193 1618782 1538326 1425627 1319219 1241501 1170695 1084931 998568 932223 875570
6199H75570o7886p3947o1570n2622o0718o3111l9401r410n304k4833l8282l0791
$$ 875570 807684 733737 672167 619545 558827 495716 456315 446905 441601 416768 378486 347695
6187C47695j5204r176j7410l2481m0456l0941j1450l338j3576k2942j5735o703
$$ 347695 332491 323315 305905 273424 232968 202027 190577 187239 173663 150721 134986 128283
6175A28283j7760l9350m1971k2053o868r952j1245N267K0678J0509j3301j8198
$$ 128283 110523 71173 29202 7149 281 -9671 -20916 -15649 5029 15538 2237 -15961
6163a5961j166P099q877k4874j5625N332P976o290q863O408J0423j3118l6062
$$ -15961 -17127 -10028 -18905 -43779 -59404 -54072 -46096 -52386 -61249 -54841 -44418 -57536 -93598
6150i3598k5680M216J3140n310j7337m205J1922Q966n60K721Q789j839j8807j4504
$$ -93598 -119278 -115062 -101922 -107232 -124569 -128774 -116852 -107886 -108446 -105725 -96936 -98775 -117582 -132086
6136a32086J0620K5651J3727o870j2220k566O045M370m668j2887j3101n881j424
$$ -132086 -121466 -95815 -82088 -88958 -101178 -103744 -97699 -93329 -97997 -110884 -123985 -129866 -131290
6123a31290o587j2680p850K130J331j0652j9212j9667j9781j6596K785L1025L9555
$$ -131290 -137877 -150557 -158407 -156277 -154946 -165598 -184810 -204477 -224258 -240854 -238069 -207044 -167489
6110a67489K0966M979J3191K3672O301k7352m0409k4059l849M78p573j9992l1966
$$ -167489 -146523 -141544 -128353 -104681 -98380 -125732 -166141 -190200 -194049 -193571 -201144 -221136 -253102
6097b53102l1358p807K4363L6759K4502J0798J0303J1507J895j2583k2332k7602
$$ -253102 -284460 -292267 -267904 -231145 -206643 -195845 -185542 -174035 -172140 -184723 -207055 -234657
6085b34657k7161j2825J3201L1857K8817R022j5719l6070l8057j1343K5580L4734
$$ -234657 -261818 -274643 -261442 -229585 -200768 -191746 -207465 -243535 -281592 -292935 -267355 -232621
6073b32621Q568j5426q490Q694M778j0210p401P240M680j2256j1322J1870K2901
$$ -232621 -224053 -239479 -247969 -239275 -234497 -244707 -252108 -244868 -240188 -252444 -263766 -251896 -228995
6060b28995M013j9015k0065p542K505J5148L3790L7060R860k1526j8869J3227
$$ -228995 -224982 -243997 -264062 -271604 -269099 -253951 -220161 -183101 -173241 -194767 -213636 -200409
6048b00409L3563K2000J087l722J419m031k1243l1548k3171n899K254k899q027
$$ -200409 -166846 -144846 -143759 -147481 -146062 -150093 -171336 -202884 -226055 -231954 -229700 -232599 -240626
6035b40626k036O270K85j5890j7070P140L1609K6532j297j7591o826J0939J1581
$$ -240626 -242662 -236392 -236107 -251997 -269067 -261927 -230318 -203786 -205083 -222674 -229500 -218561 -206980
6022b06980l139j4454j2171k233L931Q08o459o268O215K0995K5193K0225J6292
$$ -206980 -210119 -224573 -236744 -238977 -235046 -234238 -240697 -246965 -240750 -219755 -194562 -174337 -158045
6009a58045J2499j203k0486k4679p242R964P437k412L578J9576J7537q262k9770
$$ -158045 -145546 -146749 -167235 -191914 -199156 -189192 -181755 -184167 -180589 -161013 -143476 -151738 -181508
5996a81508k5789j1474j1624k1133j4579J0411K4230P399j7279j2717J9906L8682
$$ -181508 -207297 -218771 -230395 -251528 -266107 -255696 -231466 -224067 -241346 -254063 -234157 -195475
5984a95475J6693j9651k5609J96J5545k750k5505j7208Q922J2142j1492k3177
$$ -195475 -178782 -198433 -224042 -223846 -208301 -211051 -236556 -253764 -244842 -232700 -244192 -267369
5972b67369l443J6211K375k7980l2754n425K1080K4846J7827J5945J5391R351
$$ -267369 -270812 -254601 -252226 -280206 -312960 -318385 -297305 -272459 -254632 -238687 -223296 -213945
5960b13945M928Q499J0907K618r352j3822j2762j1383l544J4087K3959P508k1539
$$ -213945 -209017 -200518 -189611 -186993 -196345 -210167 -222929 -234312 -237856 -223769 -199810 -192302 -213841
5947b13841k9391r376Q670L489q470l950Q900O392r697j3947J858J4839M908j6507
$$ -213841 -243232 -252608 -243938 -240449 -248919 -252869 -243969 -237577 -247274 -261221 -259363 -244524 -239616 -256123
5933b56123k4205j3658k857m299r525l983J3046K9385L4901K8724J4969r32j1977
$$ -256123 -280328 -293986 -296843 -301142 -310667 -314650 -301604 -272219 -237318 -208594 -193625 -194557 -206534
5920b06534j3448r186p680r911q294k3Q359J3975K2154K9448J8212j4609l7687
$$ -206534 -219982 -229168 -236848 -246759 -255053 -255076 -246717 -232742 -210588 -181140 -162928 -177537 -215224
5907b15224k0462J9417L4622J3368q603q029o842k4962l8413j9338J0605J0634
$$ -215224 -235686 -216269 -181647 -168279 -176882 -184911 -191753 -216715 -255128 -274466 -263861 -253227
5895b53227j1830j2773J3749K3429m921l1012j3512K7350M1504K0373l06J167
$$ -253227 -265057 -277830 -264081 -240652 -245573 -276585 -290097 -262747 -221243 -200870 -201176 -200009
5883b00009P360j760j6651j6582l177K058j0706k5652k3927r724j404p64Q976
$$ -200009 -192649 -194409 -211060 -227642 -230819 -228761 -239467 -265119 -289046 -298770 -300174 -300938 -291962
5870b91962K8166K7545q525m4516l3653J2474L4767J1143j3714j142K2166J2040
$$ -291962 -263796 -236251 -244776 -289292 -322945 -310471 -275704 -264561 -278275 -279417 -257251 -245211
5858b45211j9071k2334R483L2476J8988q596j9742j4920p917P35J2669J5859K043
$$ -245211 -264282 -286616 -277133 -244657 -225669 -234265 -254007 -268927 -276844 -276109 -263440 -247581 -245538
5845b45538j3530j0810L783M337j6594l3871k1070J2951L1143J4157j2137q100
$$ -245538 -259068 -269878 -266095 -261758 -278352 -312223 -333293 -320342 -289199 -275042 -287179 -295279
5833b95279K5697M7080K9804j999j3345q851j5312l0446k6661j887J2546J976
$$ -295279 -269582 -222502 -192698 -194697 -208042 -216893 -232205 -262651 -289312 -291199 -278653 -276677
5821b76677r133Q39J6810J4608j799j1843q527K316J6153K4820J4258j2911k8580
$$ -276677 -285810 -284971 -268161 -253553 -255352 -267195 -275722 -273406 -257253 -232433 -218175 -231086 -259666
5808b59666j4227J0335J6440R637J4754K8949K3435q786l8524m0295k1790n100
$$ -259666 -273893 -263558 -247118 -237481 -222727 -193778 -170343 -179129 -217653 -257948 -279738 -284838
5796b84838P59p69n032o886k416L514K111l591r34J1264J8461J2170J360m000
$$ -284838 -284079 -284848 -289880 -296766 -299182 -295668 -293557 -297148 -298082 -286818 -268357 -256187 -254827 -258827
5782b58827o097q342o238P84K050p534j5081q028N155Q355M250Q798K2208K5594
$$ -258827 -264924 -273266 -279504 -278720 -276670 -284204 -299285 -307313 -302158 -293803 -289553 -280755 -258547 -232953
5768b32953J0699n042l407P791P280p371j6869r494L388P781P838J2893J5272
$$ -232953 -222254 -227296 -230703 -222912 -215632 -223003 -239872 -249366 -245978 -238197 -230359 -217466 -202194
5755b02194J267j9751k0833K818K1792J2279j1119j9345r995l207p195j1714j0845
$$ -202194 -200927 -220678 -241511 -238693 -216901 -204622 -215741 -235086 -245081 -248288 -255483 -267197 -278042
5742b78042q874m746O505J5762O217j7466k7829j0214J8991L7174M0006L2426
$$ -278042 -286916 -291662 -285157 -269395 -263178 -280644 -308473 -318687 -299696 -262522 -222516 -190090
5730a90090J4739r068k4693k3497j4287q758o957n898q186j1674o343O575R157
$$ -190090 -175351 -184419 -209112 -232609 -246896 -255654 -262611 -268509 -276695 -288369 -294712 -288137 -278980
5717b78980n050j5139l665J3765J2611j430m266O127J0776O034P683J7700J7191
$$ -278980 -284030 -299169 -302834 -289069 -276458 -277888 -282154 -276027 -265251 -259217 -251534 -233834 -216643
5704b16643j88j4304r632J115k423j9703l2868k7058q0L5092N2613L5044o79j6444
$$ -216643 -216831 -231135 -240767 -239652 -242075 -261778 -294646 -321704 -321784 -286692 -234079 -199035 -199714 -216158
5690b16158r74J5362O584j0330n082J5105J4980j3618l6604k4315R979L0603K2896
$$ -216158 -217132 -201770 -195186 -205516 -210598 -195493 -180513 -194131 -230735 -255050 -245071 -214468 -191572
5677a91572K223j0793r064L780K0492L0340K2166l520k8816l4240k1553j1886
$$ -191572 -189349 -200142 -209206 -205426 -184934 -154594 -132428 -135948 -164764 -199004 -220557 -232443
5665b32443j7458k5446j8844l284K779r21L804K0787K8823J3927p194j1771l639
$$ -232443 -249901 -275347 -294191 -297475 -294696 -295617 -291813 -271026 -242203 -228276 -235470 -247241 -250880
5652b50880j348n027O77J5492K1523J4531J1504J8000J2423j9175n1398m7408
$$ -250880 -252228 -257255 -256578 -241086 -219563 -205032 -193528 -175528 -163105 -182280 -233678 -281086
5640b81086j0137J9917J7898J581j619P667J1158N371L317R990J5084J0315q27
$$ -281086 -291223 -271306 -253408 -251827 -253446 -245779 -234621 -229250 -225933 -215943 -200859 -190544 -191371
5627a91371j1691j7976j4756k890J485j7038m3823m3798j0943J6455R231p841
$$ -191371 -203062 -221038 -235794 -238684 -237199 -254237 -298060 -341858 -352801 -336346 -327115 -334956
5615c34956N086L6902L9047P71l2660k7479o881o825j9389j2436J4708L0670J9691
$$ -334956 -329870 -292968 -253921 -253150 -285810 -313289 -320170 -326995 -346384 -358820 -344112 -313442 -293751
5602b93751j128j2413j4196j2401n232Q088J9478K1538J6251Q993J719l797l556
$$ -293751 -294879 -307292 -321488 -333889 -339121 -331033 -311555 -290017 -273766 -264773 -263054 -266851 -270407
5589b70407K521O506j92j5279k3570j0551J8147L5513K2155n042r907J3938L2089
$$ -270407 -267886 -261380 -261572 -276851 -300421 -310972 -292825 -257312 -235157 -240199 -250106 -236168 -204079
5576b04079J8951m699n919P947L484k1406l1365q390K0741K4260N993r560j1589
$$ -204079 -185128 -189827 -195746 -187799 -184315 -205721 -237086 -245476 -224735 -200475 -194482 -204042 -215631
5563b15631n155M775J3655J2742k16j3210j4393o732N14M771N874P16p602p591
$$ -215631 -220786 -216011 -202356 -189614 -189830 -203040 -217433 -224165 -223651 -218880 -213006 -212290 -219892 -227483
5549b27483K663Q857L831J516J1487J7159K301j5846r271J4454K1895O698k845
$$ -227483 -224820 -215963 -212132 -210616 -199129 -181970 -179669 -195515 -204786 -190332 -168437 -161739 -164584
5536a64584O421J2316L99q480L382J5435K985j7544j4672K714j433k7077l3747
$$ -164584 -158163 -145847 -145448 -153928 -150546 -135111 -132126 -149670 -164342 -161628 -163061 -190138 -223885
5523b23885o714J7423J1347K059K1668M5443K5305l0297o0268l6121K966J3451
$$ -223885 -230599 -213176 -201829 -199770 -178102 -132659 -107354 -137651 -197919 -234040 -231074 -217623
5511b17623L750K746P190l645k2299k1140J775J9602J8405J0674N091o102k1157
$$ -217623 -213873 -211127 -203937 -207582 -229881 -251021 -249246 -229644 -211239 -200565 -195474 -201576 -222733
5498b22733j9696M891K7110K2144k12j3333j1120o158q15J4788L6942M3231K1332
$$ -222733 -242429 -237538 -210428 -188284 -188496 -201829 -212949 -219107 -219922 -205134 -168192 -124961 -103629
5485a03629j1184k5572j3636P072J6281J1451L418k506j2735l0437m2798l3111
$$ -103629 -114813 -140385 -154021 -146949 -130668 -119217 -115799 -118305 -131040 -161477 -204275 -237386
5473b37386l684K3048K7859J2592n091p949P705K6802K6505K796j8921j4138N786
$$ -237386 -241070 -218022 -190163 -177571 -182662 -190611 -182906 -156104 -129599 -126803 -145724 -159862 -154076
5460a54076J0016l804o429J3676K9475J8126m298j2111r082j2058j5972n735J0325
$$ -154076 -144060 -147864 -154293 -140617 -111142 -93016 -97314 -109425 -118507 -130565 -146537 -152272 -141947
5447a41947J0229n239j4354r099k148j052N09N807J0116J2216J3401R022j591
$$ -141947 -131718 -136957 -151311 -160410 -162558 -163610 -163101 -157294 -147178 -134962 -121561 -112539 -114130
5434a14130m822P095J5771J206k3160k8644j5882q898j1812p943J683j159j2501
$$ -114130 -118952 -111857 -96086 -94880 -118040 -146684 -162566 -171464 -183276 -191219 -189536 -190695 -203196
5421b03196q564Q857J2561J601N830K7921L1677O468r582L167R682j2400k3381
$$ -203196 -211760 -202903 -190342 -188741 -182911 -154990 -123313 -116845 -126427 -123260 -113578 -125978 -149359
5408a49359J0551M7206K8241k5185m4507j9590j896j1356j2159J2026K5613M582
$$ -149359 -138808 -91602 -63361 -88546 -133053 -152643 -154539 -165895 -178054 -166028 -140415 -135833
5396a35833k1172j6055J0354K6012J9701P64j9029k6431j2065J2036K0615Q771
$$ -135833 -157005 -173060 -162706 -136694 -116993 -116229 -135258 -161689 -173754 -161718 -141103 -132332
5384a32332m158p369q477q674l15O170j0005l7235l7354q000N286j7877l3135
$$ -132332 -136490 -143859 -152336 -161010 -161325 -155155 -165160 -202395 -239749 -247749 -242463 -260340 -293475
5371b93475P6M9775N6867K1757m103J664J0634k52j5604j4142j264M784j397j1232
$$ -293475 -293399 -243624 -186757 -165000 -169103 -167439 -156805 -157057 -172661 -186803 -188067 -183283 -184680 -195912
5357a95912j4040m699J1332K0067J3930J720l779j787P52P48k558j0490j7287
$$ -195912 -209952 -214651 -203319 -183252 -169322 -167602 -171381 -173168 -172416 -171668 -174226 -184716 -202003
5344b02003j1983K887R717L109q89M203k80k2036l2064n044L5448M7006K7731
$$ -202003 -213986 -211099 -201382 -198273 -199162 -194959 -195239 -217275 -249339 -254383 -218935 -171929 -144198
5331a44198Q335j874j8514l7905l4692p591J3049J1667N149N729K515q299j0068
$$ -144198 -135863 -137737 -156251 -194156 -228848 -236439 -223390 -211723 -206574 -200845 -198330 -206629 -216697
5318b16697K197Q256k522j2730r688o055r092j090K5300M1242K0934j5857l0850
$$ -216697 -214500 -206244 -208766 -221496 -231184 -237239 -246331 -247421 -222121 -180879 -159945 -175802 -206652
5305b06652j9057l942L751J0970J6445J1065k60l875j870p659j9638k2300j2906
$$ -206652 -225709 -229651 -225900 -214930 -198485 -187420 -187680 -191555 -193425 -201084 -220722 -243022 -255928
5292b55928n552p649j1507j1078r804q670j455J3579K7406K8950J5053o374j9672
$$ -255928 -261480 -269129 -280636 -291714 -301518 -310188 -311643 -298064 -270658 -241708 -226655 -233029 -252701
5279b52701j4804j603N09q223n936J4407K8806J9254L762M724R164o560k9884
$$ -252701 -267505 -269108 -268599 -276822 -282758 -268351 -239545 -220291 -216529 -211805 -202641 -209201 -239085
5266b39085k9187p841J853m071M361L3505M8408K8765K331k51R566M198j5752
$$ -239085 -268272 -276113 -274260 -278331 -273970 -240465 -192057 -163292 -160961 -161212 -151646 -147448 -163200
5253a63200k9403k7187j2008J1704K9562J9859j2354k6604L90L4858L0728m139
$$ -163200 -192603 -219790 -231798 -220094 -190532 -170673 -183027 -209631 -209241 -174383 -143655 -147794
5241a47794k3658j3186k117r503j8090j0694J860K972m595r465q477k103J1008
$$ -147794 -171452 -184638 -186755 -196258 -214348 -225042 -223182 -220210 -224805 -234270 -242747 -244850 -233842
5228b33842K6339L4252L3238K8278J5510j1647l8962l8603q284J9839K0480M178
$$ -233842 -207503 -173251 -140013 -111735 -96225 -107872 -146834 -185437 -193721 -173882 -153402 -149224
5216a49224o694p847l637Q841K5668K6541L641j7130j0372Q570Q033p222m425
$$ -149224 -155918 -163765 -167402 -158561 -132893 -106352 -102711 -119841 -130213 -121643 -113610 -120832 -125257
5203a25257J9631K8867L926k7430l2132j5469k534J267O973J4696J4639Q143N729
$$ -125257 -105626 -76759 -72833 -100263 -132395 -147864 -150398 -149131 -142158 -127462 -112823 -104680 -98951
5190i8951P189K697o868q213K687J1623M821j2508k2306j4253L485J2734M308
$$ -98951 -91762 -89065 -95933 -104146 -101459 -89836 -85015 -97523 -119829 -134082 -130597 -117863 -113555
5177a13555j1862j8713j2951n681j819O613J9772J9640l508k7878k5513k978Q772
$$ -113555 -125417 -144130 -157081 -162762 -164581 -157968 -138196 -118556 -122064 -149942 -175455 -178433 -169661
5164a69661K161J444J8508L0336J5981q838j5631m244L415q86o409p582r804j2691
$$ -169661 -167500 -166056 -147548 -117212 -101231 -110069 -125700 -129944 -126529 -127415 -133824 -141406 -151210 -163901
5150a63901q948j323r15n938j691J3414K1812J5656J1806K2956L0693R475l0239
$$ -163901 -172849 -174172 -175087 -181025 -182716 -169302 -147490 -131834 -120028 -97072 -66379 -56904 -87143
5137h7143m7608k3205J5093K8186J3149j080K113P134m793k3774k3726J22K3908
$$ -87143 -134751 -157956 -142863 -114677 -101528 -102608 -100495 -93361 -98154 -121928 -145654 -145532 -121624
5124a21624K7509J8387J4909J8510J5615Q69j5259k0845j4327k627M622J133p854
$$ -121624 -94115 -75728 -60819 -42309 -26694 -25825 -41084 -61929 -76256 -78883 -74261 -73128 -80982
5111h0982o997R787K5524J8205r704l3232l5611k2854p741M500J1616J1411Q883
$$ -80982 -87979 -78192 -52668 -34463 -44167 -77399 -113010 -135864 -143605 -139105 -127489 -116078 -107195
5098a07195J2215J7103J0165p451j7481j2120m795m291j74J1901J4189k323j2985
$$ -107195 -94980 -77877 -67712 -75163 -92644 -104764 -109559 -113850 -114024 -102123 -87934 -90257 -103242
5085a03242N483L1336K4218j3082l6811k6284p686m970l894J4746L5350K9471
$$ -103242 -97759 -66423 -42205 -55287 -92098 -118382 -126068 -131038 -134932 -120186 -84836 -55365
5073e5365J681j4141k30K3957K6902n08l6049m6241j9710J6416K2756n528l2309
$$ -55365 -53684 -67825 -68055 -44098 -17196 -17704 -53753 -99994 -119704 -103288 -80532 -86060 -118369
5060a18369k9034j1452j0481k2468j6024J6254M2104L3029R96k0919j8823m507
$$ -118369 -147403 -158855 -169336 -191804 -207828 -191574 -149470 -116441 -115445 -136364 -155187 -159694
5048a59694P569J3067J1100N67j2960j6718m014J5197K2091P646j7764l3097k4884
$$ -159694 -152125 -139058 -127958 -127391 -140351 -157069 -161083 -145886 -123795 -116149 -133913 -167010 -191894
5035a91894P50K2437K2012J797j7579j9646r907n414r406q256L888J2457N176
$$ -191894 -191144 -168707 -146695 -144898 -162477 -182123 -192030 -197444 -206850 -215106 -211218 -198761 -193585
5022a93585n486O7J6448K0208O975j596P678K0844K2426J8463J9174J7077J686
$$ -193585 -199071 -199004 -182556 -162348 -155373 -156969 -149291 -128447 -106021 -87558 -68384 -51307 -49621
5009d9621j7627k4495k1535k2031k3097j0805J0905K0963J2842K948K358K045
$$ -49621 -67248 -91743 -113278 -135309 -158406 -169211 -158306 -137343 -124501 -121553 -119195 -117150
4997a17150n222r144j506N540k402j7223j9780r499m215j1244j5445j944K0782
$$ -117150 -122372 -131516 -133022 -127482 -129884 -147107 -166887 -176386 -180601 -191845 -207290 -209234 -188452
4984a88452L0145J7851k84n585j50l51r207r933O138J9895R583j3425j6735N977
$$ -188452 -158307 -140456 -140740 -146325 -146475 -146826 -156033 -165966 -159828 -139933 -130350 -143775 -160510 -154533
4970a54533K4401J5281o396j3970p599o380j4641j8302r817L018J2524J8875K0987
$$ -154533 -130132 -114851 -121247 -135217 -142816 -149196 -163837 -182139 -191956 -188938 -176414 -157539 -136552
4957a36552J3930q78j2618j1503K869K1898L1607K1817J3j1593m134K655j0215
$$ -136552 -122622 -123500 -136118 -147621 -144752 -122854 -91247 -69430 -69417 -81010 -85144 -82489 -92704
4944i2704k6755j6591J4783K8089Q326j2254n042J1333M281j9018k4377m675J3536
$$ -92704 -119459 -136050 -121267 -93178 -84852 -97106 -102148 -90815 -86534 -105552 -129929 -134604 -121068
4931a21068J4040Q252N148l944j9707k2547l183J6714J4226k055r934q718j1503
$$ -121068 -107028 -98776 -93628 -97572 -117279 -139826 -143009 -126295 -112069 -114124 -124058 -132776 -144279
4918a44279j3577J549K7412L6280K1104P449J1742J4061p092l3727l0428J986
$$ -144279 -157856 -156307 -128895 -92615 -71511 -64062 -52320 -38259 -45351 -79078 -109506 -107520
4906a07520K4497J3174j1254j6162P16J5991J4823M356k182j789j931j1424k9965
$$ -107520 -83023 -69849 -81103 -97265 -96549 -80558 -65735 -61379 -63561 -65350 -67281 -78705 -108670
4893a08670m3008l2803j608K2776J6566p950j4731R174L4183K5015j3443m0715
$$ -108670 -151678 -184481 -186089 -163313 -146747 -154697 -169428 -160254 -126071 -101056 -114499 -155214
4881a55214k7999J1494M0689L7467J1626j0002r866O191J7763J3028J199j750
$$ -155214 -183213 -171719 -131030 -93563 -81937 -91939 -101805 -95614 -77851 -64823 -63624 -65374
4869f5374M261N258l305r798q185r467j8705j7826O157K8063J1458l2843n0752
$$ -65374 -61113 -55855 -59160 -68958 -77143 -86610 -105315 -123141 -116984 -88921 -77463 -110306 -161058
4856a61058j8078K4157K8018J401j6889j8089j9574j7734O736M0096M1972R818
$$ -161058 -179136 -154979 -126961 -125560 -142449 -160538 -180112 -197846 -191110 -151014 -109042 -99224
4844i9224r769P578K5762Q942k0101k0659o36L834o928k994J4578J3423q779j4343
$$ -99224 -108993 -101415 -75653 -66711 -86812 -107471 -108107 -104273 -111201 -114195 -99617 -86194 -94973 -109316
4830a09316J0758L0128J4580j3755k0954j0446k511N200K1298K8211O575k2298
$$ -109316 -98558 -68430 -53850 -67605 -88559 -99005 -101516 -96316 -75018 -46807 -40232 -62530
4818f2530k0045Q196J8352m768k4989j2842J0486R958j0105j8405o126N976M442
$$ -62530 -82575 -74379 -56027 -60795 -85784 -98626 -88140 -78182 -88287 -106692 -112818 -106842 -102400
4805a02400o28P74J557n513j0391l23J6512J8329L57j6758j5173m073l716j3143
$$ -102400 -103028 -102254 -100697 -106210 -116601 -116924 -100412 -82083 -81726 -98484 -113657 -117730 -121446 -134589
4791a34589j1385Q971K8193K7290J3468M178o75j1338k1125j1165J6156L1413
$$ -134589 -145974 -137003 -108810 -81520 -68052 -63874 -64549 -75887 -97012 -108177 -92021 -60608
4779f0608J5593j3690k6247j7386p316r733j6393j2569L471J9633K3584J5373
$$ -60608 -45015 -58705 -84952 -102338 -109654 -119387 -135780 -148349 -144878 -125245 -101661 -86288
4767h6288P326R525J6035J1932n089j9856k0769j4574j2056j0408k602N219K525
$$ -86288 -78962 -69437 -53402 -41470 -46559 -66415 -87184 -101758 -113814 -124222 -126824 -121605 -119080
4754a19080m826j399J1876J7819J0535K991K584O04n154k31J7911K2396p559m7965
$$ -119080 -123906 -125305 -113429 -95610 -85075 -82084 -79500 -78896 -84050 -84281 -66370 -43974 -51533 -99498
4740i9498n5674k6258L301R255P139J5318K2668J0999j1692k2209j3908J297J2914
$$ -99498 -155172 -181430 -178129 -168874 -161735 -146417 -123749 -112750 -124442 -146651 -160559 -159262 -146348
4727a46348J6577P627j1607k4156j5697M366J4496Q779k245j1613j8451j7133
$$ -146348 -129771 -122144 -133751 -157907 -173604 -169238 -154742 -145963 -148208 -159821 -178272 -195405
4715a95405n405K077p216j6060Q33K9028K5824j2534l5979j2964K1195J9867m180
$$ -195405 -200810 -198733 -205949 -222009 -221176 -192148 -166324 -178858 -214837 -227801 -206606 -186739 -190919
4702a90919n775J7350K5217L805j5457r301O001Q434K37j0298k5581l9774l1403
$$ -190919 -196694 -179344 -154127 -150322 -165779 -175080 -169079 -160645 -160408 -170706 -196287 -236061 -267464
4689b67464L472L3491L0541Q061k475K231J208j0568j4447k66J7572K1656J2412
$$ -267464 -263992 -230501 -199960 -191899 -194374 -192143 -190935 -201503 -215950 -216216 -198644 -176988 -164576
4676a64576O98q730j8692l0039l6300k8618o808J5680K3660J7763J2271J3977
$$ -164576 -163878 -172608 -191300 -221339 -257639 -286257 -293065 -277385 -253725 -235962 -223691 -209714
4664b09714J4465P565J280M318J3045K0987K8346L1565J8887q136k3641q773J7349
$$ -209714 -195249 -187684 -186404 -182086 -169041 -148054 -119708 -88143 -69256 -77392 -101033 -109806 -92457
4651i2457K1635L872o913J134R023K344q120j0334j0909j7861k3434j8758j0052
$$ -92457 -70822 -66950 -73863 -72729 -63706 -61362 -69482 -79816 -90725 -108586 -132020 -150778 -160830
4638a60830o250l818K675P297M112P53N983J3005J0633L564M959J3229J2792k414
$$ -160830 -167080 -170898 -168223 -160926 -156814 -156061 -150078 -137073 -126440 -122876 -117917 -104688 -91896 -94310
4624i4310k0203k6529j9737o797N154J1610J2851J5182K3425L0985K4469J052
$$ -94310 -114513 -141042 -160779 -167576 -162422 -150812 -137961 -122779 -99354 -68369 -43900 -42848
4612d2848k4235l2475j9448K468J8735K4986K4501J8286M761j0773j6033p808
$$ -42848 -67083 -99558 -119006 -116538 -97803 -72817 -48316 -30030 -25269 -36042 -52075 -59883
4600e9883M67k267n995M382K0053J6762p516k7320k7869k2783k2300j1961J5582
$$ -59883 -59416 -61683 -67678 -63296 -43243 -26481 -33997 -61317 -89186 -111969 -134269 -146230 -130648
4587a30648L3477J6805j2187j2273J2849K0087l003j6851P303M0968L9966N817
$$ -130648 -97171 -80366 -92553 -104826 -91977 -71890 -74893 -91744 -84441 -43473 -3507 2310
4575B310k2868k3869q817L008L291q085k2614k2703j196K1017J7272n562j2534
$$ 2310 -20558 -44427 -53244 -50236 -46945 -55030 -77644 -100347 -101543 -80526 -63254 -68816 -81350
4562h1350R887L2752K5667R2q148R973K5199J0812k3167m4975l9032j7550N29
$$ -81350 -71463 -38711 -13044 -12952 -21100 -11127 14072 24884 1717 -43258 -82290 -99840 -99311
4549i9311R629J4317J5942J0613j458j1090p823Q084K2877K1736O279m417K813
$$ -99311 -89682 -75365 -59423 -48810 -50268 -61358 -69181 -61097 -38220 -16484 -10205 -14622 -11809
4536a1809J4268N019k2837l5532j2591K0518K5229L602q280L247J2041j346j7867
$$ -11809 2459 7478 -15359 -50891 -63482 -42964 -17735 -14133 -22413 -19166 -7125 -8471 -26338
4523b6338j3565J084J795p869o215N336M092j1651j4984N946K5018J5911p909
$$ -26338 -39903 -38819 -37024 -44893 -51108 -45772 -41680 -53331 -68315 -62369 -37351 -21440 -29349
4510b9349j2864N958J8326J238k9666l8914j3989J9390K6800N394j3406m483J8212
$$ -29349 -42213 -36255 -17929 -16691 -46357 -85271 -99260 -79870 -53070 -47676 -61082 -65565 -47353
4497d7353K1750N72j6663r105P819P855p742j4880j908J7756K6632K1225P217
$$ -47353 -25603 -25031 -41694 -50799 -42980 -35125 -42867 -57747 -59655 -41899 -15267 5958 13175
4484A3175r651k2446k3254j2249p67J396k069j260L824L402m412n895R724K9457
$$ 13175 3524 -18922 -42176 -54425 -55192 -53796 -55865 -57125 -53301 -49899 -54311 -60206 -50482 -21025
4470b1025K8127L039j7953j3240J266l801k3901k3653R417M1258L6143L915j8405
$$ -21025 7102 10141 -7812 -21052 -19786 -23587 -47488 -71141 -61724 -20466 15677 19592 1187
4457A187j6663o334J265J0629K0192J6598q29j1975m114Q934Q445k837r677p764
$$ 1187 -15476 -21810 -20545 -9916 10276 26874 26045 14070 9956 18890 27335 24498 14821 7057
4443G057k782M953J7811K7172J9470k997k0863k1086j1863r170j4639j3053P851
$$ 7057 4275 9228 27039 54211 73681 70684 49821 28735 16872 7702 -6937 -19990 -12139
4430a2139L7341M6249J7938k6661m6219k5480P097J6460L158n805J798J1649R827
$$ -12139 25202 71451 89389 62728 16509 -8971 -1874 14586 17744 11939 13737 25386 35213
4417C5213Q54n580r000j2189j3626j2870j2701j0476J404K0117K9302J9574J813
$$ 35213 36067 30487 21487 9298 -4328 -17198 -29899 -40375 -38971 -18854 10448 30022 31835
4404C1835p957o967j029O489J0570J962j7004k4951p339J8322K2643M772q908
$$ 31835 23878 16911 15882 22371 32941 34903 17899 -7052 -14391 3931 26574 31346 22438
4391B2438n323l46q860k1213k1005r539J009O896J1716J4283J0516K365n287j2059
$$ 22438 17115 16769 7909 -13304 -34309 -43848 -42839 -35943 -24227 -9944 572 2937 -2350 -14409
4377a4409j7925j7394p253N009J0408J1462J5534J9466J3374j713j2520j1090
$$ -14409 -32334 -49728 -56981 -51972 -41564 -30102 -14568 4898 18272 16559 4039 -7051
4365g051k594O136J4119J8232R852j1208k7475k0474N335K5475K3754Q855j444
$$ -7051 -9645 -3509 10610 28842 38694 27486 11 -20463 -15128 10347 34101 42956 41512
4352D1512m566j2053k6954l4685k1834M223K3200K4714J4892M194j028K324J0863
$$ 41512 36946 24893 -2061 -36746 -58580 -54357 -31157 -6443 8449 12643 11615 13939 24802
4339B4802J1863k280j6864r606J4615K5291J0744l026N895J9024Q758j4120j8536
$$ 24802 36665 34385 17521 7915 22530 47821 58565 55539 61434 80458 89216 75096 56560
4326E6560o454p587k2976j7767J8760M7202L4170P00j3871q920r598j6962j0565
$$ 56560 50106 42519 19543 1776 20536 67738 101908 102608 88737 79817 70219 53257 42692
4313D2692P293R313j1470k7826k0416o239r120k2060j8918O178K9679K8656P646
$$ 42692 49985 59298 47828 20002 -414 -6653 -15773 -37833 -56751 -50573 -20894 7762 15408
4300A5408r399q962j975m330j0781k416J9570K7464N596k3173k8159j3155m177
$$ 15408 6009 -2953 -4928 -9258 -20039 -22455 -2885 24579 30175 7002 -21157 -34312 -38489
4287c8489o915n986j85m121j3256l326K5514L8463J6631j2991j8957p854l77P399
$$ -38489 -45404 -51390 -51575 -55696 -68952 -72278 -46764 -8301 8330 -4661 -23618 -31472 -31849 -24450
4273b4450K5765L6256J4620k2624l4796j6855m222j5649k8876k2335o246L239
$$ -24450 1315 37571 52191 29567 -5229 -22084 -26306 -41955 -70831 -93166 -99412 -96173
4261i6173J0894K3667K9510J7340k2m843k387q103j8248j6111j213R669R109P320
$$ -96173 -85279 -61612 -32102 -14762 -14784 -19627 -22014 -30117 -48365 -64476 -65689 -56020 -46911 -39591
4247c9591J2020J6129J0392k586j2114j1680m866j600p289j4620j1683J99O299
$$ -39591 -27571 -11442 -1050 -3636 -15750 -27430 -32296 -33896 -41185 -55805 -67488 -67289 -60990
4234f0990L98n900l785j954o935m372J8495M2604L6097K14l0186l2836j8546k307
$$ -60990 -60592 -66492 -70277 -72231 -79166 -83538 -65043 -22439 13658 13872 -16314 -49150 -67696 -70003
4220g0003J6718L5291L4835R520j6085j8971j0186j2740k2664j9218l684K088
$$ -70003 -53285 -17994 16841 26361 10276 -8695 -18881 -31621 -54285 -73503 -77187 -75099
4208g5099o615j0369l9Q660L862k803J578Q376L254q985j2437m554L755P169R581
$$ -75099 -81714 -92083 -92122 -83462 -79600 -82403 -80825 -72449 -69195 -78180 -90617 -95171 -91416 -84247 -74666
4193g4666J0737M271q535j5013p014O738J0713K130n567k17J1847J1673p703k8798
$$ -74666 -63929 -59658 -68193 -83206 -90220 -83482 -72769 -70639 -76206 -76423 -64576 -52903 -60606 -89404
4179h9404k8604o289J7562K7554K6506K0591P599j1030k0727j0976O503J1857
$$ -89404 -118008 -124297 -106735 -79181 -52675 -32084 -24485 -35515 -56242 -67218 -60715 -48858
4167d8858L780l323m101o116r736m419R930J6465O010p190o679K049L614q32K162
$$ -48858 -45078 -48401 -52502 -58618 -68354 -72773 -62843 -46378 -40368 -47558 -54237 -52188 -48574 -49406 -47244
4152d7244J1912J1027p034k4243k0579r0J5714J4698M755n49J935M943R35j0949
$$ -47244 -35332 -24305 -31339 -55582 -76161 -76251 -60537 -45839 -41084 -41633 -39698 -34755 -33820 -44769
4138d4769k4328k8611j6142Q011K4909J8566l362j3938J558K6057L3074K1942
$$ -44769 -69097 -97708 -113850 -105839 -80930 -62364 -65726 -79664 -78106 -52049 -18975 2967
4126B967J3873J4801N420k2227m1114k4120J1336K1701k853k5646j6657Q736J9274
$$ 2967 16840 31641 37061 14834 -26280 -50400 -39064 -17363 -20216 -45862 -62519 -53783 -34509
4113c4509J3524J2403J8988J3866r635k9656k4420j226J3966Q103p083j1230K684
$$ -34509 -20985 -8582 10406 24272 14637 -15019 -39439 -40665 -26699 -18596 -25679 -36909 -34225
4100c4225K1401K4401N887j6847k1177m295J5470K1216J2678j320j4254k1537
$$ -34225 -12824 11577 17464 617 -20560 -24855 -9385 11831 24509 23189 8935 -12602
4088a2602j9107r290n63M103J0187J7277J3655m973k2763k3299j2029l207N610
$$ -12602 -31709 -40999 -41562 -37459 -27272 -9995 3660 -1313 -24076 -47375 -59404 -62611 -57001
4075e7001K4438M2627L6975R453j0454q610m575j4564k3274j3137J734j757j5753
$$ -57001 -32563 10064 47039 56492 46038 37428 32853 18289 -4985 -18122 -16388 -18145 -33898
4062c3898j5013k39M896l298k275J5779K8264J8510J001m566j706k852n152P22
$$ -33898 -48911 -49150 -44254 -47552 -49827 -34048 -5784 12726 13727 9161 7455 4603 -549 173
4048A73J1362J7670J9773J9066P531j6840l4547k5452Q58J5858J0072Q69L058
$$ 173 11535 29205 48978 68044 75575 58735 24188 -1264 -406 15452 25524 26393 29451
4035B9451J0620J0907J578j0779j7463j1433N014J6395R862o069j2095o225m527
$$ 29451 40071 50978 52556 41777 24314 12881 17895 34290 44152 38083 25988 19763 15236
4022A5236j2230j3309L490K4840L0216J7161j327j4802k0015j5621l389R584J7839
$$ 15236 3006 -10303 -6813 18027 48243 65404 64077 49275 29260 13639 10250 19834 37673
4009C7673K2263K2551J2568q914k9768l6462k9755j9544q776O407K2315K5743
$$ 37673 59936 82487 95055 86141 56373 19911 -9844 -29388 -38164 -31757 -9442 16301
3997A6301J0825r585j6179n648N104M14j2316j0685J1417L1686K7222M617j1634
$$ 16301 27126 17541 1362 -4286 818 1232 -11084 -21769 -10352 21334 48556 53173 41539
3984D1539j3336j2019j1241O94K4205L6587J9919j3770l7120l5920j4834J1090
$$ 41539 28203 16184 4943 5637 29842 66429 86348 72578 35458 -462 -15296 -4206
3972d206K1592M664k3048k6605J607K5159J2118j7943k1935N141K7347K1055J79
$$ -4206 17386 22050 -998 -27603 -25996 -837 11281 -6662 -28597 -23456 3891 24946 25125
3959B5125j2735j2816n258N063R711K290p330k686J2146J5248M82j2844j0038
$$ 25125 12390 -426 -5684 -621 9090 11380 4050 1364 13510 28758 29240 16396 6358
3946F358M15O145Q363J0617Q985L703L368Q150O007n893j4198j2197r742j1774
$$ 6358 6773 12918 21281 31898 40883 44586 47954 56104 62111 56218 42020 29823 20081 8307
3932H307r515l071o614j7670j1045J6866L0015P412j5835j177K6482J4688k9440
$$ 8307 -1208 -4279 -10893 -28563 -39608 -22742 7273 14685 -1150 -2327 24155 38843 9403
3919I403m4890r296L0637L3966J8640J5311J3824p887l4055l1735l941J5872J4051
$$ 9403 -35487 -44783 -14146 19820 38460 53771 67595 59708 25653 -6082 -10023 5849 19900
3906A9900P813Q923P790j592p007J426J3723J3930J058j1859j2884j044J3005
$$ 19900 27713 36636 44426 42834 35827 37253 50976 64906 65964 54105 41221 40177 53182
3893E3182J4403j184j9349k1402p614L813K606j625Q29K213p281j7387j0567O910
$$ 53182 67585 66401 47052 25650 18036 21849 24455 22830 23659 25872 18591 1204 -9363 -2453
3879b453R709o179j1820J1335L7747L1693Q24j5335n334J396j2563k3727r942
$$ -2453 7256 1077 -10743 592 38339 70032 70856 55521 50187 51583 39020 15293 5351
3866E351J0653J0434l056n807j369q543j7866l204K6409L0811J403k2572j4943
$$ 5351 16004 26438 23382 17575 16206 7663 -10203 -13407 13002 43813 45216 22644 7701
3853G701K83n057j6706q033J2196J7537R036O175O859n355k1730j5564J0149K0083
$$ 7701 7984 2927 -13779 -21812 -9616 7921 16957 23132 29991 24636 2906 -12658 -2509 17574
3839A7574K37j9773j3217M586N454n759j873K1116L6849K6907M359p965p434q549
$$ 17574 17811 -1962 -15179 -10593 -5139 -10898 -12771 8345 45194 72101 76460 68495 61061 52512
3825E2512j7459k2455j1674Q760K1321J8379Q963L833K318j832q317j1114p950
$$ 52512 35053 12598 924 9684 31005 49384 58347 62180 64498 62666 54349 43235 35285
3812C5285k323K791Q049J4418J9209J5709j298k5698l8844k7567k940J0971Q372
$$ 35285 32962 35753 43802 58220 77429 93138 91840 66142 27298 -269 -3209 7762 16134
3799A6134O382J4417J8879J0020L119J2457K1331N457k3558k9560n396J5981J0192
$$ 16134 22516 36933 55812 65832 68951 81408 102739 108196 84638 55078 49682 65663 75855
3786G5855p617j3256r543j2152j7304p928J4551K6402J2539j2322k0125j819K2558
$$ 75855 68238 54982 45439 33287 15983 8055 22606 49008 61547 49225 29100 27281 49839
3773D9839K6956Q961r557j1224j708O319J3613K3665K3364j743l6180m4362j6618
$$ 49839 76795 85756 76199 64975 63267 69586 83199 106864 130228 128485 92305 47943 31325
3760C1325J7090K7083J6809N953J297j449l329n119j2067k2023k0919l588J2970
$$ 31325 48415 75498 92307 98260 99557 98108 94779 89660 77593 55570 34651 31063 44033
3747D4033J2063K557N471K2717L4503K4008o255l8018m9419l1577m96J6922J4534
$$ 44033 56096 58653 64124 86841 121344 145352 139097 101079 51660 20083 19587 36509 51043
3734E1043J0471J3317P163j5254k9169j2602J4503J6637m191j4654k874R088N443
$$ 51043 61514 74831 81994 66740 37571 24969 39472 56109 51918 37264 34390 43478 48921
3721D8921l163n425o265q731l693J1460K3652K2988J3928K191j0699j5427O5K5656
$$ 48921 45758 40333 34068 25337 21644 33104 56756 79744 93672 95863 85164 69737 69802 95458
3707I5458L1703P837k1133k9290j9317o280O013J5707J1052j0282k5516j3417
$$ 95458 127161 134998 113865 84575 65258 58978 64991 80698 91750 81468 55952 42535
3695D2535J3922K7376K0090Q886K963n048j7035k0190o256J4140K3469J6196J602
$$ 42535 56457 83833 103923 112809 115772 110724 93689 73499 67243 81383 104852 121048 122650
3682A22650p916r397j0949j9010k5980j9196k325O193R26m53J4143K7780J6404
$$ 122650 114734 105337 94388 75378 49398 30202 27877 34070 34996 34543 48686 76466 92870
3669I2870j5480l8905l5249j1998J2272K4609K1762R987k19o283j4842k4646k0332
$$ 92870 77390 38485 3236 -8762 3510 28119 49881 59868 59649 53366 38524 13878 -6454
3656f454M352K9152L0067J0510p761j5974k0435k0868j0103O805J5089J1827O079
$$ -6454 -2102 27050 57117 67627 59866 43892 23457 2589 -7514 -709 14380 26207 32286
3643C2286l25j1367j8530p688J4510K4786J6497N631O38q028k2503k7974j8039
$$ 32286 31961 20594 2064 -5624 8886 33672 50169 55800 56438 48410 25907 -2067 -20106
3630b0106n098M103J7783L3223L0208O362r502j09J1850L435p790L678K0694P760
$$ -20106 -25204 -21101 -3318 29905 60113 66475 56973 56864 68714 72149 64359 68037 88731 96491
3616I6491k5641l1300N571M0930L1378j1327m1663l5415p760J0303J501k3530
$$ 96491 70850 39550 45121 86051 117429 106102 64439 29024 21264 31567 33068 9538
3604I538l5496j6893J6385L3034K2512R6j8556k8371k3957k918J7232J2102j1372
$$ 9538 -25958 -42851 -26466 6568 29080 29176 10620 -17751 -41708 -44626 -27394 -15292 -26664
3591b6664j5967J3027M1175L1066n375k5595j3797P195J4983J1755P554J777r541
$$ -26664 -42631 -29604 11571 42637 37262 11667 -2130 5065 20048 31803 39357 41134 31593
3578C1593k0667k0069l959J7598K7971K0080N785K224P350J533k0576l5655k3113
$$ 31593 10926 -9143 -13102 4496 32467 52547 58332 60556 67906 69439 48863 13208 -9905
3565i905K820J1584j969j5704j4729n038N895J8402K7351K2239P101n7N149P175
$$ -9905 -7085 4499 2530 -13174 -27903 -32941 -27046 -8644 18707 40946 48047 47990 53139 60314
3551F0314K61R65J6992K6647J0174j7283k8167k2500j8093j3576M989K5879J8134
$$ 60314 60575 61540 78532 105179 115353 98070 69903 47403 29310 15734 20723 46602 64736
3538F4736j7266l8032j8169J4981K2819R057L390R995O577j1770k2005j1479J615
$$ 64736 47470 9438 -8731 6250 29069 38126 41516 51511 58088 46318 24313 12834 14449
3525A4449j831j2837j1061L602J3166Q401j510m140K607J2379J7956J6016Q863
$$ 14449 12618 -219 -11280 -7678 5488 13889 12379 8239 10846 23225 41181 57197 66060
3512F6060J414n442j4345k1134j3080J2925L6148L0835L13k2499j4779R254K1236
$$ 66060 67474 62032 47687 26553 13473 26398 62546 93381 93694 71195 56416 65670 86906
3499H6906J6164J0392J0151M999n936n830R722J6227n309l2846k9511J805K1110
$$ 86906 103070 113462 123613 128612 122676 116846 126568 142795 137486 104640 75129 76934 98044
3486I8044R694p471q403q685k5610l7117j2549L2720N3388L9048K2703K2996J9590
$$ 98044 107738 100267 91864 83179 57569 20452 7903 40623 94011 133059 155762 178758 198348
3473A98348j616j8902j3240k999j0946k3604j7355l442p534j8810m474K8673L4459
$$ 198348 196732 177830 164590 161591 150645 127041 109686 106244 98710 79900 75426 104099 138558
3460A38558j128l2645k0709J1949J9506K87j1307l500J436q449j5036l233J3614
$$ 138558 137430 104785 84076 96025 115531 115818 104511 101011 102447 93998 78962 75729 89343
3447H9343J5343L364o995r314o934k52J1561K0167J3559o793k4106k4266r376
$$ 89343 104686 108050 101055 91741 84807 84555 96116 116283 129842 123049 98943 74677 65301
3434F5301P694J5982J2008l65j1608j2610l418P038J2255J4498J6266J2392j239
$$ 65301 72995 88977 100985 100620 89012 76402 72984 80022 92277 106775 123041 135433 134194
3421A34194j5652j6729m850M180K08r442j3263j0852q208n605J177J1529J8743
$$ 134194 118542 101813 96963 101143 101351 91909 78646 67794 59586 53981 55158 66687 85430
3408H5430J6256K673j4968k2469j1667N916J0423J665n09R631J0492j0550k9538
$$ 85430 101686 104359 89391 66922 55255 61171 71594 73259 72750 82381 92873 82323 52785
3395E2785j9630M987J0893j81L099K4660L1439R202j2355q126M825K767k967Q869
$$ 52785 33155 38142 49035 48854 51953 76613 108052 117254 104899 96773 101598 104365 101398 110267
3381A10267K6344K2216N27r850j416M965k168r805o494J282M095J568m439j2208
$$ 110267 136611 158827 159354 149504 148088 153053 150885 141080 134586 135868 139963 141531 137092 124884
3367A24884j3932l186J1258J5036J0067R135J1338M382r119j1784j471L415m261
$$ 124884 110952 107766 119024 134060 144127 153262 164600 168982 159863 148079 146608 150023 145762
3354A45762p364N057J6520Q343j0960j9063j1167j931l339j3380k2130k0664q354
$$ 145762 138398 143455 159975 168318 157358 138295 127128 125197 121858 108478 86348 65684 57330
3341E7330M540Q034O490J0520J6001Q958o776r284O351J6436N445q577m133Q652
$$ 57330 61870 69904 76394 86914 102915 111873 105097 95813 102164 118600 124045 115468 111335 119987
3327A19987O414r307j7175r005N810K0274L1287K8777P210j7036k2614j3337q767
$$ 119987 126401 117094 99919 90914 96724 116998 148285 177062 184272 167236 144622 131285 122518
3314A22518j0341l329J0122R623q041k0488j4467l378n36R3M120J699j1259j7870
$$ 122518 112177 108848 118970 128593 120552 100064 85597 82219 81683 81776 85896 87595 76336 58466
3300E8466n384J1608J3500O584Q889J6361R224j1905k2414j0051O845O516p043
$$ 58466 53082 64690 78190 84774 93663 110024 119248 107343 84929 74878 81723 88239 81196
3287H1196j4437r988o203j1950j9228j6014m036M374M576N222J3088K0843J6873
$$ 81196 66759 56771 50568 38618 19390 3376 -660 3714 8290 13512 26600 47443 64316
3274F4316J511j4260k1543j6669K049K7903M0825K5720l839j7045m564J0962Q429
$$ 64316 65827 51567 30024 13355 15404 43307 84132 109852 106013 88968 84404 95366 103795
3261A03795n557j3674j4034j5101j7745j8286j9961k5715k7229j6718l021O51
$$ 103795 98238 84564 70530 55429 37684 19398 -563 -26278 -53507 -70225 -73246 -72595
3249g2595j34J1567L5258N0277M4213K7357J3774K763j2311k7309k9692j3644
$$ -72595 -72729 -61162 -25904 24373 68586 95943 109717 112480 100169 72860 43168 29524
3237B9524J2990L4722L9275K6201O968n837r212p520l185M295J2441J6216J4149
$$ 29524 42514 77236 116511 142712 149680 143843 134631 127111 123926 128221 140662 156878 171027
3224A71027Q303j49r157j2522o756O74q37r840j4769j0280k082L529L977m643
$$ 171027 179330 179181 170024 157502 150746 151420 150583 140743 125974 115694 113612 117141 121118 116475
3210A16475k2580l4783k1044J5112M2472L7741J3323k556k825k845j0612j4094
$$ 116475 93895 59112 38068 53180 95652 133393 146716 144160 141335 138490 127878 113784
3198A13784j445J9066K6579J0666j6875l1817j9718R276K9123K3738J529j7374
$$ 113784 112339 131405 157984 168650 151775 119958 100240 109516 138639 162377 163906 146532
$$ [...]
##END NTUPLES=NMR SPECTRUM
##END=
