##TITLE=H1
##JCAMPDX= 6.0         $$ Bruker NMR JCAMP-DX V2.0
##DATA TYPE= NMR FID
##DATA CLASS= NTUPLES
##ORIGIN= UXNMR, Bruker Analytische Messtechnik GmbH
##OWNER= root
$$ XWIN-NMR		Version 3.5
$$ Mon Feb 22 10:37:14 2016 Russian Standard Time (UT+4h)  servis@DPX200
##.OBSERVE FREQUENCY= 200.131235884673
##.OBSERVE NUCLEUS= ^1H
##.DELAY= (6, 6)
##.ACQUISITION MODE= SIMULTANEOUS
##.ACQUISITION SCHEME= undefined
##.AVERAGES= 32
##.DIGITISER RES= 18
##SPECTROMETER/DATA SYSTEM= spect
##.PULSE SEQUENCE= zg
##.SOLVENT NAME= DMSO
##.SHIFT REFERENCE= (INTERNAL, DMSO, 0, 16.5164)
##AUDIT TRAIL= $$ (NUMBER, WHEN, WHO, WHERE, WHAT)
$$ ##TITLE= Audit trail, XWIN-NMR		Version 3.5
$$ ##JCAMPDX= 5.01
$$ ##ORIGIN= Bruker BioSpin GmbH
$$ ##OWNER= servis
$$ F:/spectra/data/servis-vadim/nmr/H1/1/audita.txt
$$ ##AUDIT TRAIL=  $$ (NUMBER, WHEN, WHO, WHERE, WHAT)
(   1,<2016-02-22 10:36:21.09 +0400>,<servis>,<DPX200>,
      <created by zg, POWCHK disabled, PULCHK disabled
       configuration hash MD5:
       00 E9 B6 7A A2 85 ED C7 34 08 36 98 17 FE 4E 26
       data hash MD5: 16K
       08 58 28 EE 44 2E E6 12 A2 16 EA 92 5E DE 51 5C>)
$$ ##END=
$$ 
$$ hash MD5
$$ 08 44 19 37 F0 9F EE 10 98 41 53 4D F2 A0 54 2F
##$RELAX= 
##$RELAX= 
##$RELAX= 
##$RELAX= 
##$RELAX= 
##$RELAX= 
$$ Bruker specific parameters
$$ --------------------------
##$DU= <F:/spectra>
##$EXPNO= 1
##$NAME= <H1>
##$PROCNO= 1
##$TYPE= <nmr>
##$USER= <servis-vadim>
##$AMP= (0..31)
100 100 100 100 100 100 100 100 100 100 100 100 100 100 100 100 100 100 
100 100 100 100 100 100 100 100 100 100 100 100 100 100 
##$AQSEQ= 0
##$AQ_mod= 1
##$AUNM= <au_zg>
##$AUTOPOS= <>
##$BF1= 200.13
##$BF2= 200.13
##$BF3= 200.13
##$BF4= 200.13
##$BF5= 500.13
##$BF6= 500.13
##$BF7= 500.13
##$BF8= 500.13
##$BYTORDA= 1
##$CFDGTYP= 0
##$CFRGTYP= 5
##$CHEMSTR= <none>
##$CNST= (0..31)
1 1 145 1 1 1 1 1 1 1 1 1 1 1 1 1 1 1 1 1 1 1 1 1 1 1 1 1 1 1 1 1 
##$CPDPRG= <>
##$CPDPRG1= <>
##$CPDPRG2= <>
##$CPDPRG3= <>
##$CPDPRG4= <mlev>
##$CPDPRG5= <mlev>
##$CPDPRG6= <mlev>
##$CPDPRG7= <mlev>
##$CPDPRG8= <mlev>
##$CPDPRGB= <>
##$CPDPRGT= <>
##$D= (0..31)
0 1 0 0 0 0 0 0 0 0.06 0 0 0 0 0 0 0.0002 0 0 0 0 0 0 0 0 0 0 0 0 0 0 
0 
##$DATE= 1456122980
##$DBL= (0..7)
120 120 120 120 120 120 120 120 
##$DBP= (0..7)
150 150 150 150 150 150 150 150 
##$DBP07= 0
##$DBPNAM0= <>
##$DBPNAM1= <>
##$DBPNAM2= <>
##$DBPNAM3= <>
##$DBPNAM4= <>
##$DBPNAM5= <>
##$DBPNAM6= <>
##$DBPNAM7= <>
##$DBPOAL= (0..7)
0.5 0.5 0.5 0.5 0.5 0.5 0.5 0.5 
##$DBPOFFS= (0..7)
0 0 0 0 0 0 0 0 
##$DE= 6
##$DECBNUC= <off>
##$DECIM= 32
##$DECNUC= <off>
##$DECSTAT= 4
##$DIGMOD= 1
##$DIGTYP= 9
##$DL= (0..7)
0 120 120 120 120 120 120 120 
##$DP= (0..7)
150 150 150 150 150 150 150 150 
##$DP07= 0
##$DPNAME0= <>
##$DPNAME1= <>
##$DPNAME2= <>
##$DPNAME3= <>
##$DPNAME4= <>
##$DPNAME5= <>
##$DPNAME6= <>
##$DPNAME7= <>
##$DPOAL= (0..7)
0.5 0.5 0.5 0.5 0.5 0.5 0.5 0.5 
##$DPOFFS= (0..7)
0 0 0 0 0 0 0 0 
##$DQDMODE= 0
##$DR= 18
##$DS= 0
##$DSLIST= <SSSSSSSSSSSSSSS>
##$DSPFIRM= 0
$$ [...]
##$SUBNAM0= <"">
##$SUBNAM1= <"">
##$SUBNAM2= <"">
##$SUBNAM3= <"">
##$SUBNAM4= <"">
##$SUBNAM5= <"">
##$SUBNAM6= <"">
##$SUBNAM7= <"">
##$SUBNAM8= <"">
##$SUBNAM9= <"">
##$SW= 20.6817932712277
##$SWIBOX= (0..15)
0 0 3 0 0 0 0 0 0 0 0 0 0 0 0 0 
##$SW_h= 4139.07284768212
##$TD= 16384
##$TD0= 1
##$TE= 0
##$TE2= 300
##$TE3= 300
##$TEG= 300
##$TL= (0..7)
0 120 120 120 120 120 120 120 
##$TP= (0..7)
150 150 150 150 150 150 150 150 
##$TP07= 0
##$TPNAME0= <>
##$TPNAME1= <>
##$TPNAME2= <>
##$TPNAME3= <>
##$TPNAME4= <>
##$TPNAME5= <>
##$TPNAME6= <>
##$TPNAME7= <>
##$TPOAL= (0..7)
0.5 0.5 0.5 0.5 0.5 0.5 0.5 0.5 
##$TPOFFS= (0..7)
0 0 0 0 0 0 0 0 
##$TUNHIN= 0
##$TUNHOUT= 0
##$TUNXOUT= 0
##$USERA1= <user>
##$USERA2= <user>
##$USERA3= <user>
##$USERA4= <user>
##$USERA5= <user>
##$V9= 5
##$VALIST= <valist>
##$VCLIST= <CCCCCCCCCCCCCCC>
##$VD= 0
##$VDLIST= <DDDDDDDDDDDDDDD>
##$VPLIST= <PPPPPPPPPPPPPPP>
##$VTLIST= <TTTTTTTTTTTTTTT>
##$WBST= 1024
##$WBSW= 4
##$XGAIN= (0..3)
0 0 0 0 
##$XL= 0
##$YL= 0
##$YMAX_a= 44699
##$YMIN_a= -45414
##$ZGOPTNS= <>
##$ZL1= 120
##$ZL2= 120
##$ZL3= 120
##$ZL4= 120
##$ABSF1= 10
##$ABSF2= 0
##$ABSG= 5
##$ABSL= 3
##$ALPHA= 0
##$AQORDER= 0
##$ASSFAC= 0
##$ASSFACI= 0
##$ASSFACX= 0
##$ASSWID= 0
##$AUNMP= <proc_1d>
##$AZFE= 0.1
##$AZFW= 0.1
##$BCFW= 1
##$BC_mod= 2
##$BYTORDP= 0
##$COROFFS= 0
##$CY= 12.5
##$DATMOD= 1
##$DC= 2
##$DFILT= <>
##$DTYPP= 0
##$F1P= 11.0000006437302
##$F2P= -0.999999642372123
##$FCOR= 0.5
##$FTSIZE= 0
##$FT_mod= 4
##$GAMMA= 1
##$GB= 0
##$INTBC= 1
##$INTSCL= 1
##$ISEN= 128
##$LB= 0.3
##$LEV0= 0
##$LPBIN= 0
##$MAXI= 10000
##$MC2= 0
##$MEAN= 0
##$ME_mod= 0
##$MI= 0
##$NCOEF= 0
##$NC_proc= 0
##$NLEV= 6
##$NOISF1= 0
##$NOISF2= 0
##$NSP= 1
##$NTH_PI= 0
##$NZP= 0
##$OFFSET= 16.51637
##$PC= 1
##$PHC0= -30.24149
##$PHC1= -0.3563094
##$PH_mod= 0
##$PKNL= yes
##$PPARMOD= 0
##$PSCAL= 4
##$PSIGN= 0
##$REVERSE= no
##$SF= 200.13
##$SI= 32768
##$SIGF1= 0
##$SIGF2= 0
##$SINO= 400
##$SIOLD= 32768
##$SREGLST= <1H.CDCl3>
##$SSB= 0
##$STSI= 0
##$STSR= 0
##$SW_p= 4139.07284768211
##$SYMM= 0
##$S_DEV= 0
##$TDeff= 0
##$TDoff= 0
##$TI= <>
##$TILT= no
##$TM1= 0
##$TM2= 0
##$TOPLEV= 0
##$USERP1= <user>
##$USERP2= <user>
##$USERP3= <user>
##$USERP4= <user>
##$USERP5= <user>
##$WDW= 1
##$XDIM= 8192
##$YMAX_p= 0
##$YMIN_p= 0
$$ End of Bruker specific parameters
$$ ---------------------------------
##NTUPLES= NMR FID
##VAR_NAME=  TIME,          FID/REAL,        FID/IMAG
##SYMBOL=    X,             R,               I
##VAR_TYPE=  INDEPENDENT,   DEPENDENT,       DEPENDENT
##VAR_FORM=  AFFN,          ASDF,            ASDF
##VAR_DIM=   8192,          8192,            8192
##UNITS=     SECONDS,       ARBITRARY UNITS, ARBITRARY UNITS
##FACTOR=    0.0002416,     1,               1
##FIRST=     0,             0,               0
##LAST=      1.9789456,     0,               0
##MIN=       0,             -45414,          0
##MAX=       1.9789456,     44699,           0
$$ Real data points
##PAGE= N=1
##DATA TABLE= (X++(R..R)), XYDATA
0@%%%%%%%%%%%%%%%%%%%%%%%%%%%Qm0O4o4O4o4O4o4O5r7J28j28J29j37J68j92
43i6J93k25K57k74L06l34L66m11M50m89N46o06O67p38Q21r19J028j161J326j533
63h26J793k145K650l425M814q038K9766J4978m4261j5523J029K2059J6134O898
77B5903j5349k6532k6022l414J7727K8750K0015N073j3377k1514j5556N333K2901
90C938K7303J3047j0276l0508l0431j1687J2010K3294J9859L598j5478k4916j4042
103c4289Q256K5230K5705J3757m168k0655k6998j4725R329K5387K0406J784j6968
116A2051k7017k2289j802K1594K9338J6829m215j9619k1715r853Q019K0685J9793
129B1799O356j1238k2660j9799l339J6218K4896J6456j702j7815k3124j3275P557
$$ plain form
0 0 0 0 0 0 0 0 0 0 0 0 0 0 0 0 0 0 0 0 0 0 0 0 0 0 0 0 0 8 -32 32 -32 32 -32 32 -32 33 -64 64 -64 65 -72 96 -96
43 -96 97 -128 129 -145 161 -173 193 -218 232 -257 289 -317 350 -388 433 -486 542 -619 707 -826
63 -826 967 -1178 1472 -1953 2861 -5177 24589 39567 -4694 -20217 -19188 2871 19005 25903
77 25903 10554 -15978 -42000 -45414 -27687 1063 21078 26151 12774 -8740 -24296 -18963 3938
90 3938 31241 44288 34012 3504 -26927 -38614 -26604 -3310 16549 20147 4669 -20247 -34289
103 -34289 -26033 -803 24902 38659 34491 13836 -13162 -27887 -18558 6829 27235 29019 12051
116 12051 -14966 -37255 -39057 -17463 11875 28704 24489 4870 -16845 -26698 -18679 2006 21799
129 21799 28155 16917 -5743 -25542 -28881 -12663 12233 28689 26987 9172 -13952 -27227 -19670
142a9670K4641K2598M019j4780k3048j9605o327J1947K3251J7307p32j5979j9084
155a5462j0053N065J9856K4009J1705j0086k4627k1863n643J2357K1863J6243
167B3364m97j6664k1790j3447K817J8203K2374J2013m708j6188j7007p598O834
180a2294J9034J8121K277j6772k3650j4820J242J5092K0520J2923m730j9084j8022
193b0163l837J0887J8386J6162M923j0388k0047j5874r38J3881J9326J1948l047
206B1219j6838j9968r717O410J8329J8262N862j0520j9578j4421q08J1431J7067
219F730J3122M44j4178j9535j0107N491J6400J7111Q443n504j7581j7896m426
232b1486J1379J7555J0969j235j2002j6507j0089L582J5268J6577P237n691j5080
$$ plain form
142 -19670 4971 27569 31588 16808 -6240 -25845 -32172 -20225 3026 20333 19601 3622 -15462
155 -15462 -25515 -20450 -594 23415 35120 25034 407 -21456 -27099 -14742 7121 23364
167 23364 22867 6203 -15587 -29034 -26217 -8014 14360 26373 21665 5477 -11530 -19128 -12294
180 -12294 6740 24861 27138 10366 -13284 -28104 -26862 -11770 8750 21673 16943 -2141 -20163
193 -20163 -24000 -13113 5273 21435 26358 15970 -4077 -19951 -20889 -7008 12318 24266 21219
206 21219 4381 -15587 -25304 -18894 -565 17697 23559 13039 -6539 -20960 -21768 -10337 6730
219 6730 19852 20296 6118 -13417 -23524 -18033 -1633 15478 23921 18417 836 -17060 -21486
232 -21486 -10107 7448 18417 17182 5180 -11327 -21416 -17834 -2566 14011 21248 15557 477
245D77j5099n085P924J6523J4262K413j1736j9001j3032J669J4122J6429Q217
258A8083l720j3576j5439o103Q248J6995J3308K346q128j4633j3158k421J0896
271g302J6949R983l255j3595j5300p525M815J4872J5166M383q557j5396j1840
284a6602j481R258J4396R967o25j0346j3894q186L620J3854J4500M946o523j3893
298a009j3207l889Q500J6119J1717j103j2129j4847q425J626J1042J4904Q308
311A7607m168j2977j2191l668O425J3107J1574J746r705j5220j0352R29J1150
324e743J4087P530l300j1701j2475n270N433J3099J2511L529p278j2997r874j229
338a3678P828J2739R181k029j2693j3853n156N317J2192J2119M482o530j3662
$$ plain form
245 477 -14622 -19707 -11783 4740 19002 21415 9679 -9322 -22354 -20685 -6563 9866 18083
258 18083 14363 787 -14652 -20755 -12507 4488 17796 20142 12014 -2619 -15777 -18198 -7302
271 -7302 9647 19630 16375 2780 -12520 -20045 -15230 -358 14808 19191 10634 -4762 -16602
284 -16602 -18083 -8825 5571 15538 14913 4567 -9327 -17513 -13893 -39 14461 19407 12884 -1009
298 -1009 -14216 -18105 -9605 6514 18231 17128 4999 -9848 -18273 -16647 -5605 9299 17607
311 17607 13439 462 -11729 -15397 -8972 4135 15709 17455 7750 -7470 -17822 -16893 -5743
324 -5743 8344 15874 12574 873 -11602 -16872 -11439 1660 14171 17700 10422 -2575 -12449 -13678
338 -13678 -5850 6889 16070 14041 1348 -12505 -17661 -12344 -152 11967 16449 9919 -3743
351c743j1010r04R180J2687Q392m13r203j2923p987K599J1404J2517N706m692
365A1610j2093j1203k819O946J2242R723M66r789j3354p606K352R960J1450O254
379A4139k927j0998j1744l875O751J2308R611J736o866j2094r579P1R706J1766
393H005N456l690j0336j0663m155N351J1784J0741K813o728j1729q878m63Q015
407d477J1388P314j466r800j2021o283L734J0902J0127K963n175j0269r157j584
421a3804P943J2039P594j153q464j0484o360J882R608J0977M352n185j0849r090
435a0994k019O032J0645Q245K51p915j0677o400J856Q825R904M468l383r173r282
450i617l440N212J0881Q957J026p113j0333p173K00P806J0665N871l208r862r340
$$ plain form
351 -3743 -14753 -15657 -6477 6210 14602 14189 4986 -7937 -15924 -13325 -1921 10596 16302 11610
365 11610 -483 -11686 -14505 -7559 4683 14406 14872 5083 -8271 -15877 -13525 -3565 7885 14139
379 14139 11212 214 -11530 -15405 -8654 3654 13265 15001 8135 -3959 -13538 -13467 -3761 8005
393 8005 13461 9771 -565 -11228 -15383 -10032 1752 12493 15306 8578 -3151 -12029 -12492 -4477
407 -4477 6911 14225 12759 2959 -9062 -15345 -11611 -709 9418 12381 7206 -3063 -12220 -13804
421 -13804 -5861 6178 13772 12619 4155 -6329 -12689 -10807 -1199 9778 14130 8945 -1904 -10994
435 -10994 -13013 -6981 3664 11909 12160 4245 -6432 -12832 -10976 -2151 7753 12221 8838 -335 -9617
450 -9617 -13057 -7845 3036 11993 13019 5906 -4427 -11600 -11400 -3594 7071 12942 9734 -128 -9468
465i468l246M162R225Q785K530n656r825o950L53P100R409N738j505q212r868
480g428m925L082Q901Q590K553n058r262p308q35O221R796P158l73p522r096m446
496i952K458P708Q294L503m192r647q412j542N643Q823O379L15o207r069n459
511a1357J983Q072Q654L928k771p827p904k807M002Q337O982P46o025q786n736
526a0509P38O659Q374M801j887p531q103k879M171Q133O687J594m367q268o737
541i124m48O192Q160M560j498o559p685l909K649P773P531K150m358p760o103
556h429p95N065P921N486m48o010p701m182J978O768O976K816k935p210p036k045
572i781M519P758N551k6n319p290m662R95O467P812L595k781o788o184k039L312
$$ plain form
465 -9468 -12714 -8552 673 9458 11988 6332 -3493 -10443 -10090 -2990 6419 12157 10652 2440 -7428
480 -7428 -12353 -9271 -370 8220 10773 5715 -3547 -10855 -11690 -5469 4327 11485 11112 3590 -5506 -9952
496 -9952 -7494 214 8508 12011 7819 -1828 -10240 -11782 -6139 2684 9063 9378 3171 -5898 -11357
511 -11357 -9374 -1302 7352 11280 8509 682 -7222 -10029 -6027 2310 9292 10038 4013 -4773 -10509
526 -10509 -9771 -3112 5262 10063 8176 645 -7458 -10337 -6166 1967 8654 10248 5881 -2387 -9124
541 -9124 -9572 -3380 4780 9340 7842 1283 -6402 -10311 -7662 111 7642 9792 5434 -2326 -8429
556 -8429 -9224 -4159 3762 9248 8800 2790 -4911 -9093 -7115 -347 6629 9445 6510 -700 -7736 -9781
572 -9781 -5262 2496 8047 8021 2702 -4588 -9250 -8255 -1788 6024 9619 6838 50 -6134 -8173 -4861
588d861O959N997P38n074p492n049L61N404O944M054j320n935o597k710L140O952
604A511O136J443m005o966n487p08M588P086M510j300o051o525l032K024O166
619f10O659K504l327o722n253m81M358O434M478k98n218p016l994J537N744O169
635D964K743k285n995n716j564L529O539N138K79m775o502l978Q30N126O363L342
651H038k009o080n921j833L138O002N119J210l645o468m772K71M857N921L250
666G078j321n261n931k524K632O180N569J417l519o001m645m96L966N945L922
681G011p93n053n970k953J897N413N510K189k390n714n166q24M008O006L923l10
697F784m409o051l657J097N134N604K151k403n276m742j252L182N890M704L45
$$ plain form
588 -4861 2098 8095 8833 3759 -3733 -8782 -8421 -3017 3927 7981 6661 726 -5871 -8581 -5441 1511
604 1511 7647 9090 5085 -1881 -7368 -8076 -3488 3598 8108 6808 757 -5768 -8800 -6776 -610
619 -610 6049 8553 5226 -1496 -6749 -7230 -2872 3562 8040 7742 2524 -4492 -8486 -6949 -1205 4964
635 4964 7707 5422 -573 -6289 -7853 -4324 2215 7353 7632 2857 -3645 -7623 -6793 -1667 4696 8038
651 8038 6029 -51 -5972 -7805 -4667 1335 6454 7664 4019 -2449 -7221 -6950 -2093 3828 7078
666 7078 5757 496 -5435 -7959 -5327 853 6422 7839 4320 -1681 -6326 -6822 -2856 3089 7011
681 7011 6218 1165 -4805 -7758 -5861 -448 5062 7251 4861 -853 -6019 -6843 -2835 3171 7094 6784
697 6784 2375 -3676 -7333 -6236 -1102 4502 6653 4250 -1026 -5768 -7020 -3838 2052 6756 7101
712G101m064n715l677N66M319N287K632j663n086n203j746K927N673M625Q28l302
728C502n526m101J9M342N718L056j525m949n185k329J905N103M915J253l109n186
744b097l598L3L749N262L411p04m463n456k717J506M659M682J700k305m974m293
760e605o71L453N403L688m00m080m987k727J081M370M872J991k333n055m337r64
776f301K777M876L918M44l449n055l001R96M191M651K175j611m640m673j556K417
792c841M848L970O32k973m636l234J77L539M723K607j243m300m460j690K001M425
808E45M001J059k645m829l534Q9L539M566K791o05l705m530k249J515M211L915
824D134J068k403m342l503m40L009M732L173l61l455m323k335J035L754L955J666
$$ plain form
712 7101 3037 -2678 -6355 -5789 -1470 3817 6449 4786 -300 -5503 -7249 -4322 1351 5976 6804 3502
728 3502 -2024 -6125 -6106 -1764 3954 7010 5485 536 -4649 -6978 -5073 30 4945 6198 3089 -2097
744 -2097 -5695 -5662 -1913 3349 6760 6056 1593 -3863 -6580 -5074 -415 4267 5967 3662 -1312 -5605
760 -5605 -6276 -2823 2580 6268 5868 1788 -3199 -5926 -4845 -475 4397 6388 4055 -1000 -5337 -6301
776 -6301 -3524 1352 5270 5714 2265 -2790 -5791 -4795 -604 4047 6222 4611 -29 -4702 -6258 -3841
792 -3841 1007 4977 5609 2636 -2000 -5234 -5057 -1518 3205 5812 4569 269 -4191 -5881 -3880 545
808 545 4546 5605 2960 -1869 -5403 -5314 -1775 2791 5582 4977 1272 -3258 -5507 -3992 219 4134
824 4134 5202 2799 -1543 -5046 -5486 -2477 2255 5428 5067 1612 -2711 -5046 -4011 -257 3698 5364
840E364j805m275l916r02K577M322L183K39k929m275k667P33L788M169J755j616
856C745l823l641j263K034M083L246J82k873m010k646L71L234M117K358q93l595
872F26l936j595J675L727L353P97k240l933k970K4L013M072K324q76l446l751
888c136j804J208L736L753J124k063l757l020m97K346L717K642j93k904l670j864
904d382J087L244L292J314j626l705l308p00K218L809K862J12k579l559k216N02
920c635L070L603J630j393l447l233j026J699L435K894M47k325l622k337M50K855
936i35L436J967p65l137l488j379J539L292K861O26k032l406k597j45K479L463
952A779K198m40k674l051j479J056K980K901Q48j800l481k837l09K323L360K360
$$ plain form
840 5364 3559 -716 -4632 -5534 -2957 1365 4548 4787 1858 -2417 -5084 -4351 -563 3606 5361 3745
856 3745 -78 -3719 -4982 -2948 1135 4381 4563 1690 -2320 -4966 -4595 -1361 2756 5114 4221 626
872 626 -3310 -4905 -3230 497 3850 4647 2407 -1526 -4496 -4472 -1459 2613 4937 4061 615 -3136
888 -3136 -4940 -3732 4 3757 4881 2818 -939 -3959 -4456 -2110 1607 4249 4056 1152 -2518 -4382
904 -4382 -3295 -51 3241 4555 2929 -776 -4084 -4784 -2566 1243 4105 4217 1638 -1921 -4137 -3635
920 -3635 -565 3038 4668 3275 -172 -3405 -4431 -2732 703 3597 4044 1719 -1903 -4240 -3790 -935
936 -935 2501 4468 3703 566 -2922 -4301 -2762 530 3391 4017 1985 -1421 -4018 -4163 -1684 1779
952 1779 3977 3537 863 -2188 -3667 -2611 369 3270 4118 2318 -1163 -4000 -4309 -1986 1374 3734
968C734p7k536l355j818R46L031L092J137j351l001k768p59J765L145K264j58
984C291k406l095j869N58K758L306J657j004k912k928j027J505K943K443L76j989
1000A607l195k206K42K501L039J597q09k627k764j120J373L039K653M64j879k984
1016a069k234j12K085K973J863n44k544k824j288J060K736K694R30j457k910k471
1032c112l33J912K891J950k83k258k790j509P95K636K796R71j359k775k405n72
1048c445J593K795K151O3k078k810j617N29K283K580J289r06k570k434o30J553
1064a654K651K070J25j914k745j920K14K179K740J461p07k314k418r21J152K564
1080E63K287M97j658k698j953L8J918K523J542n12k262k532j094J065K453K292
$$ plain form
968 3734 3657 1121 -2234 -4052 -3106 -75 3017 4154 2803 -198 -2966 -3725 -1960 1185 3449 3291
984 3291 885 -2210 -4079 -3521 -763 2543 4200 3196 284 -2644 -3671 -2166 777 3220 3596 1607
1000 1607 -1588 -3794 -3552 -1051 1988 3585 2776 149 -2615 -3735 -2362 677 3330 3794 1915 -1069
1016 -1069 -3303 -3415 -1330 1643 3506 2962 418 -2406 -3694 -2634 102 2796 3726 2269 -641 -3112
1032 -3112 -3445 -1533 1358 3308 3025 767 -2023 -3532 -2737 -101 2695 3666 2307 -468 -2873 -3445
1048 -3445 -1852 943 3094 3157 1079 -1731 -3348 -2819 -536 2044 3333 2427 -143 -2577 -3207 -1654
1064 -1654 997 3067 3192 1278 -1467 -3387 -3173 -994 1746 3207 2500 186 -2232 -3153 -2001 563
1080 563 2850 3347 1689 -1009 -2962 -2924 -1006 1517 3059 2547 285 -2247 -3341 -2276 177 2469
1096B469O55j329k431k016k18J761K507J590l55k003k426j325O49K199K341Q81
1112B949j087k376k008l00J536K386J763o7j879k526j440N99K155K317R80r46
1128B056k244k160o46J314K366J849O4j550k169j517K72J827K239J134p52k096
1144a3k125p35J121K198J932M22j424k366j659P0J734K233J261m80j878k063r50
1161b722Q95K122J941L74j286k069j656j22J511K208J419l70j763k115j021P13
1177a941J916J968P58j005k146j778k31J300K014J486q8j583j996j195M78J795
1193b48J988P68q76j882j730m77J182K007J597L6j457k060j300L06J630J900J028
1210B412o06j817j801n42J045J781J582K01j254j907j370J70J532J939J018n28
$$ plain form
1096 2469 3124 1795 -636 -2652 -2870 -1109 1398 2988 2633 630 -1796 -3121 -2472 -273 2068 2949
1112 2949 1862 -514 -2522 -2822 -1286 1100 2863 2796 917 -1609 -3049 -2450 -295 2022 3002 2056
1128 2056 -188 -2348 -2994 -1680 686 2535 2599 1049 -1120 -2637 -2365 -538 1701 2835 2083 -13
1144 -13 -2138 -2873 -1752 446 2378 2800 1376 -990 -2649 -2579 -845 1388 2649 2169 291 -1772 -2722
1161 -2722 -1827 295 2236 2610 1324 -745 -2401 -2523 -1012 1196 2615 2245 482 -1633 -2654 -1941
1177 -1941 -25 1943 2701 1696 -450 -2228 -2459 -1159 855 2341 2253 670 -1326 -2521 -2043 -248
1193 -248 1740 2508 1632 -250 -1980 -2457 -1275 732 2329 2365 908 -1152 -2452 -2146 -516 1384 2412
1210 2412 1806 -11 -1812 -2354 -1309 472 2054 2255 1001 -906 -2276 -2106 -574 1365 2383 1855
1226A855j634j807q00P77J805J720M31j088j862j463q3J303J814J188k50j581
1242C25j811q01P44J691J616N15r45j753j515j94J168J802J221k31j337j689j042
1259b236M35J555J722P03p33j578j544l53J019J709J317J6j317j808j091L71J419
1276c94J662P99o10j545j542m79R24J710J391J00j072j636j176N0J277J600Q89
1293A948n00j430j509n91P61J537J437L53r69j627j234K7J186J575R98l18j342
1310C02j602p44N88J490J455M06q42j447j232j56J063J563J064k40j266j511p92
1327a901M31J347J443N80p01j512j296k27R58J504J122lj099j505r26L02J206
1344b77J409O18n92j320j307l86Q00J474J239Q9j021j473r83K09J190J403P57
$$ plain form
1226 1855 221 -1586 -2386 -1609 196 1916 2347 1259 -603 -2066 -2149 -846 968 2156 1906 325
1242 325 -1486 -2287 -1543 148 1764 2279 1334 -419 -1934 -2128 -960 842 2063 1832 495 -1194 -2236
1259 -2236 -1801 -246 1476 2179 1446 -132 -1676 -2029 -1010 699 2016 2032 715 -1093 -2184 -1813 -394
1276 -394 1268 2067 1457 -88 -1630 -2109 -1185 525 1916 2016 944 -692 -1868 -1818 -541 1059 1948
1293 1948 1448 18 -1491 -2082 -1321 216 1653 2006 1037 -590 -1824 -1797 -611 964 1962 1644 302
1310 302 -1300 -2044 -1456 34 1489 1895 1053 -394 -1626 -1782 -719 844 1908 1668 402 -1109 -1901
1327 -1901 -1470 -123 1320 1900 1199 -313 -1609 -1836 -878 626 1748 1745 646 -859 -1785 -1483 -277
1344 -277 1132 1750 1158 -162 -1469 -1855 -1055 419 1658 1747 726 -747 -1730 -1521 -331 1072 1829
1361A829m91j336j354m37O92J345J151K25q53j347j017R1J094J341P65l07j170
1378B21j328o06N24J314J203L38p81j369j069p7R58J350R53j60j166j328o19M74
1396a168J173J200L96o47j293j081j48R07J307Q59j40r54j280p30L16J131J227
1413A075N10n59j191j105k79P29J229J040O2r38j256p76K33J007J197N89m95j191
1431a19j122l45O36J232J012J02p69j164q58R6R76J200O10l35j056j121m44M87
1449i82J117J035K01p29j194q28N5Q55J192P17j96r99j093n49M37J045J049K35
1467A368o17j114r17r6P72J177P73j44q82j089n44L21R81J035L75n50j101r04
1485a156j62O62J058Q10j9q16j068o37K36R32J028M63m01r94r30l14N56J064Q35
$$ plain form
1361 1829 1338 2 -1352 -1789 -1097 248 1399 1624 771 -576 -1593 -1502 -408 933 1698 1391 221
1378 221 -1107 -1713 -1189 125 1328 1666 885 -484 -1553 -1630 -672 678 1631 1471 305 -1023 -1642 -1168
1396 -1168 5 1205 1601 954 -339 -1420 -1568 -661 646 1505 1365 411 -869 -1599 -1283 -152 1075
1413 1075 1585 1026 -165 -1270 -1549 -820 409 1449 1511 573 -683 -1459 -1226 -219 978 1567 1072 -119
1431 -119 -1241 -1586 -950 282 1294 1396 627 -537 -1395 -1299 -323 877 1487 1152 96 -1025 -1469 -982
1449 -982 135 1170 1371 642 -552 -1380 -1325 -470 722 1439 1243 244 -849 -1398 -961 84 1133 1368
1467 1368 751 -363 -1280 -1376 -604 573 1346 1202 320 -769 -1313 -992 -11 1024 1399 849 -252 -1156
1485 -1156 -1318 -656 402 1212 1193 377 -691 -1328 -1092 -160 868 1331 930 -64 -994 -1308 -752 312 1147
1504A147M1p16j047o56J32Q62J040N34l20r82r64l35M97R63Q40J31o33j014o78
1523a158O4P50R77N49k12q14r14m45L63R52Q64J76n20r72p77n5O85R70O64j38
1543A009p92r53m36L30R06Q43K87m64r45p98j31O28R43O06n1p00q75n31K33Q58
1563c3Q59L46m08q45p98j78M77Q95O95Po71r04n42J23P37Q80M50k55q14q15k38
1584a032M28Q57P03N1n78q68o12L2O84Q83M64j96p47p98k90L70Q02P31J46m90
1604E40q56o20j0N86Q00N16j40o98p77l76L12P54P66K28l99p67o85j29N28Q25
1624C98N06q7o34p85m40K33P26P58L22l54p62o40j38M43P53N89Jn99p86m63J38
1645h21O53P30L42k49o93o70k14M10P51N98P4m95p50n33N6N64P45M07k09p02o78
$$ plain form
1504 1147 1188 472 -575 -1231 -1099 -237 803 1337 1017 35 -929 -1264 -767 196 1036 1167 534 -480 -1158
1523 -1158 -1094 -344 633 1182 970 156 -758 -1203 -840 112 976 1152 632 -340 -1117 -1172 -487 483 1147 1009
1543 1009 217 -736 -1172 -842 64 907 1194 730 -215 -1013 -1144 -516 427 1033 982 282 -593 -1124 -891 -33
1563 -33 826 1172 764 -81 -879 -1057 -580 315 1010 1017 346 -558 -1100 -977 -240 640 1090 835 21 -794 -1032
1584 -1032 -604 253 956 1007 429 -439 -1051 -1019 -335 548 1012 816 69 -729 -1019 -649 153 884 1030 540
1604 540 -316 -936 -946 -360 440 956 816 118 -659 -1035 -723 31 797 1025 626 -141 -826 -955 -427 398
1624 398 904 817 183 -602 -1042 -809 -83 675 997 643 -119 -759 -897 -454 299 888 889 290 -496 -959 -821
1645 -821 -168 562 904 655 -38 -708 -922 -512 239 837 911 416 -334 -867 -811 -247 498 905 696 -6 -684
1666f84k36L33P29O30J50m38p41n60K9N12P21M10j40o49o85l05K69O80O19K15
1686H59l74o94n62m3M85P08M69n9n95p05l52J88N91O51K34k89o53n82r5M45P16
1707C43M68k4n13o83l85J06N77O46K55k53o24n66j57L59O70N03K9m42o32m24Q5
1728f62N02O38L10k19n88o07j90K70O61N22R9l94o13m35L1M62O32L84j65n54o28
1749e44k63K61N75N56J38l56n91m39m0M43N83M43r7n05n68l15J89N39N20J87l16
1770D00n62n06p1L83N97M30k4m32n68l44J36N07N69K15k56n79n06j09L08N66M37
1791E91M1m30n55l07R9M69N29K47j68n10m85j89K77N21M46O3l57n50l62J7M39
1812a74N24L37j48m85n14j89K44M81M78P7l35n16l87oL64N30L35p7m41m99k33
$$ plain form
1666 -684 -920 -587 142 772 922 484 -257 -817 -788 -276 445 855 715 66 -619 -924 -655 25 644 859
1686 859 485 -209 -771 -814 -329 379 848 789 194 -511 -863 -675 -84 567 801 512 -141 -723 -818 -373 343
1707 343 811 787 274 -409 -794 -688 -111 535 790 537 -87 -653 -810 -451 219 722 751 309 -323 -747 -662
1728 -662 -160 478 788 569 -19 -626 -816 -546 115 637 736 342 -271 -706 -675 -213 419 803 638 84 -544
1749 -544 -807 -546 29 585 723 367 -224 -663 -703 -260 323 766 669 164 -404 -719 -530 9 529 716 400
1770 400 -162 -668 -739 -356 241 671 647 215 -353 -697 -561 -54 515 730 474 -105 -611 -720 -412 154 591
1791 591 632 202 -353 -660 -561 -92 437 684 516 6 -479 -668 -391 130 576 639 282 -268 -630 -613 -174
1812 -174 350 687 539 54 -460 -649 -405 76 554 631 296 -220 -607 -613 -249 281 616 539 98 -401 -634
1833f34J61M91M50J55k63n11m14m4L43M93L62m5l94m98k61J43M31M71J69k01m75
1854g1m29j13L01M93L61J1l83m52l02J03M39M50K06j80m37m27j39K30M51L58N9
1875E29l28m77l06N6L84M70K46j46l89m33j61K32M12L86O7k83m25l59j6L56M51
1896B66K57o0l74m12k04J71M45L92P0k49m48k95n2K92M21K73o3l40m23j86J35
1917c84L89L83J60j97m18l58o9K62M02L03j3l38m12k46Q7L60M11J57j38l92l50
1938d01j00K51L96L25qk73m14k59N1L18M06J74j02l74l32j46J94M04L14N9k38
1959B45l79l02K3K58L92K26j03l46l40j69J74L67L28J03k28l84k80j4K62L48K19
1980D00m5l00l44j78J25L38L39Q9j58l71k72m3K67L45K33j2l01l42j92Q4L10L36
$$ plain form
1833 -634 -473 18 468 623 360 -151 -565 -609 -266 227 589 544 150 -348 -609 -466 -35 436 605 404 -71
1854 -71 -500 -613 -312 181 542 553 170 -282 -584 -481 -42 408 614 434 -3 -430 -569 -339 112 470 529
1875 529 201 -276 -582 -526 -142 328 574 428 39 -394 -555 -323 89 475 542 259 -166 -525 -541 -185 266
1896 266 523 463 89 -323 -527 -356 89 481 551 302 -146 -441 -493 -201 220 493 430 90 -333 -519 -384
1917 -384 5 388 548 351 -67 -425 -494 -232 170 473 460 122 -290 -536 -449 -89 322 479 341 -51 -401
1938 -401 -501 -250 146 471 463 190 -224 -483 -432 -114 292 466 364 -10 -342 -488 -294 110 424 483 245
1959 245 -134 -436 -413 -155 237 463 360 14 -326 -495 -321 46 374 477 249 -135 -415 -429 -167 181 400
1980 400 355 55 -289 -467 -342 -4 335 424 266 -105 -377 -420 -153 192 425 413 112 -230 -422 -338 -28 308
2002C08R6j08l44k87o7J89L54K68Nk42l55k41L2L05L40J69j30l12l04j10J96L26
2024H8K83J2k14l48k00M4K29L32J74q6l10l07j15J61L08K82N7j89l12k35J5K35
2046i6L10J80n6k89k99j32J05K98K82Q1j69k91k56j9K17L12K07n2k72k83j48P2
2068b98K61K91R5j37k81k86j3J73L28K00j4k15k95j53L4K63K62J40j32k71k57
2089c05n3J67K97K03K6k05k82j85N1K12K85J20o1k54k60j16J42K90K13M1j73k92
2111a39j76L6K02K53J39n3k57k23j41J21K35K34O6j57k31k15nK06K64J77q1k11
2133D4k30j41J10K26K37M8j14k35k25k0J59K72J88ok10k57j27P1K03K43R1j26
2155B01k50k06k4J12K48J75nj51k41j46L3K14K13J27p7k30k06p9J16K33J95K1
$$ plain form
2002 308 404 296 -48 -335 -402 -213 141 409 414 172 -183 -424 -392 -87 253 422 292 -20 -324 -434 -238 88
2024 88 371 383 169 -179 -379 -335 -106 226 400 314 4 -303 -418 -257 51 333 390 201 -111 -346 -331 -96
2046 -96 214 394 338 49 -250 -382 -277 21 303 384 215 -76 -332 -351 -134 178 385 333 61 -222 -370 -298
2068 -298 -37 254 349 212 -69 -355 -368 -195 133 333 319 104 -191 -344 -310 -47 215 355 223 -48 -305
2089 -305 -358 -191 106 309 335 130 -152 -337 -286 -74 211 331 270 16 -244 -360 -218 72 285 326 153 -139
2111 -139 -315 -279 -77 176 315 262 5 -218 -359 -238 -3 231 297 140 -91 -306 -311 -105 159 336 255 44
2133 44 -186 -327 -217 9 246 294 180 -55 -280 -300 -141 131 319 313 103 -154 -281 -210 -7 236 327 201
2155 201 -49 -255 -279 -167 81 256 251 100 -141 -287 -254 -40 173 300 223 -7 -213 -292 -176 57 252 273
2177B73j74k33j71N3J92K45J02q7j97k01n6Q4K17J97Pq8k40j69mJ65K35J12k4
2200B38k01k28q0J00J86K00L2r6k19j60k4J35K09J75m1j86k02j11P6J95J94N5
2222B47q2k08j94k0J49K11J11K5j56k02j41N9J61K01R6r4j72j96k8J11K24J50
2244B52mj65j89j23K7J46K07J02p1j69j85p5J07K02J38L7j36j98j44OJ73J69J35
2267B42p6j49j86p7Q1J67J68P4j29j76j38j2J41J99R4n0j37j81r3P3J67J65O0
2290B27q9j85j55JJ34J41J45l4j12j59r5J4J50J73O3p4j56j63k8P6J62J43Pj18
2314F8j75j19L5J52J64O8o1j37j67m8R6J80J30J9j02j95j00K6J09J92O6n9j46
2337dj39m5R1J47J01M9j07j24j19k3J43J07R6k5j05j75o0L6J56J59L0r2j56j20
$$ plain form
2177 273 99 -134 -305 -252 -60 185 287 200 3 -198 -254 -170 47 244 251 163 -77 -246 -250 -85 150 262 238
2200 238 37 -191 -271 -171 15 215 247 151 -68 -228 -252 -117 92 267 226 40 -162 -273 -197 -2 192 247
2222 247 165 -43 -237 -257 -108 103 214 239 83 -119 -260 -201 -40 161 257 163 -9 -205 -233 -122 102 252
2244 252 248 83 -106 -229 -202 -56 151 253 182 13 -172 -247 -140 62 200 237 101 -97 -241 -235 -62 107 242
2267 242 166 17 -169 -246 -165 2 170 244 115 -61 -199 -211 -70 129 223 173 36 -145 -238 -165 2 167 227
2290 227 138 -47 -202 -201 -67 74 219 185 73 -86 -181 -167 -17 156 219 145 -11 -174 -202 -126 36 179 186 68
2314 68 -107 -226 -191 -39 125 193 132 -5 -172 -220 -124 56 186 205 103 -92 -192 -166 -57 135 201 142 -4
2337 -4 -143 -188 -97 50 151 200 93 -31 -150 -173 -30 77 173 148 43 -132 -192 -156 0 159 189 97 -59 -179
2361a79J1R4J46J07l2j37j32o4L3J59J30K6o0j35j33j8Q9J56R3nr8j58q3O7J07
2386a6J27P4m8j36j13o8R9J16J26J7j17j52r8J7J35J25P7m5j28j32l7O7J23J04
2410A17M9r4j38q4j0Q5J40O6k1j19j09q4O9J37J14O4r8j38o9l0Q8J43N9Jr1j52
2436a05o4M5J28J08N9n5j14j29k1P7J44R3j3j30j25n0J8J12J21O6q6j04j01l4
2460a60O2J29R4J7r2j08r2oJ37J04L7j6j08q5n4O2R7J10K7r5j17p4j2Q8J18Q7
2486A50k9r8j20k4L3J23J02K1r5r0r9oQ4R9P9rj00j15o8N2R0J11M5o4j02p9l9
2513a48P3J11R3k0r8r9o0M3Q0J13K5l8r2q9LL6J20O3Jo2r9o8J3P8Q0Q5o3q9q8
2542i6m6N6J03Q3J9o6r5n5k4P8R8P1m3q3q9l6L8P5R6J2l6j12p8J8N3J01Q2l8n0
$$ plain form
2361 -179 -168 -74 72 179 147 10 -122 -186 -153 6 136 162 102 -33 -166 -184 -95 61 154 149 51 -107 -190 -123 -16
2386 -16 111 185 137 1 -112 -180 -81 35 161 178 61 -91 -189 -172 -37 88 165 120 -8 -140 -177 -110 13 117
2410 117 166 72 -66 -150 -160 -75 65 131 110 -9 -118 -202 -133 4 118 182 84 -54 -123 -153 -65 78 137 138 47 -105
2436 -105 -169 -124 4 112 171 116 2 -127 -148 -71 73 166 153 23 -102 -152 -134 -22 99 165 79 -25 -126 -160
2460 -160 -98 31 125 142 50 -58 -150 -156 -19 85 122 106 -2 -87 -141 -79 18 128 155 60 -57 -131 -143 -55 63 150
2486 150 121 23 -97 -121 -88 35 137 158 63 -27 -126 -132 -48 51 130 121 21 -94 -162 -110 -20 91 136 72 -30 -109 -148
2513 -148 -75 36 129 109 11 -88 -148 -105 -25 88 113 75 -17 -106 -103 -67 53 116 117 55 -44 -112 -99 -21 59 144 81 -8 -96
2542 -96 -142 -86 17 100 119 53 -42 -97 -121 -43 55 126 83 0 -89 -125 -87 -12 84 96 60 -52 -130 -112 -59 42 124 86 36
2571C6j16k5L6P1J00J8k5j11q5J1L8R1N8j2l1j06m9K2Q1M9M1j2j12o6j7M6R7Q2
2599A10l4m7r0n8J7N3J07K6j0j08m8k9J9R1P1J2j8j03m5l0N9R7M3Pp5q0l0J3R6
2628A6P1J6k8o8p1l3Q1P3M9%q7q1k5J2O6P2Rpq9n8l0L1R3O1J5p4p4m7J6P7P0K9
2660H5l0q0o4k3N7P1N2Lk7r9k4oM3Q4O0k6n3q0l5L9P0N7J0j1r1o5%N6P2N5np7
2692A8o3m4K0Q3L5N0m8p0r1J2M8N9N7J9o1q8l3J2M3P6L5pq3n5qN0P5L9L1o1p6
2723b6o5L5N5O1K2lr5m6joP3O5J9l4p2l3qM0M4O3k0n6n8m3L3O5L6L7l5o7n4nM3
2756c6Q6lK0o1m9l8J9M3J04k0jo7o3NL3O4N8ln7m2l9jM2M2N0k9o1m6l5N5M8M3
2788F1Mk0n5m5j1O9J7M8rn1o3j8J3N9N0J1j0o5m0k0M6N1P0k0n5o3k2%N6P2Nj6
$$ plain form
2571 36 -80 -105 -69 2 102 120 95 -16 -101 -90 -52 39 97 85 54 -52 -101 -79 2 51 92 80 -32 -98 -115 -69 28 110
2599 110 76 29 -61 -119 -102 -49 58 84 74 -34 -82 -111 -92 -1 70 82 64 -39 -84 -114 -55 42 85 92 17 -63 -93 -80 16
2628 16 87 103 75 7 -64 -97 -16 57 106 106 19 -62 -87 -75 -9 63 72 65 -24 -82 -112 -81 12 73 88 14 -60 -107 -91 -14 56 85
2660 85 55 -25 -89 -112 -55 16 68 71 44 -55 -79 -85 -42 42 102 76 23 -57 -92 -53 17 74 84 73 -18 -83 -83 -27 45 100 95 18
2692 18 -45 -89 -69 14 49 99 51 -19 -110 -98 -50 9 66 85 24 -64 -97 -85 -42 34 69 62 -21 -76 -84 -34 41 80 111 50 -26
2723 -26 -91 -56 -1 60 82 79 -16 -62 -63 -69 4 69 88 54 -18 -51 -59 -19 25 88 68 12 -46 -89 -56 9 45 82 47 -20 -74 -79 -36
2756 -36 50 47 67 6 -43 -81 -62 -19 85 65 64 -3 -66 -61 -28 36 94 91 34 -8 -47 -48 -6 36 86 57 -4 -50 -85 -30 18 61
2788 61 65 45 -10 -55 -66 3 20 68 59 8 -55 -73 -60 -1 49 60 50 -15 -55 -75 -29 22 92 72 17 -46 -68 -68 -12 60 65 49
2820D9n5l6j5M2M2N7km8l5n6MP1K5L6k7n9n5j8N6M6M1J3n6j8o2j9N2M7L4j3l6
2851Em2l0JO6P2rpp9m4pM3P2K3J9p0m7%J0RN7M5l5m1l8j1J2N7L5J5o8m1n6K3N0
2885a1M9M1k9n5m5nJ8N5L8ml8o3j2KL9O4oql3n3j6K5O0M2Jj4m1o2J0L3K4O2rl6
2919B3o3k6J6P3K7J6l5l3k8jJN7J3L7q0k7k9L6J7N3J5k7q2j8PLN9K3K5n3m8pm
2952f0N1J9M1j7l0m3m5L4M2L8K6l0m1m8K2J6M6M9k3l3m6k8M5L6L1j1j5l7m7RJ1
2983c8Q6lql9k1l5QN6K4K7l8ro5NK8J7N3j5l8k8j5kL9L9mK2p3k0jJN4K4J9k0n3
3018b3j5jK5O2J5k4m7l6J0J2L6K9Qm3m4k2j4L0L6M9j1k2p8JoM3M1K3j0k7m0j4
3050e7J9O0J9Qm0l8k9J6L7K4M0l7k6l8j9M7M3K3lk8n5k1L1J9K6L4j0l8n0OJ8K6
$$ plain form
2820 49 -6 -42 -57 -15 27 84 82 34 -1 -57 -53 18 43 79 52 -7 -62 -80 -24 22 63 76 20 2 -60 -79 -27 20 54 41 5
2851 5 -37 -67 -66 0 72 63 56 -23 -67 -74 -31 41 64 83 13 -34 -34 -24 -15 42 87 52 11 -27 -38 -26 31 66 81 13 -28 -84 -61 -11
2885 -11 38 79 50 -5 -50 -55 -37 18 56 52 14 -49 -61 -59 -20 44 38 30 -3 -56 -72 -47 13 55 56 42 1 -61 -51 -18 6 68 59 23
2919 23 -40 -66 -50 23 50 66 31 -2 -30 -31 -30 27 40 77 -3 -30 -59 -23 -6 47 62 35 -47 -65 -58 -55 4 27 52 -1 -49 -56 -60
2952 -60 -9 10 51 34 4 -39 -84 -50 -8 30 56 26 -15 -63 -41 -25 21 70 47 14 -32 -60 -15 21 52 41 26 -11 -58 -49 -38
2983 -38 48 45 37 -2 -23 -58 -50 6 30 57 19 10 -55 -50 -22 -5 48 33 -5 -33 -48 -50 -11 28 24 46 -27 -47 -48 -47 7 31 50 30 -23
3018 -23 -38 -39 -14 48 63 39 -8 -44 -34 -22 14 43 51 8 -36 -58 -72 -42 -6 43 32 10 -68 -67 -73 -30 11 34 24 -3 -43 -57
3050 -57 -38 22 41 49 9 -29 -58 -42 -5 19 59 22 -4 -42 -61 -14 29 52 49 21 -34 -55 -24 -5 21 55 45 7 -43 -37 -19 7
3082GK0K9m4k7k8j1J7M6L6j0l8l2l7L0L2M5J1k8m4k7jM3K9L3j3k5l9k7K8J9M6
3113D0Qk3l2l4j0L3K9M2qk7o4QnL6M5nJ7n8k9oPL5L3kj5l8k8MJ7K8M7k2m9k5J
3148e0J3K9N9rj9j6n3J1K8K4L2l9Nj0l4K1L5RJ7j9l3lpQJ7M0j4l4k2m2J1K3L5
3181A3Qkl1m8L9k2O7J3j6j0m9n%K2M3j2j1k1Kk2oM2N1Jj0m0l5kJ4L4N7k6j9k2
3215cl9J5M2K2Lk5mnl5K1K2M2k5k6l7k2JO7qJ8nk8j4j9L9jK5Rk2m8J3RJ2L0PJ0
3251D1m2k9nJ3J3K9J5j4l2kPLN5%k2kk0k9L7%M6l4J6l5rl7L8J0M6l0j9k1k8RK
3286c0N1K8k4l6j4OKJ4J7J0k2k0j7RL8K1rJ4l8l7K5MOK1knk6j2%L0MK0Nk7k1J5
3322@j2J9L2Qj9l1l1J1%M1Ol8J4l1RmK8j4K4Qk7k2mJ7J7M1k2Nm4krL3K1Ok4Rk5
$$ plain form
3082 7 27 56 12 -15 -43 -54 -37 9 45 35 -3 -35 -72 -42 -10 35 46 18 -26 -53 -54 -11 18 51 38 13 -26 -53 -25 -6 40
3113 40 48 25 -7 -41 -51 -18 11 53 45 18 -46 -38 -43 -7 38 33 50 -8 -37 -43 -36 -1 32 30 15 -23 -51 -47 -30 -2 45 23 -26 -51 -50
3148 -50 -37 -8 51 42 23 7 -46 -35 -7 17 49 10 15 5 -29 -8 27 36 53 34 1 -2 -9 -1 16 56 42 8 -14 -56 -45 -22 13
3181 13 21 19 -12 -60 -21 -43 24 37 21 11 -38 -43 -43 -21 22 10 -1 -22 -20 -42 -48 -6 45 46 36 -4 -39 -41 -27 7 64 38 19 -3
3215 -3 -42 -27 15 37 40 15 11 6 -29 -8 14 56 31 5 -32 -54 -53 14 6 24 19 -9 -23 -42 -3 -4 21 30 8 -40 -27 -18 -6 24 31 41
3251 41 -1 -30 -35 -22 -9 20 35 21 -11 -13 -6 -3 52 52 30 28 8 -21 16 16 62 28 44 9 0 -37 1 11 57 27 8 -13 -41 -32 -30
3286 -30 21 49 25 -11 -25 -19 -17 -3 14 24 2 -18 -35 -26 12 33 24 38 0 -37 -12 -8 -2 19 17 12 -14 -26 -26 4 8 28 33 6 -15 0
3322 0 -12 7 39 47 28 -3 -34 -23 -23 18 24 -14 0 -31 -22 -26 2 -12 12 20 -7 -29 -33 -16 1 42 20 25 -19 -21 -30 3 24 30 6 15 -10
3359a0qL3MJ7j1Pl6j2J0KL6J9l5Mk5klJ1qqKk7jRK7J8J0ml3ljj8M4J0kk5kkk7
3398d0K9L0J6k4qnj0k2M8J0K9j6l8j0NrM7Kj5kl2mNK1J2J1l6Ok9J2j8L3J8mj0
3433Bj6k0KKJ4M6rl4j7KML1RQpl3j2RK2J7K8j4k6Mk5j0J1K8K2j7k4k2J3L8j1P
3469B2J6j2n9QQJK0j1Olrm0L9lN2k1kl4k2L5kL2j0Jml4J7MJ9J0J8m5j0j%K2K4
3506C2Jj0qj7rlL0J1Pj1j6j7rpL0L8m4k0OKqoK5J4j1j0%J1j8J1QJ4l0Nl9M6j2
3543a4J8J1Lol3K1pL9J3J8l3j4k4J4j7K1J6j1rj9PQjK1Ql0Mk0J5k%L0rk6J6m5
3579c7K2PK4qj0j5m8K6L8KK5j3Mj6m4K1J9%L9%l5J4m1K8J5MJ2j4k2l0NLM7Pj4
3614A5j4rRj1J8J1lk5J2j0k9K5RJ7k0lk1K2j1J8oK3k3J8m1K6j4J9%JJ3k5j6oM9
$$ plain form
3359 -10 -18 15 19 36 25 32 -4 -16 -6 -4 32 51 16 20 -5 -7 -10 1 -7 -15 -13 -40 -41 -32 -5 13 23 19 -14 -17 -18 -36 8 18 16 -9 -11 -13 -40
3398 -40 -11 19 35 11 3 -2 -12 -34 14 24 53 37 -1 -11 -6 -15 32 34 19 17 -15 -19 -14 7 19 30 -6 0 -29 -17 -35 -2 16 12 2
3433 2 -14 -34 -32 -30 -16 30 21 -13 -30 -28 -24 7 16 24 17 -16 -28 -19 3 20 48 34 8 12 -13 -23 -12 16 38 21 -3 -25 -12 26 15 22
3469 22 38 26 -33 -25 -17 -16 4 -7 -1 -4 -13 -53 -14 -17 35 14 12 -22 -44 -9 -11 21 11 12 8 -26 -9 -5 14 24 42 -3 -13 -14 -14 8 32
3506 32 33 23 15 -2 -11 -14 16 27 34 23 7 -10 -19 -26 4 42 -2 -22 -16 -14 -22 -28 -3 11 0 -10 -10 1 -17 -6 2 16 -14 -9 -48 -2 -14
3543 -14 4 15 18 12 -21 0 -7 32 45 63 30 16 -8 6 -11 10 26 15 6 -13 -6 2 1 22 30 0 4 -16 -1 -3 -3 27 18 -8 8 -37
3579 -37 -15 -8 16 8 -2 -17 -65 -39 -1 1 26 13 17 1 -43 -22 -3 -3 36 36 1 15 -26 2 17 21 33 19 -3 -33 -28 -25 22 29 15
3614 15 1 -8 1 -10 8 19 16 -9 3 -7 -36 -11 -2 15 -5 -8 -29 -7 -18 0 -6 17 -6 12 -29 -3 -17 2 2 3 16 -9 -25 -31 18
3649A8JK7k0nl2J1JJ1J7jk3j1j7K0K4J3k6K5l0n8M2mK3Kj2j1j4Kj7L9J0K2pl5
3683a5onKK3L3%k6Km3NK6PK4llk5nJ4QK7kk1Nj1k6K1kK2Qj7qk3NRK6njk1n6L3
3723b4J4K0J3Nj8m8J7j4J5L9J5j6j0k4mPJ1K5J7k5j1J2k7J5L1J7k9ll4J1j1J7
3755CL0J3m5K0m9J9j2J4M4l3J5l5j1J2KL3J1k2j8k5j2K5L4oJ5j8j9k4%L2K2JN
3788B1nj8j8J6PM2j5mj6j8PK7j4K6nj7k8j8KJ3L0J1ok2l4J0J9J8oJ1l6Qrk5L5
3823a1J4J1k1k6kQrK3K1Mpj9j0J8OK2j1oo%j8J4K2L4k0ql6j4j5M5K4Qmj9l7K4
3859amJ2J7qmj9l5PK4jL9%l1l5kJ3J7L2Mpj0o0L4nK9RJ5l6k2LJ9LK3kKk8j6J9
3897ekL4K3ok9k0k0MJ4M1j5K3m7kj4jK7K0rqj3l5J7K7j9M6j3j9l0nJ4K0J0K5j6
$$ plain form
3649 18 19 46 26 21 -11 0 1 12 29 28 5 -6 -23 -3 21 34 8 33 3 -55 -13 -17 6 8 -4 -15 -29 -27 -44 -5 5 27 20 -15
3683 -15 -21 -26 -24 -1 32 32 6 8 -35 -30 -4 3 27 24 21 -4 -9 5 13 40 38 17 22 11 -15 6 4 26 34 17 9 -14 -9 0 26 21 20 -1 -57 -24
3723 -24 -10 10 23 28 10 -38 -21 -35 -20 19 34 18 8 -16 -20 -13 -2 23 40 15 4 16 -11 4 35 52 23 20 -14 -3 -14 3
3755 3 33 46 1 21 -28 -9 -21 -7 37 4 19 -16 -27 -15 -13 20 31 9 -9 -34 -46 -21 13 7 22 4 -15 -39 -39 -7 15 16 21
3788 21 16 -2 -20 -4 3 45 30 26 10 -8 -1 26 12 38 33 16 -12 -30 -28 -15 15 26 20 -2 -36 -26 -7 11 5 16 -20 -12 -21 -46 -11
3823 -11 3 14 -7 -33 -35 -27 -36 -13 8 12 5 -14 -24 -6 0 22 11 5 -1 -1 -19 -5 17 51 31 23 -13 -27 -42 3 27 35 31 12 -25 -1
3859 -1 -5 7 24 16 12 -7 -42 -35 -11 -12 27 27 -4 -39 -41 -28 -11 21 25 18 8 -52 -18 -23 6 15 30 -6 -28 -25 -6 -3 20 18 20 -8 -24 -5
3897 -5 -7 27 50 44 15 -5 -25 -21 -7 34 19 42 -5 -7 -21 -22 5 25 16 8 -5 -40 -23 4 -15 31 18 -1 -31 -36 -22 -2 8 33 17
3932A7rm0lM6LJL%l6PJ8NJ8J1k4j3j2j7K2J0K8nj1l1pPK3K4pMo0jPJ5J2J0rJj8
3971a1l4KJ6K8M1k5j5l1K4QjL1Kj3m5J%J8K0J1J0l1j9j6J8N9j0Jj3j0l4K1k2L4
4005A5J1j1ok6j5J4J9OK3j8j2l6qL6K0Pj8Kk8j8RM1K4J0j9m3Jj2L3J2L0jk5l2
4039a5KJJ3K6QPl2k4RJ9QRJ1j0k9k3j6M5MJ1k4j9j6j4J7O6j9RNn6Jj7L6K5K1l1
4075HLl1k9K4QN1nLl3j9QK5ML3j8rk7n2M8L3PL4m4k1l0J4K1kK8j5Lq1K4NL0K9
4111B7j6lj6l0j6K6L5J0kk2j7k1J8L3PJ4k0pk6lK2J4N8k5j5lk8j2K6K3J9Mm6j3
4145eLK7j4L0rj5j6k1PLL3J5qm6nj6OK1K1J5pm5j6J5K7jJ0J8k6m8K5j3L5L0J9
4180D9k8k8j2jML7J5J1k8j9j3nK4L4l2K6k6k7L1j7K3K4j4l1Om0jL1L4k1J6j3l4
$$ plain form
3932 17 8 -32 -35 11 14 15 18 18 -18 -11 7 12 30 41 17 4 -8 -25 -3 7 35 30 19 -12 -19 -12 11 35 28 32 -28 -29 -22 -7 5 15 6 7 -11
3971 -11 -45 -43 -27 1 42 17 2 -29 -5 3 2 33 35 22 -23 -22 -22 -4 16 27 37 6 -13 -29 -11 48 38 39 26 16 -18 3 -19 15
4005 15 26 15 9 -17 -32 -18 1 7 30 12 0 -36 -44 -8 12 19 1 3 -25 -43 -34 7 31 41 22 -21 -20 -32 1 13 43 42 17 -15
4039 -15 -13 -12 1 27 35 42 10 -14 -5 14 22 31 42 32 3 -20 -36 9 13 24 0 -19 -35 -49 -32 34 15 24 29 -27 -26 -43 -7 18 39 8
4075 8 11 -20 -49 -25 -17 34 29 32 -1 -20 -12 13 17 50 32 23 -4 -56 -8 25 32 66 22 1 -29 -15 6 4 32 17 20 -61 -37 -32 -2 27
4111 27 11 8 -8 -38 -54 -28 7 17 15 -7 -24 -45 -27 6 13 27 7 0 -26 -29 -7 7 65 40 25 22 -6 -18 8 31 50 54 8 -5
4145 -5 -2 25 11 41 32 17 1 -20 -13 -10 23 38 30 -16 -21 -37 -31 -10 11 26 19 -26 -42 -27 0 -1 9 27 1 -47 -22 -35 0 30 49
4180 49 21 -7 -19 -20 -16 21 36 47 19 0 -13 -18 6 40 8 34 8 -19 12 -5 18 42 28 -3 3 -37 -38 -7 27 6 22 9 -25
4213b5kQJ5K5J7ol7l0j0M5JL3K2m5l2Jj6N7L0pj3j4m1J9J4L0J1Ml1l1JJ0QjL8
4248D8k9ol3j1KM1J5Lj4k6j9j3M5L8j2j7l0j3nRK6M6k3j7k8RjK3K8ONj9l8k0K4
4283fQM4k1j3k1okJ4M1J5k7j1l7j0J0K5L9oj8j1m6K0KJ8J5lm1j7j3M2L1qLrj6
4318a5j9jJL2K4K2j9n0J2K2pM2lj3k3%k9K0L2J3J0l2Jl7mL6K9J0l4j3j8OmJ4L4
4353C9J0n8j7ON%L7K4om7k0j7J6N9j1mj8Pk5l6L8N4MLk4qm7L6J5J5K5n4Jn1K8
4388b1K6ML9k2rm0j2J2M0J3Nk4k6nK2j5K2M2j5j7l1k6J6jM0J3j8k8k8J3J4L2J3
4421B8Nn3J9k9J2J7L7K6K0n9k7qmL2QJ7k5j6qj8L4L0Knl1j9oQJ8J0J8k1j8m5J1
4456d0J6L7J2nrm6J9oQM4OJl6k6KNM2j5K7nl9j5JL8K6Rj8j9k3LPJ4K7nj2l2nj2
$$ plain form
4213 -25 -27 -19 -4 21 38 32 -5 -35 -45 0 1 34 56 11 -21 -20 -36 21 51 44 31 17 -24 -5 9 39 50 54 23 -8 -7 3 11 10 48
4248 48 19 13 -20 -31 -29 12 27 30 16 -10 -29 -42 3 41 29 12 -18 -31 -36 -27 -1 45 22 5 -23 -14 -15 8 36 42 47 28 -10 -30 -6
4283 -6 2 46 25 12 -9 -15 -17 -3 38 53 26 15 -22 -32 -22 3 42 36 18 7 -39 -19 -17 1 16 13 -28 -45 -58 -16 15 7 10 1 -15
4318 -15 -34 -35 -34 -2 22 44 25 -25 -13 9 2 44 41 28 5 5 -24 -4 28 41 51 19 20 -17 -21 15 44 54 20 7 -11 -5 -9 5 39
4353 39 49 -9 -26 -20 -15 -15 22 46 40 -7 -27 -44 -28 31 20 16 -2 5 -20 -56 -18 36 40 43 19 11 -36 0 15 30 55 1 2 -49 -21
4388 -21 5 9 48 26 17 -23 -35 -23 17 30 35 11 -15 -20 2 -13 9 51 36 19 -12 -38 -22 -23 17 30 12 -16 -44 -31 -17 15 28
4421 28 33 -20 -1 -30 -18 -1 36 62 82 23 -4 -12 -16 16 24 41 16 0 -8 -26 8 38 40 35 4 -15 -21 -13 5 15 33 12 -6 -51 -40
4456 -40 -24 13 25 20 11 -35 -16 -22 -14 30 36 37 1 -25 -23 -18 24 9 36 31 -8 -23 -22 16 42 51 33 14 -9 -6 1 15 42 37 25 -7 -12 -24
4494b4J9J7J3Kk1l0j3K1J6J0L4rm6k4pK6O1JJ3n5j0l9J9L9K5J2o5Nj0J3OL9JQ
4528D7l7k6j4J5L6J3Pjn5jQJ1L0k0J0k0Mk6j2K4L6Lnl3k5j1J7K1K1Lj4k2k0QJ0
4563a8L0L0j9j7k9J3pJ6L8J2l1l1Mj3L8NJ9Qql9k5J3K3OK2k7j9l8M8k7M8J8k5
4596A8j3l0j9K9J9LK5k5k2k9%L8J1K1jk9qR%ML0%Lk6l2K1qK3L4Pl2j1k9J5LL4
4632C3ONl3m5K2j5M6j3J6On6mmJ6L0K8Mo0j5k6L0J6K8J6j9m6J4j2K7L3nLl0Ml5
4667c5kM3L4j%k8l6J9K4J5JK6l7l3lk3M6J2Rj0k5l3OK0mM1Rl8k2k4J9K1NM1l2
4702Ek2k8pM2J1K8%rj6k0j0L0RJ6k1ljj9%L2J9j3nk0J6k2J5J0K7%l0j7k1J0L4
4737B0K1ok1k3l6L4mK6Nj2Km5qQL4L8Mj8k3rj1LJ8M5j0k0l2Mj3J9M3lj4kj0m1
$$ plain form
4494 -24 -5 12 25 27 6 -24 -37 -16 0 10 44 35 -11 -35 -42 -16 45 46 59 4 -6 -45 -26 13 38 50 -15 -10 -20 -7 -1 38 39 47
4528 47 10 -16 -30 -15 21 34 41 40 -15 -16 -8 3 33 13 23 3 7 -19 -31 -7 29 32 27 -6 -31 -42 -25 -4 17 20 6 -16 -36 -28 -18
4563 -18 12 42 23 6 -23 -10 -17 -1 37 49 18 -13 -9 -22 16 21 40 48 40 1 -24 -11 12 18 40 13 -6 -44 4 -23 25 43 18
4596 18 5 -25 -44 -15 4 7 32 7 -15 -44 -44 -6 5 26 25 -4 -12 -3 -3 1 31 31 34 8 -24 -3 -11 12 46 53 21 10 -19 -4 -1 33
4632 33 39 44 11 -34 -12 -27 19 6 22 28 -28 -32 -36 -20 10 38 42 -18 -33 -59 -29 -13 15 31 12 -34 -20 -32 -5 28 23 26 -4 0 -35
4667 -35 -37 6 40 39 39 11 -25 -6 18 33 34 60 23 -10 -13 -36 10 22 31 21 -4 -37 -31 -11 -15 26 35 -3 -25 -49 -30 -9 -4 37 5
4702 5 -17 -45 -52 -10 1 29 29 20 4 -16 -26 4 13 29 8 5 4 -15 -15 17 36 23 18 -2 14 -8 7 17 44 44 14 -3 -24 -14 20
4737 20 41 35 14 -9 -45 -11 -15 11 16 4 6 -39 -47 -39 -5 33 37 19 -4 -13 -24 -21 -3 42 32 12 -20 -16 -29 -10 33 30 16 14 4 -37
4773c7M3L0K1l7lk7pJRK8J6j3j2k7q%K3L3k0rj0j0j9M0J1J8k3j1k6JK1K4J1kj7
4808A2j4k9K1ML7J9nk5l6OqL5K9J7j9l7l6K2K9K1j3Pk3j6k5K2K5pJ9l3Ql6OK9
4842FK1k6MJ5m1l2M7OL3j0Mm1j1lJ7K2J0K6j8l7lRK8j0J6kOm2pJ0M2RKm4%k3%
4879a7OL0K2l0mm0KnK4K7J4j9j6k7j9L4M2k2K5k0l8nRJ3L2j6J4k1k3rL8K1j1K4
4913C5j6l2j0ML5JKK3k2l3PJL1L1l6j0k7j8J2J2K4Rj9l8J3j5J3QJ2K6k6j7j7P
4947c0J6JL4j0k3pj4PL4J6Lmj8l4QK4K4J5Kj8j6m7K1L2J8J2m1j8j1J3J0QL1j1
4981B7k9j7j4J8OL2nj8j3j3JKK8qjL1n6j1J7J1M4lok7j3pK1K8J2lLm3j9J8J4L7
5017D4j3ql4j0J1J2PL3qkl4j6jqN3j3%j0j0l4L0J9qK0nl0k4NK6%K6j2jk5k4M3
$$ plain form
4773 -37 6 36 57 20 17 -10 -17 -16 -7 21 37 24 12 -15 -23 -23 0 33 13 4 -6 -16 -35 5 16 34 11 0 -26 -25 -4 20 31 29 12
4808 12 -2 -31 -10 -6 31 50 45 20 -16 -10 -18 17 46 63 44 7 -29 -7 22 43 30 37 14 -2 -27 -5 20 13 32 -1 7 -29 -23 6
4842 6 27 1 5 20 -21 -53 -6 0 33 23 27 -14 -25 -28 -11 11 21 47 29 -8 -11 -2 26 16 32 30 36 -6 -13 -3 39 48 50 6 6 -17 -17
4879 -17 -11 19 41 11 7 -33 -31 -36 -12 15 29 10 -6 -33 -52 -18 24 2 27 7 -31 -36 -27 -14 18 2 16 -5 -28 -37 1 22 11 35
4913 35 19 -13 -23 -19 16 17 19 42 20 -13 -6 -5 26 57 21 11 -16 -34 -22 -10 14 23 4 -34 -21 -36 -23 -15 -3 23 -3 -20 -37 -30
4947 -30 -14 -13 21 11 -12 -19 -33 -26 8 24 27 23 5 -29 -21 3 27 42 44 26 10 -37 -16 16 34 46 5 -13 -24 -11 -1 7 38 27
4981 27 -2 -19 -33 -15 -9 23 18 0 -13 -26 -25 -23 5 -3 -4 27 -29 -40 -23 -12 32 29 23 -4 -17 -24 -3 25 37 34 37 -6 -25 -7 7 44
5017 44 31 23 -11 -21 -10 2 9 42 34 32 -2 -18 -19 -27 26 13 13 3 -7 -41 -11 8 0 20 15 -15 -39 -34 -8 -8 18 6 5 -20 -44 -1
5053aJ2QkQrm3K5J1KQJ2k2nm0J2L4OK1lk9j3kj5M5mPJo0%L0k0M1KKl1k7JK2oM6
5093B4K3n3mj4J1kK5K2Kk3k2l%K0M0j0j3j2k0RjK9J1J0j7l6J7j9K6Rk4K3k0j6
5127hk2J8MK9k1qj1j6j8K6L1J0pj4k2j3K3K5J0nQl2l1M7NMOJk2Rj5OL1j0J9j0
5163B7l0k0J0J8L1qJl0Lj7J4K1qJ7k6k5lNK1NjK3l1k2MJ2J2K0Jrk4k3JK0J8J7
5199B4j1Npl2J3L4ORrl2Oj3LK8KmJj9k0JJ7J9Nk7Kj2Jj9L1J1j0j0Nk4kK8J8LO
5238B7k1l0j3OK4L2opmmk1jM2%ll1k1J8L2k3K6jOkk4k1J4J4RoLk9NPj2K3jnk3
5277b1J5k1J3J5J9Jk2j2Jj1OL1N%k6k1jPJ5QK6nn2K4NkLN0k8Kl1LMPK1rj3qj7
5316a9J0J0NOOj5Kk5L0pONJ3k1l4okK7PRqj7J5Q%LJ5k1Rm0J2K7QKQj7jJK%J9l
$$ plain form
5053 -1 11 19 17 25 16 -27 -2 9 11 19 31 9 4 -36 -24 10 16 37 34 5 -8 -10 -25 20 16 23 24 -36 -36 -6 -26 15 17 19 -12 -39 -38 -16 -22 24
5093 24 47 -6 -10 -24 -13 -15 10 32 34 11 -11 -14 -14 6 46 36 23 11 -9 0 -1 28 39 49 32 -4 13 -6 20 29 5 28 8 -8
5127 -8 -30 -12 -8 21 0 -8 -19 -35 -53 -27 4 14 7 -7 -29 -42 -19 6 16 11 19 -13 -44 3 8 12 18 19 -3 6 -9 -3 28 18 37 27
5163 27 -3 -23 -13 5 36 28 29 -1 2 -15 -1 20 12 29 3 -22 -25 -20 1 6 5 28 -3 -25 -21 -9 3 23 24 15 -9 -32 -31 -11 7 24
5199 24 13 18 11 -21 -8 26 32 41 32 0 6 -7 -4 24 26 22 23 4 -16 -15 2 21 26 -1 1 -11 -10 -29 2 13 3 -7 -2 -26 -28 0 18 21 27
5238 27 6 -24 -37 -31 -7 25 19 12 8 4 -17 -18 24 24 21 -10 -31 -13 19 -4 22 21 27 25 1 -20 -6 8 17 11 14 -15 -10 -3 -15 8 7 2 -21
5277 -21 -6 -27 -14 1 20 21 -1 -13 -12 -23 -17 14 19 19 -7 -28 -29 -22 -7 1 27 22 -30 -6 -1 -3 0 50 22 24 -7 -4 0 7 28 19 6 -2 -19
5316 -19 -9 1 6 12 18 3 5 -20 10 3 9 14 27 6 -28 -34 -36 -9 -2 7 -1 -18 -3 5 5 8 23 2 11 -29 -17 10 18 20 28 11 10 11 13 13 32 29
5358B9Jm4K0rNJ2PJ6m8OjMQNRqJ0k6k8J7K0Llkl6J4nRK9rJ0lj7qj7L7O%rqmpL8
5401B3j0K7k3J7l4rL5k5J5j3J7kj0k0J2pL2j3j7Nqj7J8lL5l6Ol9J6RL0lk2K8m4
5436c0J9J1l7N6P%k2j5L1j2NmL8l2mj2qK8MLj1J4l4J2J6k3LMMj2k0J9Nk1K1J4
5472A7k7J5k5J6njPj5J1knkJ1RPOk5rJ3J0pK2jj7j5J1J8kJ3k0Mj1nPOJ3%nk3K3
5512A7m9J4K1K6j5j8ljk5L4K6mk8j1j1LJ1qJ9J8l4nQJ2K%qJ8J1mlk7K0j4K7j0
5548Ij8K8k2jJ6kJ7j3j1rrJ1J1J4k1pJkKk4L3jJ0k4k1J8j0mK5J8m0J0k3L2Ok1
5584b2L2l7QPK2j3J2J%mJ5ok2K3QkKj0rOj2MJ9Pj0l2NqOK8j1nj6KJ1j1kK8m4P
5624b3J1k4J3K8l6M7pj6J0l7M5j8K5k0rmJ8qJ0NK5j3j1%Kj0nRJ1pqj1mK3j2K5
$$ plain form
5358 29 30 -14 6 -3 2 14 21 37 -11 -5 -6 -2 6 11 20 12 22 -4 -32 -15 5 8 5 3 -33 -19 -24 -15 14 5 15 12 -5 -13 -30 7 13 13 4 -4 -8 -15 23
5401 23 13 40 17 34 0 -9 26 1 16 3 20 18 8 -12 0 -7 25 12 -5 0 -8 -25 -7 -10 25 -11 -5 -44 -28 -19 11 8 -14 14 -30
5436 -30 -11 0 -37 19 26 26 4 -11 20 8 13 9 47 15 11 -1 -9 19 23 26 15 29 -5 7 23 0 3 7 11 -1 -21 -2 3 -18 3 17
5472 17 -10 5 -20 -4 -9 -10 -3 -18 -7 -9 -14 -16 -5 4 11 17 -8 -17 -4 6 -1 21 20 3 -12 -1 17 15 28 8 12 1 -4 3 9 22 22 17 -6 17
5512 17 -32 -18 3 29 14 -4 -7 -8 -33 1 27 23 -5 -16 -27 -24 -13 -21 -2 16 -18 -23 -15 -3 -1 -1 -9 9 20 16 13 -14 6 -8 19 9
5548 9 -9 19 -3 -4 12 10 27 14 3 -6 -15 -4 7 21 0 -7 -6 -8 -6 -30 3 2 12 -12 -33 -15 -25 -29 -4 14 -26 -16 -39 -7 -1 -22
5584 -22 10 -27 -19 -12 10 -3 9 10 10 6 21 15 -7 16 24 22 24 14 5 11 -1 3 22 29 19 -13 -8 -16 -10 18 7 2 -14 -12 -1 -12 -14 14 -30 -23
5624 -23 -12 -36 -23 5 -31 16 9 -7 3 -34 11 -7 18 -2 -11 -15 3 -5 5 10 35 22 11 11 13 3 -2 7 18 11 3 -8 -12 11 -1 24
5660B4j9j1PmnJ0j7J0Qj9j0PJ3%oPlj2rrK5jL3k4pnNKK8Rj3OqMj2j0L1j0J1pO
5701B5Ml3L5K0l0k1J9k5K5j2j2QJ5l2lLJ2J7Lk1j7J5Rj1oPkrNKnnL7%KnoqJ3%
5741A3Rk7L2k4J9k2lK8k8J2mj6K3lNorJ2j5J5j8mJ5k3J6Omj6KMNOJ3j6j4qkK4
5779clqJ4rM1k8j6K4KJ4k7Pj9Qj5K2J5k9K9j8mPJ2j1jKj0J3Nj4Pjj6J4j3J9k2
5816a2qQj4J5j5kJ0%j9K3RJ2jj0P%j9K7MRk6J6nLJ1j7J3lk4J7QOrl4L8Mk6RNO
5856A6qk1K1k8L9l6RlNj5MJ4j0J4OmKj3lJ1pKJL2j0l1K3J4rRKk2J8j3J9k9L0k3
5894F%oL3k4Qj7J7j2K7n5QL3m3J9J5k1J0j7NMrLkQoJ0pK2OmLl3J4jK0J2kj7Oj8
5934eK3rJ2lKJkJ6k3qJ5lqLLj8J4k0K6J6rj5r%Nj1J4j7J5Jj9j0j9K8J7J3l6K0
$$ plain form
5660 24 5 -6 1 -3 -8 2 -15 -5 3 -16 -26 -19 -6 -6 -12 -5 -8 -20 -29 -38 -13 -14 19 -5 -12 -17 -12 -10 18 27 14 20 12 16 4 -6 25 15 26 19 25
5701 25 29 -4 31 51 21 0 19 -6 19 7 -5 3 18 -14 -17 -14 -2 15 18 -3 -20 -5 4 -7 -13 -6 -8 -17 -12 -10 -15 -20 17 17 19 14 8 0 13 13
5741 13 22 -5 27 3 22 0 -3 25 -3 9 5 -11 12 9 14 8 -1 11 -4 11 -7 -11 4 -19 -3 3 -1 -17 -15 -11 -6 0 13 -3 -17 -25 -27 -3
5779 -3 -6 -14 0 -9 32 4 -12 12 14 28 1 8 -11 -3 -18 4 19 -10 19 1 -3 4 16 5 4 6 -4 9 14 0 7 6 -10 4 -9 10 -12
5816 -12 -20 -12 -26 -11 -26 -28 -18 -18 -37 -14 -5 7 6 -4 3 3 -16 11 15 24 -2 14 9 12 23 6 19 16 -8 9 17 23 14 -20 18 22 -4 5 10 16
5856 16 8 -13 8 -20 19 -17 -8 -11 -6 -21 -17 -3 -13 1 7 3 5 -8 -11 0 -7 -5 -4 28 18 -13 10 24 15 24 26 4 22 9 28 -1 29 6
5894 6 6 0 33 9 17 0 17 5 32 -23 -15 18 -25 -6 9 -12 -2 -19 -14 -10 -19 -16 -18 -10 -16 -6 -13 9 15 11 14 -19 -5 -6 14 26 24 7 13 -5
5934 -5 18 9 21 18 20 21 19 35 12 4 19 16 8 11 14 -4 10 -10 16 32 23 8 -1 -1 4 -7 7 -10 5 6 -13 -23 -42 -14 3 16 -20 0
5972@MKk1K6J1k4J5j5NK2Pk3J5J1j5pkKJ0Mj5JRQl1JL0j9k9L0j9KK1l4NJQpJ4
6011Cj6J9j1J3j8k4K3J6K4k5rJ2kj1J7k6J0JKKjK0J4lllj5j4K5mj0J0kJ0j8J1
6047A7k7K6l0J1K6k6%j4Jk7N6j8jKrKJmoLmL2n4L8nj0J4J0k4L0j7RPjKQpLJ4j7
6087A1oJ0j2j6L4j3Nj6OOpQj6Rj1N%rOjlj8PK5k2kJ1j9JPKjMK0j4K5k8J5l0L9
6127A2j4lJ8nPj6J4J5pjqrRRJ5k2j0nqK5j6J0pp%JQk6K2k7NJ3J7k3Mk0J8K%j3
6167b3L5j6PKJ2mlj5J6Mpj2L3j7OnLoL0m5K9j5j6%J3rJ8j2j1J8j2k8K5J5k7J9
6203BppK1j9npj9NJ6NK2j1oJ9j5RMPj2lJ7J7j5Mk4K4oj5MK1j9k2K0J6rJ0j9lL3
6242C3k5oK2m4K3j3J3Nj3oj4L2rml2J5J1k6J1L5k8K8omJ0j7LJ7j9Nj0RrJ5K5k4
$$ plain form
5972 0 4 6 -15 11 22 -2 13 -2 3 25 32 9 24 35 20 13 11 13 23 27 12 13 22 30 -1 0 30 11 -18 12 -7 -5 16 -18 -13 -12 -4 -11 3
6011 3 -13 6 -5 8 -10 -34 -11 5 29 4 -5 7 5 -6 11 -15 -5 -4 -2 0 -1 19 33 30 27 24 9 -5 20 16 6 16 14 24 6 17
6047 17 -10 16 -14 -3 23 -3 -3 -17 -16 -43 13 -5 -6 -4 -13 -11 -10 -14 -20 -17 -21 11 -43 -5 -10 -20 -6 4 -20 10 -7 2 9 8 10 18 11 14 28 11
6087 11 5 15 3 -13 21 8 13 -3 3 9 2 10 -6 3 -8 -3 -3 -12 -6 -7 -10 -28 -21 4 -18 -20 -9 -28 -27 -20 -18 -19 -15 5 -9 16 -12 3 -27 12
6127 12 -2 -5 13 8 15 -1 13 28 21 20 12 3 12 21 36 14 4 -1 -9 16 0 10 3 -4 -4 -3 5 -21 1 -26 -21 -8 9 -14 -10 -30 -12 -10 -10 -23
6167 -23 12 -4 3 5 17 13 10 -5 11 15 8 -4 29 12 18 13 16 10 40 -5 24 9 -7 -7 6 -3 15 3 -8 10 -2 -30 -5 10 -17 2
6203 2 -5 -12 9 -10 -15 -22 -41 -36 -20 -15 7 -4 -10 9 -6 3 7 14 2 -1 16 33 18 22 -2 22 16 1 5 26 7 -15 5 21 12 22 3 0 33
6242 33 8 2 24 -20 3 -10 3 8 -5 -11 -25 7 -2 -6 -38 -23 -12 -38 -27 8 -20 8 2 -2 8 -9 -6 11 -8 -3 -13 -4 -13 2 27 3
6278CJ0j3OqjJ9Pj6Jj5j%JNjj1J3k5L4oNj5mL%jj7J7J4mPjj8pJ2%%KKQjlOLrJ5
6324A6orL0k3K2KoLj2J9k5%J7kj7LqlLklQj4llRk2J1oJ6J2j1loqJ1J3mjK0j8Q
6366HlOj0J1lj2J4JK0k9j0PJ2k8L4pK3l4KJJ5kmKj9jJk0J8kPRj3qrJ7jj0J2l3
6406c8L7j6N%J1J2l0J6kK5l3L6j0j0J7Rl2RJ6mNKJqj9L0k8K3j4J5OJ5l8pJj1P
6443blJ8jk5K2k3K0km2M2j7kNj6NJ0K3j9oJ2l0L5NPOl4J1QlPJ3Pj7J1j1J8rro
6482HJ1J0l1pNj3K2Oj2j1J7jj3Rlpj6OK4rKPk5J0Ml8M2k4J6J1j4Q%PL2k7%j7J
6521a0J7LlOMJ2j2o%kKoj5KrnJ5rKQ%ljKJ3m1J6Nj1J9Lk4K5NJ8j7k7J5rJ4J3k3
6563a4J0J3oK1kj5rLj0j2L0K2j9Jj5MMJ1Jk7MJ0Mj2QmlqpJ6rJ0k1J1k0J4J%J8
$$ plain form
6278 3 13 0 6 -2 -3 16 23 7 8 -7 -8 -8 -7 -2 -3 -14 -1 -26 8 2 7 -8 -12 -9 -9 -10 -27 -10 4 0 7 6 -12 -19 -7 -7 -7 -5 -3 5 4 1 7 10 1 16
6324 16 10 1 31 8 30 32 26 29 17 36 11 11 28 26 9 12 4 1 4 2 -1 7 -7 -10 -13 -4 -26 -15 -21 -5 7 -4 -7 -13 -21 -10 3 -1 -2 18 0 8
6366 8 5 11 1 12 9 -3 11 12 32 3 -7 0 12 -16 18 11 34 0 2 3 18 16 12 14 -5 -6 -5 -25 -7 -9 -2 7 -6 -14 -23 -6 -7 -17 -5 -38
6406 -38 -1 -17 -12 -12 -1 11 -19 -3 -5 20 -13 23 13 3 20 29 -3 6 22 18 23 25 26 18 -1 29 1 24 10 25 31 46 8 1 2 -9 -2
6443 -2 -5 13 12 -13 9 -14 6 4 -38 4 -13 -15 -10 -26 -21 -11 12 -7 -13 -1 -31 4 9 16 22 -12 -1 7 4 11 24 31 14 25 14 32 23 14 8
6482 8 19 29 -2 -9 -4 -17 5 11 -1 -12 5 4 -9 0 -3 -10 -26 -20 4 -5 -3 4 -21 -11 -7 -45 -3 -27 -11 0 -14 -6 -6 1 33 6 6 -11 -10
6521 -10 7 10 7 13 17 29 17 11 11 9 11 5 -10 -8 -17 -22 -7 -16 -14 -6 -6 -9 -10 -8 5 -36 -20 -15 -26 -7 -4 -28 -3 2 20 3 -24 -9 -18 -4 9 -14
6563 -14 -4 9 3 24 22 7 -2 1 -9 -21 9 31 12 13 -2 2 6 17 18 -9 -5 5 9 -3 5 1 -2 -10 -17 -1 -10 0 -21 -10 -30 -16 -15 -15 3
6602Cm%j1K6j8j7J4K6j5j9PJ1nJ2nJ6k4KRJ7j4k2K2Oj3pOK3k9Pj2K0j2kpJ1k1
6639a9j1J1PKj5Nj2L5j2J9l2pK7rQj0J3nj0j0J8j2L0knj7K1Nj3J4jRl2PrJ0pJ9
6677A0rJ9l8K9jJqkJ0l1j1K5j8L3k7PjpKK1j7jMQJj4RrrJ7QNqkMJ4J0mLqNNj9
6720FNKLkj0Nj4%kL3j3k4J0qj2L1k2Kj5K1j2OrQLk4KK3Pj0kJ0mJ6Llm0QL5J3j6
6761A0%k8L5j1K7j0Lj9Kj2oJ1nNPmOK8m0kJ7j7nRk2J1qpK8j0j0J3j9JJ3Nj1J5
6799@nj3j4J8PKj0L5j9knJ2llK0k1J8nj1K6rJ2k0K6l2oNJ7j0j2lmRj7mM9l5pM
6838a0K7k9oRj2jrL2%ojRk%j2J8j2J1j0J6j3pJ6j2J2pOPplj0K8j2j3KkJ4pppR
6879a%NJ0%l1j7QLK4nj2Qoj2J8j6J6nRNnm%Q%J0j1JpmpL3J1k0kj2Q%RjOkj6no
$$ plain form
6602 3 -1 -1 -12 14 -4 -21 -7 19 4 -15 -8 3 -2 10 5 21 -3 -1 8 25 11 -11 11 17 4 -3 3 26 -3 4 -8 12 0 -2 -9 2 -19
6639 -19 -30 -19 -12 -10 -25 -20 -32 3 -9 10 -22 -29 -2 -11 -3 -13 0 -5 -15 -25 -7 -19 11 9 4 -13 8 13 0 14 13 22 -10 -3 -12 -2 -9 10
6677 10 1 20 -18 11 10 11 3 1 11 -20 -31 -6 -24 9 -18 -11 -12 -19 -17 4 -13 -14 -10 -2 -1 -15 -6 -15 -24 -7 1 6 -2 -4 0 14 24 20 23 15 20 25 6
6720 6 11 13 16 14 4 9 -5 -5 -7 26 13 -11 -1 -9 -21 10 -12 -10 -25 -4 -16 -10 -19 -11 -8 -32 -30 -7 0 -10 -12 -2 -6 10 13 10 -30 -22 13 26 10
6761 10 10 -18 17 6 33 23 26 7 9 -3 -9 2 -3 2 9 5 11 39 -1 -3 14 -3 -8 1 -21 -10 -18 -25 3 -7 -17 -4 -23 -22 -9 -4 -15 0
6799 0 -5 -18 -32 -14 -7 -5 -15 20 1 -1 -6 6 3 0 20 -1 17 12 1 27 18 30 10 36 4 -2 3 20 10 -2 -5 -9 0 -17 -21 28 -7 -14 -10
6838 -10 17 -12 -18 -9 -21 -22 -31 1 1 -5 -6 3 1 1 -11 7 -5 6 -4 12 -1 -8 8 -4 8 1 7 14 7 4 -6 22 10 -3 -1 -3 11 4 -3 -10 -1
6879 -1 -1 4 14 14 -17 -34 -26 -23 1 -4 -16 -8 -14 -26 -8 -24 -8 -13 -4 1 -4 -8 -8 0 0 10 -1 0 -7 -11 -18 15 26 6 4 -8 0 0 9 8 14 12 -4 -9 -15
6924a5K9pj2ONk8NLMQk1j6J2Pj1J1K2%k0J6%k4J8Ml%Rj0oQK0nj0OmK0l3K0J2p
6964A3J5k3j4L3m7K7QJ1J8n9j0J3kRmkJ0%k6jJ5J9l5JK7ok5J4J6Nj0K4j3J0nj
7000ERrrJ0OkMj8J8j4K6l0J4Lj3K6k4K3j1rmkJqK1k1J6k7J1qL2j0k5J2qnJ2qN
7039a1J5j4Jj2J0kJ3J0qj9lJ8J0J0k6M1k6jqjK4ojMjj0Nj8J5Okrojj4JJ8J9rM
7079A6j6oj4LqJ5J6k1oMJ8LJj9K0k3Lj1L6MmJ8k6QnQnj8K8j0Qj8ONOJ0k0Koj2
7119a0J5k9KK7qkl8J7J3pJ7j9Rj0J8okJ0Nj4J0J4l5PKJ1Qqk7J1K7k2J8K4pk2p
7156hJ4k2M7k0Mj1jJ2j9MnJ6kklk4%J4j7K1k6K9j4jJ5qOj5K7l5Qj6L7j5KL0j6
7193Fkj1LK0prK3j1j6J6JnrMK4k4nRRj8K0j5Jljj9LK6k0nJ5j8J7k8J7%k8RPQl5
$$ plain form
6924 -15 14 7 -5 1 6 -22 -17 -14 -10 -2 -23 -39 -27 -20 -31 -20 2 2 -18 -2 -2 -26 -8 -4 -7 -7 2 -8 -14 -6 14 9 -1 5 1 21 -12 8 20 13
6964 13 28 5 -9 24 -23 4 12 23 41 -18 -28 -15 -17 -8 -12 -14 -4 -4 -30 -31 -16 3 -32 -31 -4 -10 -35 -21 -5 0 -10 14 1 11 6 5
7000 5 14 5 -4 6 12 10 14 -4 14 0 26 -4 10 13 0 26 2 25 14 5 1 -1 0 -8 13 -8 8 -19 -8 -16 16 6 -19 -7 -15 -20 -8 -16 -11
7039 -11 4 -10 -9 -21 -11 -13 0 10 2 -17 -20 -2 8 18 -8 33 7 6 -2 -3 21 15 14 18 17 7 12 -6 9 15 13 4 -2 -3 -17 -16 2 21 12 16
7079 16 0 -6 -20 -17 -25 -10 6 -15 -21 -17 1 4 5 -14 6 -17 -14 -25 11 15 11 29 3 11 6 14 9 -9 19 9 17 -1 5 10 16 26 6 8 2 -10
7119 -10 5 -24 -22 5 -3 -5 -43 -26 -13 -20 -3 -22 -13 -23 -5 -11 -13 -3 2 -12 -2 12 -23 -16 -14 -3 5 -3 -30 -19 8 -14 4 28 21 -1 -8
7156 -8 6 -16 31 11 15 4 3 15 -4 0 -5 11 9 7 4 -20 -20 -6 -23 -2 -28 1 -13 -14 1 -7 -1 -16 11 -24 -16 -32 5 -10 -8 22 6
7193 6 4 -7 -4 16 9 0 23 12 -4 12 13 8 -1 3 27 3 -2 7 16 -2 18 3 4 1 0 -19 -16 10 -10 -15 0 -18 -1 -29 -12 -12 -40 -31 -24 -16 -51
7234e1K9J4Ok0kJ3j9J8OK6qJ7j3l4M5j3J5l8K7ll4K6J2k0K5J4m8K3oj2MJ0ooj1
7269a4nj3K7j2K3j6Ol5L2k0JJ4MpLrJ3pK3j6pL5l9K6olK0Mmkj3J3l2J1K0loLJ2
7308B1OpJ4j6Kj2jj1jJ1j8J6j5LKNRj7K4n3M5j7k8L8pLokLJ0J1l0K3K6j9kMJ2
7346B6k5J2J6j7J8k5JlK2qPj2pJ3Oj4J0k0J3j4Mj1qj0RN%rJ4k7J6nJ7%%kj1ML0
7385A5k9KK8k3J9k4J7rK3Ql0J8Qm5J6K2J1rJj1nj3K1J7k1J7Pk5j0J1j9j9K2NJ8
7420A4l7MjK0Mj9KN%j2J4NK0jl3J4K0j7NkPlMJ3j7O%QmJ0qj3omRj9RjJ1jOk7J3
7463bj9K6l5K2lk1M1ok2oJnMKLJ3Ol3QJ6ljOJ3nLLJ3J4krj0o%P%j0J4j7mpJ1K6
7506B6k4k0L0nj6l0J9J8J9l5J5j7j1LMlJ7j2mPj4K1LK9k8J7j0J6j8J4rJJ3j8J1
$$ plain form
7234 -51 -22 -8 -2 -22 -24 -11 -30 -12 -6 20 12 29 16 -18 27 14 29 -9 18 15 -19 7 19 -1 24 38 -10 13 7 -5 -1 9 3 -3 -14
7269 -14 -19 -32 -5 -17 6 -10 -4 -39 -7 -27 -26 -12 -8 -15 -12 -21 -8 -15 8 -8 -15 20 -19 7 1 -2 18 22 18 16 3 16 -16 -5 15 12 6 9 21
7308 21 27 20 34 18 20 8 7 -4 -5 6 -12 4 -11 -8 -6 -1 8 -9 15 -38 7 -10 -38 0 -7 -4 -10 -12 -9 1 12 -18 5 31 12 10 14 26
7346 26 1 13 29 12 30 5 6 3 25 17 24 12 5 18 24 10 20 0 13 -1 3 -8 -16 -26 -17 -12 -12 -21 -7 -34 -18 -23 -6 -6 -6 -8 -19 -15 15
7385 15 -14 -12 16 -7 12 -12 5 -4 19 27 -3 15 23 -22 -6 16 27 18 19 8 3 -10 11 28 7 24 31 6 -4 7 -12 -31 -9 -4 14
7420 14 -23 -19 -20 0 4 -15 -13 -8 -8 -20 -6 -1 19 18 -15 -1 19 2 7 5 12 9 13 26 9 15 15 23 19 29 21 8 2 -2 7 -12 -3 -4 7 6 12 -15 -2
7463 -2 -21 5 -30 -8 -11 -32 9 3 -19 -25 -24 -29 -25 -23 -20 -7 -1 -34 -26 -10 -13 -14 -8 5 0 3 6 19 33 31 22 12 6 6 13 13 3 17 0 -4 -11 0 26
7506 26 2 -18 12 7 -9 -39 -20 -2 17 -18 -3 -20 -31 -28 -24 -27 -10 -22 -26 -19 -33 -12 -9 20 -8 9 -1 15 -3 11 2 3 16 -2 9
7541InPJ0j8L2m1K9j6Rpj1J4j0JmJ4Mlj1Kj4MOk7jJ3J8k1kOkk2L3nL3m4JP%K1
7581Io%Qmj3QJ4j4K4j6jrK8k5MJ2qj0jRj5K8k9rL0qk4PjJJOj3Qnqj9K5J9qk7K1
7623a1jKrK4k9RPMJ5j6QKj0J1j6J4J0l1J4K0qj1jL1k3k2J7JjJ2k3K3Nk6Qokj0
7661a9J2j2J5qNkj3K5m9L2K3qjJ4j8LOk5J1K0Pk1NJ9j8K0k2K3j7J2qKrPK8lj9
7698A7j9Pk1L0j7J0%j5Kj3L4k4rK1J1j9Qk2j8J0J2J3j6jOJ0lMMJj4J0JjMj5J2
7735@j1J4K1rQRk5Qnj2J7j0MrJ4j4k0oL5oj6J6J4k9L0m8J4J7oJ9m3J4j2lL1k9
7771b8L3k3K1k0K8l6K4j0K0jj2jJ4Kk3K9qOj0rJ6L2k6l%Oj5j9J6Nk1K0J1k7Lp
7807a3J7mk5K3j7J5oj3j0J3Lj4K1j3J3k0K5J8J1m0J8j4qK4Kn%qK2k3K4PpJj7K6
$$ plain form
7541 9 4 11 21 3 35 -6 23 7 16 9 -2 12 2 3 -1 13 17 14 3 5 -9 -5 1 -26 -27 -14 4 -17 -19 -13 -15 -37 -4 -9 24 -20 -19 -12 -12 9
7581 9 3 3 11 7 -6 2 16 2 26 10 9 0 28 3 7 19 11 1 0 9 -6 22 -7 -16 14 6 -18 -11 -12 -11 -10 -4 -17 -9 -14 -22 -41 -16 3 -5 -32 -11
7623 -11 -12 -10 -19 5 -24 -15 -8 -4 11 -5 3 5 -5 6 -10 4 14 -17 -3 17 9 -2 -3 28 5 -17 0 1 0 12 -11 12 17 -9 -1 -7 -9 -19
7661 -19 -7 -19 -4 -12 -7 -9 -22 3 -46 -14 9 1 0 14 -4 -1 5 -20 -9 11 18 -3 2 21 3 23 1 24 7 19 11 13 4 11 39 36 17
7698 17 -2 5 -16 14 -3 7 7 -8 -6 -19 15 -9 -18 3 14 -5 3 -19 -37 -27 -15 -2 -18 -19 -13 -3 -6 -2 2 3 -11 -1 0 -1 3 -12 0
7735 0 -11 3 24 15 23 32 7 15 10 -2 15 5 9 0 14 0 -20 -26 9 3 -13 3 17 -12 18 -30 -16 1 -5 14 -29 -15 -27 -30 1 -28
7771 -28 5 -18 3 -17 11 -25 -1 -11 9 8 -4 -5 9 11 -12 17 9 15 5 -4 12 44 18 15 15 21 6 -13 3 8 -13 7 18 -9 -6 -13
7807 -13 4 0 -25 -2 -19 -4 -10 -23 -33 -20 -17 -31 -10 -23 -10 -30 -5 13 24 -16 2 -12 -20 4 6 1 1 -7 15 -8 16 23 16 17 0 26
7843B6k5j1J6j8MJ3%j7oK1n%qj2lJ5k5jK1mj8J5j7K2k0RJ2KJ6j6jJ3MK0j2loJ0
7881A1pRNLj1%J8l2K5Kj9KLMk3L1k8JJ4l1J9pRj6K3qoj5KJ1l%OJPj0K5k4J1k2
7921b0M0j0Qkj9MJQJ1k3LJ6pJ0pj2M3l1Ok0J9OKml8NJ9j3j1J3pJ5k8J8j2Mj1J7
7959gqj2K3j9L6k5mQnM6k3K3j3j9RJ1nqJk0J8MkK%l0K4%MjMj8J0%KnpJ0k4LLJ0
8001dj7J4nj3J5J6pj5j0J9LnPoj0MK2j7J4j4J9pjlRmMJ4Pj7O%OlnJ0noqKPlj1
8044BKkJ1j0j4Pqj6J9Rj9PMonJ3kMk0J7j3LJ2QopK2j8J2MK1j8k9J6QK1ol1J3K3
8084B8j1p%nPMNj4LJPk7lnJ3J5k8pK2J2qqlj5kPJ0OJ3j2rj3K9J0l1J4J0j9K7P
8124B3rmK4k4J1RrkJ0j7Rj2j2K3j1MOpk2PJ9qk7J9Mj8J1j5J3k5K3J7j9kJrjJ3
$$ plain form
7843 26 1 -10 6 -12 -8 5 5 -12 -18 3 -2 -2 -10 -22 -25 -10 -35 -36 -15 -19 -37 -22 -39 -17 -37 -28 -16 -14 2 -14 -15 -2 2 22 10 7 1 11
7881 11 4 13 18 21 10 10 28 -4 21 23 4 6 9 13 -10 21 -7 -6 8 -23 -4 -11 -2 -18 5 -3 -9 -24 -22 -11 -14 -14 -8 -7 0 -10 15 -9 2 -20
7921 -20 20 10 18 16 -3 1 2 10 21 -2 1 17 10 20 13 1 44 13 19 -1 18 24 26 22 -16 -11 8 -5 -16 -3 -10 5 -23 -5 -17 -13 -24 -7
7959 -7 -15 -27 -4 -23 13 -12 -16 -8 -13 33 10 33 20 1 10 21 16 8 9 -11 7 11 9 11 11 -19 5 5 9 8 12 -6 4 4 6 1 -6 4 -20 -17 -14 -4
8001 -4 -21 -7 -12 -25 -10 6 -1 -16 -26 -7 -4 -9 -2 -8 -18 -14 8 -9 5 -9 10 3 2 -1 8 4 8 22 29 12 18 18 24 21 16 26 21 15 7 9 16 13 2
8044 2 4 2 13 3 -11 -4 -12 -28 -9 0 -19 -12 -8 -14 -19 -6 -8 -4 -24 -7 -20 -17 -5 3 -3 -10 12 -6 6 10 31 13 -16 0 8 29 23 -8 5 28
8084 28 17 10 10 5 12 16 21 7 10 11 18 -9 -12 -17 -4 11 -17 -24 -2 10 2 -6 -9 -24 -26 -19 -9 -3 10 -2 -11 -24 5 15 -16 -2 8 -11 16 23
8124 23 14 10 34 10 21 30 21 19 29 12 21 9 -3 20 9 13 19 12 -10 -3 16 8 -19 0 4 -14 -3 -18 -5 -30 -7 10 -9 -11 -10 -19 -20 -7
8162gPJ4l0K4qOj2QQJK6k4mmLQJRlj2K5j6Lk6L1j8Jk0J0
$$ plain form
8162 -7 0 14 -16 8 0 6 -6 2 10 11 37 13 9 5 8 16 17 26 23 11 36 20 23 -3 28 10 11 -9 1
8191A
$$ Imaginary data points
##PAGE= N=2
##DATA TABLE= (X++(I..I)), XYDATA
0@%%%%%%%%%%%%%%%%%%%%%%%%%%%%%%%rM1o4O4o4O4o4O4o4O4q8J20j28J28j28
46f4J50j82J92k01K32k55K77l09L41l76M16m67N21n84O60p55Q74j024J226j522
66h50J993k819M814j8516k6275J7328K4154L1060J3810r179k9215k3753p026J2420
80a2054K1362J9707K086j8556k9341j9895P81K1526K7365J6270n520k1246k1975
93a9490p080J1637K4052K0718L196j8787k8146j9293m52J5503K3478J9090R74
106B5400j9753k4078q542J1441K2265K0704P987j1689k5918k2114k397J6494K1162
119A0962J1194m115j7228k1278j1268P908K2942K3125R523r524k3098k1583n462
132b7902J3182K2461J7359P43j8300k5825j4421O402K0806K1182J0611m484j7542
$$ plain form
0 0 0 0 0 0 0 0 0 0 0 0 0 0 0 0 0 0 0 0 0 0 0 0 0 0 0 0 0 0 0 0 0 -9 32 -32 32 -32 32 -32 32 -32 32 -56 64 -64 64 -64
46 -64 86 -96 96 -105 127 -128 149 -160 181 -195 221 -246 275 -309 351 -404 470 -554 672 -850
66 -850 1143 -1676 3138 -15378 -41653 -24325 -171 30889 44699 35520 6305 -17448 -24474 -12054
80 -12054 9308 29015 31101 12545 -16796 -36691 -35910 -14384 12981 29251 23731 2485 -19490
93 -19490 -26570 -14933 9119 29837 33033 14246 -13900 -33193 -33645 -18142 5336 24426 25400
106 25400 5647 -18431 -26973 -15532 6733 27437 35424 23735 -2183 -24297 -26694 -10200 10962
119 10962 22156 18041 813 -20465 -31733 -23825 -883 22242 31765 22241 -857 -22440 -27902
132 -27902 -14720 7741 25100 25843 7543 -18282 -32703 -26301 -5495 15687 26298 21814 4272
145D272j9623o466J2303K1469J4671n2j4185k2630j8948j392J8514K4187J2032
158B4152n993j8057j8364o921R627K0700J7510K795j3099k0315j4460J64J4314
171g947J8984J1049l555j6535k0025r989Q682K2944K0970N435j1267j9955j7535
184a8744m093J3059K1187J2237n154j7637j8383r716M121J7297K0720R522q034
197A6382j8716j5740l065J0983J9252J4890q0j5601k0469j1675L983J6607J7953
210A4704P016p362j6499j5168m741R114J8965J6256J861j3475j8960j2204Q42
223a9651J3384J8706J0517o669j9608j7363l603J0453J7838J5177L243j1540j9102
236h218j3010J186J3494J7221J0805j889j4198j7787q803O101J7025J6427M626
$$ plain form
145 4272 -15351 -21817 -9514 11955 26626 26574 12389 -10241 -29189 -30581 -12067 12120 24152
158 24152 18159 102 -18262 -25183 -15556 5144 22654 25449 12350 -7965 -22425 -22261 -7947
171 -7947 11037 22086 18531 1996 -18029 -28018 -19336 3608 24578 30013 18746 -1209 -18744
184 -18744 -22837 -9778 11409 23646 18492 855 -17528 -27244 -23123 -5826 14894 24416 16382
197 16382 -2334 -18074 -21139 -10156 9096 23986 23906 8305 -12164 -23839 -19856 -3249 14704
210 14704 21720 14358 -2141 -17309 -22050 -12936 6029 22285 24146 10671 -8289 -20493 -19651
223 -19651 -6267 12439 22956 16287 -3321 -20684 -24287 -13834 4004 19181 22424 10884 -8218
236 -8218 -21228 -20042 -6548 10673 21478 19589 5391 -12396 -21199 -15098 1927 18354 22980
249B2980j0323j8391j3534m88J1496J6534J0858k482j5090j7059o807O354J4773
262a179J4929O798n918j6294j5233k260J1864J7053J0626j354j2971j7727j0354
275b2020M477J5742J5447N037o952j4518j2832k642R250J6048J2349P74j1710
288H450j7071j1026J846J2945J5658P941m527j4742j5580n067Q890J6181J1726
301A5624J101q365j3542j0485N64J2173J4974O741m860j3103j3865o067N830J5214
315A934J4318K942r638j5327j0531J67J0183J3995Q144l069j2026j3173n865N097
329a2849J3245J2639L860o522j3046j1750k257R758J5802J0126k197j2093j4208
342i492p634K810J1732J3376N091o815j2998r658j160P325J2331J0210Q42r379
$$ plain form
249 22980 12657 -5734 -19268 -19756 -8260 8274 19132 16650 1560 -15499 -22306 -15952 -1179
262 -1179 13750 20548 14630 -1664 -16897 -19157 -7293 9760 20386 19032 6061 -11666 -22020
275 -22020 -17543 -1801 13646 18683 11731 -2787 -15619 -18261 -9011 7037 19386 20160 8450
288 8450 -8621 -19647 -17801 -4856 10802 18743 14216 -526 -16106 -21173 -12283 3898 15624
301 15624 16725 8360 -5182 -15667 -15103 -2930 12044 18785 13925 822 -13043 -19110 -13280 1934
315 1934 16252 19194 9556 -5771 -16302 -16135 -5952 8043 16187 13118 1092 -12081 -17946 -12849
329 -12849 396 13035 16895 10373 -2673 -14423 -16680 -6922 8880 19006 16809 4716 -9492
342 -9492 -17126 -14316 -2584 10792 15883 9068 -3930 -13588 -14748 -7423 4908 15118 15960 6581
356F581j3234q008K021J0565J2081N363n098j2613j1931l284P343J3483J0579
369A3848J069q363j1883p511J140R126J1976O977l471j1955j1806m120M943J0933
383I03J0543K880p705j3147q784J390R843J1782O752j852r632j1583n700L971
397a0339J0530R872L211n213j0691r166j396P373J1562Q062q92r588j1449n383
411a3507L627R738R780L796m948j1006r626j653O912J0598P671P50o718j0757
425e343p443J696R780J0486M162m121r910r790l274N657J0781Q393O66p006r831
440e097o278J012P719R864N813k029q861j0091m603L895R536Q445K023n472r944
455d068q035l86P977J0501N668k011p642q646m454K923R038Q937K517n376r481
$$ plain form
356 6581 -6653 -14661 -12640 -2075 10006 15369 10271 -2342 -14273 -17557 -10214 3269 13848
369 13848 14917 6554 -5329 -12840 -11700 -2574 9402 16379 12908 953 -10853 -14973 -10030 903
383 903 11446 14326 6621 -6526 -15310 -13920 -4077 7705 14457 12605 2973 -8610 -14310 -10339
397 -10339 191 10063 13274 8061 -2630 -11796 -13192 -5819 5743 13805 12913 3325 -8124 -13507
411 -13507 -9880 -142 9638 13434 8486 -2520 -12146 -13799 -6887 3711 11382 12132 5414 -5343
425 -5343 -12786 -11090 -1310 9176 13338 9217 -693 -10483 -13757 -8100 2681 11074 11740 4734 -5097
440 -5097 -11375 -10363 -2644 7220 13033 11004 2143 -7948 -12551 -8656 880 9325 11348 5876 -4068
455 -4068 -12103 -12489 -4512 5989 11657 9646 2004 -6642 -11096 -8173 865 9802 12319 6943 -2538
470b538p623j528N643R756P297l61p628r425m913K521Q292Q636L468l689q698
485g90q179k418N063R182O903K50o322q878n950P92P690R825M945l259q733p957
501g836k480M021Q407P437J145o151r027n810O71O283Q203N076j351p300q435
516g147l530L717Q456P643J979n000q883o922o51N927Q688N521j399p216p871
531f688l565K527P310P902L324l734q394o997r93N301Q027N750j30o542q963n034
547a0899K197P480P476L076l002p339o897j775M593P999O117M05n556p866n121
562i112P35O233P835M135k411p517p417k331M083P657O182J235m642p965n831
577i131M80O261P453L930j627o365p338l371L038P629O828J498m433p348n480
$$ plain form
470 -2538 -10161 -11689 -6046 3710 11007 10646 3018 -6407 -11320 -8799 -507 8129 11597 7908 -790
485 -790 -8969 -11387 -6324 2858 9761 10011 3689 -5189 -11139 -10347 -2657 7168 12113 8854 121 -7836
501 -7836 -10316 -6295 2112 9549 10694 4543 -4484 -10294 -9623 -3340 4863 9939 8588 1288 -7147
516 -7147 -10677 -6960 1496 9139 11118 6118 -2765 -9687 -10338 -4411 4277 9798 8399 1183 -6688
531 -6688 -10253 -7726 -416 7486 10810 7076 -1318 -8315 -9308 -4007 4020 9770 9640 3098 -5865 -10899
547 -10899 -8702 -1222 6254 9330 6328 -1011 -7908 -9683 -5090 2909 9026 9431 3875 -3991 -9112
562 -9112 -8377 -2144 5691 9826 7415 -102 -7519 -9850 -5767 1890 8072 9307 4665 -3300 -9131
577 -9131 -8651 -2390 5063 8993 7366 1001 -6337 -9708 -6670 959 7787 9285 4852 -2496 -7976
592g976l95N097P434M585j336o227p066l404K273O625O720K577k964o921o259
607g237j097M870P429M834n88n645p350m331J506O443O918K372l322o567n477
622g242j315L852P120N751M51m926o721m165P92N232O382L092k348o537o449k034
638i065L601O824N465Q93m103o510m568L37N185O715L643j734n825o025k570K253
654e484O013N812J365m141o642m519J87M666O392M094p80n334o348k917K173N605
670A42N362J852k735n903n083p71M036O227M195m88m900o044l294J291N135N734
686D756K377k618n844m939r50L460N844M594N28m040o084l722J065M949N360K384
702G120j908n468n607j890K988N728M499N72l447n225l533M67M442N642L140j388
$$ plain form
592 -7976 -8371 -3274 4160 8745 7409 1182 -5884 -9288 -7015 -390 6330 8907 5943 -978 -7237
607 -7237 -8334 -3464 3965 8799 8211 2566 -4784 -9115 -7609 -1166 5752 8124 4802 -1765 -7242
622 -7242 -8557 -4705 2415 8166 8617 3691 -3030 -7195 -6403 -1171 5211 8303 5955 -582 -7031 -9065
638 -9065 -5464 1360 6825 7718 3615 -2895 -7463 -7126 -1941 4774 8417 6683 858 -5167 -7737 -5484
654 -5484 529 6341 7706 3565 -3077 -7596 -7409 -2743 3649 7743 6963 1629 -4719 -7636 -5463 142
670 142 5504 7356 4621 -1282 -6365 -7136 -3100 3127 7322 6834 1934 -4110 -7404 -6113 -978 4756
686 4756 7133 4515 -1329 -6268 -7218 -3758 2086 6680 7208 3168 -2916 -6638 -5573 -624 4736 7120
702 7120 5212 -256 -5863 -7753 -4765 963 5462 6034 2587 -2638 -6171 -5704 -1262 4380 7520 6132
718F132n045n454k364J885M966M715J314k943n600m238L8M187N515L279o75m176
734A536n143k515J910N075M641J152k852n208m374r18L169N386L798k72l908m852
750c375k613J200M440M842K037k137m988m555j118K931N032L822K79l383n045
765b631l353O06M266N013K278j670m494m387j592K213M831M070M65l331m771l160
781e647K73L630M856K903r22m197m582j853J869M280L905R61k712m805l666p1
797e778L556M881L039o84l772m425k236J281M195M344J474k348m552l710o91K673
813b753M435L301j30l589m638k332J343M055M264J831j679m330m026j072K472
828b848M286L197J17k973m234k698N53L588M348K149j417l996l960j373K003M172
$$ plain form
718 6132 1087 -4367 -6731 -4846 120 4835 6149 3206 -2394 -6632 -6594 -2407 3108 6387 5712 1536
734 1536 -3607 -6122 -4212 863 5504 6656 3804 -1404 -5778 -6696 -3527 1859 5657 5385 1477 -3375
750 -3375 -5988 -4788 -348 4494 6531 4394 -594 -5149 -6267 -3336 1696 5518 5797 2414 -2631
765 -2631 -5984 -5378 -1112 3901 6179 4509 15 -4372 -5964 -3751 1080 5150 5615 2284 -2487 -5647
781 -5647 -5374 -1744 3112 6015 5093 896 -3686 -5539 -3670 610 4515 5476 2764 -2041 -5707 -5778
797 -5778 -2222 2659 5698 5014 1242 -3183 -5419 -4138 57 4401 5875 3527 -1025 -4735 -5426 -2753
813 -2753 1682 4983 4853 1264 -3374 -5706 -4363 -308 3956 5787 4108 -222 -4248 -5320 -2848
828 -2848 1438 4635 4752 1779 -2455 -5153 -4600 -1012 3336 5485 4068 72 -3888 -5261 -3258 914
844I14L545O42k829m508k984M46L449M146K346q43l722m157j677J856M097L559
860D280Q12k344m098l241l57K866M141K541o23l255l745j758J316L753L774J233
876E295k023m153l529n93K604L990K809k5k977m087k237J049L560L666J351j703
892B997l625l215p44K309M021K894j43k942l866k367M56L173L924J956j207l540
908H1l507j153J806L578K945M72k390l821k554M04L059L726K031r15l233l418
924b889j482J435L569L234N69k292l696k706j26K529L675K347n79l000l349j408
940d169J371L253L084J016j787l557k919l30K250L358K212l78k790l442j805R70
956c663L271L538J449j429l197k891p81J751L272K485m3k557l457j964O83K789
$$ plain form
844 914 4459 5101 2272 -2236 -5220 -4774 -1325 2821 5167 4324 602 -3555 -5232 -3376 721 4280
860 4280 5092 2748 -1350 -4591 -4948 -2082 2059 4600 3977 722 -3023 -4781 -3465 288 4062 5295
876 5295 3272 -881 -4410 -5003 -2399 1591 4400 4375 1398 -2689 -4926 -3877 -317 3349 4700 2997
892 2997 -628 -3843 -4587 -2278 1743 4637 4494 1552 -2314 -4681 -4225 -1052 2872 4828 3621 81
908 81 -3426 -4579 -2773 805 3750 4222 1832 -1989 -4543 -4139 -1080 2646 4677 3762 529 -2889
924 -2889 -4371 -2936 633 3867 4436 2144 -1552 -4258 -4384 -1855 1820 4167 3588 588 -2761 -4169
940 -4169 -2798 455 3539 4555 2768 -789 -3708 -4038 -1788 1570 3782 3404 614 -2828 -4633 -3663
956 -3663 -392 3146 4595 3166 -31 -2922 -3703 -1952 1320 3805 3762 1205 -2252 -4216 -3533 -744
972g44L130J490j108l131k959p29J957L303K581L12k088l308k296J11K392L031
988A944J551q46k720k788j047J403L125K795N87j976l229k399O7K336L102J832
1004C737n48k700l112j348J242K910K652P85j485k843k403k91K028K994J913l78
1020C153k376k831j602P08K604K803J061j290k766k390m15J768K897K096j8k177
1036A225l009j796N60K398K717J244r72k580k461p06J508K836K207Q4j951k697
1052a393j805K66K209K776J393q48k568k523r68J185K589K360O12j526k650j967
1068b858M4J909K548J483n64k236k522j154R96K514K375O43j389k478k041k34
1084b964J707K657J735l07k137k544j293P45K207K302R15j150k485k053l01J593
$$ plain form
972 -744 2386 3876 2768 -363 -3322 -4051 -2094 1209 3790 4102 2014 -1294 -3590 -3479 -1087 1944
988 1944 3495 2649 -71 -2859 -3906 -2503 622 3417 4004 2028 -1201 -3600 -3533 -1197 1905 3737
1004 3737 3189 489 -2623 -3971 -2729 181 2833 3618 2133 -710 -3113 -3404 -1376 1618 3531 3153
1020 3153 777 -2054 -3656 -2948 -344 2459 3520 2230 -536 -2926 -3341 -1573 1324 3420 3402 1225
1036 1225 -1784 -3580 -3020 -622 2095 3339 2367 -213 -2674 -3380 -1872 964 3171 3255 1304 -1393
1052 -1393 -3198 -2932 -723 2053 3446 2598 30 -2493 -3461 -2276 313 2673 3285 1759 -891 -2858
1068 -2858 -2814 -905 1643 3126 2562 326 -2196 -3350 -2354 160 2535 3178 1789 -689 -2730 -2964
1084 -2964 -1257 1400 3135 2828 691 -1853 -3146 -2401 -194 2108 3023 1873 -612 -2665 -2966 -1373
1100a373K429J786J6j792k440j507M34K082K334J010r50k275k220o94J271K504
1116F15K025K67j616k403j580K76J847K263J253p05k142k217p25J143K165J883
1132B349L45j468k341j686P9J799K366J355m49j878k169j026P93K086K049N61
1148B765j210k206j799j40J516K207J498k65j864k284j096P86K034K062P78r85
1164A797k100j890l68J358K171J535j38j581k070j309L74J840K034R18q81j941
1180b51j838m63J176K083J675J36j507k150j363L26J705J999J026o43j852j954
1196a895p22R55K028J748K72j263j948j478P7J575K055J091n55j747j910p73Q45
1213a645J876J790M62j128j983j553o9J312J892J282k54j549j864r34O33J744
$$ plain form
1100 -1373 1056 2842 2858 1066 -1374 -2881 -2447 -365 1969 2979 2029 -246 -2466 -3160 -1889 615
1116 615 2640 2907 1291 -1112 -2692 -2416 -569 1694 2947 2242 100 -2117 -2842 -1699 466 2349
1132 2349 2694 1226 -1115 -2801 -2722 -923 1443 2798 2349 471 -1698 -2724 -1931 155 2204 2765
1148 2765 1555 -651 -2450 -2590 -1074 1133 2631 2366 502 -1782 -2878 -2092 -58 2004 2782 1797
1164 1797 -303 -2193 -2561 -1203 968 2503 2365 784 -1286 -2595 -2221 -381 1653 2571 1690 -251
1180 -251 -2089 -2552 -1376 707 2382 2518 1011 -1139 -2502 -2176 -471 1528 2554 1911 59 -1895
1196 -1895 -2617 -1662 366 2114 2386 1123 -825 -2303 -2226 -651 1404 2495 1940 193 -1717 -2490 -1645
1213 -1645 231 2021 2483 1355 -628 -2181 -2250 -938 954 2236 1982 433 -1431 -2365 -1732 12
1229A2J767N54r56j813j558k24J239J950J372k25j527j923j061M83J609J767P97
1246B263p83j780j581k81J108J771J355O0j295j803j130K83J484J680Q07o35j612
1263h9j653n70R15J803J513K18j145j775j233J61J360J701R80n01j576j665o00
1280b156Q14J574J422L04j014j623j253P3J253J694J004l54j387j655q02N84J558
1297C6J511M28q89j544j327j67J133J619J161j44j338j591q41N19J393J432N33
1314A924p30j547j415k40J019J615J160qj135j515r64L36J312J465O38o25j458
1331a68j336m00Q32J447J210J08j058j475r41K63J212J453P83m66j362j409n11
1348a818O89J383J233K11q99j428j079MJ136J489Q56l54j237j342n65O01J317
$$ plain form
1229 12 1779 2333 1377 -436 -1994 -2218 -979 971 2343 2118 591 -1332 -2393 -1910 -301 1466 2263
1246 2263 1480 -300 -1881 -2162 -1054 717 2072 2132 837 -966 -2096 -1813 -329 1351 2158 1523 -89
1263 -89 -1742 -2312 -1397 406 1919 2137 992 -783 -2016 -1855 -495 1206 2186 1685 109 -1556 -2156
1280 -2156 -1342 232 1654 1958 944 -679 -1932 -1859 -606 1088 2092 1738 351 -1304 -2106 -1522 36
1297 36 1547 1975 1086 -458 -1785 -1952 -819 800 1961 1817 479 -1112 -1953 -1434 -41 1391 1924
1314 1924 1194 -353 -1768 -2008 -989 626 1786 1778 643 -872 -1836 -1500 -188 1277 1915 1290 -168
1331 -168 -1504 -1904 -1072 375 1585 1693 635 -840 -1781 -1518 -306 1147 1930 1464 102 -1307 -1818
1348 -1818 -1129 254 1487 1698 799 -629 -1708 -1704 -568 921 1777 1423 186 -1156 -1721 -1120 197
1365A97J236L31q76j414j073k2R65J361R02j65j108j324o91M42J226J257M07o55
1383I96j281j144j94Q49J364R61p5j057j329p50L67J171J283N19n82j304j126
1400a332k38P47J248J003K4q84j282q09K14J060J237N77m32j118j177m16O64J222
1418C08J022J35q22j243q93R0J007J237P18k98j126j160m41M92J125J045K50p28
1436G18j229r11JR00J227P22k28r54j161n38M31J127J088K65o09j145r68j36P63
1455f37J157Q11j19r11j114n85L39J018J071M13m69j138r68k17O60J096Q37m9
1473A195q24j105o77K31R62J121M56l81j038r68k74N92J052Q57N9p63j079p04
1491a288J11Q50J036N55k82r26j020l22M88J021Q90K04o74j026q24j2Q03J071
$$ plain form
1365 197 1433 1764 888 -526 -1599 -1621 -656 705 1607 1442 334 -990 -1681 -1239 -13 1244 1651 996
1383 996 -285 -1429 -1623 -774 590 1551 1476 419 -910 -1660 -1293 -122 1161 1680 1098 -206 -1332
1400 -1332 -1570 -823 425 1428 1452 568 -714 -1523 -1309 -249 988 1565 1133 15 -1162 -1578 -914 308
1418 308 1330 1465 643 -600 -1493 -1403 -396 841 1559 1261 135 -1025 -1466 -974 151 1196 1446 718
1436 718 -511 -1422 -1421 -521 706 1428 1200 246 -915 -1453 -1022 105 1193 1458 849 -296 -1264 -1400 -637
1455 -637 520 1331 1212 301 -813 -1398 -1059 -41 1030 1443 974 -164 -1132 -1349 -689 407 1244 1195
1473 1195 371 -734 -1411 -1180 -218 903 1359 978 -60 -1028 -1302 -710 342 1199 1258 495 -584 -1288
1491 -1288 -1177 -327 709 1264 982 56 -964 -1286 -798 223 1113 1317 643 -383 -1207 -1219 -416 655
1509F55O02k36q58r80m30L93R80Q87K40o00j011p77l4O94R95O39j17q15r70m97
1529a240L40Q60R29L34m38r24q44j88O23R84O96o1p63r67n71K10Q81R45L97l80
1549H23q96q29j84N50Q98O93M9o97r85o00J74P50R23M26k75q27q47k71M63Q92
1569B30P52J10n99q87o40K2O92Q86M88k10q38q33l43L96Q63P95K19m85r07o68
1589i57k3O47Q42N17j50p25q49m09L23P99P96K16m26q23o63r1N54Q58N61p6o91
1610B30q10m53K07P22P89L05l34q04o98j34N00P98O25J7n74q56n32J19P11P77
1630F05L50l23p21p13k12M54Q02O46O6n31p83n14Q1O16P17L87k03p04p11k80L33
1651f38P37O68J37m48p47n72J6O03P51M32j37o59p52l51K67O85O70J86m05p12
$$ plain form
1509 655 1257 1021 163 -817 -1247 -854 126 1013 1253 653 -358 -1135 -1169 -475 520 1159 1042 227 -743 -1240
1529 -1240 -900 -40 889 1223 785 -139 -983 -1171 -548 436 1132 1071 308 -659 -1230 -1020 -139 806 1203 823
1549 823 -73 -902 -1086 -536 362 1055 1104 407 -578 -1178 -1004 -254 669 1095 820 -7 -854 -1125 -662 230
1569 230 982 1092 493 -394 -1034 -1012 -320 566 1054 844 6 -827 -1170 -774 89 884 1103 618 -289 -957
1589 -957 -980 -333 509 1026 876 151 -698 -1107 -784 15 811 1027 601 -222 -885 -976 -422 436 997 921 230
1610 230 -580 -1033 -826 -104 685 990 656 -148 -846 -980 -480 318 943 960 386 -470 -1002 -883 -172 605
1630 605 955 632 -89 -802 -1014 -560 242 888 954 423 -360 -874 -793 -177 540 927 724 20 -691 -971 -638
1651 -638 99 767 904 456 -291 -863 -847 -244 507 939 802 143 -609 -960 -693 -8 662 848 443 -269
1671b69n41k1N05P31M85j01o08p02l36K09O18O30K52l08p07n84j34M34P25N10
1691G88rn17o76l82J35N79O84K89k93o65o19j69L73O65N58K8m57o65m20Q4N39
1712a50O45L42k19o18o04k39L13O66N17Q6l85o41m68J3N14O61L43j08n57o01k69
1733g59K35N80N79J23l75o40n02j6M57O51L99n4m95o19k95K02N75N49J73k99o08
1754a39n12r3L75O21M01qm64n75k92R8N25N68K45k33n88n12j32L14N82M31Ol86
1776B32n89l54Q1M89N57L18j81n09n49j81K84N59M71J9l37o05l58L8M19N63K99
1797F66j11n11m92j94K19N10M89J16l31n32m26m5M00N37L51r8m47n23k47J91N09
1818C1M94J31k65n28m28p2L55N12L49l0m04n24k62J24M83M54K39k28m90m62o4
$$ plain form
1671 -269 -810 -831 -326 405 890 789 181 -521 -857 -648 -30 600 852 544 -163 -747 -881 -447 278 788
1691 788 779 262 -414 -796 -661 -82 602 891 598 -67 -686 -855 -482 183 741 769 312 -353 -773 -689 -150
1712 -150 495 837 618 0 -604 -843 -530 136 653 739 354 -287 -755 -742 -228 433 776 668 111 -490 -759
1733 -759 -524 56 635 758 383 -257 -759 -775 -318 333 732 678 183 -436 -731 -529 46 595 768 469 -139
1754 -139 -651 -744 -369 252 653 645 181 -394 -686 -588 -63 505 750 517 -71 -583 -715 -401 181 612 618 232
1776 232 -357 -711 -630 -141 416 734 553 44 -505 -686 -402 157 628 647 310 -295 -653 -615 -196 367 666
1797 666 555 44 -448 -642 -423 87 576 692 361 -171 -597 -642 -242 295 646 548 101 -422 -669 -478 31
1818 31 525 656 391 -137 -565 -637 -282 230 579 549 145 -379 -641 -517 -34 420 659 431 -59 -521 -585
1839e85K77N05L81j5l77n04k95Q8M27M68K31j71m51m38j42K55M69M05L9l24n13
1860b70l33N5L74M62K82j21m16m49j76K36M50L91R7k81m75l72lL48M42K95r4l99
1882D3m27j92J65M50M17J08k39m29l55n7K98M37L09l3l77m46k46J18M44L90J52
1903E30k08m28l52m6K67M32L08ol46m41k33O0L67M36J71j62l97l73j11K31M28
1924A27L43N1l18m35k71K4L70L97J99r7m14l60j40K16L91L57N7k52m01k79JL06
1946a28M09K22j09l76l72j45J69L41L54J04k13l91l00mK60L88K70o7l37l60k12
1967d97J32L55L46Q5j45l94l21j2K43L90K68j7k83l87j73P1L21L39J11j56l32
1988e6l48n1K22L71K80J6k54l72k14M7L12L23J54j12l26l22j05J72L31K98J7k07
$$ plain form
1839 -585 -308 197 578 563 186 -318 -613 -525 -98 370 601 430 -21 -459 -601 -346 123 528 567 243 -270
1860 -270 -603 -548 -174 288 570 449 33 -416 -592 -356 94 485 582 301 -174 -546 -549 -201 241 536 442 43
1882 43 -384 -576 -411 39 456 564 325 -104 -459 -516 -218 219 528 495 118 -328 -574 -456 -12 378 530
1903 530 322 -106 -458 -504 -237 195 503 497 151 -290 -523 -463 -96 340 511 349 -48 -421 -532 -301 127
1924 127 470 521 203 -232 -503 -479 -109 288 487 390 -24 -384 -524 -308 83 440 497 245 -156 -435 -434 -128
1946 -128 281 503 394 18 -354 -499 -330 11 365 469 256 -135 -435 -439 -179 209 479 412 75 -285 -497
1967 -497 -365 -10 336 421 276 -118 -439 -451 -208 182 450 433 150 -237 -410 -339 -18 321 432 276 -56
1988 -56 -404 -455 -233 138 418 434 180 -192 -406 -359 -47 276 430 318 -8 -330 -435 -263 68 366 383 176
2010A76l67k04K5K72L49J72p3l32l21j38J78L17K64N6j80l27k33LK45L25K08o3
2032C52k90l08j34J06K76K93P9j46l40k47k7K30L05K41k5k54l18j72J00K59L20
2053C00Q3j42l14k54n8K18L11K09Jk60k85j79Q3K41L05J16j30k94k55m7J11L12
2075G2K50J0k01k88j84K9K82K48J79j03k73k56j02J39K78K41j7j26k85k07mK40
2097g8K49J72n2k39k95r4Q6K46K75O6j65k80k06J1J82K76J38k6j93k69j23P1K41
2120gK53N9j39k45k08o1J81K78J95k4k05k35j39O6K27K35R9j18k35k30o8J72K44
2143I5J90j4j61k65j78P9K18K26J08q0k40k18p8J43K30J94J7j48k44j50j0K04
2165h2K17J57p4k03k14r7J26K42J95J9j31k41j79J9J77K28J28n6j99k22r0Q8K02
$$ plain form
2010 176 -191 -395 -370 -98 251 423 350 18 -303 -441 -263 54 318 374 194 -133 -366 -363 -118 207 415 352
2032 352 62 -246 -380 -274 2 295 374 228 -112 -359 -386 -156 149 390 365 111 -207 -379 -279 -20 300
2053 300 383 241 -73 -327 -385 -167 144 353 354 94 -191 -370 -287 -46 259 375 245 -49 -304 -351 -240 72
2075 72 322 332 131 -157 -341 -312 -30 218 397 294 21 -235 -337 -198 80 321 304 178 -107 -314 -318 -78
2097 -78 171 343 291 52 -243 -337 -251 -5 270 336 171 -109 -315 -304 -122 154 292 266 73 -196 -319 -248 -7
2120 -7 246 305 166 -79 -287 -348 -167 111 306 282 77 -158 -297 -231 -4 231 330 212 -23 -253 -321 -149 95
2143 95 285 271 110 -155 -333 -254 -36 190 298 218 -22 -240 -318 -175 55 249 266 118 -126 -276 -286 -82
2165 -82 135 292 218 15 -199 -296 -170 72 267 286 155 -86 -265 -246 -69 159 287 231 32 -190 -280 -192 10
2188A0K11L7j05j92j93l2J70K24J47m1j93k21j04Q0J91K23O2j04k34j80l7J30
2210a51K16J53J3j55k23j17L3J99K07J03j20j78j73n0J24K23J45jj51k20j04K2
2232b05J55K04P4l9j62j97q4J06J75J93L0j37j98j53K3J71J87J14p4j81j76p9
2254b53N6K25J54L9j10j86j47j2J49K01R7l8j47j98p4O7J83J73N1j02j72j38k5
2277b07J27J77J32k6j14j89j00K5J64J80N7q7j63j68l6J10J98J16k6j00j69j29
2299b28M8J49J49P0l6j69j56n9R7J60J71J1j40j58j33L0J27J66J03l3j78j36o8
2322b13P4J68J21O5j10j45j38nJ31J91Q3n1j22j75p6N7J62J25L4q8j51j01l8J10
2346i2J46J11j4j32j21j05N1J31J52N9p3j46j49k4J00J70Q2nr1j47j11N8J33J46
$$ plain form
2188 10 221 258 153 -39 -232 -264 -94 130 277 236 43 -178 -282 -202 -11 212 274 170 -64 -244 -281 -151
2210 -151 65 218 231 76 -147 -264 -231 -32 175 278 158 -20 -193 -243 -119 104 249 248 97 -123 -227 -205
2232 -205 -50 154 228 189 27 -170 -254 -148 27 220 250 113 -85 -238 -215 -44 143 257 183 2 -174 -253
2254 -253 -197 28 182 221 111 -75 -222 -234 -85 116 213 175 28 -170 -244 -177 6 179 230 128 -44 -182 -207
2277 -207 -80 97 229 203 89 -100 -200 -175 -11 169 226 139 -24 -192 -228 -118 80 196 170 70 -99 -228
2299 -228 -180 -31 118 188 152 -17 -173 -232 -135 25 196 207 67 -91 -224 -194 -67 99 202 169 -9 -145 -213
2322 -213 -139 29 150 215 105 -40 -178 -183 -52 139 222 171 49 -126 -202 -145 17 142 176 88 -63 -164 -202 -92
2346 -92 54 165 151 19 -102 -207 -156 -25 127 186 113 -33 -182 -206 -106 64 146 141 50 -97 -208 -150 -17 129
2370A29N3n2j46j15p7J01J47J22K2j34j56p4K5J13J48N7j8j39j31m1Q1J17J17
2393A49K4j00j08j29J2P9J38Q1l7j12j38m8O5J15J26N5r9j34q1j3J17R2J02j3
2417A43j10j38j00O7J19J41L1m1j25j41LQ4J13R8Rj03j50o5K3Q5J51N7m9j23j07
2442a28m4O4J51J00kq9j28o6PJ07J19M2l9j06j25j1K4J36R4J8o4r4j01k0J09J13
2468F7N7j3r1j08o8P6J19J00J3o7j12r7lR2R8N5or3j22n0L8R5J18N8q5j13j04
2495a46QP2J08Q9k7n2j17o5mJ16R0O6o0j05r2j6L8J25R3mo3j27n5J0J01Q8N8l3
2523I6j03j05lK9J09Q6L3o5j25n7pO7J04P9m3r4j06m5P4P6P6M6q7q4p5j7Q2R8
2551C9P3jr8o5o2L3P8Q9L4m7j18o4k1P1Q8P1Po4j03o3L5Q1Q8M1n3p8n5k6K8R1
$$ plain form
2370 129 182 130 -16 -131 -208 -107 40 162 184 50 -106 -180 -155 -42 106 163 145 6 -125 -166 -85 32 149
2393 149 173 73 -35 -164 -152 -73 65 146 109 -3 -141 -189 -124 -9 117 172 73 -61 -142 -155 -38 54 156 143
2417 143 33 -105 -205 -138 -19 122 153 112 -13 -154 -151 -67 46 144 153 50 -100 -165 -142 -57 94 151 102 -21 -128
2442 -128 -172 -108 43 143 141 52 -76 -142 -135 -28 91 133 94 -12 -137 -148 -124 12 106 124 60 -34 -135 -155 -46 67
2468 67 124 111 20 -88 -156 -80 39 139 152 85 -27 -124 -127 -35 63 118 112 19 -103 -153 -115 -20 98 156 71 -42 -146
2495 -146 -138 -66 42 131 104 52 -65 -130 -134 -18 72 138 78 -27 -119 -135 -97 28 121 117 54 -73 -128 -118 -17 71 129 96
2523 96 -7 -112 -115 -86 23 109 142 77 -48 -105 -112 -45 59 138 95 1 -105 -150 -76 0 76 122 35 -49 -124 -141 -59 39
2551 39 112 111 13 -52 -114 -81 -3 86 120 73 -45 -109 -130 -59 29 100 107 43 -60 -123 -88 -7 81 122 69 -9 -64 -90 -62 29
2581B9R5j1p0q1p1j0R8J06K1k4j14q3j2M3Q3Q6ll9j00n9oQ2O4O5k8o3q2n1N2Q6
2611CQ1J0l1p7p6oN7O8O9mq7o0m8RP1R0K7l0r0q4rO0P6O1J4q5m8o0K4O4N7N5m7
2644E4p6n3m0L2Q5N2mk3q3m4JN0Q5L1Rp5n0n8L9R9P2j7l9q3l3k5P1O6N5k0p7n1
2676e0n9M5O4M6N0p6m6n5j7N9O7L7Qm8p2n0K9M9O1M7m0p1o5lL7P2N2Ko6o2l6J3
2708g8L8J00L3o7k2p4j2K4P8N6jm6o8n4KN5P5M5k0n4n8k5J5O7K5K0Pj06n0PN6
2739c2P7J3no5l1m9J7N8O7M1m2p9l6qK4L9Q6j0l5m9o1K6L0Q5Mk9n8k9k2L2N4N3
2771F6Nl4o5j9j9L7P8M2k7m6o6l0J9L3Q2omp4m9j0N3N4N1k6l1o7j0RK7P7K7k2
2803E5p3l7rK5N6M8j6l9m4k4k4N5O7J1j6m3n8OJ9P3M0nl0m7o0lM0P5L5l3n1m5
$$ plain form
2581 29 124 113 43 -38 -109 -119 -21 85 106 82 -32 -115 -127 -84 -1 85 82 43 -57 -116 -122 -40 24 89 61 -2 -84 -135 -83 3
2611 3 84 94 63 -14 -90 -96 -39 29 98 94 7 -53 -101 -92 -21 69 96 66 -24 -108 -117 -57 19 80 94 9 -39 -99 -75 -11 46 101 54
2644 54 -22 -75 -115 -83 2 54 50 27 -56 -100 -99 -49 36 67 76 1 -49 -107 -68 31 103 86 47 -36 -69 -94 -23 43 98 78 1 -50
2676 -50 -109 -64 0 46 96 20 -26 -81 -98 -39 28 65 73 25 -47 -97 -68 -19 42 89 49 -22 -87 -90 -53 19 71 73 7 -55 -91 -78
2708 -78 -40 60 93 26 4 -70 -82 -58 20 76 75 29 -39 -93 -91 -36 39 84 64 10 -48 -73 -58 9 34 54 61 -45 -95 -88 -32
2739 -32 45 58 53 -12 -43 -92 -75 -17 50 91 49 -30 -66 -74 -50 -11 75 65 30 -19 -80 -54 -24 61 65 36 -22 -51 -73 -41 13 66
2771 66 71 37 -28 -47 -66 -29 49 91 64 18 -48 -78 -59 -26 56 50 46 -28 -77 -87 -34 20 71 45 14 -53 -63 -54 -27 50 77 55
2803 55 -18 -55 -64 -39 17 65 49 10 -34 -58 -82 -27 40 51 35 -8 -66 -60 -41 32 72 67 37 -10 -70 -73 -33 42 77 44 -7 -52
2835e2j3J1O6L8J7n9m4m9K0K4M7M0om3p6MoO6N9J5m2k9k8k5K5O8M0Ro6l8m7L0
2867d4M1M1K8j1l6o3k6M9M8L2j6j1n0p1L9L9L5M9m5m3m3j3L7L4P0k3j1n7k9l8
2897h8P2L1L8Pm4n3k6J6M9N0j1po0j3nK6M0L4K5o2m0m5RN6L8Qnn9m4j8L1L4N3
2930C7K6n9m2k8NK5N9J0kk1o9jK0K1O0j0j2n1m0QM6M8L5k2m7k7rj5N4K5K1l4l2
2963b1k1k8L6M6M4j6m0j3m0J0M4K2L2j6p5k1%MO1J8J3k7l4m8J2K1O7Pj1k8m8k0
2995g0J3P7L2Lk7m1k9MK4L9J4J3k1q1k0L1L9N7Lk5n3j8NM9K2J2J7m4n0j1J3K7
3027DN6j1Nn3o3J7K9K7K9Ol2n5plN9J4K1j4k2m7j4J5N2L5pl3k3k4KM7J3K4%m0
3061Gm8pK5K2K3Nj7k3k3j5M6M1jKm2n0J7K0L3J9J5l8j7k7k6K7M9J7J5k3p2K6j7
$$ plain form
2835 -52 -65 -54 12 50 67 8 -36 -85 -65 -41 6 46 40 -3 -79 -75 -81 -15 44 59 17 -12 -40 -65 -40 28 68 77 11 -27 -74 -44
2867 -44 -3 38 66 55 19 -44 -70 -21 27 59 43 32 -18 -89 -50 -11 24 73 28 -15 -58 -71 -34 0 70 47 36 -21 -50 -88
2897 -88 -16 15 53 60 16 -37 -63 -47 2 52 41 34 -26 -39 -44 -18 22 56 81 19 -21 -66 -57 -1 37 45 40 -19 -63 -81 -50 -16 37
2930 37 63 4 -38 -66 -61 -36 23 33 31 10 -59 -60 -40 -19 41 31 19 -32 -72 -64 -18 30 65 43 -4 -31 -40 -55 -1 24 45 11 -21
2963 -21 -42 -70 -34 12 56 40 0 -13 -53 -43 1 23 55 39 -36 -57 -57 -53 8 26 39 12 -22 -70 -58 -37 30 37 26 -2 -50 -70
2995 -70 -57 20 52 55 28 -13 -42 -38 -14 25 39 52 31 -50 -70 -39 0 57 60 35 -18 -36 -31 18 40 52 69 25 -25 -36 -23 4
3027 4 60 49 54 1 -62 -45 -16 11 40 46 14 -41 -48 -51 8 22 43 29 7 -40 -54 -39 13 48 41 8 -15 -39 -37 10 23 47 47 7
3061 7 -41 -48 -23 -1 22 27 10 -13 -36 -51 -5 36 35 37 -5 -55 -38 -18 15 34 49 11 -6 -33 -59 -32 17 34 49 26 -46 -20 -37
3094c7PM6M0l3m2j0k5K4N7K7K7q1Kk2oL0L6M7m3l5k6oML6L5%l3k0o8K2M3RJ7K
3128B4k4m6j9RN9L3Npo4J9k9L6L2J4Km3k7j7%M8L1Lm1K9n0j8K0P0j0j0Kn2OnK6
3163FL7jk4j6k0l6K0L8J6lpk2k8J0NK9J2nl2k2NJL4K3J7k3k2l4J5J0N5J3km8l3
3198c2j9J0K6M8kj3k5j6kj0L1M9lm0k0j2KL2M5nk2l6k2k4K9M1J3J1m9k1MoJ0N9
3232C1mj1k5j2l0K5N2%Jk5j9k0J5K6L9Ook5m5J1mL2OL2om8k3kK1K3LJ2k7m0J5
3267b2%PM9j2kk5l4lJ7L5L0j4j8l7k8RM5L1j0pl3lj3MM3K4j4ll2j8LL3K6K1j1
3302C8j5l0k3K3J9kK2k7k4j9jL8J3Lj0mm3kK3K5K0K1k1o7j4K7J4K4K6k2qk9pj4
3336d6L9K4Kj0k9j1J3j3J7M8J6n0k8K%L7MJ3J4o1j5J1QJ4L7Jj1l8m2PL5K6MK3
$$ plain form
3094 -37 -30 16 56 23 -19 -29 -54 -30 27 54 81 0 2 -20 -26 4 40 87 44 9 -17 -23 -19 17 52 52 19 -1 -69 -47 -4 5 22 24
3128 24 0 -46 -65 -56 3 36 41 34 -30 -11 -40 -4 28 42 44 1 -26 -43 -43 5 36 39 -2 27 -23 -41 -21 49 39 29 31 -21 -15 -20 6
3163 6 43 42 18 2 -18 -54 -34 4 20 17 10 -12 -40 -30 -25 4 16 11 -21 -43 -38 -37 -3 20 37 14 -8 -42 -27 -17 38 51 49 1 -32
3198 -32 -51 -41 -15 33 31 18 -7 -23 -25 -35 -4 45 42 2 -18 -30 -28 4 49 44 22 -14 -36 -60 -31 10 23 34 -15 -36 -32 -38 -28 31
3232 31 27 16 -9 -21 -51 -26 26 26 27 2 -17 -37 -22 4 43 49 43 18 -27 -16 -20 12 18 50 44 -4 -27 -29 -8 15 18 30 3 -37 -22
3267 -22 -22 -15 34 22 20 -5 -39 -42 -25 10 40 26 8 -29 -57 -48 -3 28 18 11 -22 -25 -38 -34 9 33 19 16 -16 -34 -31 2 28 49 38
3302 38 23 -7 -30 -7 12 10 32 5 -19 -38 -39 -1 12 15 5 1 -42 -44 -21 4 24 45 24 -43 -57 -30 -16 8 34 12 4 -25 -32 -46
3336 -46 -7 17 19 9 -20 -31 -18 -31 -14 34 50 0 -28 -26 -26 11 15 28 42 -19 -34 -23 -15 -1 36 37 26 -12 -54 -47 -12 14 18 41
3370D1n7LqQK7J2j3j8j0ok1L2J1L4j9j3k5j5J3K0N5l7Kk2k5NJ8J6J1kk6MqqL0
3405IJ6Pj0j2j9ojK7K1k4qk5J0kNL7kNm5k5j4J5L9nL4l3ml8K6ML9K5j0l2l5J8
3441a3nL8lqj1K2n1RJ9LJ2K5m9rJj4M1j6K1qjk5j2mK9L3pk6j0oj4L5J4Jj1j0k1
3478c1oJ3RM1j4mj5j7nJ9L7%j0ql2OJ3L0J0j1J0k5k2mmJ1M0j1n4K4j8jJ3K6Nj7
3514bj5k3P%N0K2m1Mj4rj6K5J5NRl4k7PJ7J8L4l3Rj7k1klM9L3l2j5l1J6pQN1l0
3551GJ3k0k3rK6lK0j1k6j8QJ0J6MnRk3k8K8J7JL5k8j2ol0L5kJ5K7j3l7jKJ5NJ3
3588A1mj5k1j2L3mlK7%j6rmJK1L6j2Mm0j0kK7jkJ0k3j8mqK3jNJ0l0j6K1K0JJN
3627AJ0j0l5mM3J2K2j4k3m2J8K4kL8j4l5J3j3j1L2PmqNk9j0J9K5J6j5qjl0KL6
$$ plain form
3370 41 -16 -13 -21 -13 14 26 13 -5 -15 -21 -42 -10 1 35 16 3 -22 -37 -24 -4 51 14 16 -6 -31 -26 -8 8 19 17 -9 -5 -13 -21 9
3405 9 25 32 22 10 -9 -15 -16 11 32 8 0 -25 -15 -17 -12 25 23 28 -17 -42 -56 -41 -2 -7 27 -6 -10 -48 -22 -18 21 46 36 4 -31 -13
3441 -13 -18 20 17 9 -2 20 -31 -22 -3 0 12 37 -12 -21 -20 -34 7 -9 12 4 3 -22 -34 -38 -9 24 17 -9 -19 -25 -39 -4 10 11 0 -10 -31
3478 -31 -37 -24 -15 26 12 8 -7 -24 -29 -10 27 27 17 9 -23 -17 -4 26 36 25 35 10 -12 -16 -20 -9 31 20 -34 -10 -28 -29 -16 10 15 -2
3514 -2 -17 -40 -33 -33 17 39 -2 2 -12 -21 -37 -12 3 8 17 -17 -44 -37 -20 -2 32 -1 8 -9 -30 -32 -35 14 47 15 0 -31 -15 -22 -14 37 7
3551 7 20 0 -23 -32 -6 -9 11 0 -26 -44 -36 -26 -10 -6 -11 -2 -25 -53 -25 -8 -7 28 0 -12 -18 -48 -13 -15 0 27 14 -23 -24 -22 -7 -2 11
3588 11 7 -8 -29 -41 -8 -12 -15 12 12 -4 -13 -17 -16 5 41 29 33 -7 -17 -19 8 7 5 15 -8 -26 -30 -38 -15 -16 -11 -1 -31 -47 -26 -6 -5 -4 1
3627 1 11 1 -34 -38 5 17 39 25 2 -40 -22 2 0 38 24 -11 2 -11 -22 10 17 13 5 10 -19 -29 -10 15 31 16 8 7 -23 -21 15
3662A5j2pK3k5j0j5nK5K7lLl1j8J2RQKK2l5PMl1M2Qmjj3%j6K1NK1j1lm2nj0K5
3700a8M3lomm0NJ6J3OJlj1n1QK8J7pjj2j6J7k1M1kK1j4mm3JL4J1K5l2%k6NpL4
3738EK5pJ1l9k6K0MJ5J5Kk4rk3QJ6K4Rjn1j3j8K2M9mJ9k3l4J3k0K5J6JJ5k8qk7
3774d1K3K1J1K0m1pJRNQPjj4pRpK4K5k7J6l5mj0JK5L6l1j2j7k9K0J7J1pMk5k4
3811d6K0OK6K0kk0k8%J0J7J9j1j0Ol1qL3j5J1J9rKl4J4RK3rjj2l0J0nQM1j3qp
3848eMl6M3JL0j4l0Lj8oJ4J6J1k7k2K2k9K5J6J3jk5mqOmL1L3k7j8j8OJ6J5K1j
3884C3j4n1oM3%K5mJ0m5nj0J9NQJ5j1rk7J5K2LMoj8j0pKL0J2j6Pl6njK1QK1k1
3922Ak7J9j5%J9J1M0m7j1k1L2jL2L2k5l1l2J6pK1K4nj8j1l5J9K4OK4j8j4j3m9
$$ plain form
3662 15 3 -4 19 -6 -16 -31 -36 -11 16 13 16 -15 -33 -21 -12 -4 -2 20 -15 -8 -4 -35 7 15 11 10 -3 -3 -19 2 7 28 17 14 -28 -33 -43 -18
3700 -18 25 22 16 12 -28 -23 -7 6 12 13 10 -1 -52 -44 -16 1 -6 -7 -19 -35 -18 -39 2 0 21 7 3 -40 -39 -5 6 31 -1 -1 -27 -22 -29 5
3738 5 30 23 34 -5 -31 -11 -7 8 23 25 1 -8 -31 -23 -7 17 26 25 -26 -39 -57 -35 14 10 29 6 -28 -15 -35 -10 6 7 22 -6 -14 -41
3774 -41 -18 3 14 34 -7 -14 -13 -4 1 9 16 15 1 -6 3 -4 20 45 18 34 -1 -5 -15 -14 11 47 16 4 -13 -42 -22 -5 6 -1 3 -22 -46
3811 -46 -26 -20 6 26 24 4 -24 -24 -14 3 22 11 1 7 -24 -32 1 -14 -3 16 7 9 -25 -11 -2 21 12 11 -1 -31 -21 -26 -18 23 10 2 -5
3848 -5 -1 -37 6 7 37 23 -7 -4 -22 -28 -14 2 13 -14 -36 -14 -43 -18 -2 11 10 -15 -19 -27 -21 -25 6 39 12 -6 -24 -18 -2 13 34 33
3884 33 19 -32 -38 5 5 30 26 36 -9 -14 -24 -5 0 8 23 12 3 -24 -9 13 16 20 14 -4 -14 -21 -19 11 23 7 14 -22 -27 -28 -7 1 22 1
3922 1 -26 -7 -22 -22 -3 8 48 1 -10 -31 1 0 32 64 39 8 -24 -8 -15 6 30 25 7 -4 -39 -20 4 10 34 16 2 -11 -60
3955f0L9KL7J6k6mok4ON7m%m7rj5K9ML6Lj4kl9k4N0lJ5K4l5mj7j7L6MJ9K2k5o0
3992c6J8pK4K7ok3j6j8J5K0JJ6j8lj7j7mL5L1ok6knj3L2NK7j1m3oJ2j4M0pK5J7
4028D7n6k0%J9J9L5rk4k1l2K3K6J5Krk4k6K9jK3KJ5j2m6j9J7PL0J2j3m1k2J7J3
4062b4PM2k5kJj4j3K0L2lJ9m1J3l0K4RRKj5l7LpJ6J3J1K4k8k4j5K7KQOK1n2j0
4098c1KJ1K8J5nQl9l1KL1K1Rk0k7jrK0J1M4rql9j9%K9O6l2j1k0j2qLL7L0k9K2
4134C9l0l7LqL1K5%l0j4qmL0J4K5k0l6j1QqM4NKk2j1j3rM6j0K3j0jm8JRK5J7k
4171A5j8j4j5jJ2L0J1%j8j3qj1N4NOj3m2j%JK9J9k0k1j3l9L4K8L6j0l7jj9k1L3
4206b2K7K6l7J5k9k1K1J4K3kj1j8j2QJ8J3K1j2j7k2rkM2J1Kkk0k9kQM5J3ol9k9
$$ plain form
3955 -60 -21 -19 18 34 8 4 -2 -26 -20 37 33 33 -14 -23 -38 -9 -5 31 34 20 18 -21 -45 5 2 17 41 6 2 -15 -32 4 8 27 49 24 -36
3992 -36 -18 -25 -1 26 20 -3 -19 -37 -22 -2 -1 15 -3 -6 -23 -40 -44 -9 22 16 -10 -12 -17 -30 2 7 34 23 -20 -26 -14 -28 12 5 30 47
4028 47 -9 -29 -29 -10 9 44 35 11 -10 -42 -19 7 22 24 15 -9 -35 -6 -7 16 18 33 21 -25 -44 -27 -20 10 22 9 -32 -54 -37 -24
4062 -24 -17 25 0 -2 -1 -15 -28 -8 24 21 40 -1 12 -18 6 15 24 26 11 -26 -23 -30 -14 -1 10 34 6 -18 -33 -6 -4 4 10 31 -21 -31
4098 -31 -29 -18 10 25 20 28 -11 -42 -40 -9 12 21 1 -26 -27 -36 -16 -5 39 30 22 -17 -36 -36 -7 59 27 16 -4 -16 -24 -21 16 46 17 39
4134 39 9 -28 -25 -33 -2 23 23 -7 -21 -29 -33 -3 11 36 16 -20 -31 -23 -31 13 18 20 -2 -13 -26 -35 11 1 24 14 13 -35 -34 -25 0 17 15
4171 15 -3 -17 -32 -33 -21 9 20 20 2 -11 -19 -30 24 29 35 22 -20 -21 -21 -20 9 28 8 -13 -26 -65 -31 -3 33 23 -14 -15 -34 -55 -22
4206 -22 5 31 -6 9 -20 -41 -20 -6 17 15 4 -14 -26 -18 0 13 34 22 5 -17 -26 -28 14 25 27 25 5 -24 -26 -18 27 40 34 -5 -34
4241c4%L1j1L9orj9k3k5L2J3K3L0l8j8l5PK7K2Kkmk3k0M2RM5qk8m3oKK2J1J3L
4277B1l4j7pJ9K2K5J3k7m6l2J9QL8K6j6k1j4k3J5J6L7Oj1l8j8lN2J6j0%k5j3j8
4310d0NK7K8K0l0k5ll5N5QM8k5k0l4ljM6L0j6qj5l3j7K6J4M6l3On7MPnM8J9j0
4345B7l3Ll9J3N0J6j4k6k8j0NK8K0JJ6j9l4k7K6K1N6%m9qln3M4L9Poj3k3qK0Q
4380GL3lj3l5j4oQK6L1j7j0m0oJK5K1J3k5kk6K0kK9K0j2j3Jl5J1NJ7K3k4qj2l3
4416d5L3L3LJ9k1m4J1j6J7L3J0pj3k6J2k3K9L3rql8j1kJ7K5K2Nn3l6J6K3LK2K2
4450C6lm3mj9OK6L9Jl3k1JoJ8L3J4%m5j7j7J5L0K9j7km6pLK2L6J1j3k2k2rJ1K6
4486A1K0J7l5k0j9j5M3K1K2k6l2l0kL8J8PJ6k0l4j2pL6PJ7olj6p%J5L3RNm6l6
$$ plain form
4241 -34 -34 -3 -14 25 19 10 -9 -32 -57 -25 -12 11 41 3 -15 -50 -43 -16 6 8 6 2 -21 -41 1 10 55 47 19 -24 -30 -28 -6 5 18 21
4277 21 -13 -30 -37 -18 4 29 42 15 -31 -63 -44 -36 2 28 12 -9 -23 -46 -31 -15 22 28 17 -21 -39 -42 10 26 16 16 -9 -22 -40
4310 -40 -35 -8 20 40 10 -15 -18 -53 2 10 58 33 13 -21 -24 -25 21 51 35 27 12 -21 -38 -12 2 48 15 21 -36 -32 -25 -30 18 37 27
4345 27 -6 -3 -42 -29 21 37 23 -3 -31 -41 -36 -8 12 13 29 10 -24 -51 -25 -4 52 52 3 -5 -8 -61 -17 22 29 23 10 -13 -21 -1 7
4380 7 40 37 24 -11 -25 -31 -23 3 34 17 7 -33 -39 -38 -13 8 21 -4 -6 -32 -12 -14 15 35 23 10 11 -24 -13 -8 9 32 8 0 -12 -45
4416 -45 -12 21 24 43 22 -22 -11 -27 -10 23 33 26 13 -13 -1 -24 5 38 29 21 -17 -28 -30 -13 12 34 39 -14 -50 -34 -11 -8 14 36
4450 36 33 -10 -14 -33 -27 -1 38 39 6 -15 -14 -20 -2 31 45 45 0 -17 -34 -19 11 40 23 21 -25 -32 -29 -7 29 40 27 5 -17 -26 -15 11
4486 11 31 48 13 -7 -26 -41 2 23 45 19 -13 -43 -45 -7 11 18 34 14 -20 -32 -39 -3 4 21 15 12 -4 -11 -11 4 37 46 51 5 -31
4521c1J4K1K6Mjm7orJ0K6K7jk0k1nj6oN1K3Lk9l4%k0K9L4Lj0l9nj7PM9L3j3jl7
4558hk3RK1J5NL4m5k3KnN1J5mk2l2jNLJ7J5qj5qm0K3K0K0j1Jk0k7j1N6j9L2Pl2
4595cJ0l4J7J9J0J2j7j8j5QMJ4L3rk4k9j2J7K5L7J5k6l4k7LJ2K1J9jj5j0mk7K0
4629iM1JNl7k2k5K8lM4j5j2k5kJ9K4ORMk2j8j5J6J0K5Kj4l2PL%K5J9%k6l6JrM6
4667A3JJ5jj0j6m5L0J7M6nm1j9nnJ7M3J0k7k4k9j1K4K9j2K3l1jl4M1pK6PLk8j2
4702a8j2J4PL8lj6j5k0K5j3L0J3J8k9o4K1j5J0N3j0Rm8j2K2KnM8k4j1rmLJ5K7
4736B7j6pl4J6k4K6K2J5jlm9qJ4J7OK2kj1m0NJ1mL4J5j1k3qQJ0J4J2%k5l1l0K3
4772c0K0ROJj8j1k1L4J5J5k3pk4KmL2K0lrkl7lK1M1J6l4j8j8j3%N0J1J1oj0m7
$$ plain form
4521 -31 -17 4 30 34 33 -14 -20 -29 -19 7 34 33 13 -8 -13 -29 -35 16 39 42 13 -21 -21 -41 -12 22 25 15 -24 -29 -46 -39 10 43 30 29 -8
4558 -8 -31 -22 -1 14 19 53 8 -15 -13 -18 33 48 44 22 -10 -11 -6 -3 14 29 21 6 -2 -42 -19 1 21 10 11 -9 -36 -47 9 -10 22 29 -3
4595 -3 7 -27 -10 9 19 31 14 -4 -19 -11 -7 7 40 31 7 -22 -34 -17 8 45 60 34 0 -27 -24 -12 9 28 27 12 2 -2 -29 -9
4629 -9 32 33 38 1 -21 -46 -18 -21 23 8 -4 -29 -31 -12 12 18 27 31 9 -9 -24 -8 2 27 29 15 -17 -10 -7 -7 18 37 37 11 -25 -24 -33 13
4667 13 14 29 28 18 2 -43 -13 4 50 45 4 -15 -20 -25 -8 35 45 18 -6 -35 -46 -22 7 -5 18 -13 -14 -48 -7 -14 12 19 22 -6 -18
4702 -18 -30 -16 -9 29 26 10 -5 -25 0 -13 17 30 48 19 -45 -24 -39 -29 24 14 23 -25 -37 -15 -13 -18 30 6 -5 -14 -18 -15 0 27
4736 27 11 4 -30 -14 -38 -12 10 25 24 21 -28 -36 -22 -5 1 23 21 10 -30 -25 -14 -18 16 31 20 -3 -11 -3 7 21 33 33 8 -23 -53 -30
4772 -30 -10 -1 5 6 -12 -23 -44 -10 5 20 -3 -10 -34 -32 -36 -4 16 13 4 2 -35 -38 -17 24 40 6 -12 -30 -43 -43 7 18 29 23 13 -34
4808c4K4K1K6j2J2k7j5k2J4K1LK2l9Jj4JjJ5L4Kk5l4nRML5j0Jj6j6%ML2J7k6M
4844Fj9j6L7qK2J7j2Ll0k7PK7J0J7k2k7j5OL1K7mpj0%k5nJ9K9jk2j8k2J2%L4J8
4880C2j0k9nl3J7NL3kOj2j7j3J4MOL6j0k2rQrL8J3j0qk3k2OL3M0k0okm1j1L3Q
4917A8J5j5k5Nj6%K3NM2k7ml4j1J1K7K2j5l2Lj1jM7j2J0j3j3l5J1K3kL8k0Mj9
4951ak2PkK9L0j7k7KOj5K7k%Jrm3JJ7J8J7j5j7nQj0OL1J9l4rj8nK1M1k2Lj3l5
4989c7pK7K2J7J0k1l6mJ0LN3k1NQk7l4kK4K4K0l1Nl2JK1L3J0k0j8k4j0rL2J7J2
5024B1k4Ml9LRK1J9Mk3k9J3OlL2J0Lqj6k4K2J4J1K2n0k2jOK0K7qKk4qk4K9QK7
5061C0mKl2PpK5KJ2k2J0k6j9PK5PPl3k7Rj4J6M5j3J1mm7J0LJ8K7j1J6l0j3KJ7
$$ plain form
4808 -34 -10 11 37 25 37 10 -5 -27 -13 8 11 33 -6 -5 -19 -18 -19 -4 30 32 7 -27 -32 -23 -19 16 6 7 -9 -25 -25 -21 11 28 2 6
4844 6 -13 -29 8 0 22 39 27 30 0 -27 -20 7 17 34 12 -15 -30 -24 7 34 30 23 13 13 -12 -17 2 31 30 8 -10 -32 -20 -20 14 32
4880 32 22 -7 -12 -45 -28 -23 10 8 14 2 -15 -28 -14 -10 -4 32 22 0 -9 -1 -10 28 41 31 23 0 -22 -16 17 57 37 31 29 -12 -23 10 18
4917 18 33 18 -7 -2 -18 -18 5 10 52 25 21 -13 -24 -13 14 36 21 -11 -8 -19 -20 27 15 25 12 -1 -36 -25 -2 -4 34 14 18 -1
4951 -1 -23 -16 -18 11 41 24 -3 -1 5 -10 17 15 15 16 7 -36 -35 -18 0 17 2 -15 -20 -12 -22 -16 15 34 0 -9 -27 -32 -11 30 8 11 -2 -37
4989 -37 -44 -17 5 22 32 11 -25 -29 -19 -16 37 16 21 29 2 -32 -34 -10 14 34 3 8 -24 -23 -2 31 41 21 3 -21 -31 -40 -8 9 21
5024 21 -3 1 -38 -35 -26 -5 14 18 -5 -34 -21 -15 -18 14 24 27 19 3 -21 1 15 26 48 -2 -24 -25 -19 1 28 20 22 -2 -10 -34 -5 3 30
5061 30 26 28 -4 3 -4 21 23 35 13 23 -3 -22 -15 10 17 24 -9 -36 -27 -41 -25 20 7 18 14 -33 -23 -20 -2 25 14 30 0 -13 -11 6
5097FJ3QL0n6nmkmN6k3l5L5o5J4K3K7Mj8Nm5pK6RL3k8J6j7k7J1pK9mpRj2j4j0
5134c6J3K0J5Ll3k5J2K4PK6Nj7Kk3J6kJ2jJ3j8j5Rj2L0jMj8j5k1qJ3J1K2rjpr
5171a4j0K7j0J5lj2k4kK2J2J6Qk4j5k2ML6J0K1l9pNl9L1K4J0%j2rj7j1L8J6j4
5205A1%J2k2l0K3J8J5kl3mnj3K8PmPok6JlM0kJqJrj5J5RK2J0k0k3k2J6J4J7J1
5243C1k0lk1J0Qj6L4oj2orK4%Qj0J9l8JqNK2J4mk2k5Pj%K4j1OJ5l2k3L0K0j3K3
5281B1k5j5j2K0KL1K2l8jo%j9L5rM3m2nk3J4%J7K4qj2k8j0K8K5Nl9J8k1pNQPK7
5318C2j1l3Jl6L1J1lNk%k0oJ5kK2J0l8MQpK4M7j0k2j9J5l4K6NJ3j7Ok1J1JqL9
5355C7rk3j3lk1K9J0J3j2j3j9nMK7jJ1j7Rn9K9J6J7J6k0Oj8qqM1k1J2Nlk1J0J8
$$ plain form
5097 6 19 27 57 1 -4 -8 -10 -14 42 19 -16 19 -46 -32 -9 18 22 4 9 -36 -43 -17 -8 25 -3 13 -4 -31 -20 -27 2 -2 -9 0 -12 -26 -36
5134 -36 -23 -3 12 15 -18 -43 -31 -7 0 26 31 14 16 -7 9 7 19 18 31 13 -2 7 -5 25 24 28 10 -5 -26 -34 -21 -10 12 3 2 -5 -14
5171 -14 -24 3 -7 8 5 -7 -31 -33 -11 1 17 25 1 -14 -36 -32 4 14 35 -4 -11 -6 -45 -14 10 20 20 8 -1 -18 -29 9 25 11
5205 11 11 23 1 -29 -6 12 27 25 -8 -12 -17 -30 -2 5 1 8 2 -24 -23 -26 14 12 13 5 6 -3 -18 -3 6 28 38 18 -5 -27 -11 3 20 31
5243 31 11 8 -13 -3 5 -11 23 17 5 -1 -10 14 14 22 12 31 -7 -6 -14 -9 13 27 23 1 -24 -17 -18 -18 6 -5 1 16 -16 -39 -9 11 -2 21
5281 21 -4 -19 -31 -11 -9 22 44 6 5 -1 -1 -20 15 6 49 7 2 -21 -7 -7 10 34 26 14 -14 -24 4 29 34 -5 13 -8 -15 -10 -2 5 32
5318 32 21 -12 -11 -47 -16 -5 -8 -3 -5 -5 -25 -31 -16 -18 4 14 -24 -20 -12 -19 5 52 42 20 1 16 -18 8 13 26 9 15 -6 5 6 -2 37
5355 37 28 5 -8 -11 -32 -3 7 20 8 -5 -24 -29 -25 2 1 12 -5 4 -55 -26 -10 7 23 3 9 -9 -17 -25 16 -5 7 12 9 -12 -2 16
5391A6j1MK7%k8j9j3L0OJ2j0J2j1j6%J1rK4j2pj7k0KK7OPok7nj1K7QK3j9J7j8
5427@lj2K5j2L5pl7mMJ9jK5j7rk3NK2pjK1ml2qJ8PNoKNnj1j7M7l4J9k5J0k1rJ6
5467b0J3K5j8k1OoRjj0N4k8k3K3rlJ4J9j6rOljLQOj2J2j1l1PJ0K7j1Kk8QqJ9J0
5506A2J0rNj4l4J1J7K0pk3J2j1j5J1K1N%j0k3K0j8J8K6k6J8oj6OJ1J2J0k1J1j1
5540A2jj4JJ1J7k6J5j8l6K2RJ0j5J4mj3J1j5J3MJ3pk3L%J4K8k0k2J6k0jRK0l0
5575b3M1ql0qLK5J5j2pKk7K0L2Pl3K8Qo7L1KJ1Kj1J8l2k2K3LJ1Jj5j2QOj1K3M
5612Fj8NNl1KOL6pLoL%j4J9pL6l8Mrj3K1%J4j4%j5pJ9qJ0K2k3J4j2Pj5kK6k7K4
5652A6k0j7J2j7K3nJ5j5m2J7k2N2KMOk7j2jJ6L9j4j7kKj2K0Oj%%qj3L%K0J2kq
$$ plain form
5391 16 5 9 36 36 8 -11 -24 6 12 24 14 26 15 -1 -1 10 1 25 13 6 -11 -31 -29 -2 4 11 5 -22 -27 -38 -11 -3 20 1 18 0
5427 0 -3 -15 10 -2 33 26 -11 -15 -11 8 7 32 15 6 -17 -12 10 3 2 23 19 -13 -21 -3 4 9 3 5 10 5 -6 -23 24 -10 9 -16 -6 -27 -36 -20
5467 -20 -7 18 0 -21 -15 -21 -12 -13 -23 31 3 -20 3 -6 -9 5 24 8 -1 5 2 1 4 12 18 6 18 7 -24 -17 -7 20 9 11 -17 -9 -17 2 12
5506 12 22 13 18 4 -30 -19 -2 18 11 -12 0 -11 -26 -15 6 11 11 1 -22 -2 -20 -2 24 -2 16 10 -6 0 11 23 33 12 23 12
5540 12 11 -3 -2 9 26 0 15 -3 -39 -17 -8 2 -13 1 -3 -16 -5 -20 -7 -3 10 3 -20 -17 -17 -3 25 5 -17 -1 -21 -22 -13 7 -23
5575 -23 18 10 -20 -28 -25 0 15 3 -4 -2 -29 -9 23 30 -3 25 33 -34 -3 -1 10 12 1 19 -13 -35 -12 -9 2 3 -12 -24 -16 -10 -21 2 6
5612 6 -12 -7 -2 -33 -31 -25 11 4 7 1 4 4 -10 9 2 38 0 4 -5 -18 3 3 17 3 3 -12 -19 0 -8 2 24 1 15 3 10 -5 -7 19 -8 16
5652 16 -4 -21 -9 -26 -3 -8 7 -8 -50 -33 -55 -3 -1 3 9 -18 -30 -31 -15 24 10 -7 -9 -7 -19 1 7 6 6 6 -2 -15 -12 -12 8 20 18 10
$$ [...]
8191h
##END NTUPLES=NMR FID
##END=
