##TITLE=H1
##JCAMPDX= 6.0         $$ Bruker NMR JCAMP-DX V2.0
##DATA TYPE= NMR SPECTRUM
##DATA CLASS= NTUPLES
##ORIGIN= UXNMR, Bruker Analytische Messtechnik GmbH
##OWNER= root
$$ XWIN-NMR		Version 3.5
$$ Mon Feb 22 10:37:31 2016 Russian Standard Time (UT+4h)  servis@DPX200
##.OBSERVE FREQUENCY= 200.131235884673
##.OBSERVE NUCLEUS= ^1H
##.ACQUISITION MODE= SIMULTANEOUS
##.ACQUISITION SCHEME= undefined
##.AVERAGES= 32
##.DIGITISER RES= 18
##SPECTROMETER/DATA SYSTEM= spect
##.PULSE SEQUENCE= zg
##.SOLVENT NAME= DMSO
##.SHIFT REFERENCE= (INTERNAL, DMSO, 0, 17.6849)
##AUDIT TRAIL= $$ (NUMBER, WHEN, WHO, WHERE, WHAT)
$$ ##TITLE= Audit trail, XWIN-NMR		Version 3.5
$$ ##JCAMPDX= 5.01
$$ ##ORIGIN= Bruker BioSpin GmbH
$$ ##OWNER= servis
$$ F:/spectra/data/servis-vadim/nmr/H1/1/pdata/1/auditp.txt
$$ ##AUDIT TRAIL=  $$ (NUMBER, WHEN, WHO, WHERE, WHAT)
(   1,<2016-02-22 10:36:21.09 +0400>,<servis>,<DPX200>,
      <created by zg, POWCHK disabled, PULCHK disabled
       configuration hash MD5:
       00 E9 B6 7A A2 85 ED C7 34 08 36 98 17 FE 4E 26
       data hash MD5: 16K
       08 58 28 EE 44 2E E6 12 A2 16 EA 92 5E DE 51 5C>)
(   2,<2016-02-22 10:36:26.04 +0400>,<servis>,<DPX200>,
      <Start of raw data processing
       efp BC_mod = 2 LB = 0.3 FT_mod = 6 PKNL = 1 PHC0 = -30.24149 PHC1 = -0.3563094 SI = 32K 
       data hash MD5: 32K
       86 46 39 04 71 23 7E 45 2A DF 45 7B 45 B8 A3 8B>)
$$ ##END=
$$ 
$$ hash MD5
$$ D1 09 E7 B4 F6 49 75 BB 9F F5 B2 53 A1 12 DC B4
##$RELAX= 
##$RELAX= 
##$RELAX= 
##$RELAX= 
##$RELAX= 
##$RELAX= 
$$ Bruker specific parameters
$$ --------------------------
##$DU= <F:/spectra>
##$EXPNO= 1
##$NAME= <H1>
##$PROCNO= 1
##$TYPE= <nmr>
##$USER= <servis-vadim>
##$AMP= (0..31)
100 100 100 100 100 100 100 100 100 100 100 100 100 100 100 100 100 100 
100 100 100 100 100 100 100 100 100 100 100 100 100 100 
##$AQSEQ= 0
##$AQ_mod= 1
##$AUNM= <au_zg>
##$AUTOPOS= <>
##$BF1= 200.13
##$BF2= 200.13
##$BF3= 200.13
##$BF4= 200.13
##$BF5= 500.13
##$BF6= 500.13
##$BF7= 500.13
##$BF8= 500.13
##$BYTORDA= 1
##$CFDGTYP= 0
##$CFRGTYP= 5
##$CHEMSTR= <none>
##$CNST= (0..31)
1 1 145 1 1 1 1 1 1 1 1 1 1 1 1 1 1 1 1 1 1 1 1 1 1 1 1 1 1 1 1 1 
##$CPDPRG= <>
##$CPDPRG1= <>
##$CPDPRG2= <>
##$CPDPRG3= <>
##$CPDPRG4= <mlev>
##$CPDPRG5= <mlev>
##$CPDPRG6= <mlev>
##$CPDPRG7= <mlev>
##$CPDPRG8= <mlev>
##$CPDPRGB= <>
##$CPDPRGT= <>
##$D= (0..31)
0 1 0 0 0 0 0 0 0 0.06 0 0 0 0 0 0 0.0002 0 0 0 0 0 0 0 0 0 0 0 0 0 0 
0 
##$DATE= 1456122980
##$DBL= (0..7)
120 120 120 120 120 120 120 120 
##$DBP= (0..7)
150 150 150 150 150 150 150 150 
##$DBP07= 0
##$DBPNAM0= <>
##$DBPNAM1= <>
##$DBPNAM2= <>
##$DBPNAM3= <>
##$DBPNAM4= <>
##$DBPNAM5= <>
##$DBPNAM6= <>
##$DBPNAM7= <>
##$DBPOAL= (0..7)
0.5 0.5 0.5 0.5 0.5 0.5 0.5 0.5 
##$DBPOFFS= (0..7)
0 0 0 0 0 0 0 0 
##$DE= 6
##$DECBNUC= <off>
##$DECIM= 32
##$DECNUC= <off>
##$DECSTAT= 4
##$DIGMOD= 1
##$DIGTYP= 9
##$DL= (0..7)
0 120 120 120 120 120 120 120 
##$DP= (0..7)
150 150 150 150 150 150 150 150 
##$DP07= 0
##$DPNAME0= <>
$$ [...]
##$SUBNAM3= <"">
##$SUBNAM4= <"">
##$SUBNAM5= <"">
##$SUBNAM6= <"">
##$SUBNAM7= <"">
##$SUBNAM8= <"">
##$SUBNAM9= <"">
##$SW= 20.6817932712277
##$SWIBOX= (0..15)
0 0 3 0 0 0 0 0 0 0 0 0 0 0 0 0 
##$SW_h= 4139.07284768212
##$TD= 16384
##$TD0= 1
##$TE= 0
##$TE2= 300
##$TE3= 300
##$TEG= 300
##$TL= (0..7)
0 120 120 120 120 120 120 120 
##$TP= (0..7)
150 150 150 150 150 150 150 150 
##$TP07= 0
##$TPNAME0= <>
##$TPNAME1= <>
##$TPNAME2= <>
##$TPNAME3= <>
##$TPNAME4= <>
##$TPNAME5= <>
##$TPNAME6= <>
##$TPNAME7= <>
##$TPOAL= (0..7)
0.5 0.5 0.5 0.5 0.5 0.5 0.5 0.5 
##$TPOFFS= (0..7)
0 0 0 0 0 0 0 0 
##$TUNHIN= 0
##$TUNHOUT= 0
##$TUNXOUT= 0
##$USERA1= <user>
##$USERA2= <user>
##$USERA3= <user>
##$USERA4= <user>
##$USERA5= <user>
##$V9= 5
##$VALIST= <valist>
##$VCLIST= <CCCCCCCCCCCCCCC>
##$VD= 0
##$VDLIST= <DDDDDDDDDDDDDDD>
##$VPLIST= <PPPPPPPPPPPPPPP>
##$VTLIST= <TTTTTTTTTTTTTTT>
##$WBST= 1024
##$WBSW= 4
##$XGAIN= (0..3)
0 0 0 0 
##$XL= 0
##$YL= 0
##$YMAX_a= 44699
##$YMIN_a= -45414
##$ZGOPTNS= <>
##$ZL1= 120
##$ZL2= 120
##$ZL3= 120
##$ZL4= 120
##$ABSF1= 0
##$ABSF2= 0
##$ABSG= 0
##$ABSL= 0
##$ALPHA= 0
##$AQORDER= 0
##$ASSFAC= 0
##$ASSFACI= 0
##$ASSFACX= 0
##$ASSWID= 0
##$AUNMP= <proc_1d>
##$AZFE= 0.1
##$AZFW= 0.1
##$BCFW= 0
##$BC_mod= 2
##$BYTORDP= 0
##$COROFFS= 0
##$CY= 18.4799938201904
##$DATMOD= 1
##$DC= 0
##$DFILT= <>
##$DTYPP= 0
##$F1P= 9.9274215381318
##$F2P= -0.165520771350173
##$FCOR= 1
##$FTSIZE= 32768
##$FT_mod= 6
##$GAMMA= 0
##$GB= 0
##$INTBC= 1
##$INTSCL= 1
##$ISEN= 128
##$LB= 0.3
##$LEV0= 0
##$LPBIN= 0
##$MAXI= 10000
##$MC2= 0
##$MEAN= 0
##$ME_mod= 0
##$MI= 50
##$NCOEF= 0
##$NC_proc= -7
##$NLEV= 6
##$NOISF1= 3.799351
##$NOISF2= 2.8
##$NSP= 0
##$NTH_PI= 0
##$NZP= 0
##$OFFSET= 17.68489
##$PC= 4
##$PHC0= -30.24149
##$PHC1= -0.3563094
##$PH_mod= 1
##$PKNL= yes
##$PPARMOD= 0
##$PSCAL= 4
##$PSIGN= 0
##$REVERSE= no
##$SF= 200.129766148193
##$SI= 32768
##$SIGF1= 3
##$SIGF2= 2
##$SINO= 400
##$SIOLD= 16384
##$SREGLST= <1H.CDCl3>
##$SSB= 0
##$STSI= 32768
##$STSR= 0
##$SW_p= 4139.07284768211
##$SYMM= 0
##$S_DEV= 0
##$TDeff= 16384
##$TDoff= 0
##$TI= <>
##$TILT= no
##$TM1= 0
##$TM2= 0
##$TOPLEV= 0
##$USERP1= <user>
##$USERP2= <user>
##$USERP3= <user>
##$USERP4= <user>
##$USERP5= <user>
##$WDW= 1
##$XDIM= 32768
##$YMAX_p= 410054826
##$YMIN_p= -917874
$$ End of Bruker specific parameters
$$ ---------------------------------
##NTUPLES= NMR SPECTRUM
##VAR_NAME=  FREQUENCY,     SPECTRUM/REAL,   SPECTRUM/IMAG
##SYMBOL=    X,             R,               I
##VAR_TYPE=  INDEPENDENT,   DEPENDENT,       DEPENDENT
##VAR_FORM=  AFFN,          ASDF,            ASDF
##VAR_DIM=   32768,         32768,           32768
##UNITS=     HZ,            ARBITRARY UNITS, ARBITRARY UNITS
##FACTOR=    0.126318333923829, 1,           1
##FIRST=     3539.27304956752, 0,            0
##LAST=      -599.799798114586, 0,           0
##MIN=       -599.799798114586, -917874,     0
##MAX=       3539.27304956752, 410054826,    0
$$ Real data points
##PAGE= N=1
##DATA TABLE= (X++(R..R)), XYDATA
$$ [...]
$$ plain form
15644 2822 17054 17863 8643 4411 5709 1868 -6177 -7072 -735 -1111 -15742 -34788 -42723 -34763 -21872
15629 -21872 -22038 -42637 -69750 -81490 -73248 -61123 -59073 -63541 -63482 -54438 -39452 -26453 -25975 -39377
15615 -39377 -49866 -40832 -22535 -20849 -38460 -51279 -48335 -47825 -62314 -75525 -71210 -60496 -59319
15602 -59319 -60162 -50229 -39615 -45359 -61041 -67177 -60169 -47147 -25093 7501 29061 16015 -19244
15589 -19244 -40814 -37684 -31393 -35962 -40130 -34088 -25891 -22334 -17380 -9820 -11559 -27020 -41546 -41178
15575 -41178 -30017 -19690 -15061 -16994 -24905 -29921 -20393 -1286 6933 -3815 -17878 -20605 -17939
15562 -17939 -20516 -24259 -21024 -15576 -16464 -19538 -15548 -6961 -3198 -4644 -3996 1258 9112 20476 34491
15547 34491 41503 34000 21513 20853 31926 36517 23893 6356 3876 20469 41788 52692 52046
$$ packed form
15644B822J4232Q09r220m232J298l841q045q95O337l76j4631j9046p935P960J2891
15629b1872j66k0599k7113j1740Q242J2125K050m468N9R044J4986J2999M78j3402
15615c9377j0489R034J8297J686j7611j2819K944N10j4489j3211M315J0714J177
15602e9319q43R933J0614n744j5682o136P008J3022K2054L2594K1560j3046l5259
15589a9244k1570L130O291m569m168O042Q197L557M954P560j739j5461j4526L68
15575d1178J1161J0327M629j933p911n016R528J9107Q219j0748j4063k727K666
15562a7939k577l743L235N448q88l074L990Q587L763j446O48N254P854J1364J4015
15547C4491P012p503j2487o60J1073M591j2624j7537k480J6593K1319J0904o46
$$ plain form
15534 52046 49957 53263 57244 53882 45221 41671 46384 49443 42348 32001 33217 50062 70835 81185
15520 81185 78359 72085 72762 79044 79168 66725 50551 42126 37526 23744 2066 -9414 -567 17248
15506 17248 29027 34353 39159 42208 41681 44442 55185 64793 63368 57077 56809 57074 44405 23392
15492 23392 14895 27038 45585 56745 63000 70244 74699 72117 68130 68576 67784 57360 41553 33433
15478 33433 37392 43815 42012 32920 26669 29637 36198 34984 23327 11753 11143 19436 26716 30033
15464 30033 34805 42553 46572 41737 30869 19128 9524 6504 15418 33071 45595 42570 29570
15451 29570 20820 21888 24989 20311 7501 -4683 -7941 -2733 3081 3717 1207 -130 -1237 -5307
15437 -5307 -9716 -7829 1460 12400 20777 27203 31660 32087 30062 31091 36890 43219 46877 48656 48568
$$ packed form
15534E2046k089L306L981l362q661l550M713L059p095j0347J216J6845K0773J0350
15520H1185k826o274O77O282J24j2443j6174q425m600j3782k1678j1480Q847J7815
15506A7248J1779N326M806L049n27K761J0743R608j425o291k68K65j2669k1013
15492B3392q497J2143J8547J1160O255P244M455k582l987M46p92j0424j5807q120
15478C3433L959O423j803r092o251K968O561j214j1657j1574o10Q293P280L317
15464C0033M772P748M019m835j0868j1741r604l020Q914J7653J2524l025j3000
15451B9570q750J068L101m678j2810j2184l258N208N814O36k510j337j107m070
15437e307m409J887R289J0940Q377O426M457M27k025J029N799O329L658J779q8
$$ plain form
15422 48568 45934 45594 54722 70109 78083 72071 61352 56522 55428 51291 46068 45247 45224 37286 21921
15407 21921 9520 7284 12750 19641 23732 23351 19413 15050 12283 10599 10076 11076 8970 -2754
15393 -2754 -19340 -24145 -9726 9056 14194 9351 11495 22846 27999 18942 6881 5471 15348
15380 15348 29591 42572 48392 42109 29095 23323 29605 36646 34740 30718 35938 47708 54403
15367 54403 53861 54182 57965 58020 50735 43563 44390 50095 51404 45765 39827 39252 40224 33940 18885 5358
15351 5358 5047 17437 30464 34949 33838 35148 40405 44580 44732 43063 41479 38147 31476 24253 20945
15336 20945 22492 26848 34169 47343 64963 77116 73655 56808 40234 33532 32808 30109 26597
15323 26597 29456 38792 46012 45580 41127 37927 35544 31412 27298 28092 35835 47037 54764 53268 43279
$$ packed form
15422D8568k634l40R128J5387P974o012j0719m830j094m137n223q21k3p938j5365
15407B1921j2401k236N466O891M091l81l938m363k767j684n23J000k106j1724
15393b754j6586m805J4419J8782N138m843K144J1351N153r057j2061j410R877
15380A5348J4243J2981N820o283j3014n772O282P041j906m022N220J1770O695
15367E4403n42L21L783N5p285p172Q27N705J309n639n938n75R72o284j5055j3527
15351E358l11J2390J3027M485j111J310N257M175J52j669j584l332o671p223l308
15336B0945J547M356P321J3174J7620J2153l461j6847j6574o702p24k699l512
15323B6597K859R336P220m32m453l200k383m132m114P94P743J1202P727j496r989
$$ plain form
15308 43279 33302 32587 41482 50981 52794 48053 45386 51605 64446 74320 74608 69659 68495 70663 66068
15293 66068 52042 41055 44076 55248 63313 69349 79228 86275 79650 65868 61615 66011 61963
15280 61963 47499 41880 53179 63447 58188 48709 49881 55944 56586 58326 68579 75005 65124 52888
15266 52888 58831 74034 73199 57728 54859 73858 92881 94426 87115 84398 85239 85358 87317 90428
15252 90428 88849 86597 95085 109119 107366 86264 70857 78784 94776 96770 87815 83762 86032
15239 86032 86341 85384 88257 92505 96988 109952 131642 143272 132745 117428 119464 131545 132091 123101
15225 123101 124315 136540 140886 133171 130649 141886 155003 159445 157240 150472 139461 134118 143673
15212 143673 155022 147414 129021 128721 148767 160010 151225 145256 153596 156987 152157 171477 219381
$$ packed form
15308D3279r977p15Q895R499J813m741k667O219J2841R874K88m949j164K168m595
15293F6068j4026j0987L021J1172Q065O036R879P047o625j3782m253M396m048
15280F1963j4464n619J1299J0268n259r479J172O063O42J740J0253O426r881j2236
15266E2888N943J5203q35j5471k869J8999J9023J545p311k717Q41J19J959L111
15252I0428j579k252Q488J4034j753k1102j5407P927J5992J994q955m053K270
15239H6032L09r57K873M248M483J2964K1690J1630j0527j5317K036J2081N46q990
15225A23101J214J2225M346p715k522J1237J3117M442k205o768j1011n343R555
15212A43673J1349p608j8393l00K0046J1243q785n969Q340L391m830J9320M7904
$$ plain form
15199 219381 231795 153951 33626 -24249 11474 70973 90137 84828 98555 128961 144221
15188 144221 139791 138487 149687 162085 169655 177305 183615 180767 171946 170793 181593 193489 196164
15175 196164 191236 187433 192231 207160 224610 232165 226864 220562 223277 227772 222308 213135 218064 237666
15161 237666 249524 237422 213646 203066 213081 229026 235173 230803 225379 225071 227701 228668 228310
15148 228310 231361 239468 247192 247898 241883 235525 233446 235010 237859 240996 244264 248344 255195 264585
15134 264585 270423 265929 254163 248368 258458 280321 301345 313413 317421 318218 319525 322209 323455
15121 323455 318760 308886 303906 314916 340247 364451 373994 371166 369509 377910 393089 406334 412624
15108 412624 412118 407098 400498 395228 392127 389897 388975 393148 404068 416362 423129 425671 432070 445025
$$ packed form
15199B19381J2414p7844j20325n7875L5723N9499J9164n309J3727L0406J5260
15188A44221m430j304J1200J2398P570P650O310k848q821j153J0800J1896K675
15175A96164m928l803M798J4929J7450P555n301o302K715M495n464r173M929J9602
15161B37666J1858j2102k3776j0580J0015J5945O147m370n424l08K630R67l58
15148B28310L051Q107P724P06o015o358k079J564K849L137L268M080O851R390
15134B64585N838m494j1766n795J0090K1863K1024J2068M008P97J307K684J246
15121C23455m695r874m980J1010K5331K4204R543k828j657Q401J5179J3245O290
15108D12624n06n020o600n270l101k230r22M173J0920J2294O767K542O399J2955
$$ plain form
15094 445025 457084 461184 460705 464027 472820 481914 488990 497686 510290 522820 529607 529669 527199 528332
15080 528332 537816 555304 573808 585189 588559 590092 593590 595834 594003 592990 600128 614938 629545
15067 629545 638854 645491 654145 665493 677375 688211 696716 701439 704486 713882 736941 769776 797556
15054 797556 808999 808863 811865 824767 839878 848176 852883 864233 884309 904944 920337 933596
15042 933596 948397 962001 971608 981340 996072 1012900 1026612 1040369 1061613 1088185 1108607 1118446
15030 1118446 1127416 1145982 1172590 1199548 1224689 1250195 1275083 1296713 1316391 1335978 1352033
15019 1352033 1361637 1371539 1391570 1419571 1443686 1461149 1483049 1515829 1549618 1573214 1591053 1614491
15007 1614491 1643492 1669978 1695108 1728419 1769674 1805977 1830899 1853847 1884112 1917022 1945169
$$ packed form
15094D45025J2059M100m79L322Q793R094P076Q696J2604J2530O787O2k470J133
15080E28332R484J7488J8504J1381L370J533L498K244j831j013P138J4810J4607
15067F29545R309O637Q654J1348J1882J0836Q505M723L047R396K3059L2835K7780
15054G97556J1443j36L002J2902J5111Q298M707J1350K0076K0635J5393J3259
15042I33596J4801J3604R607R732J4732J6828J3712J3757K1244K6572K0422R839
15030A118446Q970J8566K6608K6958K5141K5506K4888K1630J9678J9587J6055
15019A352033R604R902K0031K8001K4115J7463K1900L2780L3789K3596J7839K3438
15007A614491K9001K6486K5130L3311M1255L6303K4922K2948L0265L2910K8147
$$ plain form
14996 1945169 1974401 2016775 2072301 2129557 2183103 2239355 2303801 2371807 2435746 2494504 2551617
14985 2551617 2608495 2663872 2718162 2775841 2844092 2928542 3027528 3130858 3228045 3318598 3411483
14974 3411483 3514957 3630731 3757150 3891947 4030673 4168744 4308372 4458896 4626998
14965 4626998 4810263 5002624 5201497 5406800 5618536 5839787 6076965 6331431 6595256
14956 6595256 6862043 7138819 7439397 7766786 8109268 8454849 8804277 9168498 9556837
14947 9556837 9967995 10389698 10807841 11218723 11630533 12050062 12471945 12885748 13288114
14938 13288114 13678756 14047478 14376506 14656481 14890232 15079369 15217757 15301302 15333597 15317098
14928 15317098 15248509 15128095 14962821 14753341 14489879 14172301 13824219 13472517 13119225
$$ packed form
14996A945169K9232M2374N5526N7256N3546N6252O4446O8006O3939N8758N7113
14985B551617N6878N5377N4290N7679O8251Q4450R8986J03330R7187R0553R2885
14974C411483J03474J15774J26419J34797J38726J38071J39628J50524J68102
14965D626998J83265J92361J98873K05303K11736K21251K37178K54466K63825
14956F595256K66787K76776L00578L27389L42482L45581L49428L64221L88339
14947I556837M11158M21703M18143M10882M11810M19529M21883M13803M02366
14938A3288114L90642L68722L29028K79975K33751J89137J38388Q3545L2295j6499
14928A5317098o8589j20414j65274k09480k63462l17578l48082l51702l53292
$$ plain form
14919 13119225 12748982 12359931 11969439 11589399 11214467 10839967 10474914 10128026 9794035
14910 9794035 9465542 9148919 8855557 8582974 8317253 8052013 7794117 7551544 7325863
14901 7325863 7116872 6923994 6739866 6551982 6356767 6165926 5992561 5835373 5683754
14892 5683754 5535907 5402677 5290820 5189675 5081043 4959888 4838684 4730801 4635879 4544781
14882 4544781 4453455 4365570 4283966 4206745 4132090 4060357 3989836 3917171 3845268 3784036 3737226
14871 3737226 3693522 3638850 3575628 3521319 3486572 3462059 3430377 3385561 3335862 3290674 3251148
14860 3251148 3214084 3179483 3150253 3126498 3104921 3084977 3071248 3065802 3060961 3045914 3020941 2999043
14848 2999043 2990896 2993322 2995863 2993206 2985901 2973941 2957497 2941734 2933076 2931126 2930752 2930964 2934130 2937613
$$ packed form
14919A3119225l70243l89051l90492l80040l74932l74500l65053l46888l33991
14910I794035l28493l16623k93362k72583k65721k65240k57896k42573k25681
14901G325863k08991j92878j84128j87884j95215j90841j73365j57188j51619
14892E683754j47847j33230j11857j01145j08632j21155j21204j07883r4922r1098
14882D544781r1326q7885q1604p7221p4655p1733p0521p2665p1903o1232m6810
14871C737226m3704n4672o3222n4309l4747k4513l1682m4816m9699m5188l9526
14860C251148l7064l4601k9230k3755k1577j9944j3729n446m841j5047k4973k1898
14848B999043q147K426K541k657p305j1960j6444j5763q658j950l74K12L166L483
$$ plain form
14834 2937613 2936212 2933855 2941333 2958271 2969240 2965646 2960434 2969209 2985313 2989187 2978704 2973137 2985456
14821 2985456 3006728 3023551 3036269 3050472 3062944 3069365 3077634 3098100 3124180 3138475 3138602 3141699
14809 3141699 3159267 3182108 3198300 3212949 3237136 3265884 3283022 3285505 3288048 3302130 3323634 3345013
14797 3345013 3366937 3390681 3409703 3418786 3424157 3434025 3444685 3447663 3446882 3455348 3475185 3494717 3508183
14784 3508183 3524350 3548495 3568714 3572692 3570349 3584789 3621628 3660062 3677270 3671716 3657954 3647306
14772 3647306 3641702 3641766 3651148 3671002 3695760 3717728 3733901 3746222 3756926 3766635 3776653 3789445
14760 3789445 3804688 3817342 3823084 3824477 3827583 3832680 3833530 3827598 3821679 3823349 3830920 3837114 3839940 3843807
14746 3843807 3850903 3857795 3861489 3863684 3867286 3872510 3877626 3880134 3876855 3867287 3857400 3854593 3857155 3854843
$$ packed form
14834B937613j401k357P478J6938J0969l594n212Q775J6104L874j0483n567J2319
14821B985456K1272J6823J2718J4203J2472O421Q269K0466K6080J4295J27L097
14809C141699J7568K2841J6192J4649K4187K8748J7138K483K543J4082K1504K1379
14797C345013K1924K3744J9022R083N371R868J0660K978p81Q466J9837J9532J3466
14784C508183J6167K4145K0219L978k343J4440L6839L8434J7208n554j3762j0648
14772C647306n604O4R382J9854K4758K1968J6173J2321J0704R709J0018J2792
14760C789445J5243J2654N742J393L106N097Q50n932n919J670P571O194K826L867
14746C843807P096O892L694K195L602N224N116K508l279r568r887k807K562k312
$$ plain form
14732 3854843 3843013 3829870 3824806 3825818 3825879 3826572 3834909 3848045 3852527 3841715 3824654 3812686 3805111
14719 3805111 3794859 3782061 3772999 3768706 3763885 3756701 3750936 3747300 3741413 3733875 3733670 3744643 3754846
14706 3754846 3748720 3727805 3710425 3710036 3721299 3729598 3727418 3717303 3704118 3690564 3678859 3672046
14694 3672046 3672152 3677336 3680420 3672108 3650097 3625031 3611652 3612054 3613606 3606204 3594026 3584512 3573801
14681 3573801 3553641 3528139 3510729 3504182 3495633 3475271 3450204 3434145 3430469 3431089 3426531 3411935
14669 3411935 3388414 3364257 3350406 3348581 3346770 3331735 3303290 3271804 3245555 3226600 3215546 3212036
14657 3212036 3210557 3202555 3184548 3160622 3136899 3116723 3099952 3082807 3059565 3028696 2996057 2967934
14645 2967934 2943423 2919289 2899239 2889866 2888313 2883653 2871880 2859735 2850417 2836171 2812096 2788249
$$ packed form
14732C854843j1830j3143n064J012O1O93Q337J3136M482j0812j7061j1968p575
14719C805111j0252j2798r062m293m821p184n765l636n887p538k05J0973J0203
14706C754846o126k0915j7380l89J1263Q299k180j0115j3185j3554j1705o813
14694C672046J06N184L084q312k2011k5066j3379M02J552p402j2178r514j0711
14681C573801k0160k5502j7410o547q549k0362k5067j6059l676O20m558j4596
14669C411935k3521k4157j3851j825j811j5035k8445l1486k6249j8955j1054l510
14657C212036j479q002j8007k3926k3723k0176j6771j7145k3242l0869l2639k8123
14645B967934k4511k4134k0050r373j553m660j1773j2145r318j4246k4075k3847
$$ plain form
14633 2788249 2777493 2776485 2770282 2754566 2742051 2744293 2756247 2763887 2760763 2750989 2739981 2729506
14621 2729506 2721293 2718927 2723377 2730117 2733935 2735366 2740155 2753154 2774526 2800727 2826523 2846731 2859749
14608 2859749 2870374 2885832 2907158 2927161 2938937 2943661 2947393 2952729 2956976 2956795 2951356 2942158 2932446
14595 2932446 2924965 2917459 2902800 2876828 2842975 2805142 2760422 2705639 2647487 2596883 2554260 2510110
14583 2510110 2460741 2413295 2372393 2332130 2286807 2240750 2199981 2160504 2113290 2057960 2004972
14572 2004972 1965378 1941568 1925265 1902332 1864059 1816346 1772697 1736293 1696766 1648098 1599906
14561 1599906 1564041 1538834 1515199 1490303 1465547 1439050 1411619 1392683 1386758 1380263 1357305 1324039
14549 1324039 1300159 1288789 1274188 1250249 1230481 1223551 1217836 1200246 1174922 1152054 1131260 1108161
$$ packed form
14633B788249j0756j008o203j5716j2515K242J1954P640l124r774j1008j0475
14621B729506q213k366M450O740L818J431M789J2999K1372K6201K5796K0208J3018
14608B859749J0625J5458K1326K0003J1776M724L732N336M247j81n439r198r712
14595B932446p481p506j4659k5972l3853l7833m4720n4783n8152n0604m2623m4150
14583B510110m9369m7446m0902m0263m5323m6057m0769l9477m7214n5330n2988
14572B004972l9594k3810j6303k2933l8273m7713m3649l6404l9527m8668m8192
14561A599906l5865k5207k3635k4896k4756k6497k7431j8936n925o495k2958l3266
14549A324039k3880j1370j4601k3939j9768o930n715j7590k5324k2868k0794k3099
$$ plain form
14537 1108161 1086785 1073126 1064673 1057045 1052422 1050595 1040932 1016384 988204 973193 972042 973372 973120
14524 973120 974691 974106 961955 940036 921366 912511 908472 904908 901847 895125 879311 861031 853658
14511 853658 855066 847239 824144 802704 795947 791805 773512 747934 735000 736718 736336 725881 715577
14498 715577 713409 712161 703617 692893 689412 691689 690269 681321 669303 658394 648501 639750 635266
14485 635266 637706 645849 655478 661291 657728 641807 618200 599234 594980 602182 606828 600231 589336
14472 589336 586983 594375 599469 593126 580089 570341 564760 555388 538271 520351 512240 517012 527320
14459 527320 532051 525179 509494 493245 483646 482734 487055 489620 484183 471118 458679 455089 459433
14446 459433 463665 462934 459104 454294 447614 440327 437254 438767 437356 427720 415433 409382 409463 408319 402070
$$ packed form
14537A108161k1376j3659q453p628m623j827r663k4548k8180j5011j151J330k52
14524I73120J571n85j2151k1919j8670q855m039l564l061o722j5814j8280p373
14511H53658J408p827k3095k1440o757m142j8293k5578j2934J718l82j0455j0304
14498G15577k168j248q544j0724l481K277j420q948j2018j0909r893q751m484
14485F35266K440Q143R629N813l563j5921k3607j8966m254P202M646o597j0895
14472E89336k353P392N094o343j3037r748n581r372j7117j7920q111M772J0308
14459E27320M731o872j5685j6249r599r12M321K565n437j3065j2439l590M344
14446D59433M232p31l830m810o680p287l073J513j411r636j2287o051Q1j144o249
$$ plain form
14431 402070 392511 381615 371595 368189 375028 385342 388315 384394 384983 394741 403864 402425 393525 385701
14417 385701 379866 372319 365291 364426 367911 367867 362651 358260 355048 342784 316043 288275 280633 297354
14403 297354 320620 331961 331139 329021 328667 322860 308244 291689 280397 274271 272088 277171 290461
14390 290461 304390 311540 314563 319225 322373 317366 308389 306699 312382 312622 301127 287182 280218 276725
14376 276725 269933 262736 261896 266678 272272 278458 286004 290112 286974 282180 283102 287190 287539 285558 286879
14361 286879 288509 282901 272870 269070 273115 276867 278543 284018 289877 282516 260329 240006 231523
14348 231523 223483 206292 193819 203104 223891 230663 219701 211295 215379 218082 208441 197868 201461
14335 201461 214835 222550 219567 212271 205706 201062 199885 200210 193847 178065 164853 166614 176564 176909
$$ packed form
14431D02070r559j0896j0020l406O839J0314K973l921N89R758R123j439q900p824
14417C85701n835p547p028q65L485m4n216m391l212j2264k6741k7768p642J6721
14403B97354K3266J1341q22k118l54n807j4616j6555j1292o126k183N083J3290
14390B90461J3929P150L023M662L148n007q977j690N683K40j1495j3945o964l493
14376B76725o792p197q40M782N594O186P546M108l138m794R22M088L49j981J321
14361B86879J630n608j0031l800M045L752J676N475N859p361k2187k0323q483
14348B31523q040j7191j2473R285K0787O772j0962q406M084K703r641j0573L593
14335B01461J3374P715k983p296o565m644j177L25o363j5782j3212J761R950L45
$$ plain form
14321 176909 165178 158044 166869 183099 192829 193735 190413 183457 172798 164807 166051 173802 180665 184878
14307 184878 188388 188810 182386 172289 164629 157865 146096 132167 126354 130372 133958 131198 129025 133094
14293 133094 135988 129563 120894 123297 135628 143766 142114 140592 147112 154835 153658 145887 141491 142233
14279 142233 139826 129662 118946 118284 128890 141168 144995 139366 131219 125676 120059 109964 99423
14266 99423 99369 113339 129016 129575 112914 94712 90579 98556 102666 92689 76437 70435 80797 97388
14252 97388 107134 108331 108372 111245 113911 114307 115332 118091 117635 110579 102282 99954 101305 97563 87554
14237 87554 81254 86594 98233 103624 97288 85457 78297 80541 88779 95424 95622 91758 90561 94795
14223 94795 99171 96100 84482 71202 64602 67509 75271 79070 72920 60143 52267 58720 77360
$$ packed form
14321A76909j1731p134Q825J6230R730R06l322o956j0659p991J244P751O863M213
14307A84878L510M22o424j0097p660o764j1769j3929n813M018L586k760k173M069
14293A33094K894o425q669K403J2331Q138j652j522O520P723j177p771m396P42
14279A42233k407j0164j0716o62J0606J2278L827n629q147n543n617j0095j0541
14266I9423n4J3970J5677N59j6661j8202m133P977M110r977j6252o002J0362J6591
14252I7388R746J197M1K873K666L96J025K759m56p056q297k328J351l742j0009
14237H7554o300N340J1639N391o336j1831p160K244Q238O645J98l864j197M234
14223I4795M376l071j1618j3280o600K907P762L799o150j2777p876O453J8640
$$ plain form
14210 77360 96831 107382 106922 98118 84902 73160 69412 74390 80598 80582 76171 75242 80148 84144
14196 84144 79820 66543 48204 28543 12109 5858 14145 32498 50234 59823 61536 59761 58241
14183 58241 59115 62995 68256 72130 73378 72067 66941 56729 45453 42054 50729 63924 69546 64592
14169 64592 57513 57012 63101 70709 77130 81687 81342 73070 60619 52587 50873 46385 31797 15108
14155 15108 12526 27521 45197 51344 49925 54652 68101 78760 78022 70403 64052 59385 52885 46744
14141 46744 47414 55893 64940 66462 58878 47483 39793 39953 45580 50099 48857 42318 34132 29124 32537
14126 32537 45643 60422 65077 58831 54907 62819 73781 72417 58745 47738 48205 53455 55002
14113 55002 55002 59703 68135 73679 72681 66592 58317 49693 40369 28255 14695 8766 19544 42534
$$ packed form
14210G7360J9471J0551m60q804j3216j1742l748M978O208j6m411r29M906L996
14196H4144m324j3277j8339j9661j6434o251Q287J8353J7736R589J713j775j520
14183E8241Q74L880N261L874J248j311n126j0212j1276l399Q675J3195N622m954
14169F4592p079n01O089P608O421M557l45q272j2451q032j714m488j4588j6689
14155A5108k582J4995J7676O147j419M727J3449J0659p38p619o351m667o500o141
14141D6744O70Q479R047J522p584j1395p690J60N627M519j242o539q186n008L413
14126C2537J3106J4779M655o246l924P912J0962j364j3672j1007M67N250J547
14113E5002%M701Q432N544r98o089q275q624r324j2114j3560n929J0778K2990
$$ plain form
14099 42534 61484 66873 64869 64061 62812 57045 51781 54120 60060 59641 52656 48441 50719 52579 47478
14084 47478 37057 26997 21859 23769 29166 28050 15099 581 -22 12533 21748 19171 14727
14071 14727 18496 25544 27586 28076 33884 40536 38943 31290 26832 25249 18277 7205 4450 14611
14057 14611 26140 26970 18680 9758 3798 1037 3698 11580 17967 18269 18447 26127 36817 39189 32818
14042 32818 29258 33263 34507 24497 12038 11148 19145 19767 7856 -2138 2952 16658 23914 22269
14028 22269 20726 22455 22641 23178 34143 54629 65346 51377 24118 8239 11509 20260 22415
14015 22415 20564 19801 16354 5894 -5951 -9777 -3788 7396 19943 30137 31909 23489 13138
14002 13138 9798 10476 5788 -3688 -6932 1132 13259 22485 30431 38038 38766 30012 23122 30314 46006
$$ packed form
14099D2534J8950N389k004q08j249n767n264K339N940m19o985m215K278J860n101
14084D7478j0421j0060n138J910N397j116j2951j4518o03J2555R215k577m444
14071A4727L769P048K042M90N808O652j593p653m458j583o972j1072k755J0161
14057A4611J1529Q30q290q922n960k761K661P882O387L02J78P680J0690K372o371
14042C2818l560M005J244j0010j2459q90P997O22j1911r994N090J3706P256j645
14028B2269j543J729J86N37J0965K0486J0717j3969k7259j5879L270Q751K155
14015B2415j851p63l447j0460j1845l826N989J1184J2547J0194J772q420j0351
14002A3138l340O78m688r476l244Q064J2127R226P946P607P28q754o890P192J5692
$$ plain form
13987 46006 53546 49299 47043 55746 65266 61363 46267 34861 34881 40360 43760 46017 51961 61119
13973 61119 67038 64606 56384 51621 58402 76002 95805 109973 117000 118374 114517 107596 104347 110236
13959 110236 122255 132810 140004 149076 164224 184113 204989 222882 233312 235323 236123 245077 262488
13946 262488 281546 301608 329686 366169 400525 427432 456297 495302 535357 561895 575487
13935 575487 586888 596619 595853 586936 586117 601269 620615 630148 630979 632026 635356 637691 639006 640140
13921 640140 636671 624217 607363 595986 593718 594863 591017 577337 555254 531979 513175 493590
13909 493590 461741 418188 380467 361808 352904 335829 309804 289320 279787 270691 254391 236920
13897 236920 224959 214592 200337 185436 174859 165927 154826 146402 147668 154803 155916 145943 131145
$$ packed form
13987D6006P540m247k256Q703R520l903j5096j1406K0N479L400K257N944R158
13973F1119N919k432q222m763O781J7600J9803J4168P027J374l857o921l249N889
13959A10236J2019J0555P194R072J5148J9889K0876J7893J0430K011Q00Q954J7411
13946B62488J9058K0062K8078L6483L4356K6907K8865L9005M0055K6538J3592
13935E75487J1401R731p66q917q19J5152J9346R533Q31J047L330K335J315J134
13921F40140l469j2454j6854j1377k268J145l846j3680k2083k3275j8804j9585
13909D93590l1849m3553l7721j8659q904j7075k6025k0484r533r096j6300j7471
13897B36920j1961j0367j4255j4901j0577q932j1101q424J266P135J113r973j4798
$$ plain form
13884 131145 118821 109554 101063 93745 89099 85840 81033 74681 71192 74670 82309 84920 77611 68530
13870 68530 70627 83213 89082 75129 49907 33335 32866 38480 39282 35037 30048 25357 21674 22776
13856 22776 30142 39076 45482 51668 59229 61087 49977 32825 25690 32312 38314 32179 21922 20945
13842 20945 25054 18593 1953 -4164 11526 31203 30273 10370 -5010 -3719 2772 1772 -2447
13829 -2447 -925 2150 -3449 -15047 -18137 -6370 9220 13934 6526 -807 3006 16197 27125
13816 27125 27714 21187 14364 6493 -6591 -18774 -16060 2839 19863 20351 12681 13417 21364 22389
13802 22389 15360 14313 23542 29007 20607 6833 -1509 -7760 -18345 -27746 -28229 -24739 -24841 -21567
13788 -21567 -4275 17323 20055 490 -17273 -14096 -331 2759 -6431 -12246 -7879 -3788 -10280
$$ packed form
13884A31145j2324r267q491p318m646l259m807o352l489L478P639K611p309r081
13870F8530K097J2586N869j3953k5222j6572m69N614Q02m245m989m691l683J102
13856B2776P366Q934O406O186P561J858j1110j7152p135O622O002o135j0257r77
13842B0945M109o461j6640o117J5690J9677r30j9903j5380J291O491j000m219
13829b447J522L075n599j1598l090J1767J5590M714p408p333L813J3191J0928
13816B7125N89o527o823p871j3084j2183K714J8899J7024M88p670P36P947J025
13802B2389p029j047R229N465q400j3774q342o251j0585r401m83L490j02L274
13788b1567J7292K1598K732j9565j7763L177J3765L090r190n815M367M091o492
$$ plain form
13775 -10280 -23928 -34470 -36740 -31974 -23880 -18083 -20765 -32214 -43718 -45657 -38109 -29439 -24687
13762 -24687 -20095 -10734 869 7451 5742 -1555 -10686 -18804 -22049 -17966 -11018 -9346 -13238 -13506
13748 -13506 -6286 -2788 -15707 -39856 -56748 -58050 -53793 -54599 -56266 -48917 -33931 -22343 -19504
13735 -19504 -20315 -19675 -19721 -23995 -30187 -33203 -32740 -33512 -38586 -46106 -53154 -59215 -63381 -61338 -50404 -36855
13719 -36855 -31408 -34707 -34118 -20900 -4742 -1952 -12489 -20297 -16675 -10601 -11829 -16428 -17300 -17951
13705 -17951 -23794 -27648 -18538 -1574 5788 -2118 -12254 -12832 -7648 -5532 -7128 -9845 -16503 -29039
13691 -29039 -39106 -34819 -15258 8145 22810 22922 10088 -7485 -19024 -20575 -18464 -18803 -17926
13678 -17926 -10421 -2236 -5318 -20399 -35747 -43904 -48862 -53860 -53451 -44209 -34077 -32265 -36041 -36610
$$ packed form
13775a0280j3648j0542k270M766Q094N797k682j1449j1504j939P548Q670M752
13762b4687M592R361J1603O582j709p297r131q118l245M083O948J672l892k68
13748a3506P220L498j2919k4149j6892j302M257q06j667P349J4986J1588K839
13735a9504q11O40m6m274o192l016M63p72n074p520p048o061m166K043J0934J3549
13719c6855N447l299N89J3218J6158K790j0537p808L622O074j228m599q72o51
13705a7951n843l854R110J6964P362p906j0136n78N184K116j596k717o658j2536
13691b9039j0067M287J9561K3403J4665J12j2834j7573j1539j551K111l39Q77
13678a7926P505Q185l082j5081j5348q157m958m998M09R242J0132J812l776n69
$$ plain form
13664 -36610 -33710 -34534 -40175 -43294 -40161 -36062 -35634 -35303 -30343 -24169 -23925 -28645 -28401 -17314 -3323
13649 -3323 -672 -13077 -28690 -34361 -31525 -32616 -43005 -54011 -56118 -51548 -48006 -46330 -42767 -39377
13635 -39377 -41801 -47661 -47802 -40701 -35483 -37129 -38584 -33392 -27251 -29125 -37937 -46888 -54949 -63709 -67522
13620 -67522 -59485 -46145 -43235 -53920 -62314 -53553 -31524 -11112 -593 1501 -1771 -9033 -18690
13607 -18690 -30092 -44290 -58886 -65772 -60074 -48294 -40597 -36999 -28744 -12725 3397 11726 12622
13594 12622 10235 5729 -1469 -10400 -20110 -30780 -40190 -42917 -36783 -26723 -18056 -8980 4926 20537
13580 20537 27996 22934 12902 8480 10356 8578 -5065 -25687 -38068 -31647 -11804 5924 12525
13567 12525 12636 13813 14459 8648 -73 805 15562 30963 30444 13842 -3601 -10176 -8409 -6100
$$ packed form
13664c6610K900q24n641l119L133M099M28L31M960O174K44m720K44J1087J3991
13649c323K651j2405j5613n671K836j091j0389j1006k107M570L542J676L563L390
13635c9377k424n860j41P101N218j646j455N192O141j874q812q951q061q760l813
13620f7522Q037J3340K910j0685q394Q761K2029K0412J0519K094l272p262r657
13607a8690j1402j4198j4596o886N698J1780P697L598Q255J6019J6122Q329Q96
13594A2622k387m506p198q931r710j0670r410k727O134J0060Q667R076J3906J5611
13580B0537P459n062j0032m422J876j778j3643k0622j2381O421J9843J7728O601
13567A2525J11J177O46n811q721Q78J4757J5401n19j6602j7443o575J767K309
$$ plain form
13553 -6100 -4263 1167 10261 18258 22674 25450 27132 24077 14260 2422 -4037 -2309 5786 18661
13539 18661 34636 47023 46043 29834 10119 1614 6479 14111 16479 17255 21914 24691 14469 -6686
13525 -6686 -20883 -15999 -3046 -3052 -19659 -35225 -35041 -24771 -18739 -20122 -21574 -19759 -18895 -21747 -26307
13510 -26307 -31028 -34925 -33054 -21918 -10516 -14410 -33915 -49153 -44876 -31139 -28805 -41457 -54590
13497 -54590 -59024 -60482 -64499 -65354 -56116 -40368 -26881 -18821 -14841 -16074 -24805 -38227 -49329 -53536
13483 -53536 -51172 -45114 -39427 -38091 -40755 -41028 -33209 -20044 -9843 -6355 -5651 -3114 960 4162
13469 4162 6406 8896 11153 12058 12752 15938 22504 30717 38426 43877 44318 37068 24281 14433 15265
13454 15265 25521 37082 45183 51749 57481 57292 48922 41259 46131 63152 79872 86508 83288 73648
$$ packed form
13553f100J837N430R094P997M416K776J682l055r817j1838o459J728Q095J2875
13539A8661J5975J2387r80j6209j9715q505M865P632K368P76M659K777j0222k1155
13525f686j4197M884J2953oj6607j5566J84J0270O032j383j452J815Q64k852m560
13510b6307m721l897J871J1136J1402l894j9505j5238M277J3737K334j2652j3133
13497e4590m434j458m017q55R238J5748J3487Q060L980j233q731j3422j1102m207
13483e3536K364O058N687J336k664k73P819J3165J0201L488P04K537M074L202
13469D162K244K490K257R05O94L186O566Q213P709N451M41p250j2787r848Q32
13454A5265J0256J1561Q101O566N732j89q370p663M872J7021J6720O636l220r640
$$ plain form
13440 73648 59794 47615 45905 54281 59489 51449 37440 32497 40482 53280 64622 74235 79947
13427 79947 76937 66790 58123 55035 52448 46323 41561 45037 55593 65443 68404 63819 55569 49908
13413 49908 51462 59178 68326 76672 84933 91412 91906 85979 77304 66465 50524 32101 20708 20521
13399 20521 24447 25768 27568 33404 37013 31873 24610 26002 32013 27912 11618 -1033 1647 11914
13385 11914 15805 11805 7791 6325 3061 -2821 -5643 -1721 4933 7535 4384 262 860 6274 10378
13370 10378 7812 1429 503 10563 26512 36559 32126 14707 -4861 -14574 -11559 -3945 -128
13357 -128 1766 8960 20209 24494 15471 723 -7082 -3548 6392 16231 22445 24438 24098 24112 25131
13342 25131 26670 30337 36836 39704 30447 13072 4042 10962 19866 13581 -3662 -12099 -3807 8613
$$ packed form
13440G3648j3854j2179j710Q376N208q040j4009m943P985J2798J1342R613N712
13427G9947l010j0147q667l088k587o125m762L476J0556R850K961m585q250n661
13413D9908J554P716R148Q346Q261O479M94n927q675j0839j5941j8423j1393j87
13399B0521L926J321J800N836L609n140p263J392O011m101j6294j2651K680J0267
13385A1914L891m000m014j466l264n882k822L922O654K602l151m122N98N414M104
13370A0378k566o383r26J0060J5949J0047m433j7419j9568r713L015P614L817
13357a28J894P194J1249M285r023j4748p805L534R940R839O214J993l40J4J019
13342B5131J539L667O499K868r257j7375r030O920Q904o285j7243q437Q292J2420
$$ plain form
13328 8613 11320 5545 1283 3977 12256 22347 29985 31827 28043 21131 12478 4154 1948 8870
13314 8870 16278 11376 -4161 -13083 -4528 12338 22940 26464 31458 39184 42360 37329 27330 14957
13300 14957 822 -10147 -10550 -1314 6824 6527 2907 4891 11778 14223 7389 -2652 -7801 -9104
13286 -9104 -13753 -21438 -21055 -6489 9515 7304 -13809 -32045 -29648 -13538 -2640 -2693 -3907 798
13272 798 6545 5511 -3320 -14609 -21069 -17737 -7411 -717 -4831 -13638 -15451 -8203 623 6418
13258 6418 9957 9647 3551 -766 7458 22684 24452 5301 -16233 -20366 -11496 -5904 -4280 6260
13244 6260 26941 41740 39525 28706 24758 31292 37895 32299 13126 -6188 -8048 9690 28135
13231 28135 28676 16002 9558 15163 19407 13559 7492 12900 25554 34193 37350 39995 40469 33354
$$ packed form
13328H613K707n775m262K694Q279J0091P638J842l784o912q653q324k206O922
13314H870P408m902j5537q922Q555J6866J0602L524M994P726L176n031r999j2373
13300A4957j4135j0969m03R236Q138k97l620J984O887K445o834j0041n149j303
13286i104m649p685L83J4566J6004k211k1113j8236K397J6110J0898n3j214M705
13272G98N747j034q831j1289o460L332J0326O694m114q807j813P248Q826N795
13258F418L539l10o096m317Q224J5226J768j9151k1534m133Q870N592J624J0540
13244F260K0681J4799k215j0819l948O534O603n596j9173j9314j860J7738J8445
13231B8135N41j2674o444N605M244n848o067N408J2654Q639L157K645M74p115
$$ plain form
13217 33354 21923 15567 15468 13836 8544 7690 15419 22348 17439 4175 -3328 1064 8447 8491 3995
13202 3995 6407 19493 34498 42699 45878 49613 51926 46782 36181 29006 26968 21320 7136 -7611
13188 -7611 -12485 -6896 3683 16239 27326 28879 17638 4663 4096 14049 19416 13040 2675
13175 2675 -3844 -7696 -9549 -3721 10089 19151 12414 -2910 -9868 -3426 6507 11950 15755 21829
13161 21829 26370 24407 18626 14735 11194 969 -15993 -28557 -26587 -13853 -3545 -1931 -2510
13148 -2510 1998 8385 9081 5070 4670 10489 15817 15622 13271 12177 7310 -8060 -29785 -43461 -38736
13133 -38736 -20447 -4774 -4375 -16425 -26166 -24107 -16741 -15207 -17080 -10016 6393 15998 9136 -2464
13119 -2464 -3830 1595 2263 1278 10392 25031 25696 7229 -11624 -14881 -9645 -9863 -13401 -9076 2092
$$ packed form
13217C3354j1431o356r9j632n292q54P729O929m909j3264p503M392P383M4m496
13202C995K412J3086J5005Q201L179L735K313n144j0601p175k038n648j4184j4747
13188g611m874N589J0579J2556J1087J553j1241j2975n67R953N367o376j0365
13175B675o519l852j853N828J3810R062o737j5324o958O442R933N443L805O074
13161B1829M541j963n781l891l541j0225j6962j2564J970J2734J0308J614n79
13148b510M508O387O96m011m00N819N328j95k351j094m867j5370k1725j3676M725
13133c8736J8289J5673L99j2050r741K059P366J534j873P064J6409R605o862j1600
13119b464j366N425O68r85R114J4639O65j8467j8853l257N236k18l538M325J1168
$$ plain form
13104 2092 7505 1767 -7632 -13097 -15145 -16350 -15038 -8250 3207 14999 23089 27231 31125 37262
13090 37262 41855 39497 33330 33343 41646 47971 45436 41672 45358 50171 44788 33011 28808 33403 33296
13075 33296 22816 13115 13539 17850 16586 11378 7975 5254 1628 3658 15906 28230 26775 14840
13061 14840 9242 15864 22308 18426 11597 13628 21233 20299 6626 -7355 -8068 3621 15395 18023
13047 18023 13046 8025 8528 15077 24105 29801 27725 19451 11872 9189 7826 3007 -2402 -2143 1218
13032 1218 -3262 -19482 -36650 -41978 -35442 -26526 -21281 -19125 -18634 -19005 -17652 -13334 -10494 -13739 -18955
13017 -18955 -17307 -8225 -891 -1658 -7580 -14532 -23232 -32300 -33093 -19770 -640 9188 6040 1316
13003 1316 5749 16434 22687 19655 10927 717 -9488 -16143 -13201 -1373 7481 2918 -9230
$$ packed form
13104B092N413n738r399n465k048j205J312O788J1457J1792Q090M142L894O137
13090C7262M593k358o167J3Q303O325k535l764L686M813n383j1777m203M595j07
13075C3296j0480r701M24M311j264n208l403k721l626K030J2248J2324j455j1935
13061A4840n598O622O444l882o829K031P605r34j3673j3981p13J1689J1774K628
13047A8023m977n021N03O549R028N696k076q274p579k683j363m819n409K59L361
13032A218m480j6220j7168n328O536Q916N245K156M91l71J353M318K840l245n216
13017a8955J648R082P334p67n922o952q700r068p93J3323J9130R828l148m724
13003A316M433J0685O253l032q728j0210j0205o655K942J1828Q854m563j2148
$$ plain form
12990 -9230 -12967 -3201 8510 11513 8997 7947 6902 3509 5184 18554 33669 34213 21854 14617
12976 14617 19945 25755 22519 17485 18571 19689 14612 12883 26468 48762 62731 64784 64723 65078
12962 65078 57701 42153 31104 31745 34726 29196 19390 17821 27992 41599 49656 50226 46667 42802
12948 42802 39963 37267 34928 35870 41251 45946 43016 32113 19014 8093 757 -331 6811 17283
12934 17283 22791 22140 20662 19381 14750 10298 16224 32796 46131 47205 43389 42709 39307 27221
12920 27221 17428 23984 39775 44747 36055 31029 38352 45051 38668 25842 18522 14586 4905 -8719
12906 -8719 -15979 -14517 -12434 -15365 -20147 -21426 -17294 -7818 5964 20314 30201 33196 29514 19680
12892 19680 6018 -5086 -7497 -2200 3991 6738 7665 9623 12338 13581 11775 6959 1678 843
$$ packed form
12990i230l737R766J1711L003k516j050j045l393J675J3370J5115N44j2359p237
12976A4617N328N810l236n034J086J118n077j729J3585K2294J3969K053o1L55
12962F5078p377j5548j1049O41K981n530r806j569J0171J3607Q057N70l559l865
12948D2802k839k696k339R42N381M695k930j0903j3099j0921p336j088P142J0472
12934A7283N508o51j478j281m631m452N926J6572J3335J074l816o80l402j2086
12920B7221r793O556J5791M972q692n026P323O699o383j2826p320l936r681j3624
12906h719p260J462K083k931m782j279M132R476J3782J4350R887K995l682r834
12892A9680j3662j1104k411N297O191K747R27J958K715J243j806m816n281q35
$$ plain form
12878 843 7778 20261 32924 43024 50876 55849 56589 54992 54698 54955 51687 46162 45692 51898 55083
12863 55083 46925 33603 27794 30653 31944 28146 29398 43883 64049 75573 74411 67404 60059
12850 60059 52562 46429 45838 50411 53668 51434 46402 42175 38597 35648 35274 34970 26779 10295 778
12835 778 13345 40868 59360 57488 49578 53640 66517 71219 63407 57472 64795 76884 77160 64108
12821 64108 54058 60354 76185 82692 71829 55594 50974 60641 73625 82405 91000 103503 112192
12808 112192 104940 82353 59995 52125 58365 68182 73506 73216 68835 61333 52330 44824 41194 41620
12794 41620 44697 48557 51740 54499 58977 66147 72408 71836 63380 53729 50353 52540 52430 45325 36083
12779 36083 33689 41528 55049 67443 75006 77602 76819 74600 72123 69213 65341 60830 56299 51967
$$ packed form
12878H43O935J2483J2663J0100P852M973P40j597k94K57l268n525m70O206L185
12863E5083q158j3322n809K859J291l798J252J4485K0166J1524j162p007p345
12850F0059p497o133n91M573L257k234n032m227l578k949l74l04q191j6484r517
12835G78J2567K7523J8492j872p910M062J2877M702p812n935P323J2089K76j3052
12821F4108j0050O296J5831O507j0863j6235m620R667J2984Q780Q595J2503Q689
12808A12192p252k2587k2358p870O240R817N324k90m381p502r003p506l630M26
12794D1620L077L860L183K759M478P170O261n72q456r651l376K187j10p105r242
12779C6083k394P839J3521J2394P563K596p83k219k477k910l872m511m531m332
$$ plain form
12765 51967 48698 47905 48164 44503 35499 29013 33853 45656 49836 42053 36351 45040 58249 56003
12751 56003 37520 23912 29005 41178 42214 33624 32197 44727 60333 67831 69009 70710 72721
12738 72721 70170 63108 57224 56645 60292 64129 63845 57125 47001 41694 47032 59050 67253 65206
12724 65206 55622 46402 45345 57048 78724 98041 101410 88011 71511 64856 67717 72397 76503
12711 76503 83081 91685 97322 97752 95021 89668 80195 69272 63621 65345 69168 70833 72536 76865
12697 76865 80964 80911 77484 73687 70897 71129 77847 89610 97972 97623 94002 94383 96391 93668 88769
12682 88769 90056 97817 104422 107828 113011 118279 113206 95927 80829 80083 86538 85709 78136 76661
12668 76661 83898 86602 76228 63990 67274 86313 102925 102150 88721 79434 83324 94234 102001
$$ packed form
12765E1967l269p93K59l661r004o486M840J1803M180p783n702Q689J3209k246
12751E6003j8483j3608N093J2173J036q590j427J2530J5606P498J178J701K011
12738G2721k551p062n884n79L647L837k84o720j0124n307N338J2018Q203k047
12724F5206r584r220j057J1703K1676J9317L369j3399j6500o655K861M680M106
12711G6503O578Q604N637M30k731n353r473j0923n651J724L823J665J703M329
12697G6865M099n3l427l797k790K32O718J1763Q362l49l621L81K008k723m899
12682H8769J287P761O605L406N183N268n073j7279j5098p46O455q29p573j475
12668G6661P237K704j0374j2238L284J9039J6612p75j3429r287L890J0910P767
$$ plain form
12655 102001 104810 106886 108398 104660 95157 86610 84397 85981 86476 86692 90758 97821 101244 96571 87226
12640 87226 81122 82652 88602 92190 91286 90969 95979 102951 104860 102172 103189 111897 121869 125210 121749
12625 121749 115491 107658 98465 91105 88001 86590 84548 85936 95911 111619 124524 130391 131636 131217
12611 131217 129198 124045 113470 96776 80278 75434 85363 98500 103827 106875 119231 136379 140888
12598 140888 127948 112570 107423 107753 105132 103026 108271 116900 120473 120279 123385 128163 125563 114224
12584 114224 103890 101957 104865 105973 105413 107386 111314 111318 105033 99124 102345 113385 120143 114117 101684
12569 101684 95698 98705 101756 98335 90325 79850 66258 55021 58544 80218 105524 117608 116122
12556 116122 113028 115600 122473 131400 140334 143198 134752 119587 108301 104825 104336 102736 100892 99956
$$ packed form
12655A02001K809K076J512l738r503q547k213J584M95K16M066P063L423m673r345
12640H7226o104J530N950L588r04l17N010O972J909k688J017Q708R972L341l461
12625A21749o258p833r193p360l104j411k042J388R975J5708J2905N867J245m19
12611A31217k019n153j0575j6694j6498m844R929J3137N327L048J2356J7148M509
12598A40888j2940j5378n147L30k621k106N245Q629L573j94L106M778k600j1339
12584A14224j0334j933K908J108n60J973L928Mo285n909L221J1040O758o026j2433
12569A01684n986L007L051l421q010j0475j3592j1237L523K1674K5306J2084j486
12556A16122l094K572O873Q927Q934K864q446j5165j1286l476m89j600j844r36
$$ plain form
12542 99956 99804 102421 110412 121782 131551 137937 141813 142259 139399 139367 148017 160485 165492 159961 151117
12527 151117 144593 140171 139752 148135 162279 170444 167966 165251 173025 186325 191094 182692 170546 166149
12513 166149 172223 183593 194572 203755 211978 217053 214696 207278 206131 217707 230982 228807 211293
12500 211293 196956 198443 207816 210476 204095 197260 196368 200557 205277 206494 205074 208714 223780 244184
12486 244184 255997 254385 246897 238768 227091 213254 207504 213783 222288 225400 228781 237058 241487
12473 241487 234547 225480 227011 236255 243349 249231 258201 261829 249791 230872 223416 228870 234622 239201
12459 239201 252058 269139 273067 261456 252056 253446 252787 241586 232107 235896 244713 246658 245189
12446 245189 248038 251775 251661 253096 258915 259710 253216 258585 290286 329014 342243 327414 311195
$$ packed form
12542I9956j52K617P991J1370R769O386L876M46k860l2Q650J2468N007n531q844
12527A51117o524m422m19Q383J4144Q165k478k715P774J3300M769q402j2146m397
12513A66149O074J1370J0979R183Q223N075k357p418j147J1576J3275k175j7514
12500B11293j4337J487R373K660o381o835q92M189M720J217j420L640J5066K0404
12486B44184J1813j612p488q129j1677j3837n750O279Q505L112L381Q277M429
12473B41487o940r067J531R244P094N882Q970L628j2038j8919p456N454N752M579
12459B39201J2857J7081L928j1611r400J390o59j1201r479L789Q817J945j469
12446B45189K849L737j14J435N819P95o494N369L1701L8728J3229j4829j6219
$$ plain form
12433 311195 309276 311276 306485 300457 299619 299646 297804 300158 307737 310835 306922 309863 329207 352302
12419 352302 360813 356039 353153 356756 358375 356013 359428 372385 383389 381624 372655 369144 371975 371413
12405 371413 365416 365355 379375 398751 408699 408006 408472 415948 422208 419032 411974 413600 427207 442692
12391 442692 446484 433056 410604 397479 406708 430124 444943 441270 434520 442510 459773 467527 461959
12378 461959 455945 455537 453123 446034 444060 451970 460128 461445 463942 475199 485941 482976 470490 464051
12364 464051 468360 475441 482348 495125 513337 525013 523431 518822 525249 541692 553928 552588 543131
12351 543131 538672 547606 568126 590773 605321 608506 607461 614148 633944 659798 679205 686559 686602
12338 686602 686556 689112 694384 703671 717155 731483 744620 760213 781518 803905 820591 833616 849967
$$ packed form
12433C11195j919K000m791o028q38K7j842K354P579L098l913K941J9344K3095
12419C52302Q511m774k886L603J619k362L415J2957J1004j765q969l511K831n62
12405C71413n997o1J4020J9376R948o93M66P476O260l176p058J626J3607J5485
12391D42692L792j3428k2452j3125R229K3416J4819l673o750P990J7263P754n568
12378D61959o014m08k414p089j974P910Q158J317K497J1257J0742k965j2486o439
12364D64051M309P081O907J2777J8212J1676j582m609O427J6443J2236j340r457
12351E43131m459Q934K0520K2647J4548L185j045O687J9796K5854J9407P354M3
12338F86602m6K556N272R287J3484J4328J3137J5593K1305K2387J6686J3025J6351
$$ plain form
12325 849967 867289 874462 869454 865984 876235 895281 910083 917388 924544 937060 953341 969325
12313 969325 982246 992185 1004253 1024973 1051860 1072759 1082089 1090569 1109143 1129994 1137344 1134020
12301 1134020 1141184 1168940 1201311 1217144 1215865 1214942 1228479 1255008 1281887 1296895 1299364 1302681
12289 1302681 1320398 1347703 1364906 1364002 1362353 1380910 1415946 1444244 1453006 1452062 1456349 1468916 1485422
12276 1485422 1504476 1525594 1544118 1557342 1571819 1595285 1622767 1640384 1644560 1648361 1664212 1688065
12264 1688065 1707773 1721339 1737326 1759800 1783326 1803737 1823980 1845964 1865593 1881110 1898307
12253 1898307 1920216 1938250 1942793 1938756 1941365 1958335 1984770 2014289 2045555 2076815 2103294 2123753
12241 2123753 2143174 2165347 2187744 2206628 2222886 2240273 2261757 2289287 2322478 2355328 2379282
$$ packed form
12325H49967J7322P173n008l470J0251J9046J4802P305P156J2516J6281J5984
12313I69325J2921R939J2068K0720K6887K0899R330Q480J8574K0851P350l324
12301A134020P164K7756L2371J5833j279r23J3537K6529K6879J5008K469L317
12289A302681J7717K7305J7203r04j649J8557L5036K8298Q762r44M287J2567J6506
12276A485422J9054K1118J8524J3224J4477K3466K7482J7617M176L801J5851K3853
12264A688065J9708J3566J5987K2474K3526K0411K0243K1984J9629J5517J7197
12253A898307K1909J8034M543m037K609J6970K6435K9519L1266L1260K6479K0459
12241B123753J9421K2173K2397J8884J6258J7387K1484K7530L3191L2850K3954
$$ plain form
12230 2379282 2393351 2407975 2435103 2475684 2518684 2551309 2570216 2584949 2609879 2650048 2696225
12219 2696225 2737027 2772558 2810058 2849972 2886774 2922904 2969350 3028376 3086628 3131664 3166337
12208 3166337 3200197 3235576 3270589 3308065 3351249 3396018 3437374 3479454 3528807 3581021 3625063
12197 3625063 3659831 3695877 3740294 3789659 3839320 3890188 3943046 3994256 4041906 4090777 4146787
12186 4146787 4210047 4276621 4344049 4412110 4480198 4546710 4610972 4675411 4745582 4825674 4912415
12175 4912415 4996787 5075307 5156241 5249518 5353092 5455666 5551564 5646202 5747079 5855898
12165 5855898 5969989 6084783 6193472 6290874 6380709 6474366 6579783 6695051 6814103 6933868
12155 6933868 7053587 7171670 7286725 7399385 7511274 7624652 7744142 7875364 8019399
$$ packed form
12230B379282J4069J4624K7128M0581M3000L2625J8907J4733K4930M0169M6177
12219B696225M0802L5531L7500L9914L6802L6130M6446N9026N8252M5036L4673
12208C166337L3860L5379L5013L7476M3184M4769M1356M2080M9353N2214M4042
12197C625063L4768L6046M4417M9365M9661N0868N2858N1210M7650M8871N6010
12186D146787O3260O6574O7428O8061O8088O6512O4262O4439P0171Q0092Q6741
12175D912415Q4372P8520Q0934R3277J03574J02574R5898R4638J00877J08819
12165E855898J14091J14794J08689R7402Q9835R3657J05417J15268J19052J19765
12155F933868J19719J18083J15055J12660J11889J13378J19490J31222J44035
$$ plain form
12146 8019399 8170296 8319793 8464488 8609247 8764444 8937348 9123989 9312759 9499222
12137 9499222 9692725 9902776 10124011 10343732 10561394 10789655 11035860 11292836 11550072
12128 11550072 11804895 12060547 12322570 12599638 12898088 13211863 13527374 13842236 14168721
12119 14168721 14513816 14868225 15223720 15589769 15980523 16393451 16814642 17240618 17681523
12110 17681523 18145033 18629953 19135450 19664502 20216526 20787473 21380624 22008283 22678556
12101 22678556 23387802 24130937 24913608 25749421 26649536 27619920 28665585 29791457 30999033
12092 30999033 32286644 33655070 35110711 36660908 38307257 40046641 41878813 43808523
12084 43808523 45838579 47967509 50201074 52562532 55083569 57787940 60694513 63836052
$$ packed form
12146H019399J50897J49497J44695J44759J55197J72904J86641J88770J86463
12137I499222J93503K10051K21235K19721K17662K28261K46205K56976K57236
12128A1550072K54823K55652K62023K77068K98450L13775L15511L14862L26485
12119A4168721L45095L54409L55495L66049L90754M12928M21191M25976M40905
12110A7681523M63510M84920N05497N29052N52024N70947N93151O27659O70273
12101B2678556P09246P43135P82671Q35813R00115R70384J045665J125872J207576
12092C0999033J287611J368426J455641J550197J646349J739384J832172J929710
12084D3808523K030056K128930K233565K361458K521037K704371K906573L141539
$$ plain form
12076 63836052 67262993 71025009 75157757 79688959 84644456 90043594 95903692 102261720
12068 102261720 109185606 116757631 125055632 134157294 144149484 155115280 167108275 180141355
12060 180141355 194198293 209262940 225349800 242489705 260637401 279572160 298924611
12053 298924611 318326867 337488563 356054360 373378843 388480011 400232042 407637706
12046 407637706 410054826 407362023 399994754 388733988 374339006 357355672 338279777
12039 338279777 317830652 296965074 276604962 257378246 239582152 223294456 208480614
12032 208480614 195061066 182957357 172096563 162370683 153614111 145642538 138307362
12025 138307362 131505937 125161261 119216360 113642155 108429276 103565521 99024132 94767664
$$ packed form
12076F3836052L426941L762016M132748M531202M955497N399138N860098O358028
12068A02261720O923886P572025Q298001R101662R992190J0965796J1992995J3033080
12060A80141355J4056938J5064647J6086860J7139905J8147696J8934759J9352451
12053B98924611J9402256J9161696J8565797J7324483J5101168J1752031P405664
12046D07637706K417120k692803p367269j1260766j4394982j6983334j9075895
12039C38279777k0449125k0865578k0360112j9226716j7796094j6287696j4813842
12032B08480614j3419548j2103709j0860794r725880q756572p971573p335176
12025A38307362o801425o344676n944901n574205n212879m863755m541389m256468
$$ plain form
12017 94767664 90754080 86941374 83293983 79786903 76405542 73148081 70028623 67067872
12009 67067872 64273193 61630977 59121396 56735586 54475368 52341192 50323918 48405387
12001 48405387 46566301 44797796 43104972 41493828 39956250 38474933 37040748 35655190
11993 35655190 34317035 33019831 31764839 30562720 29416537 28315123 27250896 26233593
11985 26233593 25276983 24380166 23531889 22727247 21969918 21260817 20592907 19956526 19345111
11976 19345111 18757294 18196141 17663926 17157054 16670815 16208049 15774084 15362384 14957197
11967 14957197 14554791 14169738 13812902 13474820 13140443 12809835 12492696 12190985 11899820
11958 11899820 11619478 11353699 11099972 10852843 10613305 10384418 10161743 9939437 9722478
$$ packed form
12017I4767664m013584l812706l647391l507080l381361l257461l119458k960751
12009F7067872k794679k642216k509581k385810k260218k134176k017274j918531
12001D8405387j839086j768505j692824j611144j537578j481317j434185j385558
11993C5655190j338155j297204j254992j202119j146183j101414j064227j017303
11985B6233593r56610q96817q48277q04642p57329p09101o67910o36381o11415
11976A9345111n87817n61153n32215n06872m86239m62766m33965m11700m05187
11967A4957197m02406l85053l56836l38082l34377l30608l17139l01711k91165
11958A1899820k80342k65779k53727k47129k39538k28887k22675k22306k16959
$$ plain form
11949 9722478 9521087 9334699 9151974 8965466 8777630 8595151 8425589 8274390 8135102
11940 8135102 7989141 7827965 7668605 7531337 7408411 7275162 7128697 6991675 6875624
11931 6875624 6765357 6647501 6530608 6423988 6318035 6203608 6093957 6005569 5927568 5832487
11921 5832487 5713717 5592792 5489646 5402479 5319475 5235748 5152569 5069133 4981952 4889675 4796502
11910 4796502 4711643 4641954 4581422 4512804 4426029 4330760 4243721 4168212 4095052 4019533 3946096
11899 3946096 3877616 3811631 3748145 3690595 3636853 3578863 3514235 3449510 3389051 3330038 3272848
11888 3272848 3226666 3197188 3175590 3148030 3111743 3073957 3038516 3002608 2965770 2933087 2906936
11877 2906936 2882158 2853411 2823104 2797583 2777667 2757609 2733150 2706189 2679693 2651514 2617025
$$ packed form
11949I722478k01391j86388j82725j86508j87836j82479j69562j51199j39288
11940H135102j45961j61176j59360j37268j22926j33249j46465j37022j16051
11931F875624j10267j17856j16893j06620j05953j14427j09651q8388p8001r5081
11921E832487j18770j20925j03146q7167q3004q3727q3179q3436q7181r2277r3173
11910D796502q4859o9689o0532o8618q6775r5269q7039p5509p3160p5519p3437
11899C946096o8480o5985o3486n7550n3742n7990o4628o4725o0459n9013n7190
11888C272848m6182k9478k1598k7560l6287l7786l5441l5908l6838l2683k6151
11877B906936k4778k8747l0307k5521j9916k0058k4459k6961k6496k8179l4489
$$ plain form
11866 2617025 2576762 2537690 2506412 2483812 2466539 2450273 2430539 2404215 2372815 2341869 2315147
11855 2315147 2291925 2270771 2251523 2231497 2205934 2177095 2156939 2152771 2153795 2141391 2112212 2081987
11843 2081987 2064717 2056290 2042282 2015742 1982758 1954185 1935528 1923031 1908147 1887274 1865570
11832 1865570 1847508 1827104 1796001 1760078 1736316 1729410 1722770 1700235 1667402 1641526 1627408 1615376
11820 1615376 1599171 1582563 1568018 1551055 1529588 1509564 1496386 1487336 1477017 1464740 1452035
11809 1452035 1437745 1420610 1403152 1388233 1374420 1358965 1342764 1328184 1314831 1302414 1294650
11798 1294650 1292972 1287569 1264149 1223300 1185566 1170492 1174718 1178046 1168942 1155284 1148749 1147853 1142784
11785 1142784 1131365 1121290 1117282 1114115 1105078 1091492 1079345 1069912 1058887 1044076 1029506 1020634
$$ packed form
11866B617025m0263l9072l1278k2600j7273j6266j9734k6324l1400l0946k6722
11855B315147k3222k1154j9248k0026k5563k8839k0156m168J024j2404k9179l0225
11843B081987j7270q427j4008k6540l2984k8573j8657j2497j4884k0873k1704
11832A865570j8062k0404l1103l5923k3762o906o640k2535l2833k5876j4118j2032
11820A615376j6205j6608j4545j6963k1467k0024j3178r050j0319j2277j2705
11809A452035j4290j7135j7458j4919j3813j5455j6201j4580j3353j2417p764
11798A294650j678n403k3420m0849l7734j5074M226L328r104j3658o535q96n069
11785A142784j1419j0075m008l167r037j3586j2147r433j1025j4811j4570q872
$$ plain form
11773 1020634 1017886 1016490 1011971 1004905 1000234 1002000 1009021 1016237 1019792 1019558 1017298 1014936 1015008 1019487 1026268
11758 1026268 1029731 1027365 1022826 1018875 1010741 993095 972574 964920 976165 993142 998603 991807 987016
11745 987016 993094 1002690 1003862 995643 986800 983133 982723 983170 986655 994409 1000335 995586 979572 962553
11731 962553 955278 957678 959793 953212 939218 924884 913668 903320 892724 885724 884473 882552 871735
11718 871735 855901 850591 864073 884081 889906 875180 852155 834790 825110 817073 806360 792989
11706 792989 780031 773589 778719 790741 795739 786250 772549 770039 777136 775829 756890 734878 730298
11693 730298 742268 749232 736982 716061 706051 709879 713204 706844 698411 698175 703162 703073 695304 684434
11679 684434 671304 654391 640509 640777 653302 662325 659529 654345 656298 659536 655238 648022 645993
$$ packed form
11773A020634k748j396m519p066m671J766P021P216L555k34k260k362P2M479O781
11758A026268L463k366m539l951q134j7646k0521p654J1245J6977N461o796m791
11745I87016O078R596J172q219q843l667m10M47L485P754N926m749j6014j7019
11731I62553p275K400K115o581j3994j4334j1216j0348j0596p000j251j921j0817
11718H71735j5834n310J3482K0008N825j4726k3025j7365r680q037j0713j3371
11706G92989j2958o442N130J2022M998r489j3701k510P097j307j8939k2012m580
11693G30298J1970O964j2250k0921j0010L828L325o360q433k36M987q9p769j0870
11679F84434j3130j6913j3882K68J2525R023k796n184J953L238m298p216k029
$$ plain form
11666 645993 643540 631207 617152 618874 633884 638785 622476 601859 595728 599211 596652 587232 582718
11653 582718 587366 594814 600801 605216 603346 588661 566283 552703 557675 573067 583104 580716 570961
11640 570961 562261 557578 553161 544634 533450 525163 521212 516985 510181 505619 507464 511941 513396 512556
11626 512556 511781 506939 493192 476296 468686 474723 487316 497737 501099 494794 481497 472089 474400
11613 474400 479793 473460 458148 452424 461909 468764 458037 439383 430659 432572 434448 435568 443396
11600 443396 455241 459046 452479 446438 447425 449230 445848 441743 444038 452197 459921 461698 455064 442330
11586 442330 431828 431058 436823 438581 432869 427014 427033 430542 434453 440036 445192 441196 425166 408643
11572 408643 404773 411700 417131 415431 411418 409936 410522 411238 410025 403564 392727 387473 396320 410435
$$ packed form
11666F45993k453j2333j4055J722J5010M901j6309k0617o131L483k559r420m514
11653E82718M648P448N987M415j870j4685k2378j3580M972J5392J0037k388r755
11640E70961q700m683m417q527j1184q287l951m227o804m562J845M477J455q40
11626E12556p75m842j3747j6896p610O037J2593J0421L362o305j3297r408K311
11613D74400N393o333j5312n724R485O855j0727j8654q724J913J876J120P828
11600D43396J1845L805o567o041R87J805l382m105K295Q159P724J777o634j2734
11586D42330j0502p70N765J758n712n855J9L509L911N583N156l996j6030j6523
11572D08643l870O927N431j700m013j482N86P16j213o461j0837n254Q847J4115
$$ plain form
11558 410435 409295 386603 361448 356871 373431 391369 395328 389535 389129 402055 420788 429840 421487
11545 421487 404520 395078 398277 403716 401789 398033 404137 418897 428163 424092 414717 410573 410092 405079
11531 405079 395063 387419 384927 381730 373335 364189 362037 368898 380760 392811 401336 402874 395965
11518 395965 383746 372090 364932 362627 363784 366922 371353 378021 387825 397507 400403 394763 387869 386396
11504 386396 385742 377095 363727 359378 367794 375331 370913 363019 365717 375256 375159 362208 351837 354853
11490 354853 362756 362961 357194 354953 356366 353000 342839 334487 336119 346937 359837 367436 366019 358790
11476 358790 354934 360447 369903 371923 362473 347965 335724 327204 321252 318172 318490 321805 327727 333537
11462 333537 331564 316374 295906 286462 292248 298958 295110 291047 304510 332026 349774 344606 330306
$$ packed form
11558D10435j140k2692k5155m577J6560J7938L959n793m06J2926J8733R052q353
11545D21487j6967r442L199N439j927l756O104J4760R266m071r375m144m81n013
11531D05079j0016p644k492l197q395r146k152O861J1862J2051Q525J538o909
11518C95965j2219j1656p158k305J157L138M431O668R804R682K896n640o894j473
11504C86396o54q647j3368m349Q416P537m418p894K698R539r7j2951j0371L016
11490C54853P903K05n767k241J413l366j0161q352J632J0818J2900P599j417p229
11476C58790l856N513R456K020r450j4508j2241q520n952l080L18L315N922N810
11462C33537j973j5190k0468r444N786O710l848m063J3463K7516J7748n168j4300
$$ plain form
11449 330306 326701 334196 339377 337699 336485 337347 330738 313475 300028 305518 322937 329789 317921
11436 317921 304908 309528 324839 326878 307314 284875 280441 291030 297255 290589 281437 280303 282860
11423 282860 279826 273280 272968 279135 279875 268410 254423 251691 259424 264168 259117 253129 257811 272272
11409 272272 286008 293050 296798 301754 306861 309132 309489 311218 314085 313459 306236 295950 289948 291168
11395 291168 294784 295039 293299 294877 298626 296695 287094 278888 278899 280217 273155 262480 261605 271681 280177
11380 280177 281434 283958 292283 296341 288379 277948 277505 282672 281109 273864 271820 274855 271987 262711
11366 262711 261439 276073 295869 306920 308738 308869 310612 313400 317773 322417 321510 311200 294911
11353 294911 278500 264849 255623 251625 248402 239622 229030 229962 246369 262845 262387 248100 238430
$$ packed form
11449C30306l605P495N181j678j214Q62o609j7263j3447N490J7419O852j1868
11436C17921j3013M620J5311K039j9564k2439m434J0589O225o666r152j134K557
11423B82860l034o546l12O167P40j1465j3987k732P733M744n051n988M682J4461
11409B72272J3736P042L748M956N107K271L57J729K867o26p223j0286o002J220
11395B91168L616K55j740J578L749j931r601q206J1J318p062j0675q75J0076Q496
11380B80177J257K524Q325M058p962j0431m43N167j563p245k044L035k868r276
11366B62711j272J4634J9796J1051J818J31J743K788M373M644r07j0310j6289
11353B94911j6411j3651r226l998l223q780j0592R32J6407J6476m58j4287r670
$$ plain form
11340 238430 244849 261857 275717 276962 267853 261950 270935 288177 293766 280732 264727 259823 258904
11327 258904 251508 246668 257395 272490 269091 249926 241852 254979 268827 266443 258268 260195 268996
11314 268996 274810 280487 291075 297921 291577 280202 277153 278984 274533 268935 277429 297246 306229
11301 306229 292523 268886 252981 247742 246727 246391 246290 246741 252343 269471 294744 313948 318358
11288 318358 314889 313622 312454 302967 287121 277859 282684 294455 301556 302043 303073 308601 313735 313305
11274 313305 310777 312739 317361 317026 312935 316406 330369 339718 329823 307476 291808 289454 292249 296909
11260 296909 310601 333606 351096 350554 338435 332018 340847 361745 385602 402852 407799 404322 403996
11247 403996 413579 427584 436897 440028 441230 442337 442822 445084 453432 468416 486181 503060 518674
$$ packed form
11340B38430O419J7008J3860J245r109n903Q985J7242N589j3034j6005m904r19
11327B58904p396m840J0727J5095l399j9165q074J3127J3848k384q175J927Q801
11314B68996N814N677J0588O846o344j1375l049J831m451n598Q494J9817Q983
11301C06229j3706k3637j5905n239j015l36j01M51N602J7128K5273J9204M410
11288C18358l469j267j168r487j5846r262M825J1771P101M87J030N528N134m30
11274C13305k528J962M622l35m091L471J3963R349r895k2347j5668k354K795M660
11260B96909J3692K3005J7490n42j2119o417Q829K0898K3857J7250M947l477l26
11247D03996R583J4005R313L131J202J107M85K262Q348J4984J7765J6879J5614
$$ plain form
11234 518674 535808 558467 587829 619610 648824 677319 711640 752878 795113 835765 880292
11223 880292 933166 991095 1049651 1110563 1178208 1255017 1344209 1449536 1567205 1686020 1801701
11212 1801701 1922606 2053871 2185268 2304932 2416153 2527057 2629786 2704735 2742497 2747663
11202 2747663 2723196 2666295 2580156 2475180 2356063 2220876 2075588 1935703 1808896 1688988
11192 1688988 1572858 1470391 1389359 1321534 1253653 1183902 1118220 1057920 1001486 953063 918138
11181 918138 893194 868466 839343 807880 775694 743638 716982 701711 693844 679400 648601 606629
11169 606629 567848 541769 527181 518830 516016 521080 530159 531689 518826 499133 484897 476513 464249
11156 464249 445177 427584 417195 410241 403783 401394 402751 398934 386609 376961 380082 388391 386958
$$ packed form
11234E18674J7134K2659K9362L1781K9214K8495L4321M1238M2235M0652M4527
11223H80292N2874N7929N8556O0912O7645P6809Q9192J05327J17669J18815J15681
11212A801701J20905J31265J31397J19664J11221J10904J02729P4949L7762N166
11202B747663k4467n6901q6139j04976j19117j35187j45288j39885j26807j19908
11192A688988j16130j02467q1032o7825o7881o9751o5682o0300n6434m8423l4925
11181I18138k4944k4728k9123l1463l2186l2056k6656j5271p867j4444l0799m1972
11169F06629l8781k6079j4588q351k814N064R079J530j2863j9693j4236q384j2264
11156D64249j9072j7593j0389o954o458k389J357l817j2325r648L121Q309j433
$$ plain form
11143 386958 374347 361595 354799 350248 344163 336742 328388 321030 320455 328332 335579 333445 326845 325402
11129 325402 325976 318028 303031 292478 287484 277604 261809 252957 256332 260313 255614 248305 244900 239416
11115 239416 226666 215698 216938 225518 229514 226120 218223 204702 187791 180899 192520 208655 208917
11102 208917 196407 192943 205396 216569 213419 205386 205708 209943 205655 193491 185265 185791 188279 186916
11088 186916 185150 189798 201804 214403 218668 211350 198516 190168 190260 193469 192009 183138 169930 158357
11074 158357 154580 161320 174728 187070 193515 194331 191245 185767 180903 179389 179421 177274 174888 178431
11060 178431 187407 192436 187847 179753 176310 176246 174127 171818 175656 184625 190653 191137 192940 201212 210353
11045 210353 210322 199209 186550 184745 197682 216924 229603 230917 227150 225709 226639 227271 229595 235697
$$ packed form
11143C86958j2611j2752o796m551o085p421q354p358n75P877P247k134o600j443
11129C25402N74p948j4997j0553m994r880j5795q852L375L981m699p309l405n484
11115B39416j2750j0968J240Q580L996l394p897j3521j6911o892J1621J6135K62
11102B08917j2510l464J2453J1173l150q033L22M235m288j2164q226N26K488j363
11088A86916j766M648J2006J2599M265p318j2834q348R2L209j460q871j3208j1573
11074A58357l777O740J3408J2342O445Q16l086n478m864j514L2k147k386L543
11060A78431Q976N029m589q094l443o4k119k309L838Q969O028M84J803Q272R141
11045B10353l1j1113j2659j805J2937J9242J2679J314l767j441R30O32K324O102
$$ plain form
11031 235697 239555 233213 220555 214517 218575 221550 215566 208924 212974 224148 229427 224767 217257 211737
11017 211737 206901 204548 210732 224192 233826 233627 232529 242647 262951 281196 288427 285728 279934
11004 279934 278709 287125 302616 314709 315467 309016 305623 308606 313532 318100 324161 330362 332629 334328
10990 334328 346405 372418 401213 420651 432376 446381 466227 487156 505238 521023 536465
10979 536465 554714 580729 615839 654212 691131 731586 782755 840876 895508 945740 1001553
10968 1001553 1068626 1142975 1222836 1313759 1416778 1522556 1624164 1725315 1827323 1918019
10958 1918019 1985578 2035781 2081178 2116922 2122592 2088443 2026039 1950153 1863609 1766324 1667435
10947 1667435 1577352 1493057 1401417 1296522 1187678 1090519 1014160 956068 905796 854352 802607
$$ packed form
11031B35697L858o342j2658o038M058K975n984o642M050J1174N279m660p510n520
11017B11737m836k353O184J3460R634j99j098J0118K0304J8245P231k699n794
11004B79934j225Q416J5491J2093P58o451l393K983M926M568O061O201K267J699
10990C34328J2077K6013K8795J9438J1725J4005J9846K0929J8082J5785J5442
10979E36465J8249K6015L5110L8373L6919M0455N1169N8121N4632N0232N5813
10968A001553O7073P4349P9861R0923J03019J05778J01608J01151J02008R0696
10958A918019O7559N0203M5397L5744N670l4149o2404p5886q6544r7285r8889
10947A667435r0083q4295r1640j04895j08844r7159p6359n8092n0272n1444n1745
$$ plain form
10936 802607 759447 729557 705800 677921 646936 624548 616424 611158 590902 551975 510385 485146
10924 485146 479104 479264 473655 462157 450089 438034 423059 405429 387384 367791 345576 327237
10912 327237 321992 328133 333287 331555 331116 338811 346300 341550 328128 320861 323942 325367 314989 297482
10898 297482 282657 271256 256999 237811 218811 206526 204346 211131 220421 223555 217657 208856 204547
10885 204547 205324 208311 214524 225921 236756 236418 223488 210256 208382 214106 213439 200829 187201
10872 187201 187621 203720 220953 223077 207892 188009 177141 177733 182456 184761 184562 184610 185423 185009 181038
10857 181038 172542 161968 155717 158732 167399 172335 170510 169497 175669 183639 184253 179145 178214 183721
10843 183721 186890 182313 176187 175355 176333 172505 166557 167158 175617 183419 182699 173611 162133 156028 161991
$$ packed form
10936H02607m3160k9890k3757k7879l0985k2388q124n266k0256l8927m1590k5239
10924D85146o042J60n609j1498j2068j2055j4975j7630j8045j9593k2215j8339
10912C27237n245O141N154j732m39P695P489m750j3422p267L081J425j0378j7507
10898B97482j4825j1401j4257j9188j9000j2285k180O785R290L134n898q801m309
10885B04547P77K987O213J1397J0835l38j2930j3232j874N724o67j2610j3628
10872A87201M20J6099J7233K124j5185j9883j0868N92M723K305j99M8Q13m14l971
10857A81038q496j0574o251L015Q667M936j825j013O172P970O14n108r31N507
10843A83721L169m577o126q32R78l828n948O01Q459P802p20r088j1478o105N963
$$ plain form
10828 161991 180074 199711 206994 198560 185045 179182 183205 189076 188729 183018 181243 190540 205048
10815 205048 210246 201819 194158 201795 216999 218221 200432 183330 185102 200617 213278 217839 220883
10802 220883 225609 227457 222018 208982 190806 173936 167392 173313 183106 189145 193954 200532 202900
10789 202900 198194 198811 215309 233776 231763 214840 212587 233764 251148 242879 225135 224833 239060
10776 239060 246042 243855 250274 267943 277046 267290 254794 257833 271999 279661 272578 255925 238819
10763 238819 229153 230990 240026 246905 249309 254080 263854 270817 269734 267935 273922 283571 287058 283570
10749 283570 279279 275464 269259 263223 263407 268815 272387 271957 270979 268906 261634 253068 255070 271154 289454
10734 289454 297969 298983 301164 304359 302241 296557 297524 308589 319868 321298 316272 316033 323578 330258
$$ packed form
10828A61991J8083J9637P283q434j3515n863M023N871l47n711j775R297J4508
10815B05048N198q427p661P637J5204J222j7789j7102J772J5515J2661M561L044
10802B20883M726J848n439j3036j8176j6870o544N921R793O039M809O578K368
10789B02900m706O17J6498J8467k013j6923k253K1177J7384q269j7744l02J4227
10776B39060O982k187O419J7669R103r756j2496L039J4166P662p083j6653j7106
10763B38819r666J837R036O879K404M771R774O963j083j799N987R649L487l488
10749B83570m291l815o205o036J84N408L572m30r78k073p272q566K002J6084J8300
10734B89454Q515J014K181L195k118n684R67J1065J1279J430n026k39P545O680
$$ plain form
10720 330258 328988 324391 325878 334870 344743 351613 358232 366540 373745 379131 387831 402261 415786 422344
10706 422344 427237 438294 449325 445202 425134 408488 411508 428022 441138 446324 452831 466507
10694 466507 481985 492245 497721 503416 511567 519393 522459 520399 520003 529538 547734 562872 567378
10681 567378 568856 579907 600612 619807 632000 642737 656093 667665 675004 686070 709209 739652
10669 739652 764123 777053 785405 797680 814178 830006 843930 861417 889396 928746 972030 1009334
10657 1009334 1036888 1059427 1084299 1114982 1150711 1190092 1233371 1282235 1338416 1401637 1468545
10646 1468545 1534924 1599522 1665192 1737304 1822125 1923856 2038963 2154982 2260694 2358053
10636 2358053 2459355 2572974 2698092 2833101 2979600 3134685 3288778 3437696 3588912
$$ packed form
10720C30258j270m597J487Q992R873O870O619Q308P205N386Q700J4430J3525O558
10706D22344M893J1057J1031m123k0068j6646L020J6514J3116N186O507J3676
10694D66507J5478J0260N476N695Q151P826L066k060l96R535J8196J5138M506
10681E67378J478J1051K0705J9195J2193J0737J3356J1572P339J1066K3139L0443
10669G39652K4471J2930Q352J2275J6498J5828J3924J7487K7979L9350M3284L7304
10657A009334K7554K2539K4872L0683L5729L9381M3279M8864N6181O3221O6908
10646A468545O6379O4598O5670P2112Q4821J01731J15107J16019J05712R7359
10636B358053J01302J13619J25118J35009J46499J55085J54093J48918J51216
$$ plain form
10627 3588912 3747858 3905313 4048996 4182857 4322885 4475599 4632631 4787281 4944755
10618 4944755 5112063 5286515 5459046 5623096 5776769 5921031 6058017 6186819 6300783
10609 6300783 6394892 6475402 6554334 6634539 6710145 6782665 6863521 6955099 7041546 7106706 7150266
10598 7150266 7176246 7176755 7142039 7079897 7009205 6936762 6855158 6762200 6666925 6574494 6479724 6379838
10586 6379838 6280291 6181828 6073740 5948127 5811434 5673692 5534987 5391612 5247414 5107132
10576 5107132 4963265 4802497 4625275 4449006 4289883 4148433 4014245 3878335 3738234
10567 3738234 3595188 3449341 3297733 3139127 2981839 2840459 2718548 2600251 2469348
10558 2469348 2333664 2217562 2129203 2049317 1958117 1859964 1770938 1693018 1615890 1539101 1475161
$$ packed form
10627C588912J58946J57455J43683J33861J40028J52714J57032J54650J57474
10618D944755J67308J74452J72531J64050J53673J44262J36986J28802J13964
10609F300783R4109Q0510P8932Q0205P5606P2520Q0856R1578Q6447O5160M3560
10598G150266K5980N09l4716o2142p0692p2443q1604r2958r5275r2431r4770r9886
10586F379838r9547r8463j08088j25613j36693j37742j38705j43375j44198j40282
10576E107132j43867j60768j77222j76269j59123j41450j34188j35910j40101
10567C738234j43046j45847j51608j58606j57288j41380j21911j18297j30903
10558B469348j35684j16102q8359p9886r1200r8153q9026p7920p7128p6789o3940
$$ plain form
10547 1475161 1428671 1386655 1335665 1278359 1226277 1183969 1147581 1112965 1077237 1036715 991329
10536 991329 947851 911064 875329 834448 796933 778358 777094 771472 747366 716205 695529 682115
10524 682115 659105 624207 593707 577689 567131 550892 531775 516866 502823 482496 459409
10513 459409 443356 435137 427410 418639 413361 408161 391473 362587 338517 332940 337138 332316 314729
10500 314729 297019 288060 283979 279302 275026 272232 267641 260777 257895 263226 272504 280271 287158 293892
10486 293892 294742 284955 269533 255852 242178 223796 206772 202666 209897 213741 207582 201344 203725
10473 203725 208536 206940 202697 204508 210485 211456 205249 197518 191645 187150 185079 185578 182765 171810
10459 171810 159132 155641 161386 167054 169140 171940 174944 171504 162587 159235 166774 177558 184057 187958
$$ packed form
10547A475161m6490m2016n0990n7306n2082m2308l6388l4616l5728m0522m5386
10536I91329m3478l6787l5735m0881l7515j8575j264n622k4106l1161k0676j3414
10524F82115k3010l4898l0500j6018j0558j6239j9117j4909j4043k0327k3087
10513D59409j6053q219p727q771n278n200j6688k8886k4070n577M198m822j7587
10500C14729j7710q959m081m677m276k794m591o864k882N331R278P767O887O734
10486B93892Q50r787j5422j3681j3674j8382j7024m106P231L844o159o238K381
10473B03725M811j596m243J811N977R71o207p731n873m495k071M99k813j0955
10459A71810j2678l491N745N668K086K800L004l440q917l352P539J0784O499L901
$$ plain form
10445 187958 190607 186097 172410 159938 159422 168347 177399 183291 186723 184753 174955 162200 152888 147360
10431 147360 144972 149226 158860 162014 151120 137135 135911 145606 151548 149528 148981 154753 161019 163551
10417 163551 163791 160290 150741 143519 151122 168695 175004 160492 139747 129537 129010 130016 132843 140269
10403 140269 146958 146776 143032 141834 142590 143257 146272 150568 147155 132789 118998 116628 120412 120717 120941
10388 120941 128350 135626 129153 111861 100862 103341 109992 112196 111316 110316 109546 111708 118201 120366
10374 120366 108219 88984 82388 94954 113037 124204 130069 133091 127204 110933 96429 94389
10362 94389 99648 101442 99234 98862 100786 101579 100772 98267 91628 83192 81992 90389 97003 92268 82945
10347 82945 80630 83837 84066 82761 87278 93936 91053 78743 70969 75166 82159 80350 69835 58297
$$ packed form
10445A87958K649m510j3687j2472n16Q925R052N892L432j970r798j2755r312n528
10431A47360k388M254R634L154j0894j3985j224R695N942k020n47N772O266K532
10417A63551K40l501r549p222P603J7573O309j4512k0745j0210n27J006K827P426
10403A40269O689j82l744j198P56O67L015M296l413j4366j3791k370L784L05K24
10388A20941P409P276o473j7292j0999K479O651K204q80j000p70K162O493K165
10374A20366j2147j9235o596J2566J8083J1167N865L022n887j6271j4504k040
10362I4389N259J794k208l72J924P93q07k505o639q436j200Q397O614m735r323
10347H2945k315L207K29j305M517O658k883j2310p774M197O993j809j0515j1538
$$ plain form
10333 58297 51592 52925 63781 80213 93009 95986 91613 86902 86964 92928 101717 106920 103797 94247
10319 94247 84126 76838 72986 73698 79054 85536 90706 97631 108204 115962 114212 107686 105226 103623
10305 103623 92102 72523 60135 61213 64539 60350 53685 51987 53562 57411 70445 92652 107778
10292 107778 104165 94925 100107 115995 121285 110110 98496 96960 96726 89159 81448 83241 90817 95506
10278 95506 98097 103634 108740 105542 94965 86527 86099 90942 95671 97053 93969 88314 85620 90456
10264 90456 101341 112772 120179 120161 109994 92556 78807 78263 87609 95003 95260 93867 95307 95489
10250 95489 89710 81851 79731 84527 90189 91627 88586 82302 73588 65313 62414 66556 72926 75159
10236 75159 72819 71609 75926 83385 88204 88712 88985 92527 96544 94607 84390 70981 62430 63243 71934
$$ packed form
10333E8297o705J333J0856J6432J2796K977m373m711O2N964Q789N203l123r550
10319I4247j0121p288l852P12N356O482N170O925J0573P758j750o526k460j603
10305A03623j1521j9579j2388J078L326m189o665j698J575L849J3034K2207J5126
10292A07778l613r240N182J5888N290j1175j1614j536k34p567p711J793P576M689
10278I5506K591N537N106l198j0577q438m28M843M729J382l084n655k694M836
10264I0456J0885J1431P407j8j0167j7438j3749n44R346P394K57j393J440J82
10250I5489n779p859k120M796N662J438l041o284q714q275k899M142O370K233
10236G5159k340j210M317P459M819N08K73L542M017j937j0217j3409q551Q13Q691
$$ plain form
10221 71934 83023 90935 93666 93814 95301 98699 100867 99347 95292 91206 87634 83483 78095 71333
10207 71333 62958 53839 46918 45200 49389 58515 71190 84474 93667 96324 95162 94021 92680 89578
10193 89578 87561 90783 96205 95502 87690 82905 89050 100246 104533 99397 93189 92940 96915 99007 95619
10178 95619 87943 81093 80571 86202 90681 88077 82344 82545 90571 99247 102539 101691 100281 99246 99065
10163 99065 101600 106751 111283 113487 115028 115739 111112 98863 84662 77044 78263 83351 86779 87256
10149 87256 87006 88656 92525 95878 95223 89228 78943 67536 62013 70735 92430 110399 107526 88015
10135 88015 74205 78621 89428 89164 77822 68412 67228 69186 68654 65131 60073 55704 55172 58118
10121 58118 59587 58979 64354 80024 95897 99191 91757 84978 82533 80966 82655 92146 101221 95073
$$ packed form
10221G1934J1089P912K731J48J487L398K168j520m055m086l572m151n388o762
10207G1333q375r119o921j718M189R126J2675J3284R193K657j162j141j341l102
10193H9578k017L222N422p03p812m785O145J1196M287n136o208k49L975K092l388
10178I5619p676o850n22N631M479k604n733K01Q026Q676L292q48j410j035j81
10163I9065K535N151M532K204J541P11m627j2249j4201p618J219N088L428M77
10149H7256k50J650L869L353o55n995j0285j1407n523Q722K1695J7969k873j9511
10135H8015j3810M416J0807k64j1342r410j184J958n32l523n058m369n32K946
10121E8118J469o08N375J5670J5873L294p434o779k445j567J689R491R075o148
$$ plain form
10107 95073 75570 61896 63846 70273 69715 66575 68660 73519 77222 83306 91871 92679 82139 75478
10093 75478 86763 106186 113791 108699 106898 114084 119260 115186 108155 104845 104237 106242 114634 126034
10079 126034 127979 115118 98633 92836 98843 106869 108967 104641 98748 98054 105767 116266 119256 111705
10065 111705 101676 98312 102410 108856 113744 116407 117960 120137 123392 125841 126414 127135 128124 123482 108969
10050 108969 91246 80862 77935 75330 74993 87288 111025 128344 126890 115568 109621 110427 110339 108504
10036 108504 109392 111426 109447 105085 103324 101545 93618 83499 82557 92268 100796 99765 94368 92317
10022 92317 91802 87502 82344 84490 94052 100289 94460 81380 74268 78942 87292 88424 82350 77534
10008 77534 77334 76778 73630 73885 81769 91409 94392 90079 82627 73464 63750 59013 62824 69156 68812
$$ packed form
10107I5073j9503j3674J950O427n58l140K085M859L703O084Q565Q08j0540o661
10093G5478J1285J9423P605n092j801P186N176m074p031l310o08K005Q392J1400
10079A26034J945j2861j6485n797O007Q026K098m326n893o94P713J0499K990p551
10065A11705j0029l364M098O446M888K663J553K177L255K449N73P21R89m642j4513
10050A08969j7723j0384k927k605l37J2295K3737J7319j454j1322n947Q06q8j835
10036A08504Q88K034j979m362j761j779p927j0119r42R711Q528j031n397k051
10022I2317n15m300n158K146R562O237n829j3080p112M674Q350J132o074m816
10008G7534k00n56l148K55P884R640K983m313p452r163r714m737L811O332l44
$$ plain form
9993 68812 60556 49199 37655 29651 34506 56580 82631 92992 85202 74311 70220 68986 67755
9980 67755 71581 79439 79044 65391 51860 51559 58084 57529 51431 53020 64696 73952 72504 67771 71576
9965 71576 84631 96267 96720 87803 81204 84206 88112 77728 54155 38480 46129 66165 75756
9952 75756 68668 58247 56684 63531 72680 79021 78760 73742 74643 88854 106085 108640 96461 88059
9938 88059 94049 104698 109040 110600 114124 110785 91588 66947 56752 64057 72925 72165 68080 70554
9924 70554 77397 79300 74977 74528 87021 106878 115382 99334 68038 45831 45322 55046 58358 55996
9910 55996 60340 73667 85273 88542 87886 87239 83758 77093 74537 80879 90539 95272 93721 88879 82324
9895 82324 75609 71532 69461 65164 59229 58648 65238 70367 67551 62160 60744 59229 52112 45448 47505
$$ packed form
9993F8812q256j1357j1544q004M855K2074K6051J0361p790j0891m091j234j231
9980F7755L826P858l95j3653j3531l01O525n55o098J589J1676R256j448m733L805
9965G1576J3055J1636M53q917o599L002L906j0384k3573j5675P649K0036R591
9952G5756p088j0421j563O847R149O341k61n018R01J4211J7231K555j2179q402
9938H8059N990J0649M342J560L524l339j9197k4641j0195P305Q868p60m085K474
9924G0554O843J903m323m49J2493J9857Q504j6048l1296k2207n09R724L312k362
9910E5996M344J3327J1606L269o56o47l481o665k556O342R660M733j551m842o555
9895H2324o715m077k071m297n935n81O590N129k816n391j416j515p117o664K057
$$ plain form
9880 47505 52578 49375 41689 43428 53785 56191 45438 36892 40773 44898 35319 19635 14463 20236
9866 20236 25124 27176 35266 50594 63477 69159 72773 76506 74687 65716 58005 58369 62172 60515
9852 60515 52344 45534 48815 63433 79627 83327 71881 60468 65109 81736 91914 87625 78277
9839 78277 72828 68569 61260 53647 48537 44590 43856 51632 63812 68171 64890 69872 87510 97500
9825 97500 84614 65918 67195 83892 90266 80713 74885 82259 89182 86886 86635 95666 100487 89995
9811 89995 77959 84120 104283 117029 113116 102262 95685 96901 106751 123097 136103 136446 128875
9798 128875 126882 133544 138613 136108 133309 137559 143515 140701 128300 115408 108873 106891 105051 104302
9784 104302 109569 120632 127858 121242 103804 91105 94607 109389 122117 127366 130307 135353 139283
$$ packed form
9880D7505N073l203p686J739J0357K406j0753q546L881M125r579j5684n172N773
9866B0236M888K052Q090J5328J2883N682L614L733j819q971p711L64L803j657
9852F0515q171o810L281J4618J6194L700j1446j1413M641J6627J0178m289r348
9839G8277n449m259p309p613n110l947p34P776J2180M359l281M982J7638R990
9825I7500j2886j8696J277J6697O374r553n828P374O923k296k51R031M821j0492
9811H9995j2036O161K0163J2746l913j0854o577J216R850J6346J3006L43p571
9798A28875j993O662N069k505k799M250N956k814j2401j2892o535j982j840p49
9784A04302N267J1063P226o616j7438j2699L502J4782J2728N249K941N046L930
$$ plain form
9771 139283 137096 129622 122123 117378 112810 104986 96007 93250 100692 112300 118354 117597 117115 119543 118349
9756 118349 109465 99624 96612 97622 95195 89830 87882 90393 93256 96262 102364 108497 106567 94806
9742 94806 80399 69757 63453 61458 65208 72061 74820 69991 61464 54167 49021 45241 42560 40525
9728 40525 40343 46242 58718 68874 68835 66250 75973 95776 104271 88977 64249 52759 58868 69579
9714 69579 73566 68901 58153 46612 41914 46316 51781 49739 42279 37038 35813 36048 38695 45222
9700 45222 50451 48180 41644 39317 42619 47003 52478 62184 71936 73142 67142 65255 71870 77940 75376
9685 75376 68749 67447 73252 80707 84346 81523 73064 64801 64174 72212 82187 87411 86391 80505 72443
9670 72443 67198 67945 70707 70410 71572 82736 99479 105879 97301 88383 90461 93952 85063 69288
$$ packed form
9771A39283k187p474p499m745m568p824q979k757P442J1608O054p57m82K428j194
9756A18349q884r841l012J010k427n365j948K511K863L006O102O133j930j1761
9742I4806j4407j0642o304j995L750O853K759m829q527p297n146l780k681k035
9728D0525j82N899J2476J0156l9k585R723J9803Q495j5294k4728j1490O109J0711
9714F9579L987m665j0748j1541m698M402N465k042p460n241j225K35K647O527
9700D5222N229k271o536k327L302M384N475R706R752J206o000j887O615O070k564
9685G5376o627j302N805P455L639k823q459q263o27Q038R975N224j020n886q062
9670G2443n245P47K762k97J162J1164J6743O400q578q918K078L491q889j5775
$$ plain form
9656 69288 62854 67121 68356 61330 56638 61330 66322 60274 46870 40225 47303 60839 68180 64024
9642 64024 55064 52565 59386 66326 64071 55456 50330 51075 51422 49056 49782 56409 62343 61718 59106 62090
9626 62090 68509 68957 60697 51883 50369 53547 52548 43843 32792 25979 24083 24827 29443 40001 50697
9611 50697 50272 37918 29706 40635 64110 78805 74407 60535 50116 45405 43687 45533 50584
9598 50584 53795 53373 55188 61486 62559 49764 31240 22907 26765 30392 27371 25498 32084 42685
9584 42685 49753 53183 55604 54398 46090 34482 27561 28311 33088 36520 34073 23174 6918 -5448
9570 -5448 -6438 2477 14540 25591 34273 37975 34799 28325 24982 27197 33257 41897 51551 57032 54072
9555 54072 46949 44576 48277 50121 44319 33248 20842 8130 -1827 -3118 3985 10799 12845 17349
$$ packed form
9656F9288o434M267J235p026m692M692M992o048j3404o645P078J3536P341m156
9642F4024q960k499O821O940k255q615n126P45L47k366P26O627N934o25k612K984
9626F2090O419M48q260q814j514L178r99q705j1051o813j896P44M616J0558J0696
9611E0697m25j2354q212J0929K3475J4695m398j3872j0419m711j718J846N051
9598E0584L211m22J815O298J073j2795j8524q333L858L627l021j873O586J0601
9584D2685P068L430K421j206q308j1608o921P50M777L432k447j0899j6256j2366
9570e448r90Q915J2063J1051Q682L702l176o474l343K215O060Q640R654N481k960
9555E4072p123k373L701J844n802j1071j2406j2712r957j291P103O814K046M504
$$ plain form
9541 17349 31035 47570 56346 57875 59568 60540 53556 41041 35926 44123 57380 66698 71864 73481
9527 73481 67318 54117 44894 46648 50698 46266 39295 44169 59397 66475 55695 39984 36069 41504
9513 41504 40309 26756 13047 12910 25769 40646 49870 53014 50239 40202 27294 23874 37744
9500 37744 59568 70485 63035 47815 38015 35404 35621 38755 46036 51075 44818 28873 15497 13157
9486 13157 18767 25573 31901 38892 44837 46510 44231 42379 44923 51264 56432 56148 51993 49254 48882
9471 48882 46150 40136 38359 45490 52897 49176 38014 33875 40091 43860 36118 24100 18144 17174
9457 17174 15951 17284 25690 35008 34829 27186 25214 33969 42205 36934 19801 4659 2092 9911
9443 9911 18078 20531 20341 22636 25391 22237 13860 9459 14073 21247 22989 20869 21033 23699 25352
$$ packed form
9541A7349J3686J6535Q776J529J693R72o984j2515n115Q197J3257R318N166J617
9527G3481o163j3201r223J754M050m432o971M874J5228P078j0780j5711l915N435
9513D1504j195j3553j3709j37J2859J4877R224L144k775j0037j2908l420J3870
9500C7744K1824J0917p450j5220r800k611K17L134P281N039o257j5945j3376k340
9486A3157N610O806O328O991N945J673k279j852K544O341N168k84m155k739l72
9471D8882k732o014j777P131P407l721j1162m139O216L769p742j2018n956r70
9457A7174j223J333Q406R318j79p643j972Q755Q236n271j7133j5142k567P819
9443I911Q167K453j90K295K755l154q377m401M614P174J742k120J64K666J653
$$ plain form
9428 25352 27359 33684 41969 45307 42633 40466 44290 53839 65855 75631 77224 68676 56162 47167
9414 47167 41517 35341 30366 30572 32743 31050 28996 34459 43540 43817 35522 33538 42860 48600 40414
9399 40414 31664 39464 57185 64994 61343 64029 79820 91717 82914 59748 41582 36517 37001 35149
9385 35149 32468 33580 37523 39962 41751 49765 66545 82452 83896 69958 55388 54215 64375
9372 64375 72056 68238 57284 50871 55755 66010 67266 52605 33896 30177 43372 55147 52335
9359 52335 44089 44427 48421 41086 24696 19634 36020 58780 66324 54376 36233 26976 32125 46258
9345 46258 58694 63435 63895 64645 62441 53301 44292 45499 51347 45308 26335 14562 23145 39152
9331 39152 43548 37710 35978 40792 41058 31108 16993 5485 -953 627 11481 23795 26432 19629
$$ packed form
9428B5352K007O325Q285L338k674k167L824R549J2016R776J593q548j2514q995
9414D7167n650o176m975K06K171j693k054N463R081K77q295j984R322N740q186
9399D0414q750P800J7721P809l651K686J5791J1897q803k3166j8166n065M84j852
9385C5149k681J112L943K439J789Q014J6780J5907J444j3938j4570j173J0160
9372F4375P681l818j0954o413M884J0255J256j4661j8709l719J3195J1775k812
9359E2335q246L38L994p335j6390n062J6386K2760P544j1948j8143r257N149J4133
9345D6258J2436M741M60P50k204r140r009J207N848o039j8973j1773Q583J6007
9331C9152M396n838j732M814K66r950j4115j1508o438J580J0854J2314K637o803
$$ plain form
9317 19629 14899 19310 28723 37151 42776 42875 33438 18188 8804 10383 13790 8203 -4678 -14684
9303 -14684 -16354 -12040 -5397 2409 11598 22433 33300 38725 33758 22881 18854 27849 40605 44115
9289 44115 37673 30267 25861 20693 14100 11566 14271 14868 9472 6743 16816 35072 46398 45498
9275 45498 43671 51907 65444 72196 71049 71893 78823 84020 81323 76249 76142 77743 73075 62973 55649
9260 55649 54656 57564 64573 77866 92551 99556 99404 101526 106640 103103 87912 78093 89079 111560
9246 111560 124228 122741 119928 121159 118145 108905 105655 115372 127039 128438 124761 128855 140476 147581
9232 147581 144380 136603 130098 124407 118375 113692 111153 110088 112836 123271 138773 150075 152824 154525
9218 154525 165157 183144 194976 189059 168014 146865 139421 146420 157284 162754 162949 162271 161354 158569
$$ packed form
9317A9629m730M411R413Q428N625R9r437j5250r384J579L407n587j2881j0006
9303a4684j670M314O643P806R189J0835J0867N425m967j0877m027Q995J2756L510
9289D4115o442p406m406n168o593k534K705N97n396k729J0073J8256J1326r00
9275D5498j827Q236J3537O752j147Q44O930N197k697n074j07J601m668j0102p324
9260E5649r93K908P009J3293J4685P005j52K122N114l537j5191r819J0986K2481
9246A11560J2668j487k813J231l014r240l250R717J1667J399l677M094J1621P105
9232A47581l201p777o505n691o032m683k539j065K748J0435J5502J1302K749J701
9218A54525J0632J7987J1832n917k1045k1149p444O999J0864N470J95o78r17k785
$$ plain form
9204 158569 155536 154293 151138 141438 130056 127463 133490 135258 126446 118709 125038 139214 143240 131397
9190 131397 115036 104370 97451 89476 82104 78286 76147 74135 75810 82773 87866 83126 71727 64333
9176 64333 64203 63300 55080 45377 46411 61941 81593 90235 81872 63970 48702 41322 38148 34393
9162 34393 30614 30684 36278 45018 52164 53242 47761 42024 45501 61690 83987 102238 111580 113815
9148 113815 113081 112222 110708 104483 91317 77742 75231 86015 98523 102141 100559 103076 108143 105918
9134 105918 94497 82414 75046 69441 64378 65027 73979 86569 98592 109798 116702 113043 103208
9121 103208 103305 119151 133261 126606 106283 96688 106249 118279 116179 103774 95493 96913 102003 103180
9107 103180 97920 89153 83461 86185 95535 103753 105046 99538 89973 79584 73270 74494 79294 79308 72503
$$ packed form
9204A58569l033j243l155r700j1382k593O027J768q812p737O329J4176M026j1843
9190A31397j6361j0666o919p975p372l818k139k012J675O963N093m740j1399p394
9176F4333j30r03q220r703J034J5530J9652Q642q363j7902j5268p380l174l755
9162C4393l779P0N594Q740P146J078n481n737L477J6189K2297J8251R342K235
9148A13815p34q59j514o225j3166j3575k511J0784J2508L618j582K517N067k225
9134A05918j1421j2083p368n605n063O49Q952J2590J2023J1206O904l659r835
9121A03208R7J5846J4110o655k0323r595R561J2030k100j2405q281J420N090J177
9107A03180n260q767n692K724R350Q218J293n508r565j0389o314J224M800J4o805
$$ plain form
9092 72503 64738 59266 53070 47018 49703 63490 75042 70586 55846 49220 57298 69091 74668 76626
9078 76626 79079 77578 68620 60490 63652 74639 80342 76747 72555 73305 73391 68821 67573 77764 91670
9063 91670 92860 77817 60306 53456 56791 62967 67568 68017 62374 55865 59710 74459 82481 69064
9049 69064 45368 36132 47133 60750 64495 66074 73811 79312 72453 61540 62959 76951 88228
9036 88228 87510 78971 67822 54292 41481 36710 41046 47255 52084 61237 77319 91809 96091 93810
9022 93810 94668 100459 104668 102913 96483 87055 74998 63402 57965 60806 67778 73436 76454 79132
9008 79132 83446 88700 92253 92091 88962 85760 84624 85425 87242 89876 93269 96726 99211 99107 94072
8993 94072 84080 75007 74977 84655 94622 95855 90061 85649 85877 86211 82379 75459 68460 63190 62100 68036
$$ packed form
9092G2503p765n472o196o052K685J3787J1552m456j4740o626Q078J1793N577J958
9078G6626K453j501q958q130L162J0987N703l595m192P50Q6m570j248J0191J3906
9063I1670J190j5043j7511o850L335O176M601M49n643o509L845J4749Q022j3417
9049F9064k3696r236J1001J3617L745J579P737N501o859j0913J419J3992J1277
9036H8228p18q539j1149j3530j2811m771M336O209M829R153J6082J4490M282k281
9022I3810Q58N791M209j755o430r428j2057j1596n437K841O972N658L018K678
9008G9132M314N254L553j62l129l202j136Q01J817K634L393L457K485j04n035
8993I4072r992r073l0R678R967J233n794m412K28L34l832o920o999n270j090N936
$$ plain form
8977 68036 78786 85737 82235 71318 61570 57257 56604 58086 62548 68499 71301 70021 70091 74583 76938
8962 76938 69242 55938 50924 59115 68637 66179 54018 44991 44690 47229 47442 47979 51722 54723 51685
8947 51685 44145 38682 39659 46899 57243 64651 62250 49750 37326 36662 47789 58687 58174 45748
8933 45748 28922 15429 9663 12728 22510 34799 46395 56536 64436 67250 62905 54652 50204
8920 50204 54487 63919 69848 68299 64483 66059 73718 81422 84837 85017 83126 76721 64659 52156
8906 52156 46670 50198 58451 65637 67319 61601 51851 46105 48923 55240 56909 53459 50700 50417 49007
8891 49007 46366 47773 54428 59570 57809 51975 46806 42569 40260 46184 63118 81008 85270 73058
8877 73058 54609 40554 35338 40597 54461 66609 65069 52617 47238 59619 77581 81374 69120
$$ packed form
8977F8036J0750O951l502j0917r748m313o53J482M462N951K802j280P0M492K355
8962G6938p696j3304n014Q191R522k458j2161r027l01K539K13N37L743L001l038
8947E1685p540n463R77P240J0344P408k401j2500j2424o64J1127J0898n13j2426
8933D5748j6826j3493n766L065R782J2289J1596J0141P900K814m345q253m448
8920E0204M283R432N929j549l816J576P659P704L415J80j891o405j2062j2503
8906E2156n486L528Q253P186J682n718r750n746K818O317J669l450k759k83j410
8891D9007k641J407O655N142j761n834n169m237k309N924J6934J7890M262j2212
8877G3058j8449j4055n216N259J3864J2148j540j2452n379J2381J7962L793j2254
$$ plain form
8864 69120 57085 57080 64308 68601 67612 64481 60236 54682 49853 46690 42463 37623 40656 57056 75628
8849 75628 77166 59101 40905 39371 48039 49809 41900 35610 35298 32761 24511 20506 28565 40415
8835 40415 42292 32508 19650 9338 3037 5434 20295 39294 46973 39532 28675 23708 20731
8822 20731 15565 16214 31004 50734 56157 42709 26154 21243 24947 26088 23275 24770 34128 44503
8808 44503 47979 44934 42066 44399 51198 58024 61310 61530 61992 63802 63341 57473 50490 51129 60654 68220
8792 68220 62514 45647 30374 24606 24810 25747 29727 41382 57951 71662 80235 88119 96543 99321
8778 99321 92437 82571 79785 83654 83436 73241 61087 58776 66441 72932 70832 65140 64915 71280 78040
8763 78040 81021 81140 79209 73837 65735 58785 54560 50769 48178 53446 69487 87315 94934 92288
$$ packed form
8864F9120j2035nP228M293r89l131m245n554m829l163m227m840L033J6400J8572
8849G5628J538j8065j8196j534Q668J770p909o290l12k537q250m005Q059J1850
8835D0415J877r784j2858j0312o301K397J4861J8999P679p441j0857m967k977
8822B0731n166O49J4790J9730N423j3448j6555m911L704J141k813J495R358J0375
8808D4503L476l045k868K333O799O826L286K20M62J810m61n868o983O39R525P566
8792F8220n706j6867j5273n768K04R37L980J1655J6569J3711Q573P884Q424K778
8778I9321o884r866k786L869k18j0195j2154k311P665O491k100n692k25O365O760
8763G8040K981J19j931n372q102o950m225l791k591N268J6041J7828P619k646
$$ plain form
8749 92288 89512 91037 90680 84545 79069 80068 81230 72342 55300 42796 41716 46118 47926 46864 46189
8734 46189 44990 40599 35325 34599 39042 43524 45181 48183 57878 72275 82271 80449 68335 55048
8720 55048 49689 54535 63979 69574 67331 60894 56876 56902 56055 50216 42523 39628 43086 48685 54106
8705 54106 61751 71470 75872 68718 55757 50616 59172 73236 81405 81154 77125 72330 66983 64064
8691 64064 69157 82808 97426 104655 103477 99073 96505 98388 105939 117246 125069 122000 109929 100084
8677 100084 100247 105056 103316 93088 84331 86319 97318 108730 115686 120105 124849 128146 124589 111248
8663 111248 93154 81986 86468 102843 117423 120759 117268 118377 128292 140421 146891 146700 143106
8650 143106 137510 129845 122871 121142 124722 127636 125233 120938 122205 130683 140716 147946 153961 159546
$$ packed form
8749I2288k776J525l57o135n476R99J162q888j7042j2504j080M402J808j062o75
8734D6189j199m391n274p26M443M482J657L002R695J4397R996j822j2114j3287
8720E5048n359M846R444N595k243o437m018K6q47n839p693k895L458N599N421
8705E4106P645R719M402p154j2961n141Q556J4064Q169k51m029m795n347k919
8691F4064N093J3651J4618P229j178m404k568J883P551J1307P823l069j2071r845
8677A00084J63M809j740j0228q757J988J0999J1412O956M419M744L297l557j3341
8663A11248j8094j1168M482J6375J4580L336l491J109R915J2129O470j91l594
8650A43106n596p665o974j729L580K914k403m295J267Q478J0033P230O015N585
$$ plain form
8636 159546 159221 149113 136613 133385 139406 143553 141938 145168 161437 181637 190810 188391 186174 189266
8622 189266 190797 185862 179548 177698 178610 178665 179375 183582 189592 194036 197133 201279 207441 215805 226549
8607 226549 237420 244445 247513 250925 256211 260275 263661 272834 288260 298186 293858 285128 288865 304581
8593 304581 314927 311233 304940 308625 317891 321073 318218 319091 326523 333053 333797 332598 332752 330087 321071
8578 321071 312554 315587 329720 339991 333034 312800 295659 291038 292317 288272 277627 267510 261761
8565 261761 258074 255171 254369 252702 243172 226243 213530 213168 217341 213001 200839 192860 192431 189263
8551 189263 177456 166521 166771 173235 174713 172140 174611 179950 174631 156000 140176 139852 145688 140959
8537 140959 126541 117923 121659 129183 133403 136952 140883 138854 129155 121387 122881 127298 125336 118844
$$ packed form
8636A59546l25j0108j2500l228O021M147j615L230J6269K0200R173k419k217L092
8622A89266J531m935o314j850R12N5P10M207O010M444L097M146O162Q364J0744
8607B26549J0871P025L068L412N286M064L386R173J5426R926m328q730L737J5716
8593C04581J0346l694o293L685R266L182k855Q73P432O530P44j199J54k665r016
8578C21071q517L033J4133J0271o957k0234j7141m621J279m045j0645j0117n749
8565B61761l687k903q02j667r530j6929j2713l62M173m340j2162p979m29l168
8551A89263j1807j0935K50O464J478k573K471N339n319j8631j5824l24N836m729
8537A40959j4418q618L736P524M220L549L931k029r699p768J494M417j962o492
$$ plain form
8523 118844 115010 113981 112787 114404 120312 120189 104502 83838 78292 87803 91635 80866 71960 79708
8509 79708 95111 103394 108112 119672 131104 125714 103944 83421 73723 69217 67671 76849 96366
8496 96366 109300 102411 84510 74860 79908 89421 90546 79364 63062 55537 65535 84551 92634
8483 92634 81286 63938 57835 63211 68640 69637 70447 71838 70130 67756 72653 85011 94846 95922
8469 95922 93118 92168 90638 84503 76562 71901 70308 69620 72047 79866 87779 87616 80255 75597 79166
8454 79166 84721 83339 75819 72050 79219 93341 102810 99802 88428 81032 84932 93456 93229 81138
8440 81138 70116 74440 91625 104350 100865 88117 81564 86584 95495 100258 100165 95958 84687 66205
8426 66205 49732 46469 56720 69954 77040 77194 73764 69858 69139 74009 80060 78267 66766 55360
$$ packed form
8523A18844l834j029j194J617N908j23j5687k0664n546R511L832j0769q906P748
8509G9708J5403Q283M718J1560J1432n390k1770k0523r698m506j546R178J9517
8496I6366J2934o889j7901r650N048R513J125j1182j6302p525R998J9016Q083
8483I2634j1348j7348o103N376N429R97Q10J391j708k374M897J2358R835J076
8469I5922k804r50j530o135p941m661j593o88K427P819P913j63p361m658L569
8454G9166N555j382p520l769P169J4122R469l008j1374p396L900Q524k27j2091
8440H1138j1022M324J7185J2725l485j2748o553N020Q911M763r3m207j1271j8482
8426F6205j6473l263J0251J3234P086J54l430l906p19M870O051j793j1501j1406
$$ plain form
8412 55360 53473 57921 58329 51515 44158 42778 47014 52266 53772 48526 38239 30139 29869 34085 35323
8397 35323 33154 33286 35381 30685 15329 -1699 -9285 -7060 -2056 2165 6506 10703 13981 18735
$$ packed form
8412E5360j887M448M08o814p357j380M236N252J506n246j0287q100k70M216J238
8397C5323k169J32K095m696j5356j7028p586K225N004M221M341M197L278M754
$$ [...]
##END NTUPLES=NMR SPECTRUM
##END=
