##TITLE=H1
##JCAMPDX= 6.0         $$ Bruker NMR JCAMP-DX V2.0
##DATA TYPE= NMR FID
##DATA CLASS= NTUPLES
##ORIGIN= UXNMR, Bruker Analytische Messtechnik GmbH
##OWNER= root
$$ XWIN-NMR		Version 3.5
$$ Sat Jan 16 11:47:39 2016 Russian Standard Time (UT+4h)  Irina@DPX200
##.OBSERVE FREQUENCY= 200.131235884673
##.OBSERVE NUCLEUS= ^1H
##.DELAY= (6, 6)
##.ACQUISITION MODE= SIMULTANEOUS
##.ACQUISITION SCHEME= undefined
##.AVERAGES= 1
##.DIGITISER RES= 18
##SPECTROMETER/DATA SYSTEM= spect
##.PULSE SEQUENCE= zg
##.SOLVENT NAME= CDCl3
##.SHIFT REFERENCE= (INTERNAL, CDCl3, 0, 16.5164)
##AUDIT TRAIL= $$ (NUMBER, WHEN, WHO, WHERE, WHAT)
$$ ##TITLE= Audit trail, XWIN-NMR		Version 3.5
$$ ##JCAMPDX= 5.01
$$ ##ORIGIN= Bruker BioSpin GmbH
$$ ##OWNER= Irina
$$ F:/spectra/data/iren3/nmr/H1/1/audita.txt
$$ ##AUDIT TRAIL=  $$ (NUMBER, WHEN, WHO, WHERE, WHAT)
(   1,<2016-01-16 11:46:45.48 +0400>,<Irina>,<DPX200>,
      <created by zg, POWCHK disabled, PULCHK disabled
       configuration hash MD5:
       00 E9 B6 7A A2 85 ED C7 34 08 36 98 17 FE 4E 26
       data hash MD5: 16K
       3D 27 2E 06 3C F2 37 AE E0 85 F9 10 01 B8 91 AE>)
$$ ##END=
$$ 
$$ hash MD5
$$ 88 52 01 97 D2 BA 0A CD C9 FF AD 85 04 DD 8E D4
##$RELAX= 
##$RELAX= 
##$RELAX= 
##$RELAX= 
##$RELAX= 
##$RELAX= 
$$ Bruker specific parameters
$$ --------------------------
##$DU= <F:/spectra>
##$EXPNO= 1
##$NAME= <H1>
##$PROCNO= 1
##$TYPE= <nmr>
##$USER= <iren3>
##$AMP= (0..31)
100 100 100 100 100 100 100 100 100 100 100 100 100 100 100 100 100 100 
100 100 100 100 100 100 100 100 100 100 100 100 100 100 
##$AQSEQ= 0
##$AQ_mod= 1
##$AUNM= <au_zg>
##$AUTOPOS= <>
##$BF1= 200.13
##$BF2= 200.13
##$BF3= 200.13
##$BF4= 200.13
##$BF5= 500.13
##$BF6= 500.13
##$BF7= 500.13
##$BF8= 500.13
##$BYTORDA= 1
##$CFDGTYP= 0
##$CFRGTYP= 5
##$CHEMSTR= <none>
##$CNST= (0..31)
1 1 145 1 1 1 1 1 1 1 1 1 1 1 1 1 1 1 1 1 1 1 1 1 1 1 1 1 1 1 1 1 
##$CPDPRG= <>
##$CPDPRG1= <>
##$CPDPRG2= <>
##$CPDPRG3= <>
##$CPDPRG4= <mlev>
##$CPDPRG5= <mlev>
##$CPDPRG6= <mlev>
##$CPDPRG7= <mlev>
##$CPDPRG8= <mlev>
##$CPDPRGB= <>
##$CPDPRGT= <>
##$D= (0..31)
0 1 0 0 0 0 0 0 0 0.06 0 0 0 0 0 0 0.0002 0 0 0 0 0 0 0 0 0 0 0 0 0 0 
0 
##$DATE= 1452930404
##$DBL= (0..7)
120 120 120 120 120 120 120 120 
##$DBP= (0..7)
150 150 150 150 150 150 150 150 
##$DBP07= 0
##$DBPNAM0= <>
##$DBPNAM1= <>
##$DBPNAM2= <>
##$DBPNAM3= <>
##$DBPNAM4= <>
##$DBPNAM5= <>
##$DBPNAM6= <>
##$DBPNAM7= <>
##$DBPOAL= (0..7)
0.5 0.5 0.5 0.5 0.5 0.5 0.5 0.5 
##$DBPOFFS= (0..7)
0 0 0 0 0 0 0 0 
##$DE= 6
##$DECBNUC= <off>
##$DECIM= 32
##$DECNUC= <off>
##$DECSTAT= 4
##$DIGMOD= 1
##$DIGTYP= 9
##$DL= (0..7)
0 120 120 120 120 120 120 120 
##$DP= (0..7)
150 150 150 150 150 150 150 150 
##$DP07= 0
##$DPNAME0= <>
##$DPNAME1= <>
##$DPNAME2= <>
##$DPNAME3= <>
##$DPNAME4= <>
##$DPNAME5= <>
##$DPNAME6= <>
##$DPNAME7= <>
##$DPOAL= (0..7)
0.5 0.5 0.5 0.5 0.5 0.5 0.5 0.5 
##$DPOFFS= (0..7)
0 0 0 0 0 0 0 0 
##$DQDMODE= 0
##$DR= 18
##$DS= 0
##$DSLIST= <SSSSSSSSSSSSSSS>
##$DSPFIRM= 0
##$DSPFVS= 10
$$ [...]
##$SUBNAM0= <"">
##$SUBNAM1= <"">
##$SUBNAM2= <"">
##$SUBNAM3= <"">
##$SUBNAM4= <"">
##$SUBNAM5= <"">
##$SUBNAM6= <"">
##$SUBNAM7= <"">
##$SUBNAM8= <"">
##$SUBNAM9= <"">
##$SW= 20.6817932712277
##$SWIBOX= (0..15)
0 0 3 0 0 0 0 0 0 0 0 0 0 0 0 0 
##$SW_h= 4139.07284768212
##$TD= 16384
##$TD0= 1
##$TE= 0
##$TE2= 300
##$TE3= 300
##$TEG= 300
##$TL= (0..7)
0 120 120 120 120 120 120 120 
##$TP= (0..7)
150 150 150 150 150 150 150 150 
##$TP07= 0
##$TPNAME0= <>
##$TPNAME1= <>
##$TPNAME2= <>
##$TPNAME3= <>
##$TPNAME4= <>
##$TPNAME5= <>
##$TPNAME6= <>
##$TPNAME7= <>
##$TPOAL= (0..7)
0.5 0.5 0.5 0.5 0.5 0.5 0.5 0.5 
##$TPOFFS= (0..7)
0 0 0 0 0 0 0 0 
##$TUNHIN= 0
##$TUNHOUT= 0
##$TUNXOUT= 0
##$USERA1= <user>
##$USERA2= <user>
##$USERA3= <user>
##$USERA4= <user>
##$USERA5= <user>
##$V9= 5
##$VALIST= <valist>
##$VCLIST= <CCCCCCCCCCCCCCC>
##$VD= 0
##$VDLIST= <DDDDDDDDDDDDDDD>
##$VPLIST= <PPPPPPPPPPPPPPP>
##$VTLIST= <TTTTTTTTTTTTTTT>
##$WBST= 1024
##$WBSW= 4
##$XGAIN= (0..3)
0 0 0 0 
##$XL= 0
##$YL= 0
##$YMAX_a= 139692
##$YMIN_a= -118364
##$ZGOPTNS= <>
##$ZL1= 120
##$ZL2= 120
##$ZL3= 120
##$ZL4= 120
##$ABSF1= 10
##$ABSF2= 0
##$ABSG= 5
##$ABSL= 3
##$ALPHA= 0
##$AQORDER= 0
##$ASSFAC= 0
##$ASSFACI= 0
##$ASSFACX= 0
##$ASSWID= 0
##$AUNMP= <proc_1d>
##$AZFE= 0.1
##$AZFW= 0.1
##$BCFW= 1
##$BC_mod= 2
##$BYTORDP= 0
##$COROFFS= 0
##$CY= 12.5
##$DATMOD= 1
##$DC= 2
##$DFILT= <>
##$DTYPP= 0
##$F1P= 11.0000006437302
##$F2P= -0.999999642372123
##$FCOR= 0.5
##$FTSIZE= 0
##$FT_mod= 4
##$GAMMA= 1
##$GB= 0
##$INTBC= 1
##$INTSCL= 1
##$ISEN= 128
##$LB= 0.1
##$LEV0= 0
##$LPBIN= 0
##$MAXI= 10000
##$MC2= 0
##$MEAN= 0
##$ME_mod= 0
##$MI= 0
##$NCOEF= 0
##$NC_proc= 0
##$NLEV= 6
##$NOISF1= 0
##$NOISF2= 0
##$NSP= 1
##$NTH_PI= 0
##$NZP= 0
##$OFFSET= 16.51637
##$PC= 1
##$PHC0= -305.5404
##$PHC1= 2.968419
##$PH_mod= 0
##$PKNL= yes
##$PPARMOD= 0
##$PSCAL= 4
##$PSIGN= 0
##$REVERSE= no
##$SF= 200.13
##$SI= 32768
##$SIGF1= 0
##$SIGF2= 0
##$SINO= 400
##$SIOLD= 32768
##$SREGLST= <1H.CDCl3>
##$SSB= 0
##$STSI= 0
##$STSR= 0
##$SW_p= 4139.07284768211
##$SYMM= 0
##$S_DEV= 0
##$TDeff= 0
##$TDoff= 0
##$TI= <>
##$TILT= no
##$TM1= 0
##$TM2= 0
##$TOPLEV= 0
##$USERP1= <user>
##$USERP2= <user>
##$USERP3= <user>
##$USERP4= <user>
##$USERP5= <user>
##$WDW= 1
##$XDIM= 8192
##$YMAX_p= 0
##$YMIN_p= 0
$$ End of Bruker specific parameters
$$ ---------------------------------
##NTUPLES= NMR FID
##VAR_NAME=  TIME,          FID/REAL,        FID/IMAG
##SYMBOL=    X,             R,               I
##VAR_TYPE=  INDEPENDENT,   DEPENDENT,       DEPENDENT
##VAR_FORM=  AFFN,          ASDF,            ASDF
##VAR_DIM=   8192,          8192,            8192
##UNITS=     SECONDS,       ARBITRARY UNITS, ARBITRARY UNITS
##FACTOR=    0.0002416,     1,               1
##FIRST=     0,             0,               0
##LAST=      1.9789456,     0,               0
##MIN=       0,             -118364,         0
##MAX=       1.9789456,     139692,          0
$$ Real data points
##PAGE= N=1
##DATA TABLE= (X++(R..R)), XYDATA
$$ [...]
2457E85J13l284K618L125l358q66L016k332k591L763J263l261J683K219l810r33
2473b050L785j256k397L423O45l968J212K707l205o38L882j397k861L114R03l521
2489a622J350K743l295j126L697r32k568L110Q59m152P70K851k664o80M216q44
2505A713l391K107P34l631J503L918k343j389K886j709l708K880K230k662J208
2520C46K958l505k456L122k02k203L417J905l975l99K373k686j229M319K70l083
2536a028J830J039m072K68L838j510j448L356n77l934J861K089l080M45L551k163
2552D65k378L110p0l281K240K148l392l7L366j805j968L184o7l666J709K404k913
2569i51J24L544k062k796K608K37l010K494K949l095r97K593k191k363L765J415
$$ y = [585, 698, -2586, 32, 3157, -201, -1067, 1949, -383, -2974, 789, 2052, -1209, 474, 2693, -1117, -2050, 1735, 479, -1918, 1505, 2150, -1818, -606, 2101, -1104, -1742, 2140, 743, -2118, 996, 1899, -1622, -272, 2471, -824, -1950, 1747, 815, -1753, 1357, 2216, -1936, -1166, 1685, -979, -1659, 2557, 1713, -1678, 429, 1163, -2468, -965, 2953, 610, -779, 2107, 398, -3310, -430, 1800, -862, 346, 3304, -201, -2657, 465, 263, -1940, 1477, 3382, -593, -992, 1381, -1305, -2534, 1785, 2055, -1028, 802, 1841, -2231, -1963, 1875, 365, -1083, 2273, 1696, -2238, -377, 1712, -1368, -923, 2628, 465, -1913, 1197, 1127, -2154, 86, 2234, -1158, -1195, 2171, 366, -1602, 1582, 1515, -2151, -442, 1962, -951, -827, 2717, 655, -2141, 467, 704, -2306, 188, 3137, 42, -955, 1638, -553, -2916, 849, 2264]
2585B264k858J403J748m050j266L636n97j517L513L61m325M77K327k599J52M167
2601B836r84l039J983Q0l616J703L432k178q82K931j897l112K793J456k802J340
2617D4K756k959j567L206q85k628K831J280l491P85K775k463j290L171q05k929
2633b169K500J664k989O96K834k850j717L062l85k433K845J624l637k10K459k240
2649i46j164L949K18k993J672R53l738K63L640j336j172L003r15l990J655K030
2665A129k399Q60L303k050k635K503k44k796K514K567k846m42K460k290k144L315
2681H05P16k761J658J794l249n51L161j378j896L070L42l215J361K146k735m85
2697a217L015j505k263K936O93l030J270K160l016o75L241j053j956K763O02l553
$$ y = [2264, -594, 809, 2557, -1493, -2759, 877, 280, -1237, 2276, 2637, -1688, -1211, 1116, -1483, -1331, 2836, 1852, -1187, 796, 876, -2740, -1037, 2395, 217, -665, 2266, 369, -2743, 50, 1506, -1296, 44, 2800, -159, -1726, 1480, 595, -2033, 798, 2078, -1413, -628, 2147, -316, -1606, 1565, 760, -2169, 331, 1995, -994, -298, 2536, -314, -2031, 1031, 646, -1787, 1058, 2682, -955, -1165, 1294, -946, -2110, 1839, 2057, -936, 736, 1689, -2049, -1786, 1854, 518, -654, 2349, 1434, -2556, -901, 1129, -1270, -410, 2893, 843, -1792, 711, 467, -2329, 185, 2752, -94, -536, 1924, -366, -2510, 805, 1521, -1240, 418, 2212, -1037, -1588, 1573, 195, -1701, 1369, 1711, -1504, -143, 2003, -732, -1217, 1798, 293, -1970, 966, 1659, -1371, -101, 2059, -957, -1632, 1609, 556, -1400, 1363, 1965, -1588]
2713a588P52K306k376l07L470j109k733K066N62l142J312L097k114r06K700j493
2729D97k906K557J470k559J146K417k871j585K790o83k164K784J328l098L30K273
2745A726k489r61L240k26k666K027J127l254M80K848k069j264L101o19k772J969
2761A98J540k837L72K661j917j554L028k66k767J785J453k911J93K872j723j544
2777a417K716k14k864J724J714k576K66K866j816k058K491R5k645J861K007k763
2793f13k97K621j836j818K883M49k624J450J704k706n01K859j229j817K636L40
2809A501k956J208J921k597k73K995j220k152K453M77k795J246K098k350n71K742
2825A727j193k174K339O79k798J144K174k440o66K771r51k181K277P48k666R08
$$ y = [-1588, -836, 1470, -906, -1213, 2257, 1148, -1585, 481, 1043, -2099, -787, 2310, 196, -710, 1990, 497, -2409, 148, 1618, -941, 205, 2622, -249, -1834, 956, 273, -1891, 893, 2221, -877, -547, 1726, -763, -1724, 1516, 1290, -1376, 651, 1778, -1476, -996, 1852, -217, -1481, 1620, 1001, -1771, 198, 1738, -1099, -727, 1934, 17, -1537, 1491, 1225, -1542, 243, 1696, -1215, -1022, 1850, 127, -1417, 1299, 1085, -1779, -55, 1659, -917, -651, 2215, 399, -1659, 832, 927, -1718, 143, 2150, -613, -910, 1711, -125, -1943, 940, 1389, -1235, 215, 1919, -787, -1288, 1571, 342, -1475, 1161, 1501, -1455, -247, 1674, -923, -1196, 1799, 579, -1573, 880, 1357, -1438, -192, 1906, -444, -1015, 1727, 534, -1640, 699, 1378, -1420, -276, 1898, -542, -1208, 1563, 612, -1569, 708, 1456, -1210, -302]
2841c02K176k199r54K796q55k277K198Q79k737P79K339k178j059K777o05k302
2857a524K063J008k680N89K387j985j154K598m75k427J923J320k709N02K374j953
2873a43j259K643l09k321J808J318k685J54K453j794j352K637j57k449J648J439
2889A631k597J52K567j525j603K519l3k517J590J495k486j01K524j502j489K413
2905A038J5k458J424J595k426j11K620j222j647K270J1k546J268J824k195l16
2921h56K470j346j837K151M84k338J357J922k388o75K334j049j715K276P39k461
2937i32Q20J744k413n68K679p91j729K171L86k635P89K001j893n56K555q33k072
2954a277J865O42k486P63K177j916q84K451o94k107K048Q46k487O17K090j756
$$ y = [-302, 1874, -325, -1279, 1517, 662, -1615, 583, 1462, -1275, -496, 1843, -335, -1394, 1383, 778, -1524, 539, 1547, -1133, -544, 1843, -142, -1296, 1302, 827, -1600, 323, 1643, -1066, -564, 1810, -143, -1402, 1241, 932, -1389, 419, 1737, -948, -794, 1659, -135, -1487, 1150, 993, -1456, 192, 1631, -966, -814, 1753, 228, -1375, 1144, 1111, -1406, 184, 1679, -807, -908, 1616, 114, -1375, 1038, 1053, -1405, 19, 1614, -812, -923, 1697, 475, -1172, 1098, 1109, -1437, -169, 1655, -540, -856, 1614, 268, -1569, 582, 1066, -1272, 85, 2007, -381, -1056, 1278, 229, -1486, 790, 1529, -932, -112, 1632, -781, -1349, 1330, 539, -1190, 981, 1367, -1268, -479, 1522, -371, -927, 1628, 795, -1277, 588, 1230, -1256, -493, 1684, -232, -1116, 1335, 641, -1466, 582, 1428, -1059, -442, 1648, -108]
2970a08j012K426m78k178J698R33k367N64K281j739j110K150m91k157J880J395
2986A687k292K90J997j860j349K379pk008J688J190k563j13K150j357j076K541
3002A297Ok378J290J098k351J51K465j147j461K182k50k453J335J612j985k3K278
3019A666j378j626K189J09k127J250J667k140m24K127j180j499K097M32k333J054
3035a16J667k041l43K268j063j726K004N49k202R77J682k055o18K156r10j580
3051a351K078P03k353P61J585k057n22K432n34j707J856M25k432N35J916j680
3067c45m86K329p46k050J608O82k127P92K086j703q81K027o87j895J751J043k133
3084g35M44J816j778r36K141l71j827J671J053k260L21J860j486j000K245k89
$$ y = [-108, -1120, 1306, 828, -1350, 348, 1281, -1086, -522, 1759, 20, -1090, 1060, 569, -1588, 292, 1687, -605, -315, 1682, -178, -1527, 852, 845, -1163, 525, 1715, -848, -961, 1189, -168, -1244, 1297, 1303, -1075, 215, 1313, -1038, -887, 1578, 431, -1030, 1152, 902, -1551, -216, 1396, -589, -612, 1666, 288, -1338, 851, 960, -1167, 83, 1750, -390, -814, 1313, 133, -1366, 731, 1163, -1170, -116, 1551, -490, -833, 1435, 372, -1354, 650, 1199, -1003, -26, 1656, -399, -1017, 1139, 229, -1351, 727, 1430, -923, -162, 1423, -634, -1156, 1276, 742, -965, 891, 1316, -1116, -581, 1335, -345, -831, 1498, 752, -1298, 310, 992, -1135, -343, 1743, 40, -841, 1186, 499, -1396, 355, 1398, -735, -291, 1525, -253, -1189, 952, 581, -1246, 425, 1478, -782, -461, 1399, -87, -1087, 1158, 869]
3100H69k018J386J162k235K40J929j447j075K139n4k016J348J189k080O7J945
3116A349j263j114K025n9k079J197J232j972q3K223j230j255J847J26k091J086
3132f1J463j870j39K052j187j505J929K72k019J064J458k001k73J987r51j407
3148a188J859M59j998P82J519j876m62K147q66j499J809M69k161P45J582j779
3164d58m10K191o91j746J737N25k120O92J706j701n79K046o23j819J587P19j885
3181h29N67J657j622p95K065m78j684J642Q20k036L53J706j608q65K160l65j691
3198a003J379Q16k038L27J849j368r06K037l28j865J327R73j917L16J810j411
3214bj016J841j86j719J281J060j897Q9J878j238j136J986j10j841J210J090j949
$$ y = [869, -1149, 237, 1399, -836, -596, 1333, -114, -1189, 950, 896, -1120, 228, 1417, -663, -596, 1349, 86, -1028, 997, 938, -1141, 56, 1288, -684, -767, 1456, 226, -1029, 818, 944, -1147, -61, 1402, -468, -607, 1445, 258, -1247, 682, 954, -1065, -1, 1457, -544, -817, 1170, 219, -1188, 671, 1130, -868, -86, 1433, -443, -905, 1242, 376, -1123, 686, 1155, -1006, -261, 1321, -458, -868, 1323, 632, -1114, 623, 1148, -972, -280, 1426, -275, -854, 1192, 569, -1250, 337, 1056, -829, -262, 1395, -227, -1022, 1043, 565, -1119, 523, 1343, -693, -340, 1366, -242, -1107, 1053, 688, -1003, 376, 1192, -846, -519, 1330, -38, -944, 1093, 765, -1100, 227, 1200, -717, -401, 1409, -2, -1018, 823, 637, -1082, 199, 1259, -638, -549, 1329, 91, -1045, 941, 831, -1010, 200, 1290, -659]
3231f59N7J902j133j230J833Kj855J183J301j769j99J813j115j285J864K65j795
3248h20J038J170k030l07J964p34j195J804J81j970O85J270j615j64K116p14j533
3265h54J433J82k052J038J557j478l80J874r88j599J609O52j754Q73J433j748
3281b02p30J846n88j390J693N40j911N60J332j467n84J959n10j513J464O41j929
3298g89N09J680j572p80J902m04j573J495P72j949L12J498j396p18K009j72j596
3315g72J259O17k056K21J914j021p33J730m21j995J108J014j543M42J895j276
3331C83j253J431j55j656J525J258j735o2J366j294j140J912K33j519J088R65
3347A347j976j72J789r62q49J880K5j952Q61J177j705p2J752q25j238J596J07
$$ y = [-659, -602, 1300, 167, -1063, 770, 772, -1083, 100, 1401, -368, -567, 1246, 131, -1154, 710, 975, -820, 218, 1388, -642, -949, 1015, 281, -914, 890, 1071, -899, -214, 1056, -559, -723, 1393, 679, -854, 579, 761, -1291, -253, 1304, -174, -554, 1320, 332, -1267, 342, 994, -760, 113, 1546, -202, -932, 914, 326, -1064, 629, 1169, -742, -182, 1150, -317, -901, 1058, 548, -965, 499, 1140, -789, -280, 1400, -172, -952, 950, 546, -1027, 468, 1240, -709, -397, 1101, -295, -1013, 996, 824, -772, 487, 1104, -952, -731, 1183, 162, -571, 1159, 738, -1257, -149, 865, -678, -236, 1659, 383, -870, 561, 406, -1250, 275, 1533, -202, -264, 1102, -192, -1332, 580, 813, -706, 382, 1347, -629, -801, 988, 26, -823, 1057, 1082, -870, -9, 1168, -537, -609, 1143, 318, -920, 676, 783]
3364G83j730R17J269j682k37J812q33j090J600K35j898O09J254j475k14J958p46
3381E32j384J338J01j761R68J630j313n01J589r96j553J547Q06j501O51J488j910
3398b69p66J618m90j049J700P40j971L06J030j409m17J994j73j460J226L99k038
3415a029M08J686j147n23J756n33j683J299P19j620M07J574j261q57J756l81j507
3432i36J172Q68j816K82J605j127p88J703l41j684J144R47j581L23J716j271j175
3449i59J556j52j553J309J235j681r6J374j256j027J886L25j460R46P91j857k44
3466h63J685p08q47J756O9j944O32J011j511P1J964q35j162J366l0j749Q95J415
3484A215j361j94J545r73j371J527L95j585P52J313j538l98J676o57j278J498
$$ y = [783, -947, -30, 1239, -443, -680, 1132, 299, -791, 809, 1044, -854, -245, 1009, -466, -680, 1278, 532, -852, 486, 587, -1174, -206, 1424, 111, -390, 1199, 203, -1350, 197, 1003, -498, 153, 1641, -269, -1035, 583, 93, -956, 744, 1484, -487, -181, 849, -560, -977, 1017, 844, -616, 610, 1009, -1029, -621, 1065, -82, -605, 1151, 618, -1065, 234, 953, -667, -260, 1314, 53, -804, 952, 571, -936, 236, 1104, -712, -430, 1175, 48, -740, 963, 622, -1062, 82, 1029, -552, -229, 1487, 216, -959, 597, 445, -1108, 201, 1436, -245, -341, 1033, -223, -1250, 636, 961, -499, 447, 1238, -619, -863, 822, 114, -733, 1023, 1092, -852, -220, 791, -720, -649, 1315, 480, -682, 684, 654, -1095, -200, 1215, -146, -340, 1205, 232, -1139, 388, 783, -802, -50, 1263, -275, -673, 1003, 346, -932, 566]
3500E66M06j684O47J261j369n23J734p27j431J486N10j535N38J416j512o63J648
3517G68m37j220J501O21j793K76J250j416m79J954k91j368J036M60j789M59J569
3534A101j079m46J619o05j559J020P44j416L81J608j271r39J516l02j500J339
3550B11R40j558J45J406j254q32J680n8j488J124Q13j715J33J496j020r14J616
3567G25m7j495R91R05j540LJ596j017r06J531P4j601R53R38j712o3J631p38j019
3586g91J557P1j614P53J044j481j5J652p97j229J405J11j622Q59J233j331k56
3603d51J523q94j242J487M35j546Q09J144j558l23J608p79j053J406L99j636N01
3620a70J293j435m53J716m90j292J378L77j578L79J349j177n40J576m81j351J288
$$ y = [566, 972, -712, -65, 1196, -173, -696, 1038, 311, -1120, 366, 876, -659, -121, 1295, -217, -880, 768, 331, -889, 612, 1233, -560, -284, 966, -450, -929, 1025, 734, -634, 402, 862, -927, -468, 1101, 22, -424, 1195, 590, -969, 51, 795, -621, -240, 1368, 97, -842, 674, 372, -1128, 211, 1151, -407, -262, 1144, -110, -942, 738, 680, -808, 316, 1129, -586, -453, 1043, 23, -891, 725, 678, -817, 174, 1079, -461, -458, 1138, 121, -785, 746, 820, -781, 172, 1110, -602, -665, 966, 228, -791, 766, 837, -777, -24, 1020, -461, -476, 1176, 379, -850, 555, 666, -956, -97, 1136, -195, -451, 1072, 178, -1064, 423, 858, -688, 121, 1265, -293, -616, 992, 213, -840, 566, 965, -671, -170, 1123, -312, -765, 951, 461, -831, 547, 924, -654, -275, 1074, -103, -643, 933, 452, -899, 389]
3637C89N64j710M90J386j236n63J556l96j254J122O24j628M07J393j129p14J614
3654I15m11j391J154O38j496K43J492j146p79J596j96j456J120Q16j589R0J474
3671A074r74r24J557r9j489J024Q94j555M8J506r62q49J506Jj529R50Q89j498
3689d30o5J554r35q89J426N9j513Q14J015j367j21J528q61r57J350J65j554Q39
3707E8J019j432j35J425p84j024J407K69j529P59J010j311l18J576o29j114J367
3724F14K49j589N89J174j267l02J501o06j201J223M22j446N73J195j217m56J430
3741H86n14j196J243M93j480M21J164j241m79J478l42j247J223O14j582L89J163
3758I93j072n26J477l26j350J055O46j401J67J352j050p51J519k08j271J051O74
$$ y = [389, 953, -757, -267, 1119, -117, -680, 876, 480, -774, 348, 972, -656, -249, 1144, 15, -699, 915, 504, -887, 267, 905, -591, -348, 1144, -2, -781, 815, 619, -837, 283, 1099, -490, -400, 1074, 100, -824, 733, 634, -855, 169, 1063, -492, -444, 1062, 100, -749, 757, 758, -771, 179, 1068, -430, -495, 1059, 124, -765, 661, 720, -793, 21, 1036, -331, -452, 1076, 215, -742, 608, 773, -781, 58, 1077, -355, -490, 935, 151, -873, 534, 803, -726, 33, 1043, -268, -586, 990, 361, -753, 614, 863, -726, -137, 1037, -230, -532, 969, 363, -838, 385, 807, -639, -66, 1129, -88, -544, 886, 372, -824, 419, 912, -568, -147, 1017, -224, -703, 775, 433, -814, 409, 1023, -559, -170, 993, -79, -605, 872, 546, -804, 251, 897, -504, -337, 1015, -35, -786, 733, 525, -746, 305, 979]
3775I79j496J61J314r33o89J453j88j374R28P04j426K05J395q93p77J315n8j483
3793h63R77Q62j267jJ337r42r35J351P2j335R17R51j396j70J271p37r25J490K04
3812H61j438P23Q75j435k04J537o59q84J221J17j455O62J048j288j67J396n75
3829C35j088J269K81j432N62J051j201l17J436n33j149J213K92j383N88R67j025
3846a34l10J384n01j181J033M87j395N00J180j067n63J266m62j106J206N74j371
3863d60L85J092j231m61J406k44j090J043N30j464R2J176r03n00J411j74j244
3880f36Q92N27j335K32J314q91o85J407k75j316R01P03j232J32J222q77p71J336
3898F48q8j280Q65Q11j304J06J173q07p39J245J9j325P35Q61j229k5J244q60q24
$$ y = [979, -517, -356, 958, 25, -664, 789, 601, -773, 155, 859, -567, -362, 1033, 140, -637, 678, 620, -863, 114, 976, -291, -292, 1045, 103, -832, 519, 591, -744, 173, 1124, -272, -442, 829, 92, -833, 657, 861, -577, 146, 1021, -414, -618, 919, 260, -624, 597, 714, -741, -79, 969, -319, -486, 910, 335, -753, 516, 797, -635, -73, 978, -223, -540, 896, 363, -786, 427, 719, -664, -76, 891, -134, -444, 940, 439, -742, 291, 778, -617, -117, 1063, -4, -567, 699, 237, -869, 337, 911, -460, -75, 1017, -214, -675, 731, 487, -603, 440, 970, -494, -402, 774, -129, -629, 782, 608, -636, 256, 783, -552, -320, 994, 103, -582, 825, 550, -766, 135, 838, -394, -262, 960, 83, -688, 648, 560, -720, 145, 956, -348, -242, 931, 124, -615, 630, 649, -676, 59, 920, -309, -334, 910, 50, -774]
3917g74J243J63j238P71Q08j264j33J260p29p35J220J47j299N70P95j194j59J373
3935H25n29q65J121J18j310N82R48j080j75J297o30r75J020K25j225O35R54j087
3953a51k57J223n11j005J163L36j277M53R71j088l18J183l12j174J141L94j280
3970e09M10R29r12m47J280l24j019R46M57j299L14J048r66m97J311l01j060Q97
3988B58M49j130K12J163r17n17J212j91j133Q39M86j203K03J158q07o06J174k46
4006D04j012P84O20j088M2J217q92o79J214p8j128Q10O88j278L8J118o76p32J134
4025E06J06j187P16P29j211n8J200o06p04J067N7j223O18P51j041j06J194n36
4043B72q09J006J39j218O14Q59j053o2J129n72q59R49K35j144M77R58j038k64
$$ y = [-774, 469, 632, -606, 165, 973, -291, -424, 836, 107, -628, 592, 739, -560, 10, 805, -389, -548, 825, 296, -569, 552, 670, -640, -58, 890, -190, -365, 932, 302, -673, 347, 572, -653, -18, 936, -151, -408, 815, 304, -701, 462, 798, -479, -26, 945, -143, -461, 722, 410, -764, 377, 771, -509, -99, 830, -82, -529, 751, 427, -592, 354, 811, -488, -174, 874, -92, -589, 722, 421, -639, 258, 707, -423, -211, 952, 35, -482, 730, 539, -594, 245, 731, -472, -269, 889, 82, -524, 650, 404, -608, 176, 796, -292, -250, 967, 75, -604, 610, 532, -596, 214, 902, -376, -338, 780, 104, -628, 506, 612, -575, 141, 870, -341, -399, 801, 195, -509, 558, 615, -608, 10, 761, -280, -386, 808, 272, -537, 469, 608, -610, 4, 863, -190, -252, 877, 305, -554, 395, 630, -514, -37, 921, -117, -381]
4061c81J080m73q59J008L15j136M75Q26r02m45J186l49q83R53K17j064K58R55
4079G81r24k92J169l08r72Q79L71j100K75R02p95m66J075k50r40Q42M78j189K59
4098b05J054q36m15J088k56j044Q25N55j131J94J047p63n71R71j23r62P14O72
4116H14j071R3R58q33n31J056or06O95N47j114p0J043n88n10J044k6j100N83N77
4136F55r75J3J039n70n86R31Lr99N20P42j016o8J028n38o97R52J24j032N34P58
4156H18j005j20R73m85p08R76J60j028M31Q19r52k53J074n43p72R75K69j057M72
4175D4P82r65k36R90m48p06R20L29j063L02P06q53l25J171k84p89P91K57j083
4194d60K66R24p35k79R78l06r63P74L74r37L04Q60p70m39R61k47q57P99M69j010
$$ y = [-381, 699, 226, -633, 375, 690, -446, 29, 855, -47, -492, 694, 345, -538, 415, 632, -432, -174, 781, -143, -435, 734, 426, -546, 333, 704, -396, -121, 781, -14, -480, 595, 345, -595, 247, 725, -464, -205, 849, 13, -402, 686, 430, -614, 211, 766, -365, -171, 876, 113, -458, 513, 390, -572, 142, 814, -257, -164, 794, -39, -570, 486, 480, -426, 269, 816, -298, -368, 675, 87, -423, 621, 595, -505, 78, 655, -320, -307, 732, 162, -424, 507, 510, -489, 31, 773, -243, -311, 717, 179, -518, 434, 558, -474, 60, 818, -187, -307, 666, 181, -527, 449, 609, -419, 12, 831, -121, -374, 700, 157, -615, 360, 629, -428, 44, 826, -139, -375, 615, 167, -539, 381, 710, -353, -51, 655, -198, -523, 648, 364, -425, 366, 623, -460, -194, 730, -5, -284, 694, 388, -575, 199, 573, -364, -60, 800, 30, -409, 552, 305, -552, 247, 716, -294]
4214b94K72Q34q14m60R96j36q54O57M21r15J07Q99o94m91R41o5r11O26N86j022
4234c17J63Q38o56m30R29j06q44N56N78j021jR35n70m03R19Kr54M84M70q39O4
4255b03R97n60n99P96J6r61N01P00p72m4Q81o26o77R44L4p75N20O01r16j57Q57
4276E57m53o17R25R9r27M76N40p84j76R56k94o74P81J65r43L64N92o77k21R08
4296E97k89p27P83J93r47L41O87o93l30J053k97p48O86K31q56J53Q94o65l74Q71
4316E63k40q22O73L14p89K63P29o38m35Q58j58p64O88M42q84J11P38o68m24R23
4336D80j33p11O34L65r12O8Q45n66l72Q11l5q37N55L81q17L7Q42n36m24P71l2
4357D14q27N53M82q05k8Q70m89n22P61L5p43L65N44q17n1R05n37n54Q00P2q03
$$ y = [-294, -22, 812, -2, -462, 534, 398, -456, 201, 622, -293, -186, 713, 19, -472, 469, 404, -507, 119, 705, -317, -154, 684, 28, -402, 527, 421, -423, 133, 711, -310, -311, 624, 54, -349, 570, 572, -382, 102, 572, -267, -203, 794, 234, -365, 431, 447, -514, -13, 687, -85, -129, 752, 126, -551, 393, 427, -348, 172, 773, -143, -300, 557, 104, -513, 412, 511, -416, 60, 600, -184, -360, 596, 302, -372, 409, 574, -369, -5, 587, -90, -311, 597, 308, -419, 364, 557, -390, -49, 638, -55, -385, 668, 371, -377, 309, 540, -316, -163, 731, 66, -308, 563, 323, -499, 174, 488, -301, -38, 691, 53, -382, 476, 318, -446, 242, 684, -200, -89, 649, -19, -443, 480, 347, -364, 270, 635, -277, -209, 636, 70, -302, 509, 474, -363, 192, 573, -244, -207, 635, 99, -325, 446, 414, -413, 140, 622, -183, -211, 659, 170, -352, 409, 444, -299, 66, 610, -207, -258, 647, 110, -444, 356, 428, -375]
4378c75M13O40p40j27Q06m14o07P61J81q16L59N73p64k05P87k55o20P37K25q65
4398c06L15O65p34k91Q73k49o68O89K51r18K30P22o40k12Q69k61o79N92K62p68
4418b58K16O85o18k71P33k00p16O43L19p79J35P52o10l67Q32j93o52N48L69q04
4438b36J50P34n98l54P72j32p63N83M40p59M4P29m86m74Q39m5p55M81L96p59M7
4459a46O78m98l81P58Rp29M07M56p34LP85m32n48Q07m5p50M40M49o48o1P93m22
4481A91n36P28k0p25M17N56p05r6P27m19m28P14P7q01M14M86p12r9O87k33n57
4502c34O59J02p09L01N58o40j40P33l39n08N63J79o61J84O58o63j72O93k05n89
4522c30O63J78p62K41N47n37k61P61j66o70N55L08q04J95O03m84k85P43j77o33
$$ y = [-375, 38, 678, -62, -189, 617, 203, -404, 357, 538, -278, 81, 654, -110, -315, 472, 217, -403, 334, 559, -306, 9, 674, -60, -351, 522, 273, -395, 294, 545, -373, -143, 579, -61, -273, 596, 335, -344, 248, 510, -258, -42, 643, 25, -246, 487, 287, -429, 214, 533, -246, -111, 641, 31, -336, 496, 303, -349, 199, 568, -236, -86, 648, 50, -304, 468, 336, -427, 156, 596, -163, -119, 610, 124, -350, 489, 444, -311, 170, 566, -193, -146, 532, 34, -347, 411, 420, -309, 98, 554, -180, -177, 608, 176, -372, 435, 390, -360, 80, 529, -119, -180, 613, 191, -345, 383, 363, -362, 55, 611, -94, -190, 537, 118, -310, 404, 481, -320, 94, 580, -132, -231, 456, 223, -334, 325, 427, -282, 19, 577, -63, -203, 530, 191, -317, 246, 425, -236, -52, 606, -57, -229, 464, 259, -330, 333, 511, -251, -10, 537, 0, -261, 500, 334, -336, 219, 527, -277, -82, 521, 37, -248, 495, 318, -315]
4542c15M88L65q02J87P13n82l13O88j11o54N37L04p04J56O35n62l14O37J7o74
4562c04M47L66o60l2P16m42l42O34j7o32L91L91o32k7O26l07n40P32N2p03L69
4583H6M63o98L4O55m46l72O82R1p48L14M62o55j25Q18l98m41O64K0p42M23N02
4604E89o47r0O96k99o12O03J98p10L06N73o46j57O49k55n47O63Q9n82K52M47n11
4625Il22Q13k69n48N17L08p68K04O48o16k51Q18k30o28N44K21o59J56O22n80l09
4646c20P36j85n43N69K48p38R9O08m51j83O42j66o05M02L76o76Q0O75n16k84O46
4667D14p6p30N70L48o54J44N64n24l63O69k4o76M84M07o59l8N95l08m57P53m4
4688C95o72L83L39n94K6O67l41m79O30n7n06K74M75o34KO39m36m27O19R7o30K90
$$ y = [-315, 173, 538, -264, -77, 636, 54, -259, 429, 318, -336, 201, 505, -199, -43, 592, 30, -284, 353, 370, -304, 143, 509, -151, -183, 533, 91, -251, 383, 366, -266, 125, 516, -116, -143, 483, 176, -364, 368, 420, -283, 86, 549, -149, -115, 540, 94, -278, 404, 495, -253, 61, 523, -132, -257, 561, 163, -278, 386, 406, -336, 87, 589, -58, -148, 548, 249, -363, 240, 438, -272, 34, 607, -39, -196, 453, 198, -349, 314, 403, -179, 73, 520, 9, -313, 500, 231, -317, 200, 508, -260, -56, 592, -24, -275, 543, 313, -315, 229, 450, -209, -53, 569, -11, -320, 416, 231, -312, 257, 505, -233, -134, 474, 23, -160, 482, 316, -289, 113, 489, -187, -107, 568, 52, -232, 414, 338, -392, 178, 526, -128, 16, 580, 56, -307, 362, 338, -338, 146, 553, -106, -144, 451, 143, -314, 439, 395, -277, 106, 445, -149, -123, 544, 203, -276, 354, 297, -209, 65, 540, -94, -92, 547, 111, -316, 303, 400, -230, 60]
4710F0M74o06p9P05l31n50O64Q2o33J95N76n94j11O73k91n62N69J26n94K62N00
4731E35m59k44N40j49n65N68K98p59J99N17n42k38P65j92n55N87J94o89J95N11
4751E17m63l22P13j82n71N05K37o68K02O35m99l16O58j32n91M76K34o00J49N12
4771D94m49l32P23r4p00N27K67o13O3O11l59l80O41q8o12M72L24o21P0O15m96
4792F3l69O52j4o28N24K99o69K4O20k97n17P08K6p05M31L64o16NN50k91m29O39
4814C70k1o69M12L92n73j1O47l54l97N76O8o51K80M62n56j38O30l39m10N30J90
4835D38o73L44M34n75j25N89k55m41N30J66o48J87M90m64k15O59k26m74M97K21
4855D59o38J59N19m23k29O14j89n66O22L7n48J03N19m65k18P01j96n37M59K88
$$ y = [60, 534, -72, -151, 554, 223, -327, 337, 419, -214, -19, 557, -37, -148, 525, 234, -328, 241, 367, -227, 35, 535, 76, -168, 372, 223, -342, 226, 524, -235, -36, 481, -61, -299, 466, 274, -281, 306, 500, -189, 6, 517, 54, -268, 445, 263, -308, 197, 434, -234, -32, 603, 104, -212, 446, 314, -277, 199, 433, -167, -18, 494, 45, -287, 436, 342, -358, 169, 436, -177, -114, 497, 138, -242, 399, 311, -301, 171, 495, -126, -56, 559, 63, -306, 346, 332, -296, 228, 527, -142, -118, 502, 205, -312, 396, 422, -283, 148, 512, -104, -99, 451, 160, -269, 370, 349, -320, 92, 484, -89, -100, 547, 193, -204, 372, 440, -211, 69, 531, -25, -163, 467, 128, -282, 248, 438, -235, 109, 543, -32, -157, 432, 177, -264, 266, 432, -216, -29, 461, -3, -218, 441, 215, -259, 238, 459, -179, -20, 499, 76, -153, 461, 272, -294, 328, 365, -183, -80, 439, -26, -244, 457, 261, -276, 183, 471]
4875D71o18R4N57l86l13N90j48n44M88K65n64N6N26l59l40N86k3o10N17K56o04
4896a03K5N52l77l18N80K2o27L66L28n04p6N56k92l07N65o8n25L43L25n41k7N67
4918D64k83m45N68J2n15K27N30o29k9N28l10l74N32J02n51K26M98n50j32N30k63
4939A36l83N15J73o12K51L93n24r5O13k29m43N02J59o36J87M67n00j51N90j68
4959B45m67M71J72o00K24L74m67q3M63n2n00M06K61o65J27O06m63k60O10j64n09
4980b71M74J96n75J91M54m03k75O08j35n19M84K00n51R3N07m34l29O28l3n59M70
5001B21K55o00P0M91l42k89N54o6m64L20K07m47kN69l53m02O01N0o35L94L25n38
5023h1m7O34l76l08N15L5o14K96L66m61n7N20k69l36M53J04n48K62M44n42j18
$$ y = [471, -147, -53, 504, 118, -195, 395, 247, -297, 191, 456, -108, -52, 474, 115, -225, 361, 338, -272, 245, 501, -103, -78, 474, 97, -221, 359, 381, -246, 120, 448, -56, -132, 424, 132, -175, 390, 322, -203, 140, 465, -76, -103, 464, 181, -264, 304, 316, -199, 28, 558, -71, -100, 428, 118, -256, 276, 378, -173, 53, 551, 1, -131, 399, 136, -247, 268, 441, -171, 80, 473, -51, -146, 467, 238, -205, 297, 456, -180, 7, 474, -26, -177, 413, 245, -222, 249, 421, -179, 45, 419, -48, -131, 332, 280, -220, 186, 447, -218, -91, 515, 52, -208, 402, 238, -271, 203, 399, -176, 15, 469, 66, -209, 399, 264, -255, 229, 429, -122, -29, 478, 44, -285, 343, 310, -249, 221, 476, -124, -54, 437, 95, -194, 360, 294, -170, 150, 357, -90, -92, 477, 124, -278, 323, 373, -262, 132, 457, -81, -128, 506, 130, -178, 337, 372, -242, 54, 420, -41, -98, 422, 153, -183, 270, 374, -174, 88, 532, -10, -128]
5044a28N56k76l62N09N7n59K88L75n36j14O28k73l58M39J60o07K59M35n51m7N46
5065D41k02m69M98J68o28J49M71m16j51N81k91l47L99K22n59J38M67m32k57O27
5085D09j95m35M35J83m95J02M44m12j26M84j99m67M88J94n46J78M40m27k25N53
5105C83j30m81M08K81n51J11M24l79l05O24j10l90L57J73n04QM92k91l20N33j2
5126C21n50L55K06m39K6N49l27l31N01k8m54K47L70m81p7N09k53l77M72P0m58
5147a49L15K64m57l2M91k50l62M30J49n27K08L67m55r7N33k92l32M43O7n31K61
5168D4M21n04j03N03j28l27L64J43n83K23L99m87j43O40j97m92M71J52n32J91
5188E5L70m04j48O04k36m49M10J69n37J61M71m08j97M30j7m66M16J68m36RN19
$$ y = [-128, 428, 152, -210, 299, 356, -203, 85, 460, -76, -190, 438, 165, -193, 246, 406, -201, 58, 493, -58, -105, 441, 239, -230, 268, 436, -192, -43, 428, 12, -139, 442, 151, -196, 203, 425, -134, 4, 471, 39, -218, 409, 214, -221, 214, 397, -98, 4, 448, 36, -90, 394, 195, -272, 216, 410, -136, 42, 482, 55, -170, 383, 253, -228, 180, 461, -90, 21, 445, 66, -239, 385, 275, -115, 242, 415, -89, -81, 411, 120, -200, 333, 321, -229, 126, 332, -107, -81, 468, 141, -190, 311, 283, -171, 76, 446, -35, -112, 397, 144, -233, 239, 309, -149, 166, 430, -27, -59, 432, 182, -180, 250, 399, -128, 80, 447, -8, -105, 428, 136, -196, 247, 314, -217, 44, 465, -39, -142, 361, 233, -94, 270, 413, -170, 53, 452, -35, -178, 462, 265, -227, 244, 396, -136, 55, 425, 21, -127, 477, 241, -208, 202, 371, -166, -5, 466, 58, -139, 291, 274, -192, 224, 392, -44, -35, 484]
5209D84m36k05N67j16m39L08J98n32J45M51k52l09M42m5m76L90K37m89M5M63l15
5230A16k54M49l3m62L55K56o08J71M44l53k38N37o8n06L94K35n22Q0M34l00l02
5251a75N02p3m27K55K55m07Q3M20l19k64M43k3m31K88L20m82q0M77k08k80M11
5272B85J3m51K60K36l62p4N10k22l62M65Q5m93J11L93l23j24M38j91l76M34J11
5293C63m64J39L87m03p1L85j73l04L68J08n02K12L66m09r7M66j80l94L21K54m68
5314i6J01L80l34j54M56q7m01L55J83n00J01L69l16j49M27r7m37M02J49l70Q9
5335G1L66l62j69M06j21l07L25J47m19Q0L55l06j92M07j8m04K79K77m58j1M39
5356C85k67k69M30l2l92K53K55m94M4M69l49j33L46M7m49K83K49m16J0M46k61
$$ y = [484, 48, -157, 410, 294, -145, 163, 361, -171, -26, 425, 173, -136, 306, 261, -215, 175, 412, -77, -32, 431, 116, -138, 311, 278, -184, 171, 427, -181, -10, 434, 81, -157, 380, 312, -194, 200, 435, -87, -7, 427, 127, -175, 327, 254, -173, 82, 337, -70, 13, 433, 114, -150, 293, 270, -161, 127, 447, -35, -115, 362, 154, -126, 285, 298, -153, 107, 343, -19, -93, 417, 195, -167, 298, 383, -110, 1, 394, 71, -53, 385, 194, -182, 252, 363, -101, 38, 425, 22, -49, 336, 163, -141, 227, 335, -167, 45, 411, 2, -95, 371, 191, -203, 118, 372, -96, 5, 385, 51, -103, 353, 266, -135, 220, 403, -97, 4, 373, 57, -92, 335, 238, -199, 203, 352, -18, 71, 437, 75, -94, 312, 191, -116, 209, 356, -63, 17, 372, 66, -126, 281, 263, -141, 138, 415, -43, -54, 385, 118, -151, 279, 247, -145, 108, 363, -131, -87, 382, 33, -100, 246, 293, -156, 127, 376, -40, -30, 416, 155]
5377A55l22L53M9l71K81K53m52O8L61k41k66L95O6m48K58K71m23M3L48j82l50
5398a54L98M6l31J49K55l83o5M76k65k72M07O9l86Q0L37k96q4L77j49l83M36P8
5420C40m83J39M09l21j73M37j48l61L44J79l76O3L21l33j19M19j65l03L18J34
5440C21l46O7L41k96j94M19q4l78L38J77m38N6L46k44k95M64p5l46L12J86m01
5461g0J35L20l17j78M25o4m30K94K25l15o6M03k54k38M11l3l60J93K74l35l3L93
5483C80k68k76L56K0l43K98J86l79lK76j11k46L71J6l79K19K50l97J7L59k63j51
5505f8K86Ol80K65K25l34J9K83j90l21M70J04m10J37K29l45l2M31k20k39L66k1
5527B61l95K51K80l74p2M64k72k57L08J37m17J27K56k15j27L66j25l14L02P2l06
$$ y = [155, -167, 186, 235, -136, 145, 398, -54, 14, 375, 134, -132, 263, 329, -119, 139, 410, -13, 30, 378, 196, -154, 244, 290, -41, 108, 363, -20, -85, 391, 126, -146, 261, 330, -56, 24, 361, 65, -19, 358, 209, -174, 262, 340, -143, -4, 405, 84, -89, 348, 200, -161, 183, 362, -14, 49, 370, 37, -82, 337, 172, -131, 187, 321, -25, 42, 383, 87, -107, 312, 228, -150, 188, 365, -73, -17, 329, 85, -210, 254, 179, -167, 145, 331, -70, 65, 385, 68, -110, 315, 251, -179, 115, 340, 25, -41, 362, 108, -130, 281, 248, -112, 81, 355, 20, -13, 380, 112, -164, 192, 212, -131, 167, 353, -26, -29, 247, 136, -110, 261, 277, -102, 117, 367, -30, -13, 346, 83, -68, 218, 224, -156, 109, 334, 0, 19, 302, 112, -209, 261, 365, -45, 92, 321, -24, -56, 375, 155, -84, 282, 261, -134, 117, 397, 23, -49, 415, 143, -114, 194, 331, -86, 41, 297, 82, -45, 321, 196, -118, 184, 256, -50]
5548e0O7L68l58j04L54j12k65L17P8l28R8L04l25q0L63l3m50L13J43m07J30L41
5570C64k37j68L03m7l04K25J87l92R0K90j87k29M03p6l60K80K04l66NL68k34j98
5592g9L04L4l57K36K35m40J16K96k50j61L01j4l72K81K36l25n9L70k41j86L57
5613B82ml25J29K64m12P0L39j98k87L37N5l63J84K87l71o2M06j79k82K98J57l93
5635f8R3L39l50k9L03r0k93L27K7l46J18K79k72q4L98k05k39K80J14l60Q5L31
5657C58l19j57L79r4k93L28J12l41M3L27k52j58L71j26l07L43J30m01N1L31k27
5678I8j59L70j29l52L39J16m03J47K96k26j39K91l3l18K68J28l38R3K60j89k21
5699a01L79p9l18K12K43l13NK37j23k41L47o1k62K34J33l10RL01j82j97L98p8
$$ y = [-50, 17, 385, 27, -77, 277, 165, -100, 217, 295, -33, 65, 369, 44, -36, 327, 294, -156, 157, 300, -107, 23, 364, 127, -41, 262, 215, -89, 136, 323, -69, 21, 311, 124, -105, 298, 222, -138, 142, 346, -20, -15, 353, 119, -79, 225, 259, -98, 138, 373, -67, 49, 345, 95, -66, 235, 221, -151, 130, 366, 41, -18, 352, 111, -75, 282, 278, -47, 82, 346, -66, 4, 343, 145, -142, 195, 250, -113, 71, 358, -13, -75, 331, 152, -130, 168, 325, -68, 25, 364, 14, -15, 288, 198, -95, 232, 259, -87, 31, 310, 38, -46, 352, 147, -92, 188, 302, -58, 27, 358, 39, -118, 261, 167, -126, 202, 314, -27, 16, 343, 91, -67, 304, 178, -129, 214, 344, -57, -6, 325, 98, -61, 309, 180, -172, 167, 283, -120, 27, 323, 97, -42, 249, 216, -102, 166, 294, -44, 49, 309, 120, -101, 278, 199, -119, 93, 336, 23, 28, 265, 142, -99, 248, 187, -75, 159, 292, -18, -9, 292, 110, -87, 311, 233]
5721B33l35K67J55k28j13L43k23k09L56ql28J92K28l33k9L85j71k35L06qk98J42
5743H9L23l77m2L24j91j94K37J35m00J98K25l10%L30k02j83J98J07l60J47K97
5764C51l30j01L52j13l25L32J42l01P9K05k20q5K56n2k27K37J07l39Q1K29j24
5785A54j51K42l2k85K40R5k04p6L86l42k1K69j00k33J77K10l48Q9J73j14j60L32
5807C01q9k61K48J29k99N3K30k35q2K62o2k29K34J15k83l1K63j63j15K95p5k87
5829h1K18J92l07%L29k31k30L69rk58N2K71l09k0L44j67k20K27R6k89J13J47j85
5852E2o6L47j97k53K90P5l01J61K33l52J6K32r5j97K97P6l60J85J49k90l4L34
5874C02j92j57K30R3l13R4J81j95l2K74j32j91K24O8k60J56J58k50q0K94j10l33
$$ y = [233, -102, 165, 320, 92, -21, 322, 99, -110, 246, 238, -90, 102, 330, -3, -32, 353, 182, -53, 253, 245, -53, 89, 412, 35, -7, 317, 126, -68, 169, 304, -96, 102, 327, 17, 17, 347, 145, -38, 160, 267, -93, 54, 351, 21, -80, 272, 159, -166, 166, 308, 7, 86, 291, 71, -14, 242, 190, -37, 200, 307, -32, 49, 278, 154, 3, 245, 213, -72, 168, 263, 59, -17, 369, 27, 6, 275, 175, -58, 119, 329, -19, 70, 243, 129, -31, 301, 212, -49, 199, 328, 29, 82, 312, 77, -5, 257, 195, -34, 200, 315, 32, 1, 264, 101, -14, 281, 206, -81, 137, 329, 22, 22, 351, 120, -110, 259, 250, -8, 44, 315, 6, -14, 330, 163, -57, 170, 266, -23, 90, 237, 52, -14, 333, 136, -117, 173, 248, -53, 108, 341, -11, 5, 237, 142, -55, 242, 318, -42, 143, 292, 2, -32, 302, 110, -47, 183, 276, -37, 57, 238, 43, 11, 285, 153, -38, 186, 254, -6, 150, 308, 58, -22, 272, 162, -171]
5896a71L57J02l05R2L31l57n4L79j80k81K47J08k96N0K66k33r8L29r1k59J84J31
5918B51k48R1K20j93j50L02m2l15K23K03l46kL11k08j19K31J3k75K00J66l06Q9
5940I6K69k34j40K06M4k67J70J69k97L2K15r3k04K76Pk64J56J86l01k2K46p7k01
5963b8K79M0l89J48K72l32l0L83k50k07L11O2l21J78K21l12k5L05j49j67K72j8
5985B43k80J00J00j08j03L36q8k70K91J20l79J18K39j96j61K75l3k60K61mj82
6006A9L3K34k05n6K62j15k22K13J14l18J16K10k37l0K50j44j35J92O6k18mK60
6028B85j65j59K89o4k62K14Q0k17J01J73j79j03K68n6k75J90J74l55J01K63k46
6049E7o2K49Ll22K00J92k17p2K26j65j28K88Qk91R4J90k80Q0J62q7j04J91R5l87
$$ y = [-171, 186, 288, -17, 75, 406, 49, -5, 374, 194, -87, 160, 268, -28, 22, 288, 55, -43, 286, 195, -64, 120, 251, 3, 94, 314, 121, -29, 273, 231, -84, 139, 342, -4, -6, 305, 97, -22, 209, 222, -53, 147, 313, 7, 96, 365, 131, -9, 197, 241, -26, 144, 313, 16, 48, 263, 170, -34, 242, 249, -15, 141, 327, 26, 4, 250, 173, -28, 251, 291, -98, 50, 322, -10, -40, 343, 93, -114, 197, 259, -62, 116, 337, 25, 0, 305, 156, -11, 261, 243, -37, 63, 163, 55, -48, 288, 200, -70, 221, 341, -38, 80, 319, 123, -38, 237, 204, -56, 205, 201, 19, 52, 286, 81, 25, 287, 172, -50, 163, 277, -41, 75, 285, 48, 18, 268, 124, -11, 181, 247, 29, 25, 285, 120, -39, 250, 186, -76, 138, 218, 1, 102, 275, 96, -7, 261, 205, -70, 120, 294, -61, 40, 303, 57, -5, 244, 247, -75, 125, 317, 100, 28, 254, 89, -39, 249, 257, -34, 60, 250, -30, 50, 212, 125, 21, 212, 307, -80]
6073h0K09J94k81n4L25j97j30J91O0k94J47K15l29M2K60j32j77K03J12l28J65
6094A21J84k37m8K15j41q1J94K8k65O5K48k11o2K53q6k81K90L5k54J46K04l18
6116aL3K66r2k49K51O9k66O5J89j96k5J83l7j84J84R1l22kL03j75j46K75q7k36
6140a09K30J04k54O6K75k76m6K64p9k06J74J08k72R8J99j83j14K40n8j60J61J21
6162B83k37k1L12k40q8K61j3l30K48J12k60l3K65j23k25L61r6k16K21J31k36q8
6184a2K93j67j90L14j2k59J29K16k85q7L33r4k04K03O3k84J36J97k63L1K27j16
6206A69k43K73K5l05J27K34k55j6J99m9j52K17Mk70J45J73j99q4K26p8j65J59
6228A35J90l68J28J95j88p3K48p3k29J62J40l04P3K13k01lK21j08j51J22N7k06
$$ y = [-80, 129, 323, 42, -12, 313, 116, -14, 177, 237, -57, 90, 305, -24, 18, 278, 146, -31, 172, 284, -44, 121, 305, 68, 20, 235, 94, 13, 207, 235, -30, 35, 283, 72, 10, 263, 177, -104, 186, 221, -33, 113, 317, -1, 32, 298, 206, -43, 208, 277, 11, 76, 265, 69, 44, 227, 190, 6, 190, 281, -41, -43, 260, 85, -61, 214, 127, -109, 121, 225, -29, 37, 312, 36, -10, 254, 175, -31, 143, 251, -21, 77, 276, 93, -21, 219, 161, 1, 162, 283, 46, 25, 337, 97, 9, 270, 257, -73, 175, 287, 27, -6, 259, 136, -89, 272, 176, -40, 181, 312, 76, -12, 281, 114, -76, 238, 226, -33, 96, 312, 27, -60, 273, 179, -25, 178, 241, -43, 93, 290, 27, 58, 285, 169, -74, 199, 224, -81, 46, 280, 25, 9, 208, 159, 7, 224, 228, -42, 103, 276, 77, -7, 219, 141, -24, 135, 325, -43, 85, 280, 92, 19, 267, 194, -35, 127, 267, -37, 36, 249, 48, 45, 266, 158, 7, 129, 186, -20]
6250b0J01K44j83j80K88j42j45J76J18l07P6K46j94o4J46P1k56K03P4j70n8K62
6272B86k10n8K16j5k58J71J82k63n7L35k33j31K61Nk31R3J83k48J6K96k27j10
6294CK38l2k55J12K56l02N3K10j21j28J83o6j33O4K07k62K6K57j64j97K50O9k60
6317HR4J49k13m8K49m4k47K32J0j91J08J47j65j12K86j18j64K45M6k16Q2J43k64
6340A7JK49j16j83J84J09k46M1K16k48p5L59j47j51J50N8k37J35J77j92q1K07
6362B27o3j64R0J44j53N7R3j50j01J63k8j55J90M8k33Q2K08j50n9J61Rk27J63
6385A52M0j87O5J79j24j28J86J0j93J67L1j73J0K19j08j36K04l4k60K06J38k50
6407A4Q6J45j15j56K74n5k11Q6J79j99m2K12o8j90K81m8k13J19J35j95k7K62q5
$$ y = [-20, 81, 325, 142, -38, 250, 108, -37, 139, 257, -50, 26, 272, 78, 14, 160, 231, -25, 178, 252, 82, 24, 286, 76, 18, 234, 219, -39, 132, 314, 51, -6, 329, 96, -35, 226, 231, 0, 93, 276, 28, 44, 340, 113, 3, 241, 209, -46, 66, 322, 20, 73, 283, 162, 34, 217, 151, 18, 82, 289, 27, 53, 310, 146, -51, 199, 268, 8, 102, 251, 38, -10, 239, 195, -52, 180, 190, -1, 107, 254, 89, -23, 263, 145, -19, 226, 272, 56, 138, 281, 17, 18, 267, 151, -32, 152, 261, 15, 56, 272, 24, -51, 308, 161, 10, 160, 218, -19, 116, 293, 101, 20, 227, 164, 0, 90, 234, 81, 138, 231, 81, -20, 143, 115, -40, 150, 198, -35, 47, 255, 105, 46, 207, 216, -11, 152, 192, 5, 70, 249, 125, -3, 183, 193, 0, 167, 198, 25, 35, 254, 146, 10, 214, 180, -80, 126, 264, 14, 100, 245, 130, -26, 248, 193, -18, 68, 247, 48, 6, 218, 150, -40, 241, 193, -20, 99, 234, 39, 12, 274, 189]
6430A89j88J96m3j45J17J33j63n9K00j09j33J43N3k06O1K28k00l0J87j32r9K09
6452B09K6j74k5K51j84m6J66p4j40J64L5j69P1J34j71l2J31k2j39J80R7k54J7
6475E1J94k15q8K93p1j94J28J41j81J4J59j26j07K33r5j78J77J10j87k1K70j75
6497A32j27J68j9j02J08M8j42QJ33p5j00J50jk15J47J06j44PR6p5j26K32Rj78
6521D0J06P9j84Q2J70k10l8J22P9k36J12J26j74o2K27j08j86K84k2j29K5J12j43
6544G2o2J81q3j38K38j2j73L1K48k34o4J67j9j33J47O6k18J49N2j80n5K98j56
6567A22p7J06L2k27J26J86k25O2J53j55l5J71J8k34P5J40j63p5K09o3j55K22J7
6590B30k08R6J28j88mJ38n6j28J24M0j17K2J73j64k6J41j9k07J75O8j39J4J36
$$ y = [189, 1, 197, 154, 9, 126, 259, 96, 37, 237, 128, -5, 138, 191, -15, 46, 274, 74, 44, 231, 99, 0, 209, 235, 61, 36, 287, 103, 57, 223, 149, 9, 173, 208, 39, 110, 244, 73, 41, 172, 150, 11, 191, 288, 34, 51, 245, 30, -58, 235, 164, -30, 98, 239, 58, 72, 231, 105, -2, 231, 136, -42, 135, 245, 58, 37, 307, 132, 5, 173, 154, 52, 160, 208, 66, 74, 207, 132, 32, 182, 181, -34, 113, 219, 75, 82, 178, 103, -23, 209, 218, 40, 146, 225, 41, 123, 293, 83, 45, 167, 246, 10, 122, 248, 74, 12, 239, 131, -55, 229, 207, 78, 103, 215, 72, 10, 191, 108, -30, 208, 196, 23, 54, 302, 68, 4, 171, 152, 19, 166, 232, 14, 163, 215, 35, -20, 278, 122, 45, 151, 183, -44, 82, 268, 43, 105, 258, 103, 68, 239, 257, 23, 98, 238, 75, 0, 209, 146, -9, 213, 230, 22, 118, 246, 58, 54, 192, 136, 8, 132, 172, 55, 77, 250, 86, 60, 201, 182, -25, 150, 218, 79, 93, 229]
6613B29j01j08K43j37n5P3N7j04k0J57j32q6K24o1p7rJ71k21RJ89j70m4J28n1
6637A04o1J47L9j99L8Q2k2j24J57K2k25J84M0j41JK07j46o5J15N4k34J36J68k35
6661D2RJ92r8j38J87m6j16J30K7j47%K08q5j70J60R5j89Q4J16j30k7Q3Jj76K13
6686B25l7j67N3J86j30n3J48j18o6J58K6j68P1Q2j08o5J94q6j39K04l4j07J0K09
6710B88k11p6J87m7j17J50M1j78L0J93j77k7J48o2j62J68J00j98M6J74j37q9J54
6733A98r3n7M1O1j25J09J29j17j12J09N9j66J26P2k04J55J3n0j24J24P0k09J32
6756A41N2q7m7J38q1o8Q9O6j65R3J30k03K8J10m4p1J09qk00J97K8j41J3J51n2
6781A78j41J93o8j82J12R3o1l9R9k6j72J62N3j43J8J54j57j2J65r2n3Q5M3j88
$$ y = [229, 128, 20, 263, 126, 71, 144, 201, 97, 77, 234, 102, 16, 240, 179, 102, 93, 264, 43, 52, 241, 71, 27, 155, 104, 43, 190, 229, 30, 68, 150, 128, 4, 161, 183, -42, 142, 182, 41, 42, 249, 103, 38, 153, 207, -27, 109, 277, 42, 51, 243, 145, 7, 194, 148, 32, 162, 189, 42, 42, 250, 165, -5, 155, 250, 61, 145, 261, 131, 104, 187, 188, 12, 225, 188, 21, 74, 260, 130, 77, 225, 107, 41, 199, 225, 57, 128, 210, 102, 37, 231, 145, 6, 210, 176, 69, 79, 288, 77, 1, 188, 141, 24, 174, 215, 37, 67, 260, 83, 56, 204, 142, -20, 148, 248, 50, 96, 270, 133, 44, 198, 105, 48, 89, 150, 25, 134, 263, 146, 34, 143, 202, 36, 162, 234, 30, 185, 198, 148, 24, 148, 218, 9, 141, 193, 106, 59, 197, 116, 48, 137, 203, 38, 131, 261, 58, 86, 196, 152, 81, 190, 182, -18, 179, 207, 66, 79, 230, 178, 37, 230, 162, -20, 92, 185, 124, 85, 184, 158, -14, 148, 201, 58, 76, 230, 73, 61, 226, 134, 81, 166, 209, 21]
6805B1K6J58j17J4O9o1n1J46k7r4l2J39j69jJ60o6p3J11P6j79L9J14j05MJ50j54
6831I8KL0M6r2M2M2n2m9P6k8p7J48L3j52P6K5j8r8O1Q2j19J07l3k4j6J26j42p6
6859A8J60j5j31O6J08j24MJ32j28n4J76n6j01J9J30j09o5J64q8j09J83l6q3O4
6883A25J17j71k5J27j16k3J82o4p4L6O3r1j6J36j33J4J54r0r8J03N0j25L7L8k9
6908A27p5R1J1m0PJ13j58PJ11j11LL8O6j58J05J9p8k8K01j16j38J66m9n9R9R0
6934B44j88qJ78o9n3Q6l8j20R5J35j52p3J94j16q4J43P4j74l8K59k14l2J18r0
6958G7o2J33M6j56O0N0m3k5J05m8q0J29m0o6L1J03r4p5R7Qp6J09Mj16M2M3j12
6985D4NJ26O0j94J37J0j26lR3j7j13J66rj00M7P3q1K9J5l5q6J27L3j20P1K5q3
$$ y = [21, 47, 205, 88, 102, 171, 110, 59, 205, 178, 84, 52, 191, 22, 21, 181, 115, 42, 153, 229, 50, 89, 203, 98, 102, 252, 98, 100, 130, 176, 84, 126, 168, 116, 67, 143, 115, 38, 186, 219, 67, 143, 168, 150, 52, 113, 195, 76, 183, 150, 126, 110, 236, 94, 18, 178, 163, 32, 98, 206, 82, 86, 218, 90, 36, 212, 156, 55, 74, 204, 95, 30, 194, 106, -3, 180, 144, 61, 125, 242, 71, 46, 173, 57, 34, 216, 152, 78, 114, 177, 86, 70, 206, 73, 87, 241, 151, 53, 156, 206, 81, 118, 156, 127, 52, 143, 154, 114, 121, 234, 76, 83, 194, 83, 86, 124, 190, 32, 137, 156, 78, 50, 251, 135, -3, 163, 114, 55, 154, 244, 56, 48, 226, 157, 104, 190, 152, 32, 127, 262, 110, 37, 231, 115, 31, 174, 248, 74, 36, 295, 81, 49, 167, 77, 15, 148, 194, 38, 98, 148, 105, 80, 185, 137, 57, 186, 146, 80, 111, 214, 120, 45, 142, 150, 74, 183, 187, 71, 113, 156, 44, 49, 175, 235, 41, 178, 188, 62, 59, 152, 135, 22, 188, 179, 79, 126, 199, 118, 147, 162, 127, 41, 168, 201, 81, 152, 177, 94]
7012I4k3J35r7m9J88o5j14K2R9p8m6J57p4j21J99l9j17L1Q3j27O7N2p9q5Q0K0
7038A13o2K9R5j10J7J01n1j08J50Op9p3J60j27J0J07n2n1Q5k2o9P5Q4j78j2J62
7064B00r2j4L1M3o0K1P7n5j69K06j9j34O9N1p4l2J34r0oQ2Qp2Q6L0j33mJ16j19
7092H1oN3L1j36R5K4p0Q5K5p7j7Q9l1r0J48j2p9L9qM0j44J20l9j36J52L0o4OK4
7121A33j9p6J16Kj34J37M6j25j7J27j04qP6Oj42J30L4j54lJ80m8r5J11M3j67O3
7147A12L3j12lJ27lr8P7j6p1mJ76j30m0R3M1j50J26n2j0L1P1p2n4Q8rj21J14N3
7175A97j07K6J33j44n1K31j70k5P1qk9l3J06o0l3M0%n6NO4r2N5J15o4j27J20n5
7202A09p3Q5N8j09N4N1j2j13J31j6j44P3P2j43R9N5m3q9J26l2j23J17J0n2l5R0
$$ y = [94, 71, 206, 109, 60, 248, 183, 69, 91, 190, 112, 66, 223, 149, 28, 227, 188, 71, 102, 185, 58, 125, 177, 98, 13, 93, 113, 51, 80, 175, 65, 82, 183, 132, 24, 174, 180, 101, 28, 188, 61, 71, 178, 126, 75, 160, 138, 69, 144, 228, 50, 38, 200, 108, 94, 125, 168, 108, 129, 206, 151, -18, 188, 169, 35, 104, 155, 81, 49, 183, 93, 87, 169, 177, 105, 191, 221, 88, 84, 200, 81, 75, 128, 159, 23, 118, 142, 72, 157, 182, 105, 88, 177, 146, 56, 204, 192, 113, 152, 144, 184, 40, 160, 121, -15, 137, 167, 103, 109, 133, 114, 38, 154, 156, 22, 159, 205, 80, 63, 190, 86, 78, 154, 160, 18, 148, 182, 28, 25, 205, 157, 62, 173, 216, 49, 112, 145, 33, 30, 157, 154, 56, 133, 117, 46, 42, 218, 88, 48, 141, 182, 32, 158, 106, 96, 127, 198, 126, 72, 160, 151, 30, 144, 197, 90, 116, 249, 105, 54, 285, 115, 90, 161, 153, 124, 91, 197, 137, 104, 144, 144, 88, 93, 157, 65, 120, 235, 171, 44, 164, 109, 36, 121, 179, 70, 124, 175, 163, 50, 181, 165, 21, 94, 166, 23, 122, 177, 134, 45, 171, 139, 16, 133, 143, 91, 56, 146]
7228A46j3n1M9M0q5O7k5n9L6N5j06j9J48p1m9O3M0j04K9N6n0k3O2M6r2l2J48r2
7256A14l7J07j02l2P7J6n4L6J04j29j9Q2k1p8P2pp7M6J18j06L7N3p5p1J05J6p0
7283A05l2Q3n8k9J23n8q7J27o8n3N2Q8n9m4J52r8l4M0K7j27O2P6j10L5O6p0n4
7310E5N4N9r6OJ01p1r1J77m2p7N9j0o6L6O4%j53J61l3o4O4j8o2K2R1o9k3J3O6
7339A53p7Q8O3j23N3Qn5m5J04Po8J8Q4j11k3J22l8j09J15rp1K1M7o6L2J37j09
7366A48p3L3P3j24O4R0p4p2J98p3j43Q6j7l8K9P8p2m9M8k5q0J74Jj04L4P5j17
7393G0lP3o6ML4J3n5O9K8q7n1J02J05j62M7J9jj1N9r7l0J90p5j08O6L4n8l1K4
7422A02K3o0J26o1o9R5kj09K3P7nl8P7o8lK1K8n2k6J38j11n6J40o0k5O1J3r1l3
$$ y = [146, 133, 82, 131, 171, 86, 153, 128, 69, 105, 160, 54, 35, 183, 112, 63, 126, 166, 62, 91, 147, 97, 74, 136, 182, 90, 58, 206, 114, 77, 184, 82, 50, 127, 143, 89, 125, 229, 100, 81, 163, 142, 64, 136, 129, 52, 98, 216, 110, 147, 200, 125, 54, 159, 175, 105, 73, 156, 98, 69, 192, 134, 47, 174, 106, 53, 105, 193, 134, 90, 242, 144, 110, 150, 177, 50, 112, 188, 78, 113, 179, 109, 55, 109, 168, 72, 78, 179, 108, 17, 194, 152, 75, 134, 124, 58, 94, 158, 158, 5, 166, 133, 69, 133, 115, 53, 75, 166, 97, 74, 87, 153, 76, 164, 227, 104, 157, 165, 110, 65, 169, 176, 108, 126, 210, 99, 76, 198, 160, 51, 166, 157, 86, 107, 154, 88, 120, 257, 148, 75, 108, 181, 57, 121, 211, 137, 65, 263, 190, 47, 133, 116, 78, 107, 185, 113, 64, 112, 87, 7, 181, 182, 78, 112, 187, 70, 67, 140, 74, 78, 112, 125, 70, 139, 167, 80, 29, 131, 236, 74, 121, 140, 139, 128, 187, 90, 60, 250, 175, 67, 133, 167, 109, 78, 102, 125, 65, 191, 130, 61, 156, 154, 45, 68, 145, 140, 102, 179, 111, 108, 129, 157, 105, 79, 217, 106, 50, 190, 130, 105, 166, 179, 88, 55]
7451E5J06n6r4J76o5nqM7m7o6J70j21k1Q3Pj03J23l7l3k9J30j01j2P6j6q5M9M4
7479A67j15N3mL1q4J02L6j56O6R4r8k8J28k4j45J70k1j22N8Kj9m3J76q1l8J05
7505B10m2p6QJ5Jm7R8n6n8J19%o6O5l1o3nN5Kq4J54l3m6L2K8o7o2Q8k3p3R5j5
7536A23r7J21L8j21j7Q1l0j5M2J4p2N8j3j3K1J05k2j10N0Ln9J0J22o0m2Pj5k1
7564H8K2L4o0JJ35j11L6qPo7N6J01j54J9J9M0j08J13%l9l8R8r9J7L2q6K2R9o9
7593A00m2R5j3r7N5J29k1j56J31K9j39N0R2j17k7Q3k4j28J29K5n6N1N4r5k3J41
7619B26n5n8L1k0K4r6J00p5j9J44j30JJ08M2j77R2rj48J16J04l0o7P6K1j50P9
7645A30Q0p8l3P4Jn2j0N5j01jJ22r2m3J54n3q9P5N0j37J20pj5p3J28o8j26J22
$$ y = [55, 161, 105, 11, 187, 122, 117, 109, 156, 109, 43, 213, 92, 71, 154, 161, 58, 181, 144, 111, 82, 212, 111, 99, 175, 159, 74, 123, 167, 52, 105, 101, 132, 48, 150, 186, 30, 96, 190, 92, 64, 192, 168, 23, 193, 172, 50, 108, 110, 91, 48, 224, 143, 105, 210, 168, 92, 100, 115, 116, 69, 167, 111, 53, 172, 172, 106, 171, 140, 77, 72, 127, 129, 45, 199, 166, 120, 152, 180, 113, 51, 139, 116, 43, 138, 123, 26, 147, 185, 64, 47, 128, 98, 83, 125, 139, 67, 125, 112, 99, 120, 225, 203, 93, 143, 146, 87, 97, 219, 159, 117, 124, 109, 88, 110, 144, 84, 85, 220, 109, 145, 137, 144, 77, 133, 234, 80, 99, 118, 158, 50, 163, 163, 124, 86, 184, 85, 102, 134, 48, 70, 169, 100, 58, 153, 140, 43, 98, 227, 206, 50, 181, 210, 71, 121, 213, 96, 69, 152, 128, 0, 129, 154, 98, 149, 203, 108, 85, 226, 171, 113, 144, 124, 148, 52, 152, 77, 58, 202, 72, 73, 181, 223, 46, 138, 129, -19, 97, 201, 171, 104, 180, 201, 51, 130, 210, 132, 99, 173, 174, 122, 112, 167, 66, 65, 187, 95, 52, 206, 153, 64, 139, 189, 52, 172, 165, 150, 77, 205, 137, 11, 133]
7672A33M3j08J3O9m6N8K3o3m3Q1L8q5J7P4j74M1J48o3j34J51j9j8m3J01j06k3
7698F5J23l2n6O7M5q2m7P8k4Rj3o0l1J42l0rnQ5j07lLl5L5j0Q0j01O1N1l1j11
7728E7N8j2l8L1M4n5pJ30p6k8M5l2J5L0Ln0m6L1l1J2J14j5j19P8M7k3o2O7m9j
7758A18M5k5j1n1J28j37JP3Ko7K2Q9q0k4J11j30oJ00q5l3J34m3o5R8ro4JJ04p3
7787A23nk5J06j08JJ22j29m1J00N2m8pM0j03R8J6k0o0M6J5j45P5M2m9pQ5n1k6
7815I7N3k8q7L9J01p1j5M9k4j8R3K4j33K8J4N0q8Q3J3q3J66j01r7J6P4Km9K4K2
7844A54q8M5K1q7O0ML8k3P1j01rR4j9j16P2N5n0mnK9j09R7K4l0J3Q8j34%K5j5
7874A00pN4ro5L9R7j23k0J21o8NJ2l2m4Q8k4j6pJ01j19PJ0O4p7N1K8p7J4%O8o6
$$ y = [133, 176, 68, 81, 150, 104, 162, 185, 122, 79, 160, 198, 113, 130, 204, 30, 71, 219, 156, 22, 173, 154, 136, 93, 194, 88, 65, 188, 156, 100, 167, 212, 130, 83, 161, 137, 146, 133, 73, 42, 184, 154, 145, 140, 225, 118, 115, 118, 83, 118, 108, 188, 87, 148, 199, 168, 57, 115, 103, 65, 96, 140, 85, 78, 208, 132, 104, 149, 117, 132, 162, 165, 115, 69, 100, 69, 81, 195, 180, 61, 139, 186, 163, 101, 168, 119, 118, 163, 138, 127, 76, 204, 67, 68, 141, 143, 76, 98, 187, 107, 83, 194, 64, 58, 158, 73, 40, 174, 131, 66, 164, 155, 91, 92, 196, 123, 118, 93, 199, 91, 92, 214, 85, 44, 144, 196, 148, 141, 181, 78, 176, 192, 172, 112, 158, 173, 28, 103, 145, 96, 89, 174, 123, 97, 150, 122, 35, 74, 175, 104, 89, 138, 114, 96, 189, 213, 80, 108, 122, 172, 84, 167, 180, 97, 263, 162, 65, 81, 155, 157, 108, 132, 154, 66, 111, 132, 45, 105, 109, 147, 124, 195, 94, 85, 179, 160, 44, 116, 171, 121, 117, 112, 141, 32, 129, 153, 123, 136, 224, 90, 90, 115, 100, 93, 147, 138, 73, 112, 209, 86, 66, 187, 119, 124, 136, 104, 60, 148, 124, 108, 101, 202, 83, 90, 100, 164, 87, 138, 166, 89, 103, 103, 171, 105]
7905A05J05n4o5MQ0k7o3K5J5r1J21M7q4M4O5m8q2L1M3o3Npj8L0O6m0j42R3K8m1
7935H2P3ql3RJ1J2l6pN2q0O1J4j06J01K1m6n1Q6L2o3r6J41n4m4R6l3k2N7l7L9
7965A71n7N9r7L6jK5l7P6jj39J8J23j00j2N9M3o3k0J1k1J04Qp1j8R5m6q7J02m6
7994A14n1N7J7n6J0N6J5k0N0j0j42O2O1j7m7N8l3j7l0Q0k0K5L3j09k9J06Oj70
8022aQ8N9j9j6R4o2q0P8J5p0O5m2J0L3jln4Q3q8K7Rj2l1M8L9l5q5P1P3r3K1J0
8054A31m8N1k8L7k8L0J8n4nR4j24K7L9n0L2Q0j03J8K2jk2m3O7l3k4J6O0o3l7P7
8084A36J6m3K6J8j8k0l3J9k5M8j4k6Q8J7nl5K6n0j1J8J2q7Q3p5N4P5k8q1M3L8
8114A66q0K1N3k6qM2L9j37NM5K8q6O6J5Orl6k1J7O1r5LJ35m6j23J24k2J2m6L8
$$ y = [105, 210, 156, 91, 95, 175, 148, 85, 110, 125, 34, 155, 202, 118, 162, 227, 179, 97, 128, 171, 108, 113, 106, 88, 118, 184, 144, 2, 95, 123, 82, 155, 147, 114, 123, 134, 146, 110, 103, 155, 75, 136, 150, 44, 145, 166, 120, 69, 155, 187, 124, 28, 169, 115, 71, 167, 134, 112, 169, 132, 171, 114, 173, 76, 112, 111, 136, 99, 175, 174, 35, 53, 176, 76, 64, 123, 166, 103, 83, 94, 73, 177, 185, 114, 96, 191, 145, 58, 160, 114, 63, 120, 137, 81, 91, 147, 162, 142, 192, 182, 40, 102, 163, 146, 99, 157, 124, 107, 77, 157, 137, 162, 195, 86, 57, 163, 169, -1, 87, 146, 127, 111, 205, 143, 63, 141, 156, 86, 151, 109, 119, 152, 151, 148, 94, 177, 89, 116, 125, 113, 82, 130, 169, 134, 49, 120, 193, 100, 121, 131, 83, 134, 106, 143, 115, 145, 163, 109, 104, 198, 74, 101, 140, 90, 122, 202, 99, 117, 139, 138, 116, 73, 140, 107, 83, 99, 159, 96, 59, 136, 152, 109, 135, 153, 135, 115, 82, 101, 76, 124, 110, 84, 172, 189, 184, 149, 175, 125, 114, 132, 144, 57, 140, 65, 119, 194, 166, 85, 128, 166, 86, 107, 160, 134, 126, 168, 207, 70, 75, 120, 148, 62, 128, 143, 149, 140, 104, 83, 100, 161, 66, 69, 204, 158, 35, 159, 137, 149, 103, 141]
8144A41l3n7P8QJ7m1L3k3RM7p3J8oK0m7k7J59n4j12R0j2j07J06Jq1J25nn3JQ1
8174B03j07M1J7j9k5N3m6l5PO6m4nN4L4o9o6J52
$$ y = [141, 108, 51, 129, 137, 154, 113, 146, 123, 132, 179, 106, 124, 118, 138, 91, 64, 223, 169, 57, 147, 135, 28, 134, 135, 54, 179, 174, 121, 122, 203, 96, 137, 154, 135, 110, 163, 117, 82, 89, 155, 111, 106, 160, 194, 125, 59, 211]
8191B11
$$ Imaginary data points
##PAGE= N=2
##DATA TABLE= (X++(I..I)), XYDATA
0@%%%%%%%JjJkLmNpRj0J2j6J9k3K8l3L9m5N2o1P1q2R5j09J24j41J60j81K04k29
37a21K57k88L22l59L99m43M91n44O02o65P33q08Q91r81J080j190J313j450J603
56H42j777J976k205K473k791L177l658M273n094O253q023J1100j7972O1117j5101
71C4590r7795o95k6722M6532J00038K9128o4232l3396m6907n8905L3830J03696
83A9162L3164O620J6167m9901p8657J7768M5793L248K7683L3768n3261n7152J1102
96b4496m303k3115L9622K9417l7865m800L7174j4156j3138L8461l018m2429K1709
109i37L6544j3881J0807K7432m9399o0216J0753P543m498N7568M3362n0168m8373
122c3463p906l0810M765R1449N9395j8000j3546l3436q1968j5531P2142M3354
$$ y = [0, 0, 0, 0, 0, 0, 0, 0, 1, 0, 1, -1, 2, -2, 3, -4, 5, -5, 7, -9, 10, -13, 15, -18, 21, -24, 28, -33, 38, -44, 51, -58, 66, -75, 85, -96, 108, -121, 136, -152, 170, -189, 210, -233, 258, -286, 316, -349, 384, -424, 467, -514, 566, -624, 689, -761, 842, -935, 1041, -1164, 1309, -1482, 1695, -1963, 2310, -2784, 3469, -4554, 6546, -11426, 49691, 34590, -63205, -63900, -90622, -44090, 55948, 85076, 20844, -12552, -59459, -118364, -84534, 19162, 52326, 58946, 75113, 25212, -53445, -35677, 10116, 13364, 41047, 74815, 21554, -35598, -24496, -28799, -51914, -12292, 17125, -20740, -25540, 11634, -2522, -15660, 22801, 19783, -22646, -937, 35607, 21726, 32533, 59965, 10566, -49650, -38897, -31354, -35852, 21716, 65078, 14910, -33463, -41369, -72179, -67414, 24035, 83430, 65430, 51884, 18448, -63520, -79051, -6909, 36445]
134C6445J7609L0654m0957j02762l1971K8283J6137N3242P3774j9282p0546k1923
146c1297j7220j8778O0807P7695n789k5522p741n3279m5260M1359M2303p045J5125
159B5358R280n4788l1315L1267M539q107M0101J4475l8341L417K8498k1045j0108
172f769K9712j3929l2323K7496K3285k3245M382J1469m7320k9777L5024J6468
184e527J220M2339J0010n8539k7280J3640p905K2297O9801J1298m7519k0794k5160
197b2119m5725K3418P0619J4704r567L874m7204o4361J6800M8083J5959L5042
209C9523L1022m7999n6691N281L676K54N4193L7613l7961l0550l650l4817j2262
222e2368N2300K5592j9325P584j89m3975n087L9412L94p016L0816k056l6934R919
$$ y = [36445, 54054, 84708, 43751, -59011, -90982, -62699, -46562, 6680, 80454, 61172, -9374, -31297, -48517, -67295, -6488, 71207, 65418, 39896, 32155, -21124, -66384, -25025, 17278, 10233, 25358, 34638, -20150, -51465, -20198, -15659, -23766, 16335, 30810, -7531, -4114, 24384, 3339, -6769, 22943, 9014, -23309, 4187, 27472, 4227, 8609, 20078, -27242, -57019, -21995, -5527, -4307, 38032, 48042, -10497, -37777, -24137, -32042, -9745, 60056, 71354, 23835, 3041, -22119, -67844, -44426, 26193, 40897, 31330, 35204, -12000, -76361, -59561, -11478, 4481, 39523, 70545, 22546, -34145, -28864, -25188, -24934, 29259, 66872, 28911, -1639, -5289, -40106, -52368, -68, 25524, 6199, 13783, 13594, -30381, -35468, 3944, 4338, -2678, 28138, 26082, -10852, -933]
236i33J9881k5014m187K5461j7691k1202K9805R942k6962P316R683l4372m429
249c2702M1182O264p821K5391p615m8345j956K4663o161J5273L9727j8632m6216
262a6948k377m916j9790L4238M7588j3388j9207M259l0672k8882L7555L6359n384
275A8435J2631P747m7674k9523K5230P190k252L5931Q978m3791j4038J1579j8316
288b7873L464M5014M768k5900Q706m36l1712R243L3617j0989r835K2746j1141
301I672l0032J6530J4115k3847M213K3299j8650j2606K7682m42k3862J4479J0154
314A0705k6138N698L1059j0918j3690J9430r707l1172J4665K0781j5354O507K2977
327B4843k3804k6321J7975L049j4235K6501K2186k6946j1083J4491j7933j1972
$$ y = [-933, 18948, -6066, -10253, 15208, -2483, -23685, 6120, 16062, -10900, -3584, 6099, -28273, -32702, 8480, 14744, 6923, 32314, 24699, -23646, -25602, -939, -7100, 8173, 47900, 29268, -16948, -19325, -24241, -44031, -9793, 37795, 24407, 5200, 9459, -21213, -50095, -12540, 23819, 18435, 31066, 38813, -8861, -38384, -13154, -5964, -8216, 27715, 36693, -7098, -21136, -9557, -27873, -24409, 20605, 25373, -527, 8179, 7743, -23969, -14726, 18891, 7902, -1933, 20813, 9672, -20360, -3830, 10285, -13562, -9349, 13950, -4700, -17306, 10376, 9934, -13928, 551, 10705, -15433, -9735, 21324, 10406, -3284, 16146, 6439, -24733, -10068, 10713, -4641, 1866, 24843, 1039, -25282, -7307, -4258, -18493, 8008, 30194, 3248, -7835, 6656, -11277, -23249]
339b3249L3945J2041k1139P615N417l3365n748K9919k976r699K3994k242l3222
352a8709N633J7840j6194M025L0414j0523k2345J5443P44k3664J4487K2440j9719
365a28p047K0267j3337k0242K1230Q008k1506R799J8103k0943o940K4178o727
378D715j7325K0015O669k3967P428J9069j9293q483K2021p777j9644J8221Q583
391A0232k2343O557J9061j8437q854K3571m066j7802J8805R082k4043L457J9056
404A4276j7062r256K2982m266k0651J5380Q638k3278M226K1616j4733r785K2503
417A0590l293k0742J5604J1768k1341K869K0471j5474j2608K0264k682k0306J5261
430C81J2462k1679K37J9802j4030j1813K2417J273j9064J3154J1301k2309j245
$$ y = [-23249, 10696, 22737, 1598, 9213, 14630, -18735, -24483, 5436, 2460, -7239, 16755, 14513, -18709, -13076, 4764, -11430, -7405, 23009, 12486, -9859, 5584, 6328, -17336, -2849, 19591, -128, -7175, 13092, -245, -20487, 743, 8751, -12755, -2956, 15147, -5796, -12736, 11442, 4715, -12610, 7405, 14074, -9893, -2465, 16604, -2689, -11172, 10849, 3072, -16572, 1649, 10232, -12111, -5554, 13507, -4930, -13784, 9787, 5721, -12081, 6724, 15806, -8237, -4780, 14276, -2786, -12042, 10940, 6674, -13977, 1403, 10041, -13237, -9011, 12605, -2128, -11913, 10590, 7297, -13445, 2159, 13927, -7414, -4545, 15926, 452, -12156, 8108, 5426, -14880, 381, 12843, -8836, -8599, 11203, -2827, -14640, 7777, 9050, -10014, 3140, 14441, -7868, -9113]
443i113K0738j0645j0865K0895p88k3340R111J2319j8584J415K3123r948j4849
456a0531J6265j067k0748J3281J7771j5994k014J7628j4327j7229J8823N631j6681
469i192J1978J4242k1759p700J7914q325j1051K2465N784k1664N212J1969j9212
482i339k988K3767m863j4496J5894K014k3149O541J7191j4468l708K0382q549
495D229j7743J5727O101j9408P226J6860j5957o619J9776n495j6021J5533O093
508A0302k0327M875J7290j3735o266J8996o542j9160J3352Q706j6714O483J8072
521A5332j4956j0908J5933m397j5065J7543J2217j7941M37J2670j6979r758K1234
534E362J867j4089J2644O510k2856j362J7490q701m929K1540j823k0963P922Q106
$$ y = [-9113, 11625, 980, -9885, 11010, 10222, -13118, -4007, 8312, -10272, -8857, 14266, 4318, -10531, 5734, 4667, -16081, -2800, 14971, -1023, -3037, 14591, 264, -16965, 1858, 7489, -9192, 2786, 17028, -4731, -12431, 5483, -2842, -13893, 8572, 14356, -7308, -2096, 9873, -9339, -12327, 11440, 6577, -7919, 7975, 9989, -13160, -6619, 10572, -3896, -7604, 12778, 4229, -13514, 2213, 8314, -11094, -3868, 12992, -2965, -9584, 10192, 4697, -11324, 4209, 10302, -10025, -5150, 12140, -1595, -7861, 11135, 4593, -14567, -1215, 7491, -9223, -2740, 15332, 376, -10532, 5401, 1004, -14061, 3482, 15699, -2242, -1805, 10865, -6114, -15872, 5362, 7229, -6860, 5784, 12294, -10562, -11924, 5566, -3135, -8064, 13476, 11653, -9310, -1388, 6718]
548F718j7261M087K1143r822j2045J4422l920j9274J2171J3905j4790J050J6564
561A2948j3226j3282J7523K181j5697J1649J2010j8066k909J6398j0029j1267
573a1767J7717K133j7827Q356J1497j6586j818J8044q281j2412J6368L027j7114
586h663Q103J2304j5999l601J6960p523j2421J5954M059j7917N793J2190j5146
599e907l394J8729n169j3189J3838L516j8257N627J4381j2938l810J7464o631
612D260j5797J2682N591j6006O517J5378j3762p150J5617n533j4199J4790Q148
625A0536j6005L768J2882j5095p856J7811j550j2918J3275O359j8875R46J4122
638G400j1046n070J9003j866j6615Q761N440j6824M059J8295r031q189J4061m760
$$ y = [6718, -10543, -6456, 14687, 4865, -7180, 7242, 3322, -15952, -3781, 10124, -4666, -3616, 12948, -278, -13560, 3963, 6144, -9553, 2096, 14106, -3960, -6869, 9529, -500, -11767, 5950, 8083, -9744, -1388, 10109, -6477, -8295, 9749, 1468, -10944, 5424, 8451, -8663, -560, 11744, -4255, -7856, 9104, 1581, -10840, 5114, 9173, -8744, -2951, 9239, -5907, -9301, 9428, 4259, -8930, 4908, 8424, -9833, -4206, 10175, -2763, -6573, 10891, 4260, -11537, 1145, 6736, -9270, -2753, 12625, -1137, -8287, 7330, 1797, -12402, 2388, 10536, -5469, -1701, 11181, -3914, -11770, 6041, 4491, -8427, 4848, 11207, -7668, -6722, 7400, -3646, -8716, 10287, 8421, -8194, 567, 6007, -10817, -6758, 11537, 2506, -5683, 8378, 3618]
652C618j7298J0904J1056j2295L433J4570j3486j2594J3865K69j2107J3318J0611
665A3864j6761l066J2126j0707p951J8687L383j4372P391O480j7576p75J7388
678H111o194q584J4777o36j7732P057J0593j3384RJ6224q205j1526J4028K164
692F702j5051P789J0525j5162k623J6621n570j0377J3502O15j8276N360J2349
705F404j0638N22J7477p932j6070R070K165j2708J1652J6958j2084p917Q654j0844
719e291j2849J7414J1562r783N066O476k0620j0007J6311K474l861J6896L293
732A7081k2435m123Q479r128J855K2642m61j5934L658j431j7187P039K0188m997
746E246m931J1032q832j7598J0387J0078r855N674J3091j3486j0592J2752j582
$$ y = [3618, -13680, -2776, 8280, -4015, -582, 13988, 502, -12092, 1773, 2042, -10065, 3253, 13864, -2897, -5963, 6163, -4544, -12495, 6192, 9575, -4797, 2594, 9074, -8502, -9277, 8111, 1917, -6667, 8110, 7474, -10258, -3201, 7392, -5992, -5983, 10241, 2036, -9490, 4538, 6702, -8349, -560, 9965, -5197, -7820, 8801, 3231, -7146, 6356, 6971, -11305, -5945, 6404, -4234, -3712, 13765, 5833, -10237, -1167, 998, -11710, -58, 16900, 4816, -3101, 5553, -5291, -18140, -726, 10836, 1053, 6119, 12595, -8025, -18032, -1721, 753, -3108, 13788, 17081, -5354, -9477, -998, -10126, -8271, 14371, 13910, -2024, 1634, 203, -16984, -9945, 10243, 5246, 315, 11347, 2515, -15083, -4696, 5382, -4473, 1201, 14292, 806, -9786, 2966, 1384]
759A384j1360J1969P584j5300J067J3884q892p170J3413l285j5363R890J0562
772H383j0524L259J2567j3853j3868J1185J818p102J5861J1316j7685q510O069
785a084j0440l361K3406Q725j2317J364k147k2069j486K1926M207j047J2378p987
799A0068k5723R7J1491l071R909K0005r636j9606J920l146j0208J6116J9388q982
813H622o740M992j3853j2236J6753J0131p983O910O597j7813o944J3772k427o951
827g170J3843K719j6014L727J0924j0968l692J2798o295j1262J3481P635j1083
840a357M100P385j6836q125J5026K036l905J5002J923k2270n568P805o176N296
854e664K3517p4j7386j223m883j5708J0285K4538J19m645M468j5930k1380R848
$$ y = [1384, -9976, 1993, 9577, -5723, -4656, 9228, 336, -6834, 6579, 3294, -12069, -2179, 8383, -2141, 1118, 13685, -168, -14036, -2851, -1033, -8135, 7726, 19042, 1357, -7153, -1084, -11524, -14885, 8521, 17246, 4929, 6293, 4146, -17923, -19409, 2517, 6724, 5677, 18055, 10068, -15655, -15558, -4067, -7138, 2771, 22776, 13140, -6466, -4546, -7692, -17900, -1784, 17604, 8622, 1882, 6874, -6979, -19215, -2462, 7669, -314, 6596, 13193, -4620, -11564, 2208, -219, -7170, 6673, 9392, -6622, -2895, 8029, -2939, -6631, 6167, -128, -11390, 2091, 9726, -1357, 2743, 10128, -6708, -14833, 193, 2229, -1676, 13326, 15249, -7021, -12589, -4784, -10960, -5664, 17853, 17779, 393, -830, -5713, -21421, -11136, 13402, 13521, 8876, 13344, -2586, -23966, -14118]
868a4118J5785j95J0373J0386j9454j8454O338O75j974K0476J2202j6348q268
881b576K412j2744l028K1260O461j0060M828L39j8240l41J5600l385m035J3047
895I538k717j5084O892Q403j1729MJ1546q470p161J4852K844j2486M710L548j5923
910a1233l70J7610k68m117J1001n640k1222J904J1363l097Q005J6943j0491j9253
924h865J589j719p489J7138J9584q445q768P67j5469j1037J8762J4765l492N472
938A2793J239k2702j0807J3134L450J038J7315J999k0671n178M939q260L951K0465
952A2705o47j2593L853j920j4661O083J4861o211l297J0682o448j2435R855N925
966E752j1504L161J0038r675l607J4296k137j2316O114K250j2939N269J5810n457
$$ y = [-14118, 1667, 1472, 11845, 22231, 2777, -15677, -9339, -8664, -10638, 9838, 22040, 5692, -2576, -164, -12908, -15936, 5324, 11785, 1725, 6553, 6892, -11348, -11689, 3911, 526, -3509, 9538, 6821, -8263, -1371, 7032, -4697, -4693, 6853, -1617, -8778, 6074, 8918, -3568, 1142, 4690, -11233, -11603, 6007, 5739, 1622, 12623, 6983, -14239, -12335, -972, -4069, 3936, 20879, 10388, -8865, -7276, -8995, -16484, 654, 20238, 11793, 3025, 3792, -11677, -22714, -3952, 10813, 7321, 12793, 14032, -8670, -19477, -6343, -2893, -1855, 15460, 17459, -3212, -8390, -3451, -11711, -7760, 12705, 12058, -535, 3318, 1398, -13263, -7180, 7681, 1470, -1827, 8855, 2407, -10028, -173, 5752, -5752, -2591, 7447, -2228, -5835, 8461, 6324, -5992, 122, 2372, -10567, -5298, 10512, 5055]
980E055n543Q002q318j5342R575J1835m568O106R332j5809j4228Q184J501l293
994g511J6431R840j5663p904K941j0573k106K0923P510r397K266j989j8518p96
1008a4546J6869J107j278J1617n155j9029J762P747o133N881J5143p478j2052
1021e545O286j328j0247R668J1234r665k333R281p831q695J1495K562j1150N370
1035h98P964j0492r06J2543n893j0040Q705J569j0268P857J1227j0034m704P955
1049D585p813r102J3131P380q504M196N114j5122o324J2921M82l767J2616J949
1063A1742j6558j686O764p636J296J6753j280j1841L940q09j2866N692J4556m811
1077C256l440Q905o878j2993Q164O996p676M865R823j0768p839R486j742q071
$$ y = [5055, -488, 7514, -804, -16146, -6571, 5264, 696, 6802, 16134, 325, -13903, -5719, -4218, -7511, 8920, 18760, 3097, -4807, -1866, -12439, -14545, 6378, 13888, 4491, 6757, 4768, -13750, -14546, 2323, 3430, 2152, 13769, 8614, -10415, -8653, -906, -7039, -1158, 13985, 6507, -5545, 741, -587, -10834, -1166, 10068, 403, -1930, 7351, -480, -9175, 2320, 4882, -6268, -898, 7066, -3426, -4332, 8211, 2318, -7722, 983, 2552, -7716, 141, 11368, 1334, -3370, 4585, -3228, -12330, 801, 8181, -323, 3873, 8987, -6135, -12459, 462, 944, -2823, 9793, 11742, -4816, -6502, 262, -7374, -6078, 10675, 9395, -2446, 1494, 685, -12181, -6489, 8067, 3256, -184, 8721, 1843, -11150, -2986, 4010, -3666, 1199, 11022, 254, -7585, 1901, 159, -7912]
1091g912J0203O039j1586O75Q941q334n065J1869q41j0092P369N343j1020J348
1105c063J0364p978o657J0510l25r389Q300O565j1576r40R381p175n350J2472
1119E139J150j0471N426M617j2258k48J2199m241n738J0341j009j2463M998P563
1133E005q851Q27J1692o005q713Q460M11j0252O551Q693r545k103R686n736p914
1148g794J0225K462j0041M975P539j0007k476J0688m167p731R409K202j0955M084
1162a587Q192r109k744J0668l768q215R099K993j0776L575Q617q802l286J0677
1176E534l288q905Q551L451j0747L190R089q372m124J0304k885q591Q935M562
1190F704j0592K053Q376q753m383J0989j216q412P851L601j1845J019R473o298
$$ y = [-7912, 2291, 8330, -3256, -2581, 6360, -1974, -7039, 4830, 3989, -6103, 1266, 6609, -4411, -3063, 7301, -677, -7334, 3176, 2851, -6538, 1762, 8327, -3249, -4189, 5192, -1983, -7333, 5139, 6289, -4182, 1244, 5861, -6397, -6645, 5554, 1313, -4425, 5916, 4907, -7556, -2558, 5005, -3846, -3019, 8673, 2668, -6045, 2415, 2826, -7426, -875, 7818, -1727, -3830, 5856, 120, -7794, 2431, 4893, -5148, -173, 7366, -2641, -5117, 5571, 1404, -6327, 3082, 5284, -5671, -1587, 6605, -2504, -5248, 5420, 1652, -6563, 2536, 5529, -5247, -1672, 6945, -1857, -5143, 5534, 2246, -6659, 1892, 5343, -5404, -2214, 6875, -1497, -5621, 4683, 1798, -6793, 2142, 6704, -3888, -1835, 6541, -2212, -6595, 4394, 3178, -5234, 2617, 6218, -5627, -4608, 4865, -1433]
1204a433l184J1192j831j0584N758M243r873K511J1040o209n888Q545k581j0074
1218h368P431P004q753J049Q837p717o533R686L20q575P150N926j0452q25R065
1233E245n835n684J0021K01r917N744O417r294m22R551o027o798R668J371q869
1248d628N822O275j0370k650Q997m365n127J1145J922j1007K616N009r521j80
1262f062J2602k112o787P183j208j2456L927R541n458Q1R753o350j0833O434K911
1277A166p230O796R439q789n177O747m792o876J0536N505q701J915N433r882l881
1292g791J0658p46o438Q118K573j0957J298P950o608k695J0092k292q656O890
1306A396L867r442J710P844p454m001J0142o25p540O705L103j1016M14Q883m846
$$ y = [-1433, -4617, 6575, 4744, -5840, -82, 4161, -5712, -3201, 7839, 1630, -4258, 4287, 1706, -8368, -937, 6067, -2686, -1637, 7200, -517, -7050, 2636, 2956, -5619, 1531, 7457, -2995, -3820, 5245, -590, -6274, 3747, 3948, -5969, -225, 6192, -3102, -3524, 6027, 0, -6798, 2870, 4241, -4628, 1194, 7469, -2901, -5551, 3446, -919, -6046, 5099, 7021, -3986, -1370, 3639, -5882, -6062, 6540, 4428, -2359, 4824, 3616, -8840, -4913, 4628, -830, -749, 9004, 2654, -8179, -1745, 1166, -6064, 732, 10171, 1382, -3795, 2952, -1840, -8716, 1820, 7325, -1376, 539, 5972, -3910, -7791, 2867, 2121, -4317, 3801, 6374, -4583, -3285, 4665, -1943, -4638, 5454, 3162, -5494, 1396, 5263, -4179, -2469, 5375, -2079, -6080, 4062, 3437, -4103, 2602, 5705, -5311, -4897, 3986, -860]
1321h60k188J0582k118j1155L716L621q091L871J1483n273o430N939l513r570
1335i986Q058Q668n955Q55O400r587q078Q865K428n263P787N246j1343l600O730
1350A225m677k965J1949K066r470K379L099r685J94J0994k652n214P443q26j0482
1365f622L862O824o775l0R170m823p066P658J511q609M116O271p920j434R152
1380E285l441o563P195Q25r579L673P717o125q81Q656m884q798O341K948o791
1395d422N317P887q251m898O407l870n947R774N170p880J169M505r501l409J0515
1410B566N72n066O935J324j1468J17P152m760o92J0398j987r297L743K151q071
1425f383L589R684m991m260O724l083q371O348N369o921J668O970o957n257P987
$$ y = [-860, -3048, 7534, 5416, -5739, -2023, 1598, -6493, -2622, 8861, 3588, -2842, 3097, -416, -9986, -1928, 6740, 785, 1640, 8040, -1547, -9625, -760, 1668, -3595, 4192, 9438, -1905, -5505, 1225, -3452, -6417, 5532, 7598, -1872, 507, 3606, -6079, -5885, 5109, 2457, -2757, 4686, 3860, -6622, -2760, 4064, -2711, -2741, 6429, 1606, -5460, 2198, 3709, -4900, -784, 5487, -2433, -3867, 5285, 1844, -4719, 2476, 3301, -6278, -2605, 5112, -1013, -1894, 6762, 1878, -6920, -579, 2369, -4422, 895, 8782, 531, -4367, 2040, -1830, -7777, 1997, 7167, -713, 456, 4961, -4540, -7949, 2566, 3138, -1928, 5007, 6331, -5137, -5020, 2132, -2628, -3320, 7078, 5091, -4206, -463, 1688, -6383, -2794, 6890, 1899, -2361, 4363, 1280, -7091, -743, 4626, -2295, -627, 6343, -614, -5871, 2116]
1440B116k96o729O040M480q420K73P504n344m338Q058m65p824N348M723p835K23
1456b486P602n580n319P963P08p041N425M751q710j090P446m287m195Q860R05
1471D952q408L170L901q178r0R483k808m993O640n64r224L746O545n745J55Q088
1487F670m736p409N864J250o716M997O945p149k840O392m125n578Q038L313p005
1502b089K782M719q089k780Q221j408m831O930J582r101J291N936n698j213Q785
1517E037j861o920N095J647p914K743P583n314k915P051k783p141O002L465p052
1532c277K148O630o190l695P384j374o253O019L373p777J050O657n341l495P396
1547C255j257o828N280L780p082J104O696n339m344P160k77o168N572M117p841
$$ y = [2116, 1820, -4909, 1131, 5611, -2809, -2536, 4968, -376, -4714, 3344, 2879, -4945, 403, 5126, -2709, -2486, 5116, -464, -5783, 2180, 2888, -4153, 1272, 6023, -2687, -3777, 3669, -618, -4813, 4047, 4952, -3456, -286, 3615, -4563, -4653, 4830, 2022, -2971, 3669, 3105, -6119, -2373, 4172, -1573, -1418, 6670, 1934, -5475, 389, 1639, -5077, -80, 6865, -284, -3124, 3268, -857, -6435, 1603, 4916, -2089, 693, 5412, -2677, -5457, 2764, 1356, -3475, 3455, 5037, -4064, -2773, 3163, -2535, -3748, 5037, 3176, -3744, 1351, 2998, -4916, -2173, 5410, 96, -2819, 4232, 1449, -5692, 310, 3775, -3277, -1129, 5501, -689, -4384, 3000, 1626, -4627, 1392, 4765, -3012, -1962, 4695, -646, -4141, 3255, 1998, -4830, 450, 4230, -2852, -1748, 4948, -391, -4735, 2425, 2148, -4020, 1552, 5669, -2172]
1562b172p69N994m617l186Q273P29p026L293K708p878J57Q539k332l362O379j612
1578C118r014L151N319m859J519P700m751o756M623j20n796O019O852o069k182
1593a246M637n320n013Q070L097n445L255L427q530k555P192j664l051P384R40
1608E178q508J371M571n678j34Q199k357n773N123O71p279K921N980n391j901
1623c007O710k527n326N888J983p205J658N445n080j336P653j868o450L875J262
1638A675o872K985P586l851k728M972l784p119N671M899m097K645M997p467n627
1653f115N488j68l168P701L979q078k038L104n304j336R834J658n599K653K05
1668B816q766M60Q132j601j330O280k657q837K766L874m444K628P183m605n144
$$ y = [-2172, -2941, 3053, -1564, -4750, 3523, 4252, -2774, 519, 3227, -4651, -4494, 4045, 1713, -1649, 4730, 3118, -5896, -2745, 2574, -2285, -766, 6934, 2183, -4573, 50, -70, -5866, 153, 7005, 936, -1246, 3391, -1929, -6942, 1128, 4225, -1220, 2035, 5462, -3068, -5623, 1569, -95, -3146, 4238, 5178, -3330, -1959, 2612, -3066, -3200, 4999, 2642, -3131, 1992, 2663, -4616, -1695, 4285, -1106, -3007, 3703, 1176, -4150, 1738, 3721, -3484, -1826, 3619, -1461, -2797, 4856, 2988, -3462, 413, 1675, -5197, -2212, 5374, 1523, -1205, 3767, -17, -7136, -1465, 3434, -663, 1982, 6979, -488, -6115, -627, -795, -3963, 3738, 7717, -361, -2399, 705, -4599, -5935, 3899, 5557, -42, 2611, 2816, -5950, -5490, 2642, 1041, -289, 5991, 3334, -5503, -2737, 1137, -3307, -679, 6504, 1899, -3245]
1683c245M670q98n740N297M773n758m17N359m389l872O356J92o249L429M068n474
1699a898L28O444l969n100M907L22n224M878N555n698k144L885m725m188P671
1714A044L518m548K427J975q440k484O994K9j323O865O9r255o48L298l891J988
1730b382R157j571o571K035j249o805M307P966k729j150M159n117o928N098L707
1745A927l578L530M607o847l891N116j495l718O351K805o428P25M190m998j856
1760c560O464j128n167M336K491n670J504M855n217l226N682n01l895N401K815
1775E184o719p23L766m198j361Q029Q02n431K078J94p336R67P569j107j486N129
1791E357k886q200K248M113k874L123O624m845n940K845j036m120O136N594m970
$$ y = [-3245, 1425, 527, -5213, 84, 4857, -901, -1318, 4041, -348, -4220, 2136, 2328, -3921, -492, 3576, -1898, -1570, 4874, 905, -4195, 712, 1034, -4190, 688, 6243, 545, -1599, 2286, -2439, -6627, 1044, 4562, 14, 2441, 4416, -4024, -6508, 486, 515, -808, 6057, 6126, -3129, -3777, -479, -4370, -2382, 6775, 5204, -1367, 668, -581, -7386, -3079, 4887, 2158, 1008, 5167, 50, -6878, -1780, 1927, -1651, 1879, 6486, -361, -4252, 864, -631, -4349, 2002, 4807, -1621, -896, 3294, -1704, -3560, 2904, 1776, -3391, 945, 3436, -2234, -730, 4125, -1092, -4318, 1364, 863, -3032, 2369, 5184, -1535, -2258, 1508, -2690, -4051, 3978, 4780, -651, 1427, 1621, -5715, -4748, 2821, 1714, 228, 5357, 2471, -5729, -3481, 632, -2242, 881, 7505, 2660, -3280, -435, -1471, -5591, 545, 6139, 1169]
1806A169j369L039n384l717O847K412l811L374K109p215j446N665k006k299N873
1821C241K46o245K053L312n042j59N991k689l870N131Q33n338K599L444n534j208
1837c235N822j579l218N101L64o641J238L799l885K80O896j898n253K723Q8n488
1853d886L326O294l272j763L799l786n580M711L305l331K663M055o119l696M583
1868C03q08k677N942K467o194k05L221m770j242O707j54m331L404R32o183J133
1884b455N320l124j757N355j426n110L528K360n143J049M755l755k419N328o55
1899A851m832L493K114n386Q19N326k843k432M748j202n502L200L201m294R94
1914g45N099l840l866M213l19m108M132L773m868p47L877l515l029N576R94m437
$$ y = [1169, -200, 2839, -2545, -6262, 585, 2997, -814, 2560, 4669, -2546, -3992, 1673, -333, -2632, 3241, 3487, -2758, -705, 2607, -2435, -2594, 3397, 708, -3162, 1969, 2802, -2536, 63, 3507, -2027, -3235, 2587, 1008, -2210, 2891, 3255, -3386, -2148, 1651, -2234, -1954, 4942, 3044, -2209, 514, 602, -4886, -1560, 4734, 1462, -301, 3498, -288, -5868, -1157, 2148, -1183, 1480, 5535, -584, -4280, 303, -505, -3182, 2760, 5227, -967, -1172, 2049, -2721, -3963, 2744, 2590, -1741, 1663, 2595, -3588, -2455, 2865, -259, -2016, 3339, 1913, -3197, 331, 2691, -2452, -1403, 3352, -403, -2822, 2506, 1851, -2981, 512, 2626, -2760, -1941, 3385, 542, -1890, 2858, 1656, -3846, -646, 2555, -1739, -745, 4354, 514, -3352, 861, 542, -3566, 566, 4339, -529, -1276, 2601, -914, -3943, 1633, 2627, -1810]
1930a810K710K578n769p92N232k044k621N000K99n518K102L356m489j65N191k359
1946I01l569M316N04n161K492L607m483q62M998k108l468M443Q87n289K041L748
1962B997m113p36N115k039m118L980Q61m919K137M303l965j545M559j954m014
1977c451M315J884m741J527L908m216j851M940j247l900L873J626m961J119M190
1992C015l676j709M686j223m188L771K265m586Q91M056l942k389M773n34l846
2007b636L782K174n309R1M054l079j710N435l34m650K720J694m920P38N113k583
2023E80k404M302j147m941L009L031l943N79M463l326l038M308l5m215L168K946
2039C337m615k33M220k789k684M443J37m708K548L172m089JM496k871l431M140
$$ y = [-1810, 900, 3478, -2291, -3083, 2149, 105, -2516, 2484, 2783, -2735, -633, 2723, -1766, -1931, 3260, 901, -2668, 1648, 2152, -3009, -517, 3090, -1393, -2255, 2743, 635, -2833, 1610, 2497, -2792, -751, 2997, -1116, -1852, 3263, 1224, -2894, 1086, 1947, -2972, -835, 3468, -497, -2042, 2517, 563, -3451, 864, 2748, -1993, -466, 3442, -774, -2625, 2315, 1068, -2832, 1041, 2667, -2294, -1175, 3015, -661, -2370, 2316, 1093, -3095, 676, 2941, -1645, -754, 3302, -640, -3029, 1744, 1210, -2636, 1146, 3320, -1989, -1898, 2156, -923, -2633, 2802, 2468, -2182, 538, 2232, -2688, -1950, 3163, 580, -1824, 2478, 1331, -3610, -601, 2430, -1513, -934, 3529, 203, -2835, 1473, 1438, -2777, 391, 3337, -1278, -1511, 2709, -80, -2764, 1679, 1816, -2892, -344, 2828, -1261, -1260, 3236, 365, -3066, 1074]
2055A074N17m041K918L369m503j416L789k525k714N223J564m455J457K241n008
2070b510q39N510p79k588M079j00n930J066L600k898K20N360k279m575K761O26
2086G24m107K789M608l437j685L595k463l910M213K222l912J547L092m345j840
2101b909M582r18l342L770J562m782J153L784l465j600M431j336l977L599K207
2116B759m043Q34L413m150k284M684M9l007L683J640n434l11L481k595q67N592
2132C444j94m808J491R50m653J439N644j707k154L314j834n353K845L599k665
2147f42J191M086m050m112L343K97k912L824L276m644j106L157k987k339N214
2162A596J137l979K089J929m800m55M693j768k652M090J69m583K171L033m007
$$ y = [1074, 1591, -2450, 468, 3837, -666, -2082, 1707, -818, -3532, 1691, 3255, -1200, 257, 2498, -2510, -3349, 2161, 1382, -1206, 2873, 2773, -3157, -2091, 1509, -1389, -1169, 4191, 1912, -2663, 98, 724, -3383, -594, 4014, 577, -1108, 2487, 24, -3886, 327, 2549, -1363, 184, 3276, -1069, -2909, 1673, 755, -2587, 1183, 2745, -2037, -884, 2900, -565, -2165, 2266, 930, -3047, 552, 2759, -1284, -450, 2963, -1187, -3471, 1213, 1262, -1745, 1938, 3578, -1856, -2167, 1314, -1281, -2148, 3444, 3250, -1558, -67, 883, -3770, -2331, 3313, 1606, -548, 2766, 932, -4421, -1576, 2023, -642, 549, 4635, 585, -3527, -184, 113, -2799, 1025, 4301, -343, -1449, 1708, -1279, -3618, 1596, 2733, -1246, 843, 2772, -2028, -2483, 2210, 442, -2210, 1880, 2049, -2534, -363, 2670, -1337]
2177a337n08M207k063l003M277J000m152J609K422m408p86M994q92k770L535P9
2193B204n424J229L610k596J67M943k035m656K216O65l561K884M742l217k250
2208a079K833k615l696M365K968l066J346K584m964k478M326ok127M088J358n374
2224a537j42K922l041p58N294l92l960K349R33m537J211M462k597j706L993j249
2240A245m025L028J998m052O99L793k947k030M261m06l963K584J910m211P71M430
2256C085k345k140L443r49m444K685K989l243O80L691l305l371L444L59k959L537
2272A157K964m409j244K937k685j946M986J261l764J464J450m825m85M802q86
2287G77j833L758l61n099J346K959l012M09M694k151l626K814J93l911K483L701
$$ y = [-1337, -1845, 2362, 299, -2704, 1573, 2573, -1579, 30, 2452, -1956, -2742, 2252, 1360, -1410, 2125, 2204, -3220, -1991, 1619, -977, -810, 4133, 2098, -2558, -342, 323, -3238, -354, 4388, 1171, -1079, 1754, -861, -4557, -192, 2776, -290, 1056, 3640, -1324, -3802, 524, 518, -1609, 2479, 3837, -1537, -1679, 1243, -1798, -2556, 2738, 2346, -1614, 735, 1668, -2869, -1658, 2804, 207, -1499, 2494, 1245, -2780, 248, 2246, -1806, -1107, 2686, -261, -2291, 1970, 1564, -2399, 185, 2095, -2116, -1345, 3085, 740, -1400, 2043, 1094, -3350, -665, 2324, -919, -239, 3452, 147, -3224, 220, 579, -2380, 1157, 4121, -288, -1532, 1405, -1280, -3226, 1760, 3021, -743, 721, 2171, -2654, -3139, 1663, 777, -1056, 2702, 2341, -2758, -1412, 1547, -1465, -1056, 3638, 1487, -2139, 675, 868, -3043, -560, 3141]
2303C141l325j035L539k261l113L850J213l701J738K954l764j334M093j463k981
2318b449L533R95m212J472L289l232j243L906j491l219L446J571l737J094L109
2333B832l724j643M038o32k919L412J377m508K62L194k763r93M745o17l789K317
2349E89J023m243J072M254k153j676L479j477m195K805K341l159J083L751l301
2364A93k674L349l41l090L403K482l943l65K889k872j965M392M45l449K264J760
2380B478m363q0L988j863j843L940k23m265J787K352l403J90L973k171k715L428
2396A210J71l760K185K733l441m40L692j966k596L587N01l964J651K733l382n14
2412a600M014j786k948L182O75l739J750L328l217r52L455j985k975L345J498
$$ y = [3141, -184, -1219, 2320, 59, -3054, 796, 2009, -1692, 46, 3000, -764, -2098, 1995, 532, -2449, 1084, 2079, -2133, -661, 2628, -604, -1847, 2059, 568, -2651, 795, 2366, -1371, -277, 2832, -892, -2535, 1503, 871, -2048, 1364, 2741, -1767, -1505, 1689, -1074, -2067, 2678, 2061, -1728, 589, 1612, -2631, -1559, 2695, 542, -1134, 2345, 868, -3327, -522, 1819, -1340, -257, 3494, 193, -2481, 868, 527, -2563, 840, 3322, -621, -986, 1903, -969, -2934, 1458, 1903, -1546, 718, 2478, -1885, -1965, 2023, 160, -1683, 2257, 2034, -2231, -444, 1908, -1495, -1305, 2668, 497, -2218, 1210, 1381, -2379, -194, 2539, -902, -1342, 2350, 384, -2212, 1375, 1876, -2088, -437, 2296, -1086, -1600, 2414, 628, -2320, 862, 1537, -2202, -452, 2876, -341, -1293, 2162, 177, -2798, 547, 2045]
2427B045l407J564K590l760j512L755r07k359L647J216m315M27K562k954o07M606
2443B591o95l372K385M64m188J297L799k205r32L540j682m045K725J789k932J472
2459A1L403l225k264L150p98l010L467K065l726K94K696k989j678M140kl114K489
2476I09J373l860L14L398k282j784L698m46l496K363J901l467K48L309k336k083
2492b241L787K05l343K053J761l875n9L706j755j733L590l07m166J512K266k929
2508a528N98M189k036l010K618k67l378K540L303k878n81K766k786k994L590J430
2524A576k599J989K123m073j394L278j112j654L911Q44m096O63J913l194k74M412
2540B313r24k724K445L05l977J508L177k529o39L486j545l083K737J088l292J148
$$ y = [2045, -1362, 202, 2792, -968, -2480, 1275, 368, -1991, 1656, 2872, -1443, -1016, 1546, -1408, -2015, 2591, 1896, -1476, 909, 1373, -2815, -1518, 2281, 76, -856, 2684, 1002, -3043, -318, 1471, -1461, 11, 3414, 189, -2075, 1075, 277, -2733, 734, 2799, -927, -633, 2063, -926, -2604, 1536, 1534, -1580, 909, 2282, -1578, -1264, 2134, -148, -1932, 1766, 1320, -2176, 187, 2088, -1379, -1131, 2178, -158, -2241, 1546, 1751, -1592, 461, 2222, -1653, -1712, 1994, 239, -1494, 2096, 1789, -2377, -865, 1401, -1528, -930, 3259, 1223, -1787, 831, 564, -2814, -274, 3029, 151, -430, 2336, -450, -3444, 146, 1576, -1023, 966, 3089, -984, -2378, 900, -212, -1866, 2045, 2889, -1207, -544, 1369, -1825, -2099, 2313, 1389, -1335, 1110, 1415, -2562, -1054, 2123, -406, -1045, 2441, 896, -2187, 550, 1638, -1654, -506]
2556e06K939k983j202L557q74k905K567J040l635J133L219k342j130L225j270
2571H33l418K446J631k831J385L078l196k170K852n98k443L473K073l469j37K197
2587A706l122j458M296M55k612K068P91m431L5L555j451q50L659o42l989J341
2603f49J607k822J039L848j995k335K480o48l311K502K574k917kK854k333k176
2619b284L142L82k896K021K070l340l78L230j673k129K988J00l255J889K478k939
2635e94m50K967j928k360L060R88k766J615K065l534j124L104r63j816L537O33
2651B434l765N46K022k865j70M178p60k510K022R0l851J346L288j906n76K950
2667B473j837l230K326J323k609J558K945k828j718K685j013k299L012J589l153
$$ y = [-506, 2433, -550, -1752, 1805, 931, -1974, 593, 1633, -2002, -869, 2350, 8, -1122, 2103, 833, -2585, -139, 1492, -1339, 46, 3124, -72, -2242, 610, 12, -2431, 1042, 3115, -354, -491, 1706, -1416, -2874, 1422, 1877, -735, 1333, 2124, -2307, -2272, 1283, -168, -1018, 2641, 1999, -1990, -649, 958, -1864, -825, 3023, 1028, -1307, 1173, 525, -2786, -284, 2290, -627, -629, 2225, -108, -2284, 858, 1240, -1656, 365, 2435, -905, -1283, 1947, 274, -1855, 1133, 1233, -2022, -133, 2345, -594, -1044, 1923, -5, -2365, 695, 1683, -1083, 532, 2597, -937, -2061, 1043, 80, -1736, 1801, 2434, -1331, -785, 1237, -1628, -1798, 2380, 1620, -890, 1132, 1222, -2629, -1283, 2005, 99, -477, 2473, 636, -2594, -268, 1055, -1554, 4, 2949, 121, -1597, 1088, 75, -2224, 788, 2377, -776]
2682g76M44K254k666j299L380m13k543K368J135l326N56K904k196j294L076o51
2698I53k734K316J524l147L02K625k358j388L274o8k663J945J268l403Q5L056
2714A587j520j181L140m82l535J608J637k714O63L287j832k166K422l74k862K213
2730a09K385k555r4K366k100k188K949O06k584J845J779l210o82K873j396j652
2746a767L146M36l192J221J820k744k29L186j236k153K577L31l113J324K260k581
2762g14n19K955j277k250K696P41l027J070K207k519o32L033j018k384K375O16
2778A353l054J065K463k135q69K935j218k532K400J028k731J069K481k505j155
2793a405K656q59k310K499J279k939N85K189k240j119L050m21k348K048J077k973
$$ y = [-776, -332, 1922, -744, -2043, 1337, 924, -1619, 749, 1884, -1442, -886, 2018, -178, -1472, 1604, 953, -1781, 535, 2059, -1088, -786, 1839, -519, -1907, 1367, 1299, -1364, 581, 1849, -1554, -1469, 1587, 67, -1114, 2026, 1544, -1991, -383, 1254, -1460, -797, 2490, 658, -1508, 914, 540, -2322, -109, 2276, -279, -373, 1993, -107, -2295, 654, 1260, -1324, 521, 2300, -910, -1592, 1281, -115, -1767, 1379, 1815, -1377, -156, 1664, -1080, -1309, 1877, 641, -1512, 1065, 1396, -1717, -393, 1867, -714, -1233, 1722, 445, -1805, 891, 1632, -1395, -325, 1882, -637, -1269, 1764, 746, -1638, 737, 1353, -1701, -636, 1827, -308, -1177, 1758, 540, -1992, 408, 1436, -1295, -226, 2255, -250, -1405, 1251, 392, -1918, 581, 1860, -1079, -494, 1695, -545, -1664, 1386, 965, -1383, 665, 1742, -1231]
2809a231L80K523j826j176K817m70k755J903J339k753N51K614j912j374K599k36
2825I93k574J840J513k718J49K576j788j589K778j15k731J746J588k566M6K637
2841A785j720j570K641j0k615J552J700k556j38K609j480j818K564K04k671J451
2857g2J811k454k50K753j319k023K494L35k632J251J874k400m44K622j280j967
2873a701K405O12k628J216J889k310o69K681r53k078K399O32k768R08J972k177
2889e70o56K677q93k073K113P76k576Q17K179k113r04K690p44k178K028Q54k654
2906a227O82K190k063q40K647n69k275J813R56k488O67K347j838j090K417o42
2922F87k328J856J266k451N37K282k008j403K531k68k063J891J313k627J26K101
$$ y = [-1231, -851, 1672, -154, -1330, 1487, 1017, -1738, 165, 1504, -1249, -698, 1916, 4, -1370, 1229, 993, -1581, 259, 1772, -946, -797, 1779, -9, -1598, 1180, 1065, -1666, 80, 1668, -898, -852, 1785, 65, -1505, 1136, 1126, -1489, 63, 1763, -793, -931, 1678, 198, -1620, 944, 1148, -1523, -72, 1739, -715, -965, 1788, 469, -1554, 940, 1275, -1357, -106, 1768, -632, -1076, 1546, 266, -1701, 704, 1316, -1312, -96, 1793, -517, -1186, 1495, 542, -1536, 863, 1495, -1273, -365, 1607, -570, -1226, 1451, 558, -1515, 598, 1374, -1202, -385, 1794, -319, -1223, 1467, 723, -1455, 573, 1427, -1227, -545, 1645, -418, -1258, 1389, 820, -1455, 358, 1314, -1174, -507, 1840, 2, -1088, 1329, 687, -1641, 215, 1481, -970, -433, 1849, -159, -1562, 969, 701, -1362, 529, 1842, -785, -659, 1442]
2938A442j707j228K624k8k293J423J146k527J16K579j408j310K375j83k421J351
2954d9J542k285R3K510j509j671K293J02k386J365J549k322j49K452j273j557
2970a295K210J87k434J257J623k127k61K424j227j803J994L12k153J256J880k222
2986c79n55K222j136j688K207P75k256Q92J575k333p66K494n88j603K087M51k605
3003a206O30J905j898m61K660p07k114J728N51k433Q33K182j767p87K118p92j983
3020a541J825R39k160P19J932j851r81K205m13j989J782R80k446N24J953j641
3036a63j092K322m01j973J602J158k291L46K086j670j180K185j68j940J598J216
3052A635k436L1J978j427j116K459p5k066J190J143k286Q4K352j101j252K022
$$ y = [1442, -265, -1493, 1131, 1103, -1190, 233, 1379, -1148, -1032, 1547, 139, -1171, 1204, 1021, -1400, -49, 1493, -792, -699, 1811, 302, -1369, 924, 1026, -1360, 5, 1554, -768, -917, 1535, 262, -1295, 915, 1102, -1332, -75, 1548, -579, -840, 1584, 357, -1446, 548, 860, -1293, -37, 1843, -379, -934, 1288, 152, -1536, 671, 1446, -810, 82, 1657, -676, -1442, 1052, 464, -1139, 948, 1399, -1206, -576, 1329, -569, -1030, 1630, 923, -1191, 537, 1088, -1345, -512, 1670, -97, -884, 1234, 442, -1541, 284, 1223, -937, -218, 1714, -137, -1118, 1087, 674, -1315, 467, 1447, -999, -475, 1478, -163, -1255, 1067, 666, -1307, 295, 1453, -838, -492, 1594, -76, -1256, 929, 761, -1179, 419, 1635, -801, -770, 1208, -219, -1335, 1124, 1049, -1017, 173, 1316, -970, -886, 1466, 365, -887, 1135]
3068A135k45k316J208J487j905J0K212j312j522J907J93k156J323J596k012k82
3084f79K025j215j528K066M41k217J111J384j965m36K171r40j412K001L86k274
3100a081Q95J655j920m96K179q73j616J867N91k266P61J711j775o26K134o14j681
3117a155J760O33k173N99J718j737n27K063o85j735J608P58k144N26J950j591
3133a32q49K068m67j844J541R39j994M13J806j622r48K064m07j815J499J032k076
3150g92K95J810j454q91K025k10j914J421J069k088P4J974j374j018K039j47k034
3167a215J288J167j952J10K001j209j264J981l5j989J180J275j890p1J912j278
3183A1j242J906K35j939J134J309j894k77J917j020j267K002J56k047R48J318
$$ y = [1135, 890, -1426, -218, 1269, -636, -626, 1586, 274, -1248, 659, 852, -1304, 19, 1615, -397, -679, 1346, 131, -1397, 669, 1110, -1107, 4, 1388, -577, -1013, 1158, 218, -1194, 807, 1193, -1081, -186, 1469, -451, -947, 1232, 359, -1257, 610, 1201, -1065, -304, 1407, -368, -994, 1140, 526, -1155, 605, 1238, -935, -336, 1382, -355, -882, 1181, 496, -1239, 369, 1127, -1017, -491, 1459, -132, -981, 1087, 620, -1224, 317, 1256, -738, -325, 1481, -141, -1089, 975, 568, -1247, 252, 1284, -792, -497, 1313, -141, -1032, 993, 783, -1131, 290, 1359, -729, -655, 1319, -55, -1073, 966, 819, -1215, 73, 1240, -712, -602, 1399, 190, -1074, 907, 872, -1117, 63, 1338, -552, -623, 1289, 11, -1231, 675, 910, -1029, 105, 1414, -480, -757, 1160, 140, -1127, 875, 1031, -1016, -68, 1250]
3199A250j852k50K025q35j404J751L13k075Q86J567j770k52J991r54j596J744
3215E39M58j985Q50J456j712m32J932p69j562J817M93j973O71J559j574o20J998
3232A146o51j637J490P62k004P01J563j576p51J816n25j488J640P96j845K93J488
3249A218j560p46K055k21j624J364O89k194K75J806j199o36J984l40j961J170
3265H0Q48j762M83J900j210j222J685l75j725J324J219j720J22J663j452j111
3281a253J856J50j624J223J054j962q5J693r99j183J960K4j852J031J133j809
3297f43J5J882j055j258J793J97j768J012J206j935k72J875q86j166J821K27j952
3314i07P19J150j719r2K145n61j436J373J23k096Q87J620j339k82J730q98j768
$$ y = [1250, -602, -852, 1173, 338, -1066, 685, 998, -1077, -191, 1376, -394, -646, 1345, 391, -1205, 539, 997, -988, -138, 1318, -394, -826, 1106, 337, -1225, 592, 1085, -888, -217, 1342, -232, -852, 1146, 495, -1142, 348, 1110, -894, -193, 1370, -206, -957, 859, 334, -1154, 486, 1282, -563, -270, 1218, -342, -1088, 967, 746, -878, 486, 1175, -1019, -744, 1062, -137, -773, 1211, 871, -1090, 80, 928, -834, -351, 1549, 339, -883, 802, 427, -1298, 26, 1245, -475, -353, 1310, -142, -1253, 603, 753, -871, 352, 1406, -556, -641, 1052, 53, -1130, 830, 854, -998, 33, 1166, -643, -628, 1254, 199, -1059, 734, 931, -837, 175, 1381, -554, -826, 1049, 163, -1003, 818, 1045, -907, -188, 962, -757, -849, 1296, 735, -701, 672, 795, -1301, -414, 1206, -133, -415, 1315, 417, -1351]
3331a351J465N73j582J051J470j668q04J571o41j239J730P52j868M72J212j696
3347e53o66K085l05j355J428M48k011M33J594j297o11J924m48j634J269P35j791
3364g55L14J678j382p68J875l32j607J342P29j912K46J717j164o64J787l64j814
3381a074J020R28j728M62J856j144j225J564l91j577J421J346j603K0J363j413
3397a75j090J709K96j397J205R29k099k47J628r36p19J947J49j881O95Q57j643
3414g72n0K056p26j160J431o9j888R27J328j484j26J775r90j302J602K36j714
3431i26Q79J235j486l20J720p73j290J482K85j803P60J421j313l48J603p71j576
3448a221J513N21j550P98J473j629q13J556n96j185J651P89j741K59J210j551
$$ y = [-1351, 114, 687, -895, 156, 1626, -42, -846, 725, 84, -1155, 575, 1327, -541, -69, 1143, -553, -1219, 866, 561, -794, 634, 1082, -929, -496, 1098, -199, -810, 1114, 666, -968, 301, 1036, -755, -441, 1237, -145, -913, 962, 630, -977, 365, 1094, -818, -572, 1145, -19, -683, 1104, 740, -1074, -54, 874, -854, -392, 1464, 320, -905, 659, 268, -1309, 112, 1458, -145, -125, 1238, -175, -1265, 444, 740, -657, 548, 1477, -622, -869, 759, -177, -896, 1051, 1200, -681, 14, 871, -772, -822, 1234, 508, -652, 779, 710, -1178, -251, 1077, -407, -533, 1242, 252, -1050, 552, 788, -926, -47, 1188, -298, -618, 1102, 329, -961, 521, 806, -997, -237, 1184, -129, -477, 1126, 355, -1221, 292, 813, -737, 61, 1534, -95, -908, 648, 52, -1133, 518, 1307, -434, -175, 1035, -516]
3464e16o21K005j12j368J356L00k007L46J466r66m46J792m81j763J057P03j666
3481i21N61J783j187q92J526l95j538J278Q78j591J91J479j250q74J696k23j449
3498i28J156Q92j653R8J575j030j001J659j08j673J166J080j620o4J475j115j036
3515a127J686J84j513J082R64j782j97J611r18q01J829K3j806O77R12j534MJ970
3533A264q11j124J370o9j763Q74J368j336r5J536q74j457J457L28j514Q59J315
3550A328j542m34J490p43j169J569N26j714O01J240j477m10J708n87j258J393
3566E21M01j665N01J344j425m37J656n36j259J362O18j708L47J383j321n78J720
3583I24l91j319J173M91j604K62J439j093n53J748m95j522J139O52j585N57J384
$$ y = [-516, -1137, 868, 756, -612, 744, 1044, -963, -617, 849, -117, -563, 1229, 748, -1015, 42, 745, -921, -360, 1423, 236, -656, 870, 475, -1063, 215, 1093, -498, -307, 1172, -78, -952, 744, 521, -928, 228, 1120, -533, -435, 1140, 110, -891, 768, 660, -1013, 153, 1233, -387, -451, 1024, -91, -1127, 559, 743, -770, 312, 1276, -506, -703, 908, -10, -811, 1018, 1041, -765, -88, 824, -710, -706, 1264, 453, -671, 699, 630, -1133, -259, 1109, -227, -322, 1214, 340, -1117, 340, 668, -846, 13, 1328, -214, -648, 842, 99, -1070, 499, 1025, -689, -88, 1152, -325, -735, 973, 386, -872, 521, 922, -743, -242, 1102, -323, -760, 896, 360, -899, 463, 1081, -627, -280, 1103, -218, -796, 924, 533, -786, 387, 878, -726, -464, 975, -118, -671, 1077, 582, -940, 199, 851, -734, -177, 1207]
3600A207j130q16J497l20j549J232R55j575K29J341j112q56J582k3j467J105Q40
3617A140j656P8J429j014q36J601n1j520R53Q21j470N5J569r30j042J606jj568
3635h36R30J000j581QJ469q23j043J463J50j546P90J063j457j73J661p90j132
3652h47J450J25j508P57J146j440k51J526o69j145J347L50j597P24J158j377l00
3669e51J487n98j154J349L05j530O11J135j317m82J662n46j282J361L99j478N11
3686a18J181j254m86J625m39j253J088N60j650N03J310j233n49J492k67j374J155
3703B91N67j413L54J330j174o42J513k92j375J122O82j475J56J298j074o98J606
3720G76j32j408J001P02j528J77J416r08p45J392j43j484R37Q92j440P6J474r28
$$ y = [1207, 77, -739, 758, 438, -1111, 121, 1076, -499, -270, 1071, -41, -897, 685, 662, -805, 300, 1140, -516, -438, 991, -23, -859, 742, 691, -829, 124, 945, -525, -470, 1099, 169, -873, 733, 732, -836, 94, 1094, -487, -479, 990, 167, -876, 587, 737, -809, -19, 1044, -413, -586, 1075, 285, -847, 603, 728, -780, -23, 1123, -317, -568, 958, 289, -856, 491, 841, -756, -32, 1126, -251, -551, 936, 338, -816, 533, 838, -692, -81, 1054, -263, -745, 917, 371, -911, 450, 849, -629, -118, 1063, -191, -677, 948, 509, -744, 344, 904, -746, -243, 1067, -166, -715, 777, 510, -864, 291, 858, -555, -201, 1129, -45, -687, 826, 534, -841, 281, 963, -512, -356, 942, -132, -830, 776, 644, -764, 237, 939, -589, -412, 1004, 96, -649, 743, 600, -884, 53, 945, -495, -419, 1055, 127]
3738A27r07J413o4j377R76R03j437m7J394q61r74J444J32j450P35R84j410j77
3756e96J520p27r31J404L4j424P58J005j399k05J473o93j053J336K17j426O97
3773a0J024j421k21J495o03j054J376K50j545N75J119j351k25J563n90j208J131
3790C05M33j560O33J211j102l78J389o02j218J243O23j458L69J186j250n88J432
3807F68l32j132J156N98j483K33J216j067n41J528l06j251R98N89j457K49J285
3824I51j026n39J342k48j311J023O56j339J91J321r71p05J381j41j298R35P01
3841I23j453Q7J395q96p48J320rj430Q10R21j265pJ423q71r22J245N0j294Q32
3860A11R42j326k15J349q66q34J392J20j143N85Q01j351j10J377o03q97J314J86
$$ y = [127, -780, 633, 569, -808, 168, 1071, -366, -413, 981, 120, -854, 590, 722, -728, 7, 991, -419, -596, 924, 197, -734, 670, 704, -720, 38, 1043, -356, -561, 912, 219, -834, 502, 719, -707, -10, 1014, -407, -628, 867, 264, -790, 586, 836, -709, -134, 985, -366, -591, 972, 382, -826, 305, 738, -822, -189, 1022, -80, -458, 931, 329, -889, 354, 977, -481, -112, 1074, -176, -764, 668, 336, -796, 360, 958, -525, -292, 924, -143, -684, 844, 538, -713, 285, 874, -583, -334, 951, -75, -614, 728, 480, -831, 192, 848, -491, -300, 1021, 50, -655, 726, 585, -713, 222, 923, -530, -443, 952, 56, -692, 628, 619, -811, -1, 920, -345, -352, 1071, 200, -722, 523, 573, -721, 111, 1053, -273, -488, 861, -5, -839, 553, 673, -470, 115, 916, -435, -545, 832, 229, -668, 646, 832]
3878H32j511N25R20j129j30J424o07j003J103K22j406O72J058j114l06J317o48
3895B19r85J118L48j311M21J141j146l36J338n46r43J077L78j308M13J082j053
3912i3l73J217m37j085J096M13j230L38J135j121n09J309k30j059J056M63j382
3929d92K73J039r52m41J326k57j152Q64M97j316K95J184q27n42J191k04j231R27
3947A82O20j119J16J140r50o28J155j47j141R17P47j195k9J154p43p68J272o4
3965E19j167P69P97j323K6J218p67p25J238m9j107O29P90j199k8J197o14p94J109
3984E19J63j263N73Q14j177j03J294o32q42J120J53j205N42R10j034j20J178n91
4002B99r06R87K32j202M92J002j148k21J096l98r06J050L32j164M27Q80r81l95
$$ y = [832, -679, -154, 766, -363, -493, 931, 324, -679, 424, 646, -760, -88, 970, -144, -450, 867, 219, -766, 352, 700, -611, -190, 951, -195, -531, 807, 261, -682, 395, 773, -535, -122, 960, -93, -466, 751, 314, -771, 325, 738, -492, -154, 981, -140, -649, 660, 430, -629, 427, 890, -492, -219, 820, -132, -573, 753, 496, -656, 208, 705, -611, -316, 868, 41, -501, 690, 486, -745, 182, 802, -317, -201, 939, -11, -639, 516, 369, -772, 145, 892, -303, -332, 822, 79, -689, 583, 519, -648, 121, 918, -405, -379, 839, 72, -653, 585, 536, -571, 58, 848, -351, -379, 818, 204, -590, 519, 682, -581, -8, 806, -371, -474, 820, 188, -654, 466, 619, -586, -44, 866, -168, -288, 890, 299, -607, 380, 612, -590, -98, 904, -244, -465, 631, 233, -673, 377, 709, -455, -28, 852, -129, -524]
4020e24J179l52r18R88M16j267L32R86r91m23J280k73j041R90K97j148L03J007
4038H41q74m76J219k82j002P67N24j246L37J060r40m57J149k19j030Q36N31j072
4056c34J13J058q42n71J122j44r68P49O67j221P1J062p29o11J143k7j045P05O25
4075H23j162K8J070o54o00R61O4j067O10O49j020n1J122n42q19J088J0r97N35
4094D8P29j013p6J110o18p18R56J59j194N50P57q62j29J114o05q27R73K38j041
4113d49M92P59r30k79J001m91p02R50K92j025M15P09r87k53J133l58p91R02K45
4132F33j111L52Q36q03l36J090k72r24P94L08r87K41R78p79m12J079l25r20Q21
4151B63L85j039L09Q44q44m29J107k43q72P22N09j075J92R26p19m70R49j06r72
$$ y = [-524, 655, 303, -615, 373, 789, -478, -146, 840, -151, -574, 706, 433, -608, 382, 679, -469, -166, 841, -33, -509, 710, 428, -574, 193, 717, -529, -192, 868, -72, -529, 620, 401, -629, 207, 738, -334, -221, 837, -5, -576, 546, 402, -566, 183, 850, -371, -300, 762, 33, -578, 565, 538, -507, 198, 823, -339, -311, 759, 105, -495, 466, 530, -537, 73, 722, -298, -349, 773, 231, -588, 500, 510, -487, 48, 777, -236, -312, 798, 180, -538, 418, 577, -617, -67, 690, -172, -301, 813, 208, -619, 354, 592, -449, 43, 802, -128, -407, 594, 103, -599, 351, 643, -382, 33, 742, -245, -498, 635, 277, -514, 388, 633, -478, -126, 710, -93, -429, 661, 389, -535, 259, 567, -420, -179, 799, 20, -392, 687, 362, -558, 263, 648, -391, -82, 762, -82, -511, 596, 353, -519, 203, 712, -363, -171, 755, 36, -434, 515, 409, -563]
4170e63P30M99r36J22Q38p34m80Q96K4q33O59M97j065M4R27o08m91J012l8r74
4190d74M99N56r89J1J059n13n63R08rr62N34O52q54q0R71n72o69Q96O8j004N72
4211C7O82r39p1Q64m48o52Q97J90r68M66O53q32k22R50l92o93Q79J09r98M44P49
4232G05q46k15R61l88o95Q52K17r67L52O75q17k12R11k37o62P06K21j023K74Q37
4252F49p75j99J011l01q46P09K95r03K53Q59o63m13Q20k25q70P34N10r42K99P33
4272G35q14l81R01j80o82P07M19r37J7P82n87m75R77p4q58N95M61q58N3Q40n56
4293H5m85Q68Pq70N26N42q91l0Q21n37m82Q70j0q50M33N86q01m1R62m94n73Q35
4315D71q4q99M80O31p76j7Q40m60o85P96J02p35M16O34q30j63P72l39o70Q43K26
$$ y = [-563, 167, 666, -270, -148, 690, -44, -524, 372, 396, -437, 222, 719, -346, -302, 625, 17, -474, 538, 500, -474, 25, 581, -408, -397, 662, 149, -414, 494, 485, -477, 57, 709, -145, -225, 746, 174, -495, 401, 469, -535, 37, 719, -220, -291, 573, 125, -527, 370, 560, -408, 58, 711, -121, -343, 607, 215, -478, 401, 510, -488, -44, 705, -141, -356, 605, 217, -478, 374, 591, -376, -24, 651, -166, -378, 533, 296, -366, 340, 561, -462, -188, 649, -126, -325, 686, 385, -461, 248, 543, -360, -107, 752, 89, -324, 496, 271, -599, 135, 645, -297, 2, 735, -79, -460, 441, 261, -421, 286, 705, -232, -215, 567, -20, -495, 482, 408, -450, 145, 606, -252, -199, 641, 85, -400, 468, 475, -395, 131, 673, -218, -248, 573, 36, -446, 424, 414, -436, -3, 583, -218, -259, 703, 209, -364, 471, 387, -512, -32, 599, -177, -194, 646, 186, -499, 297, 399, -336, 80, 714, -116, -279, 493, 154, -516, 327, 553]
4336E53q64K97O62q33j07Q26l08o23P64J32q29L02O40p11j59Q54l35o66O36K77
4356E08q53K46P24o58k94Q18k07p00O53K87q38K64P02o30l87Q75j60p77N70M66
4376F09r38J63P84o65l40Q78j93o56N28L80q09K41O66n93m54Q15o7o74M46M54
4396E75q11Q9O73n36l82Q30j4p76N41M02q72N5Q12m97m41P43n0p49M67M45p07
4417b03N9P51m75m58P07N3q31M85M45p10k2P96m82n00P08J42q19M27M43p50jP85
4439E50l47o11P35P8p46L85N45o76j70P69l37n59O02K64p69K54O45o76k25Q20
4459E31k66o20O88K13q70K23O38o01k75Q43k38o41O10K16p65K48O81n81k83P40
4479D91j65p34N99L47q46K59O20n82l51P90j03o96N34L86p59J24O82n47l54O80
$$ y = [553, -311, -14, 648, -185, -292, 534, 226, -397, 367, 499, -330, -28, 612, -99, -258, 596, 261, -405, 231, 508, -345, -99, 625, -33, -327, 491, 284, -416, 237, 524, -314, -50, 652, 22, -365, 510, 350, -427, 143, 609, -329, -166, 618, -47, -387, 491, 298, -358, 170, 550, -259, -18, 648, 55, -399, 416, 349, -325, 121, 575, -236, -147, 526, -10, -392, 438, 424, -352, 189, 591, -281, -226, 586, 89, -352, 391, 341, -408, 59, 504, -203, -144, 607, 132, -326, 381, 434, -397, 88, 533, -177, -199, 597, 115, -385, 323, 465, -354, 73, 516, -234, -235, 550, 203, -408, 327, 405, -341, 44, 589, -87, -257, 512, 175, -384, 218, 482, -287, -33, 612, -64, -289, 531, 265, -355, 333, 546, -324, -101, 537, -64, -339, 504, 266, -375, 235, 451, -314, -66, 615, 34, -249, 491, 326, -408, 191, 538, -308, -49, 571, -11, -362, 428, 325, -371, 163, 549, -210, -86, 596, 49, -305, 375]
4499C75n6o34M60L66p45M4P29m88l67P12q5p12N29M26o76n5P21m63m31P64o0o87
4521c33M47L80o83l9P39m56l89P02L6p13M37M66p58OO68m02m84P44M0p60L70M71
4543D89o49j10Q26l43n79O58R2o90L45N40o60j56P03l26m94N90K31p36K72N23
4563E26o59j12P16k61n03O33J55p67K61N53n52l06P49k09o11O13K24o88K13N45
4583E20n36l23P77k33n18N39L03p48J58N83n89k42P88k19n91M42K79p11J68O58
4603E05m66k78P01j76o26M90L53o65J04O05n12l57P26j19o60N42L51o20PN73m29
4624D9l72P04mo85M30L66o50PO22l97l99O70k9o29L43M85n89o8N65k72m71O57
4646C33kn88L31M60o54j36P44l81m07N97O2o13K08N83n56j43O86k53n96N90J37
$$ y = [375, 319, -315, 145, 511, -234, -190, 539, 51, -316, 396, 311, -401, 128, 554, -122, -177, 544, 81, -350, 414, 354, -333, 114, 494, -189, -228, 511, 55, -334, 368, 404, -309, 128, 594, -164, -158, 510, 108, -376, 368, 408, -352, 18, 489, -160, -270, 556, 213, -366, 292, 384, -306, 39, 579, -81, -237, 466, 140, -354, 236, 467, -269, 3, 526, -133, -245, 471, 210, -293, 340, 495, -272, -11, 542, -10, -316, 433, 224, -387, 226, 450, -238, -25, 520, -16, -339, 438, 205, -313, 226, 529, -219, -61, 522, -67, -309, 479, 260, -331, 111, 390, -321, -153, 505, 39, -239, 462, 286, -340, 150, 503, -162, -58, 547, 35, -322, 404, 285, -375, 167, 518, -102, -95, 478, 49, -323, 381, 377, -308, 122, 488, -162, -155, 467, 70, -329, 341, 312, -317, 26, 511, -78, -146, 419, 147, -324, 333, 331, -257, 74, 534, -120, -256, 488, 107, -300, 297, 359, -254, -46, 537, -19, -162, 524, 271, -325, 265, 402]
4667D02p60K92N73n87k09P94l88m82N52K84p27K69M71n78j45O78j84n38M86K13
4687D16n88J16N85n38k63O85j16n68M63K60n83J38N56n39k69O80k37n70N02L06
4707D36o64J70N64m69k82O35q7o69N26L13o79J23P03n45m02P66j23o58M18L13
4727C89n24N0N77l88m40P07o8o05M54L84p00Q4N59m16l21N19P3o88M07L91o36
4748a92K7N91l02m42P23j5o81L72L84n82k3N58k92l40M68O8o15L40M53n74j03
4769a77O63l12m81O26R7p02L33M69n69j30O59l21m73N86J97o64K32N07n65j49
4789a74N99k21n29N88J82o70K00N76o09k33P41k18n12N08K27o50P7N89l92k60
4809a81O27j90n46M73K39p05K24N44n40j53O20j84n78M97K01n51J70N26m20l22
$$ y = [402, -358, -66, 507, -80, -289, 505, 117, -365, 187, 471, -256, 13, 484, -94, -239, 439, 255, -283, 203, 416, -172, -56, 529, -9, -272, 413, 297, -271, 192, 452, -131, 7, 563, 24, -245, 435, 198, -372, 130, 436, -228, -58, 506, 37, -245, 390, 303, -366, 160, 473, -206, -83, 620, 75, -327, 439, 316, -342, 76, 389, -135, -85, 492, 104, -336, 371, 303, -302, 152, 536, -164, -80, 479, 63, -258, 261, 334, -354, 53, 444, -192, -165, 426, 124, -318, 405, 390, -291, 81, 465, -117, -140, 418, 126, -214, 254, 322, -293, 47, 500, -74, -177, 486, 174, -307, 319, 416, -286, 47, 516, -53, -183, 476, 155, -318, 268, 465, -199, 33, 540, -25, -174, 425, 204, -325, 263, 445, -225, -25, 551, -58, -291, 450, 232, -280, 228, 455, -195, -118, 471, 79, -181, 446, 256, -290, 183, 422, -283, -59, 485, -55, -208, 412, 228, -350, 147, 348, -203, -33, 493, 73, -249]
4829b49O44r4n88M08L71o29JO24m24l13N16M4n72L87L00n17m1O03l66l68N95n9
4851B73n57L97L21n65MN93m42l54O22K0n38L00L61n90l9O53k92m16N65K9n68K83
4873F0M15o25j8N98k52l70M31M8n04K42N04o05j30O06k55m35N21J85n92K12N00
4894E36n97j46N64j64m63N14J87o93K98M86n79j83N97j48n46N91J36p07K62M68
4914D13m38j45N31j35n08N10J75o39K02N18l95k89N84j96m52M24K50n68J23M65
4934D30l91k95O04j29m82M56K57o30J10N17l71l68N41L9n36L66K68m90K0N38l33
$$ y = [-249, 395, 301, -287, 121, 492, -137, -136, 488, 64, -249, 267, 311, -261, 126, 426, -91, -132, 471, 105, -263, 332, 273, -284, 113, 434, -131, -127, 466, 24, -330, 292, 312, -226, 74, 435, -155, -194, 459, 167, -249, 316, 345, -223, 60, 475, -150, -168, 430, 178, -192, 239, 287, -217, 25, 529, -76, -206, 400, 145, -290, 231, 416, -176, 36, 536, -61, -207, 357, 193, -270, 244, 431, -262, 36, 522, -57, -240, 357, 209, -337, 254, 390, -317, -55, 413, -25, -170, 361, 226, -282, 228, 403, -236, -34, 484, 89, -200, 384, 188, -264, 160, 410, -158, -35, 430, 39, -256, 348, 219, -263, 193, 450, -180, -70, 447, 76, -292, 249, 288, -248, 118, 386, -104, -84, 454, 121]
$$ [...]
8191F2
##END NTUPLES=NMR FID
##END=
