##TITLE=H1
##JCAMPDX= 6.0         $$ Bruker NMR JCAMP-DX V2.0
##DATA TYPE= NMR SPECTRUM
##DATA CLASS= NTUPLES
##ORIGIN= UXNMR, Bruker Analytische Messtechnik GmbH
##OWNER= root
$$ XWIN-NMR		Version 3.5
$$ Sat Jan 16 11:47:59 2016 Russian Standard Time (UT+4h)  Irina@DPX200
##.OBSERVE FREQUENCY= 200.131235884673
##.OBSERVE NUCLEUS= ^1H
##.ACQUISITION MODE= SIMULTANEOUS
##.ACQUISITION SCHEME= undefined
##.AVERAGES= 1
##.DIGITISER RES= 18
##SPECTROMETER/DATA SYSTEM= spect
##.PULSE SEQUENCE= zg
##.SOLVENT NAME= CDCl3
##.SHIFT REFERENCE= (INTERNAL, CDCl3, 0, 16.5164)
##AUDIT TRAIL= $$ (NUMBER, WHEN, WHO, WHERE, WHAT)
$$ ##TITLE= Audit trail, XWIN-NMR		Version 3.5
$$ ##JCAMPDX= 5.01
$$ ##ORIGIN= Bruker BioSpin GmbH
$$ ##OWNER= Irina
$$ F:/spectra/data/iren3/nmr/H1/1/pdata/1/auditp.txt
$$ ##AUDIT TRAIL=  $$ (NUMBER, WHEN, WHO, WHERE, WHAT)
(   1,<2016-01-16 11:46:45.48 +0400>,<Irina>,<DPX200>,
      <created by zg, POWCHK disabled, PULCHK disabled
       configuration hash MD5:
       00 E9 B6 7A A2 85 ED C7 34 08 36 98 17 FE 4E 26
       data hash MD5: 16K
       3D 27 2E 06 3C F2 37 AE E0 85 F9 10 01 B8 91 AE>)
(   2,<2016-01-16 11:46:48.75 +0400>,<Irina>,<DPX200>,
      <Start of raw data processing
       efp BC_mod = 2 LB = 0.1 FT_mod = 6 PKNL = 1 PHC0 = -310.6511 PHC1 = -0.8315811 SI = 32K 
       data hash MD5: 32K
       3B 2C 83 3E 03 C0 53 90 6D 1D CF EF EA D0 39 8C>)
(   3,<2016-01-16 11:47:11.67 +0400>,<Irina>,<DPX200>,
      <pk PHC0 = 5.110678 PHC1 = 3.8 
       data hash MD5: 32K
       22 50 F7 47 72 B8 B9 E3 41 FB 6A 2D 34 7D CB E7>)
$$ ##END=
$$ 
$$ hash MD5
$$ 27 20 69 F0 5A E3 00 BA 01 A7 86 A8 D2 9B 32 F7
##$RELAX= 
##$RELAX= 
##$RELAX= 
##$RELAX= 
##$RELAX= 
##$RELAX= 
$$ Bruker specific parameters
$$ --------------------------
##$DU= <F:/spectra>
##$EXPNO= 1
##$NAME= <H1>
##$PROCNO= 1
##$TYPE= <nmr>
##$USER= <iren3>
##$AMP= (0..31)
100 100 100 100 100 100 100 100 100 100 100 100 100 100 100 100 100 100 
100 100 100 100 100 100 100 100 100 100 100 100 100 100 
##$AQSEQ= 0
##$AQ_mod= 1
##$AUNM= <au_zg>
##$AUTOPOS= <>
##$BF1= 200.13
##$BF2= 200.13
##$BF3= 200.13
##$BF4= 200.13
##$BF5= 500.13
##$BF6= 500.13
##$BF7= 500.13
##$BF8= 500.13
##$BYTORDA= 1
##$CFDGTYP= 0
##$CFRGTYP= 5
##$CHEMSTR= <none>
##$CNST= (0..31)
1 1 145 1 1 1 1 1 1 1 1 1 1 1 1 1 1 1 1 1 1 1 1 1 1 1 1 1 1 1 1 1 
##$CPDPRG= <>
##$CPDPRG1= <>
##$CPDPRG2= <>
##$CPDPRG3= <>
##$CPDPRG4= <mlev>
##$CPDPRG5= <mlev>
##$CPDPRG6= <mlev>
##$CPDPRG7= <mlev>
##$CPDPRG8= <mlev>
##$CPDPRGB= <>
##$CPDPRGT= <>
##$D= (0..31)
0 1 0 0 0 0 0 0 0 0.06 0 0 0 0 0 0 0.0002 0 0 0 0 0 0 0 0 0 0 0 0 0 0 
0 
##$DATE= 1452930404
##$DBL= (0..7)
120 120 120 120 120 120 120 120 
##$DBP= (0..7)
150 150 150 150 150 150 150 150 
##$DBP07= 0
##$DBPNAM0= <>
##$DBPNAM1= <>
##$DBPNAM2= <>
##$DBPNAM3= <>
##$DBPNAM4= <>
##$DBPNAM5= <>
##$DBPNAM6= <>
##$DBPNAM7= <>
##$DBPOAL= (0..7)
0.5 0.5 0.5 0.5 0.5 0.5 0.5 0.5 
##$DBPOFFS= (0..7)
0 0 0 0 0 0 0 0 
##$DE= 6
##$DECBNUC= <off>
##$DECIM= 32
##$DECNUC= <off>
$$ [...]
##$SUBNAM3= <"">
##$SUBNAM4= <"">
##$SUBNAM5= <"">
##$SUBNAM6= <"">
##$SUBNAM7= <"">
##$SUBNAM8= <"">
##$SUBNAM9= <"">
##$SW= 20.6817932712277
##$SWIBOX= (0..15)
0 0 3 0 0 0 0 0 0 0 0 0 0 0 0 0 
##$SW_h= 4139.07284768212
##$TD= 16384
##$TD0= 1
##$TE= 0
##$TE2= 300
##$TE3= 300
##$TEG= 300
##$TL= (0..7)
0 120 120 120 120 120 120 120 
##$TP= (0..7)
150 150 150 150 150 150 150 150 
##$TP07= 0
##$TPNAME0= <>
##$TPNAME1= <>
##$TPNAME2= <>
##$TPNAME3= <>
##$TPNAME4= <>
##$TPNAME5= <>
##$TPNAME6= <>
##$TPNAME7= <>
##$TPOAL= (0..7)
0.5 0.5 0.5 0.5 0.5 0.5 0.5 0.5 
##$TPOFFS= (0..7)
0 0 0 0 0 0 0 0 
##$TUNHIN= 0
##$TUNHOUT= 0
##$TUNXOUT= 0
##$USERA1= <user>
##$USERA2= <user>
##$USERA3= <user>
##$USERA4= <user>
##$USERA5= <user>
##$V9= 5
##$VALIST= <valist>
##$VCLIST= <CCCCCCCCCCCCCCC>
##$VD= 0
##$VDLIST= <DDDDDDDDDDDDDDD>
##$VPLIST= <PPPPPPPPPPPPPPP>
##$VTLIST= <TTTTTTTTTTTTTTT>
##$WBST= 1024
##$WBSW= 4
##$XGAIN= (0..3)
0 0 0 0 
##$XL= 0
##$YL= 0
##$YMAX_a= 139692
##$YMIN_a= -118364
##$ZGOPTNS= <>
##$ZL1= 120
##$ZL2= 120
##$ZL3= 120
##$ZL4= 120
##$ABSF1= 0
##$ABSF2= 0
##$ABSG= 0
##$ABSL= 0
##$ALPHA= 0
##$AQORDER= 0
##$ASSFAC= 0
##$ASSFACI= 0
##$ASSFACX= 0
##$ASSWID= 0
##$AUNMP= <proc_1d>
##$AZFE= 0.1
##$AZFW= 0.1
##$BCFW= 0
##$BC_mod= 2
##$BYTORDP= 0
##$COROFFS= 0
##$CY= 18.4799938201904
##$DATMOD= 1
##$DC= 0
##$DFILT= <>
##$DTYPP= 0
##$F1P= 9.9274215381318
##$F2P= -0.165520771350173
##$FCOR= 1
##$FTSIZE= 32768
##$FT_mod= 6
##$GAMMA= 0
##$GB= 0
##$INTBC= 1
##$INTSCL= 1
##$ISEN= 128
##$LB= 0.1
##$LEV0= 0
##$LPBIN= 0
##$MAXI= 10000
##$MC2= 0
##$MEAN= 0
##$ME_mod= 0
##$MI= 50
##$NCOEF= 0
##$NC_proc= -6
##$NLEV= 6
##$NOISF1= 3.799351
##$NOISF2= 2.8
##$NSP= 0
##$NTH_PI= 0
##$NZP= 0
##$OFFSET= 16.51637
##$PC= 4
##$PHC0= -305.5404
##$PHC1= 2.968419
##$PH_mod= 1
##$PKNL= yes
##$PPARMOD= 0
##$PSCAL= 4
##$PSIGN= 0
##$REVERSE= no
##$SF= 200.13
##$SI= 32768
##$SIGF1= 3
##$SIGF2= 2
##$SINO= 400
##$SIOLD= 16384
##$SREGLST= <1H.CDCl3>
##$SSB= 0
##$STSI= 32768
##$STSR= 0
##$SW_p= 4139.07284768211
##$SYMM= 0
##$S_DEV= 0
##$TDeff= 16384
##$TDoff= 0
##$TI= <>
##$TILT= no
##$TM1= 0
##$TM2= 0
##$TOPLEV= 0
##$USERP1= <user>
##$USERP2= <user>
##$USERP3= <user>
##$USERP4= <user>
##$USERP5= <user>
##$WDW= 1
##$XDIM= 32768
##$YMAX_p= 314859337
##$YMIN_p= -494853
$$ End of Bruker specific parameters
$$ ---------------------------------
##NTUPLES= NMR SPECTRUM
##VAR_NAME=  FREQUENCY,     SPECTRUM/REAL,   SPECTRUM/IMAG
##SYMBOL=    X,             R,               I
##VAR_TYPE=  INDEPENDENT,   DEPENDENT,       DEPENDENT
##VAR_FORM=  AFFN,          ASDF,            ASDF
##VAR_DIM=   32768,         32768,           32768
##UNITS=     HZ,            ARBITRARY UNITS, ARBITRARY UNITS
##FACTOR=    0.126318333923829, 1,           1
##FIRST=     3305.42128286362, 0,            0
##LAST=      -833.651564818493, 0,           0
##MIN=       -833.651564818493, -494853,     0
##MAX=       3305.42128286362, 314859337,    0
$$ Real data points
##PAGE= N=1
##DATA TABLE= (X++(R..R)), XYDATA
$$ [...]
10018E33088q2180l6067k3545j9181j0760k2097m5561l8394m163J114l5218n6967
10006A60069l4434r862j5446j9290N033K2892L555j8068j863K3800J0388k6251
9994A00523l3269p746N869q397k2092j7857r887o455L628J8853J6499j0059l2549
9981b939k2737Q896K3925K576k8657k4133K1350N4202K5975l4006m8901r47M0340
9968A4944J8545k9459l4800M77J6791q044l5735l4387j4660O168K7957M3173L1742
9955B712m68j4415P274K7861O586m0033n7765k5598K1084L8026K0233m024j1400
9942b9927l304O187Q337J807j2091k5346k2000K002K1076O147k7269k7379K0469
9929h1291N9904L5833k3015l9855N61L1233L062m4714m5471m62K9562J1287k5491
$$ plain form
10018 533088 450908 414841 391296 372115 361355 339258 293697 255303 251140 252254 217036 160069
10006 160069 125635 115773 100327 81037 86070 108962 112517 94449 92586 116386 126774 100523
9994 100523 67254 59508 65377 56980 34888 17031 7144 689 4317 23170 39669 29610 -2939
9981 -2939 -25676 -16780 7145 9721 -18936 -43069 -21719 32483 58458 24452 -24449 -25396 14944
9968 14944 33489 4030 -30770 -30293 -13502 -21546 -57281 -91668 -106328 -100160 -72203 -29030 2712
9955 2712 2244 -12171 -4897 22964 29550 -10483 -68248 -93846 -72762 -34736 -14503 -18527 -29927
9942 -29927 -33231 -27044 -18707 -16900 -28991 -54337 -76337 -74335 -53259 -47112 -74381 -101760 -81291
9929 -81291 -21387 14446 -8569 -48424 -47863 -16630 -13568 -58282 -103753 -104215 -74653 -63366 -88857
9916h8857l8090j9579J2306M3311O0625M6139l67m1227l4015J2196L9573J2091
9904D106l8691n6812l2484k120J1416K2486M2028M8930K3036j6184k9810q568
9892c2667J8503J9782q483m1808m6957j1089L7590N0326J2847l3017l9222r209
9880h3404J5700J4935N213L111J452r915k1865j6447R024L3212K5496k0990o6297
9867a10775n4700J4574P1485N8479O524j2358J0667J9582r581l4594k3932n379
9855g0008p252o922J8328L5533N982m1466m6504q161J9991J6414J2396K3422K0492
9842b7755j1452l8158k7760J192J3681Q992O543O888l1o593oJ0690R933M512O666
9827d2658L158k1268m1341j8994K7928L7415l563l1395q4M5983L8963r613l0438
$$ plain form
9916 -88857 -126947 -146526 -134220 -90909 -30284 15855 15488 -25739 -59754 -47558 -7985 4106
9904 4106 -34585 -91397 -123881 -126001 -114585 -92099 -50071 -1141 21895 5711 -24099 -32667
9892 -32667 -14164 5618 -2865 -44673 -91630 -102719 -65129 -14803 -1956 -34973 -74195 -83404
9880 -83404 -67704 -52769 -47556 -44445 -42993 -52908 -74773 -91220 -82196 -48984 -23488 -44478 -110775
9867 -110775 -165475 -150901 -79416 -20937 -14413 -26771 -16104 3478 -6103 -40697 -64629 -70008
9855 -70008 -77260 -84182 -65854 -30321 -24339 -65805 -112309 -120470 -100479 -84065 -71669 -48247 -27755
9842 -27755 -39207 -77365 -105125 -103933 -90252 -81260 -74717 -67829 -67860 -74453 -74459 -63769 -53836 -49324 -42658
9827 -42658 -39500 -60768 -102109 -121103 -93175 -55760 -59323 -90718 -90802 -44819 -5856 -15469 -45907
9814d5907j981K6787J8231o667j5857j1727p605Q91J5306J7783J543r492J949
9801a6746J4587L023j7430j2726J6398L3621J4861k5046n0025l5470P292L3806
9789c3855J2861k7031k9265P800K7041P350o91K9441L9316j4607o5085l0004M3565
9776c3164M2902k8240n5734l483L5926P730j8489J2627L7091r442o6639m6267
9764a25182K0117L9207Q099k830J6735J3215j8003k3545M337J3468r122j4054
9752g7558J6766L5741J3553j4687j4265J195J0999J7991J6916q471l7536k5489
9740f4845J5312J7578k9289m7991K501N0982K6007k7492k6054J3854J2957k8909
9728h5389l4265J5154M7319K3875q06J6117K8065j2869n6847k6959M8968O6950
$$ plain form
9814 -45907 -47888 -21101 -2870 -9537 -25394 -37121 -44726 -43835 -28529 -10746 -9203 -18695 -16746
9801 -16746 -2159 864 -16566 -29292 -12894 20727 35588 10542 -39483 -74953 -67661 -33855
9789 -33855 -20994 -48025 -77290 -69490 -42449 -35099 -35790 -6349 32967 18360 -46725 -76729 -33164
9776 -33164 9738 -18502 -74236 -77719 -41793 -34063 -52552 -39925 -2834 -12276 -78915 -125182
9764 -125182 -105065 -65858 -57759 -60589 -43854 -30639 -48642 -72187 -67850 -54382 -63504 -77558
9752 -77558 -60792 -25051 -11498 -26185 -40450 -39255 -28256 -10265 6651 -1820 -39356 -64845
9740 -64845 -49533 -31955 -61244 -109235 -106734 -55752 -29745 -57237 -83291 -69437 -56480 -85389
9728 -85389 -119654 -104500 -57181 -33306 -34112 -17995 10070 -2799 -59646 -86605 -37637 29313
9716B9313L08o1569m6942K994J4573o563o862J5145J6113m474l061K1477J8779
9703a0769j9374l4099N62K8281P643j4274J1218M0439J1084m3682m8061j1282
9691h2314j344j8578n520K9792J9199l1199l4185K5631N3310K911m1372p748M5724
9678d5693L6555j0224k5204j3672j7467k1009Q105L5833J4426k3864j8210J4303
9666f6121J5902n201k128R989j5485n0877k8970K9573L6108j8133m4513j323M7780
9653i3399M3820R005j4338k0380j0988J5884L2263P420k4684o658L4108J7875
9641a0072m3176n1732M561K3158l0900n3414J6189P7526L6070l4869k4125K6935
9629f3849Q979n4155m6525L5735P5560K4528l6120l8058j1342k277n067m923r421
$$ plain form
9716 29313 29621 -31948 -78890 -75896 -61323 -67886 -74748 -59603 -43490 -47964 -51025 -29548 -10769
9703 -10769 -30143 -64242 -63680 -35399 -27756 -42030 -30812 9627 20711 -22971 -71032 -82314
9691 -82314 -83658 -102236 -107756 -77964 -58765 -89964 -124149 -98518 -45208 -42297 -83669 -91417 -45693
9678 -45693 -9138 -19362 -44566 -58238 -75705 -96714 -88609 -52776 -38350 -62214 -80424 -66121
9666 -66121 -50219 -55420 -57548 -47559 -63044 -113921 -142891 -113318 -77210 -95343 -139856 -141179 -93399
9653 -93399 -49579 -40574 -54912 -75292 -86280 -70396 -38133 -30713 -55397 -62055 -27947 -10072
9641 -10072 -53248 -104980 -100419 -77261 -108161 -161575 -145386 -67860 -31790 -66659 -90784 -63849
9629 -63849 -54870 -109025 -155550 -119815 -44255 -19727 -55847 -93905 -105247 -107524 -112591 -117514 -126935
9616a26935j2585M477K4031R841j9981j1826K6824L1064r394k8478K788K7862
9604h2312O146j8626q04K7043J5115j7687k1021K456R210j2007k9654j9768J0115
9591a31794L8614M7737L2575P988p553j7324l2075l5337l950L6662L1690j6355
9579d9122l9019m039L4196K2555j0492j2066P587N294j3735j0596J1583J0446
9567d7408k2112m4069k5776J3386L7944L5187J5472l917j1786j2057j5487j7619
9555i8242l376J9754K2701K512p230O073R245j3273k0165J5551M3285Q281m8112
9542f2996m1270K2644N3052J6925j4992J0774M4876J9570m1645o1047k0737K0719
9530e4127J6607j2646k1073n28J7368J0236n399k422J1924M958k5031l5773n651
$$ plain form
9616 -126935 -139520 -135043 -111012 -101171 -121152 -132978 -106154 -75090 -84484 -112962 -110174 -82312
9604 -82312 -76166 -94792 -95596 -68553 -53438 -71125 -92146 -89690 -80480 -92487 -122141 -141909 -131794
9591 -131794 -93180 -45443 -12868 -4880 -12433 -29757 -61832 -97169 -101119 -64457 -32767 -49122
9579 -49122 -88141 -92180 -57984 -35429 -45921 -57987 -50400 -45106 -58841 -69437 -57854 -47408
9567 -47408 -69520 -113589 -139365 -125979 -88035 -52848 -37376 -41293 -53079 -65136 -80623 -98242
9555 -98242 -101618 -81864 -59163 -56651 -63881 -57808 -48563 -61836 -82001 -66450 -23165 -14884 -62996
9542 -62996 -104266 -81622 -28570 -11645 -26637 -15863 29013 48583 6938 -54109 -74846 -54127
9530 -54127 -37520 -50166 -71239 -71767 -54399 -44163 -49562 -51984 -40060 -35102 -60133 -95906 -101557
9517a01557K3188N467l1020k3314K7109N4278K8217p578j3840r381j8799k1852
9505h9082L261K8618J6713j6208k4677m835N038j1368k4954p388K8545M5514K4566
9492b6257j5017l4816j8060R962J3048o875j2784J2996M3969M8447K6469n022
9480C6060l5324n0827l1938J5713M9726L6758o323l6959l4646q323K0368K4741
9468b0974p738m6238m1204J971J9237j3036l1826J0600N7640L5782j7954j2874
9456f6614M0044M2280k4756o4407k3652K5260J3352j6694k523K4189N267k9585
9444g7839j6134K2284J1816l7317m0998J6382N3019K0975k6603l1061q665N931
9432a08210K2211M7065M0479j6714o0827k5674M7134N6981j0143o4004m3529P912
$$ plain form
9517 -101557 -78369 -72902 -103922 -127236 -100127 -45849 -17632 -25210 -39050 -48431 -67230 -89082
9505 -89082 -85821 -57203 -40490 -56698 -81375 -86210 -81172 -92540 -117494 -124882 -96337 -50823 -26257
9492 -26257 -41274 -76090 -94150 -84188 -71140 -78015 -90799 -77803 -33834 14613 41082 36060
9480 36060 736 -50091 -82029 -66316 -16590 20168 13845 -23114 -57760 -66083 -45715 -20974
9468 -20974 -28712 -74950 -116154 -114183 -94946 -107982 -139808 -129208 -71568 -35786 -53740 -66614
9456 -66614 -26570 15710 -9046 -73453 -97105 -71845 -58493 -75187 -77710 -53521 -48254 -77839
9444 -77839 -93973 -71689 -59873 -97190 -138188 -121806 -68787 -47812 -74415 -105476 -114141 -108210
9432 -108210 -85999 -38934 1545 -15169 -75996 -101670 -54536 2445 -7698 -71702 -115231 -107319
9420a07319K6096J7491K1158K8543L183m1496m7701r50M0601K5747k0075l6141
9408i0863j1280J2180Q480p87O768J6627R168m77J1993L1742K1219j8287m0577
9395d4094j9203J5835K3528N859o886l344L409M034M84o407j3825r479R949K2022
9381a8118O387j9123k1322l966R42p039O798M3426M8676o990o9674o8855j4406
9368a23264K4701K1024J0371J6342J4286j2624l3688j7367J9710M1722M2019L1921
9356C5153R895k2265l7067j6857O661n711l2747k0136K8210M6800Q698l1619k3668
9343e4653O402J0278l753j479N042j7716m9212l6225J4831L8967J4627o488P680
9330g1699J8130p397l2125j7284O588j636j3863J2891M2771J2487m6415l9471
$$ plain form
9420 -107319 -81223 -63732 -42574 -14031 -10848 -52344 -100045 -100995 -60394 -34647 -54722 -90863
9408 -90863 -102143 -89963 -81483 -82270 -75502 -58875 -49707 -50184 -38191 -6449 14770 -3517 -44094
9395 -44094 -63297 -47462 -23934 -18075 -24961 -28305 -24896 -20862 -20378 -26785 -40610 -50089 -40140 -18118
9381 -18118 -11731 -30854 -52176 -56142 -55200 -62239 -55441 -12015 36661 29671 -40003 -108858 -123264
9368 -123264 -98563 -77539 -67168 -50826 -36540 -49164 -82852 -100219 -80509 -38787 3232 35153
9356 35153 45048 22783 -14284 -31141 -24480 -30191 -62938 -83074 -54864 -8064 634 -30985 -54653
9343 -54653 -48251 -37973 -41726 -43205 -38163 -55879 -105091 -141316 -126485 -87518 -72891 -79379 -71699
9330 -71699 -53569 -60966 -93091 -110375 -103787 -105423 -119286 -106395 -63624 -51137 -97552 -137023
9318a37023L5508P2113K0739l4367j6397K1396m795o1197m9979K9752P9985N2197
9306G932J389j6783j6023k2000k0080J698J5549J308j4282o160R03k2007m5777
9293a34333j9679M4805P7852M1693k2666n0628k8091M849P682j9318m3273l6666
9281a77773l442K9104L8041K2698J980j327J8246L7408K6370q770k5632m849J5552
9268c2394k972l2781j9179K8186M4809J3540j0731L485J4380j1048l1446l270
9256c9421L5704K4233j9219k7422L421J2216k0228m0656j4009K2874K4931K827
9244c4749q548m902l121n458k652N259J2348J6985J6170N129r500j3414o068N66
9230c1955M881J3357J7236K340j7795j5142L217R24k3770k8261K423K5335J1159
$$ plain form
9318 -137023 -101515 -29402 -8663 -43030 -59427 -38031 -42826 -104023 -154002 -124250 -44265 7932
9306 7932 9321 -7462 -23485 -45485 -65565 -63867 -48318 -47010 -61292 -67452 -66549 -88556 -134333
9293 -134333 -154012 -109207 -31355 10338 -12328 -62956 -91047 -86198 -78516 -97834 -141107 -177773
9281 -177773 -181215 -152111 -114070 -91372 -89392 -90719 -72473 -35065 -8695 -17465 -43097 -47946 -32394
9268 -32394 -35366 -68147 -87326 -59140 -14331 -791 -11522 -8037 6343 -4705 -36151 -39421
9256 -39421 -3717 20516 1297 -26125 -22704 -10488 -30716 -71372 -85381 -62507 -37576 -34749
9244 -34749 -43297 -48199 -51320 -56778 -59430 -54171 -41823 -24838 -8668 -3539 -13039 -26453 -32521 -31955
9230 -31955 -27074 -13717 3519 5859 -11936 -27078 -23861 -22937 -46707 -74968 -72545 -47210 -36051
9217c6051m727J4109L6365J5414k3823j9887K0100K6258j8467m3841k386N1026
9205A4090M0274j5899l4050N987L3720j48m8816m5374o494K01k9784k9279K6521
9192h9051O9682M1087j6494k4874J1227K2922p758k8458j0667J1334R834M057
9180g159P690j149k6877l1450P12K6342J2837o835M601K1811O855j7191o966J9713
9166B934J2393k2891l2958p070R842m295j7036L46L0494L9743J7361k0959m4226
9153c6322k7308J4572L0379J765k2036J100L2566J3635l2527l5641N042K4245
9141c0530M104n878J1401J2490j5481k4700J960J4163j2780k8625J988L5622K7306
9128h960K104l893o130j8777q948L2546M4720n535m7493j4786L5837J6673l6230
$$ plain form
9217 -36051 -40778 -26669 9696 25110 1287 -18600 1500 27758 9291 -34550 -36936 14090
9205 14090 54364 38465 4415 10402 44122 43974 -4842 -50216 -56710 -56509 -86293 -115572 -89051
9192 -89051 -19369 21718 5224 -19650 -8423 14499 6741 -21717 -32384 -21050 -11216 -7159
9180 -7159 531 -618 -27495 -58945 -58233 -31891 -19054 -25889 -21288 523 7378 -9813 -16779 2934
9166 2934 15327 -7564 -40522 -47592 -37750 -42045 -59081 -58735 -28241 11502 28863 7904 -36322
9153 -36322 -63630 -49058 -18679 -16914 -38950 -37850 -5284 8351 -24176 -59817 -54775 -30530
9141 -30530 -26426 -32304 -20903 -8413 -23894 -48594 -46634 -32471 -45251 -73876 -71888 -36266 -8960
9128 -8960 -6856 -10749 -16879 -35656 -44604 -12058 32662 27127 -20366 -35152 685 17358 -18872
9115a8872k2884M1914M6528k5938o2852o623N2871K6396l8266m2836J2564M6864
9103H866K1141k5994m4669k3310J6460M0450K9098K264l293R433l40l8341n2115
9090f0350j1312L4850K5707j9981l4785m265J8730n48l0206k3912J4129M0684
9078e1259L2424R021o89M746Q602Q773J6726K4246M854l5846m7912q265K9941
9065d638Q536m1648m2826P755L4902Q997j0632J8187N0415L4744l652j6513j1035
9052C2592j4188r871J9695L3686q327n9213m0708L0354N9053J3376l6865l3720
9040a4136l222J0856J2669J8327J5316j634m717J5686J9262k0285n9508m3851
9028e5237Q441L3922J5340p367p041J311J065j922l251r729j5547k980K1435K4523
$$ plain form
9115 -18872 -41756 158 46686 20748 -42104 -48727 4144 30540 -7726 -50562 -37998 8866
9103 8866 30007 4013 -40656 -63966 -47506 -7056 22042 24306 21013 30446 30106 -8235 -60350
9090 -60350 -71662 -36812 -11105 -31086 -65871 -70136 -51406 -51954 -82160 -106072 -91943 -51259
9078 -51259 -18835 -9814 -10503 -5757 2845 11618 28344 52590 57444 21598 -26314 -34579 -4638
9065 -4638 3898 -37750 -80576 -72821 -37919 -28922 -39554 -21367 29048 63792 60140 43627 32592
9052 32592 18404 8533 28228 61914 53587 -5626 -46334 -15980 43073 56449 19584 -14136
9040 -14136 -17358 -6502 6167 24494 39810 38176 33459 49145 68407 48122 -11386 -55237
9028 -55237 -46796 -12874 2466 -4901 -11942 -10631 -9566 -11488 -14739 -24468 -40015 -42995 -21560 2963
9014B963k868k3659p421J9720J1157k7917m2868p730L4334K8948j3965l3658k743
9001f5707L5068K6132j8528l8793p882L4301L9056J0321j3847j8751j9186j8590
8989e6406j818K5827L0690J383k4158j0886J8679J8237j0222k2071l341R332q106
8976c2860k9250k4352n787L318J1289L0610L6814K374m3807m2775R029M8679L2194
8963d524r683k0483P665L3110K2610j0499k5160l496K2510R477l1500m0523J147
8950d9349L0997j536m5651k2575M3104N6375M520k7731o929q95m1493n3128J1952
8937a02339P1377L9746k8910l4816L501K954k2329N470O3286M8449l4995o2577
8925e1183Q664O6764K6548m3854n0245j3909J06R93K1702K7085k3542p7461n5460
$$ plain form
9014 2963 95 -23564 -30985 -11265 -108 -28025 -70893 -78623 -44289 -15341 -29306 -62964 -65707
9001 -65707 -30639 -4507 -23035 -61828 -69710 -35409 3647 13968 121 -18630 -37816 -56406
8989 -56406 -58224 -32397 -1707 -324 -24482 -35368 -16689 1548 -8674 -30745 -34086 -24754 -32860
8976 -32860 -62110 -86462 -92249 -88931 -77642 -47032 -10218 -7844 -51651 -94426 -85397 -36718 -4524
8963 -4524 -14207 -34690 -27025 6085 28695 18196 -6964 -10460 12050 21527 -9973 -50496 -49349
8950 -49349 -18352 -19888 -65539 -88114 -45010 11365 15885 -11846 -18775 -19670 -61163 -114291 -102339
8937 -102339 -30962 8784 -20126 -54942 -51441 -48487 -70816 -65346 -2060 46389 11394 -51183
8925 -51183 -42519 24245 50793 6939 -43306 -57215 -57109 -56116 -34414 -7329 -30871 -108332 -163792
8912a63792J9955N9626M1932J8474R193j0847l1256j1769K8510K2220k9740m3975
8900i1469J3022O3646L7279k3338l5718l310N628k4199l4662O846N1724L9914
8888E363j3659l9483p285L6352L3603q197l1941j1163J9642K0881j15j2648j0438
8875a9088q142r392p639n715p619l340J1962J8769K506j4544n751J1602L456j7881
8861e0816r321K6554L7290M260k4202p240K8882L7879K0463N924j890j6430k6571
8848B4782r228K3155L0773N575j5579q089M050r034l0257j9320K0194L6169J199
8835E4390m2519l9076J884K0660m203k8079j2085J9860K3203l83j3829k254J5579
8822f852K1453J2087j0603l4654l4485j865L0514K7044j015j6194j1474q414j1216
$$ plain form
8912 -163792 -143837 -84211 -42279 -23805 -14612 -25459 -56715 -68484 -39974 -17754 -47494 -91469
8900 -91469 -78447 -14801 22478 -860 -36578 -39888 -34260 -58459 -93121 -86275 -34551 5363
8888 5363 -8296 -47779 -55064 -18712 14891 6694 -25247 -36410 -16768 4113 3998 -8650 -19088
8875 -19088 -27230 -36622 -44261 -49976 -57595 -60935 -48973 -30204 -27698 -42242 -47993 -36391 -32935 -50816
8861 -50816 -60137 -33583 3707 7967 -16235 -23475 5407 43286 63749 69673 67783 51353 24782
8848 24782 15554 38709 69482 75057 59478 51389 55439 46405 16148 -3172 17022 53191 54390
8835 54390 11871 -27205 -25321 -4661 -8864 -36943 -49028 -29168 -5965 -6348 -20177 -22431 -6852
8822 -6852 14601 26688 16085 -18569 -53054 -54919 -24405 2639 1624 -14570 -26044 -34458 -45674
8809d5674o484m71r451j7940K197L2021K2126k3570m1205l274L7187K9014l334
8796b8858q348J2814K1180N868r210q493J629J2082J6511O577j6680l4721k9922
8783e9571m748K3296L4469J6905j6433k7947p52K6948J2459j9754j3098K3071
8771e155K4043j5967k6117J8756M7763J1935l2709k2492J1115J0233p462Q59J2744
8758B7546q040k4980O407L7457J627n1728k6337M5809M1722m2664p2046Q766Q2732
8745B6271M9270k6339l7233N98R588p338L851L2332K4087j2100j9102M432M995
8732E3312k5064l1875N023L5720K0474j0997j0753J7907L4031J7858j1446k6095
8720F8095j7889J568J6778K0369J3056o33j1991j1600k621j155j0424r264J2167
$$ plain form
8809 -45674 -52158 -52629 -62080 -80020 -77823 -45802 -23676 -47246 -88451 -91725 -54538 -25524 -28858
8796 -28858 -37206 -24392 -3212 2656 -6554 -15047 -13418 -1336 15175 21752 5072 -29649 -59571
8783 -59571 -64319 -41023 -6554 10351 -6082 -34029 -34781 -7833 4626 -15128 -28226 -5155
8771 -5155 18888 2921 -23196 -4440 43323 55258 22549 57 11172 21405 13943 14802 27546
8758 27546 19506 -5474 933 38390 40017 -11711 -38048 7761 49483 6819 -65227 -56461 26271
8745 26271 75541 49202 11969 12567 22155 14817 18668 51000 75087 62987 43885 48317 53312
8732 53312 28248 -3627 1396 37116 57590 46593 35840 53747 87778 105636 94190 68095
8720 68095 50206 51774 68552 88921 101977 101344 89353 77753 75132 73977 63553 54289 66456
8707F6456K3599l606m1098l6729L930K4302P908J395L0250N3727L4674j67q644
8694A55997K840M053p362j6448k0614j7166M861L3633L5725J3707J2012L6108
8682B37346K9068k7994o2536k1547L1083J1126m7391m7898J3064N1023L3871J1127
8670B10342Q314m265k9068k5648M396P387k4628l2587O110L7926K9590J9968L5303
8657B43140L5848j617k5689L262L6966J9071j6714m060M4969O3577L3929n016
8645D27666k8966l8503k0082L0728O2500K0937n5392o9478m461M8180K2441l2004
8633C63566l5831J895J1724k2861m5798j9193K2273K7362J492q275J4349L2873
8621C43576J4009k2735l2395o421J9809J9090N230N119J9478K7556J9150N447
$$ plain form
8707 66456 90055 86449 45351 8622 12552 36854 44762 46157 76407 130134 164808 164641 155997
8694 155997 158837 162890 155528 139080 118466 101300 106161 139794 175519 189226 201238 237346
8682 237346 266414 238420 175884 154337 185420 196546 149155 101257 114321 165344 199215 210342
8670 210342 218656 214391 185323 159675 164071 171458 146830 114243 120353 158279 187869 207837 243140
8657 243140 278988 277371 251682 254944 291910 310981 294267 290207 335176 398753 432682 427666
8645 427666 398700 360197 340115 370843 433343 454280 398888 329410 324949 373129 395570 363566
8633 363566 327735 329630 341354 318493 272695 253502 275775 303137 304629 296354 310703 343576
8621 343576 357585 334850 302455 296034 315843 334933 340163 345282 364760 392316 411466 416913
8609D16913Q36N527R164P848J1634K8415M3597L3672N826m21L0719N9080M3165
8596F95975N140m29L1451N4966M9356M1057M3279L0057q412l4289j6035K3713
8584I15829M2993L3220J4238O299K5028P1247J09190R3500L6364L868K3683M6812
8572A422271L1191P234J4395K4313j1711p4556j00828p5066m2680m3030p4381
8561A077152j11655j21845q2619k0678k068m5813q5041o1404j4900j7493n7443
8550D56193o6198l2607q312j4452k2456k0057k1665j9764J540J4824j2898m4956
8538B09192k3321K1815J1005m2250m3835J6013L6069k3592o8907k9190L0409K9618
8526A23026O88N738J9142o485l4139j0132K5108N636l2340r840M5431L4937m1282
$$ plain form
8609 416913 417749 423276 432440 440288 451922 480337 523934 557606 563432 563011 593730 652810 695975
8596 695975 701115 700686 732137 787103 836459 877516 920795 950852 942440 908151 892116 915829
8584 915829 958822 992042 1006280 1012579 1037607 1108854 1218044 1311544 1347908 1351776 1375459 1422271
8572 1422271 1453462 1460696 1475091 1499404 1487693 1413137 1312309 1237243 1194563 1151533 1077152
8561 1077152 965497 843652 761033 740355 738287 692474 607433 546029 531129 513636 456193
8550 456193 389995 357388 349076 334624 312168 292111 270446 250682 252222 267046 254148 209192
8538 209192 185871 207686 218691 176441 132606 148619 184688 161096 92189 62999 93408 123026
8526 123026 123714 129452 148594 142109 107970 97838 122946 128582 96242 86402 131833 166770 125488
8513A25488p6567k5992L2818L1260n82j2118j1504k0651k1826J534K3226J7462
8501F2548K664N643J7014J3625m361k3387l5701l1574l763K5675J9430j7374l2678
8488b239k293L0814K0742j4367k5268l212K0342K6510K2529J2079j1463m0984
8476C3190n2575l3851K91K4781K7746J5440J862m005l728l812o622r435r317m463
8462b4498N235J3645J1003j608q482L02J3282J3817L088n385n077K305J4248K2711
8448E4586J4223j0489l0159l0864k3928k0690j1987O118J2273m926j7081J997
8436f0927K7242J8444j2507j8563R122L2943K9103J1146l563r774k880Q987m626
8423B4147m8476o4978o295P4101P6754j442o0285l8759J6589M2247L5262J4144
$$ plain form
8513 125488 48921 22929 55747 87007 86425 74307 62803 42152 20326 21860 45086 62548
8501 62548 65212 70855 87869 101494 97133 73746 38045 6471 2708 28383 47813 30439 -2239
8488 -2239 -4532 26282 47024 32657 7389 4177 24519 51029 73558 85637 74174 33190
8476 33190 -19385 -53236 -52945 -28164 -418 15022 16884 12879 9151 5339 -1283 -10718 -20035 -24498
8462 -24498 -19263 -5618 5385 3777 -4705 -4403 8879 22696 25784 20399 15322 17627 31875 54586
8448 54586 68809 58320 28161 -2703 -26631 -47321 -59308 -53190 -40917 -45843 -62924 -60927
8436 -60927 -33685 -15241 -27748 -46311 -37189 -4246 24857 36003 32440 22666 19786 28773 24147
8423 24147 -24329 -89307 -95602 -21501 55253 53811 -6474 -45233 -28644 13603 48865 63009
8411F3009j8912m3491k3080K2688K2110l4693o4582j9405L6666L4640M509K501
8399a8040J1148o647k0991P738M0349J9813k5373l0146l527K096p424O313K3235
8386a456J159k8729r681K5909N268m4058l0046L6551M8168j6034n2221q212L6973
8373c6409J8445j5237r881J791j3876j6717J9478L8966L887k6113K119L5935J2490
8360A4878k5512j0364K3876M334m6325n0686j0013J2978J1362K4963M1043J5118
8348E652k7408k1872J4521N079m6374n4858k241L2527J4105M881L9836N8518J6746
8335C9112l2332l2820j5181k1826k2797J6107M8787J9296l4618l7180L612J9098
8323e0742j4J600L5880M6208M019m2989m5139j7326j902o424q714K747J8934K5629
$$ plain form
8411 63009 44097 606 -22474 214 22324 -12369 -76951 -96356 -59690 -25050 -20541 -18040
8399 -18040 -6892 -13539 -34530 -26792 13557 33370 7997 -22149 -25676 -23580 -31004 -24691 -1456
8386 -1456 -297 -29026 -38707 -12798 -7530 -51588 -81634 -45083 3085 -12949 -65170 -73382 -36409
8373 -36409 -17964 -33201 -43082 -41291 -55167 -71884 -52406 -13440 -9553 -35666 -33547 2388 14878
8360 14878 -10634 -20998 2878 7212 -39113 -89799 -99812 -86834 -75472 -50509 -9466 5652
8348 5652 -21756 -43628 -29107 -24028 -70402 -125260 -127501 -94974 -80869 -75988 -36152 22366 39112
8335 39112 6780 -26040 -41221 -63047 -85844 -69737 -20950 -1654 -36272 -73452 -69840 -50742
8323 -50742 -50756 -49156 -13276 32932 36951 -6038 -51177 -68503 -70405 -76829 -85543 -82796 -63862 -38233
8309c8233J3760j2780l2112k2029J0960L4721K9238P836m584j677K840m534k1336
8296c7930l1089k0853K097J6680J3798O063O174Q015o19j7299k8509k5051n310
8283a13833K4234M2717K7251j3072l4502j1915K2290K0470j2361k7357m149K2959
8271e7268J8560o823k0009j1745J053N621M382L51r329k1051j9647K793K7948
8258h5164K6658j701k1042m512K5046K4660p350l1316k6111j1324k972R794K6529
8245g8805J9783j2813k4983Q494L9233J5028l2269l2667J1488L3342J0572q983
8233e2580L367J5278R4j9450k0429j6283j7424p647J3622J7372m3k278J8332J7799
8219e0270j8009l4455K46L0269L252l4545j3979L5255L1497k1929m4997j2917
$$ plain form
8309 -38233 -24473 -37253 -69365 -91394 -80434 -45713 -16475 -8639 -13223 -14900 -12060 -16594 -37930
8296 -37930 -69019 -89872 -87775 -71095 -57297 -51234 -45060 -37045 -37664 -54963 -83472 -108523 -113833
8283 -113833 -89599 -46882 -19631 -32703 -67205 -79120 -56830 -36360 -48721 -76078 -80227 -57268
8271 -57268 -38708 -45531 -65540 -77285 -76232 -70611 -66229 -65878 -75207 -96258 -115905 -113112 -85164
8258 -85164 -58506 -60207 -81249 -85761 -60715 -36055 -43405 -74721 -100832 -112156 -115128 -105334 -78805
8245 -78805 -59022 -71835 -96818 -88324 -49091 -34063 -66332 -98999 -87511 -54169 -43597 -52580
8233 -52580 -49213 -33935 -33841 -53291 -73720 -90003 -107427 -115074 -101452 -84080 -84123 -86401 -68069 -50270
8219 -50270 -68279 -102734 -102488 -72219 -68967 -103512 -117491 -82236 -50739 -72668 -117665 -130582
8207a30582J6993J1662K819Q449K069j6682m062M2352N6969O829m8565m5879p964
8194a05592O983l195j771J3777J3697p611k4120j8457J341J6212J0080j3729k2441
8181a34826J0136N2726M6103o564l5937j3016P677j3018k8877O319M9027L5251
8169b4999j1627k3316J416J0886j704J0J4336N878j9428k3392j0669j5828k6032
8156a24469k065L2031J5981l0277k2380M2360O5910Q849m2819k2061J4525j648
8144f6063l0333m757M0105K5314l4116n2215q668L1004K4356M77m514M031N403
8131f9976o572k4069k6643O109N5893O6016J5947l6512l1835O336J6222m904j2491
8118d6479R08K643j1850j5387p313j1952k2681r021K2019L1322J3934K183L982
$$ plain form
8207 -130582 -113589 -101927 -99108 -90659 -88590 -105272 -109334 -66982 -10013 -3184 -51749 -97628 -105592
8194 -105592 -98609 -101804 -103575 -89798 -76101 -83712 -107832 -126289 -124948 -108736 -98656 -112385 -134826
8181 -134826 -124690 -71964 -25861 -32425 -68362 -81378 -73701 -86719 -115596 -109277 -60250 -24999
8169 -24999 -36626 -59942 -58526 -47640 -49344 -49334 -34998 -29120 -48548 -71940 -82609 -98437 -124469
8156 -124469 -126534 -94503 -78522 -108799 -131179 -88819 -22909 -14060 -56879 -78940 -64415 -66063
8144 -66063 -96396 -101153 -61048 -35734 -69850 -122065 -130733 -99729 -75373 -74896 -79410 -75379 -69976
8131 -69976 -76548 -100617 -127260 -121151 -65258 758 16705 -19807 -51642 -45306 -29084 -33988 -46479
8118 -46479 -45571 -42928 -54778 -70165 -77478 -89430 -112111 -121132 -99113 -67791 -53857 -51674 -47692
8105d7692l021j6528r885J1073J2251n448q480K921l479k2028j3106J6409J3534
8092g3479k6159m3117j3331J6005J5416J5707L0372K1112j8033k8743Q432K6113
8080f9705j2476l6760J0920O2525L2375l2198k6893L1246L2998l4753o4509o069
8068a13299N4575L6983j5065j9284J5745K0966j6655m1416k0695J0782J0278r434
8056h6519l787L1853M9363J8398k2264j9412J0348O780k9194k9346K4797N7807
8044H824J8746l0366j2737L7900L5467j8228m5614k2265J020j789MJ9307K6153
8031A6422J1331M420J3365R868j1865k2246j2305l702K044K0528K8559j3404p3081
8018c0066o4072K2941Q7539N6770j6836m0679m512L3091L3640O255k0780k0867
$$ plain form
8105 -47692 -50713 -67241 -77126 -66053 -53802 -59250 -67730 -64809 -68288 -90316 -103422 -87013 -73479
8092 -73479 -99638 -142755 -156086 -140081 -124665 -108958 -78586 -57474 -75507 -104250 -95818 -69705
8080 -69705 -82181 -118941 -108021 -45496 -13121 -45319 -72212 -40966 -7968 -42721 -107230 -113299
8068 -113299 -58724 -21741 -36806 -56090 -40345 -19379 -36034 -77450 -98145 -87363 -77085 -86519
8056 -86519 -90306 -58453 -9090 9308 -12956 -32368 -22020 -15240 -44434 -73780 -48983 8824
8044 8824 27570 -2796 -15533 22367 57834 39606 -6008 -28273 -27253 -29042 -29038 -9731 16422
8031 16422 27753 32173 45538 55406 43541 21295 8990 5288 7332 27860 56419 43015 -30066
8018 -30066 -94138 -71197 16342 73112 56276 15597 11085 44176 77816 84071 63291 42424
8006D2424J1039M0417K7305j4916l7018k7990j5167J842M0255O1467Q567p2965
7994F5260o7501K7233P4401Q934n7883k5328L6226K3207k0738p77M7547K8570
7982A39151l0057k6808K6307L0642j1192k625N7102N9352j8467o5123k3130K4446
7970A59598R051j7778j076J7367p623l5218k1093N27q615j8011j414J302k9971
7957D7046l2897K8741P4626K5092n9694o6555l331K8274j2j9230N389K9012K0937
7944G7398Q999J1967P001j2821j5973P542K0491q97k6984k1647O633K4256J7281
7931A03246j086j0055R51K0464K1900k744k4446j2440K2406M2271K9614l379l8922
7918A47780o1205n3765j7619J9003L2426K9030J9136n081l6152l3807J2832M1579
$$ plain form
8006 42424 53463 93880 121185 106269 69251 41261 26094 27936 68191 129658 138225 65260
7994 65260 -2241 24992 99393 108327 50444 25116 61342 84549 63811 63034 110581 139151
7982 139151 109094 82286 108593 139235 128043 125418 182520 241872 223405 158282 135152 159598
7970 159598 168649 150871 149795 167162 159539 124321 103228 103755 95140 77129 75715 77017 47046
7957 47046 14149 42890 117516 142608 82914 16359 13028 41302 41290 22060 27449 56461 77398
7944 77398 86397 98364 105365 92544 76571 84113 104604 103707 76723 55076 61709 85965 103246
7931 103246 102160 92105 93056 113520 135420 132676 108230 95790 118196 160467 190081 186702 147780
7918 147780 86575 32810 15191 34194 66620 95650 114786 109705 73553 39746 52578 94157
7906I4157k366o9935o6824N403N0162K1455j7761p496K0121R593k4109k8599P28
7893a5471K5344K8109K2653J3951n215k5369k6181j0192p95o107r959j365Q314
7880b283M200j0194j8287j2288k948m518j2329o289J6362K6433N85l6163l5338
7867i3057O395L5812J3879k9912l7653M3L6130L2553O234j954J3316J6956j0170
7854a1428l4924j4940L4110M9130L398n4351o2906k1831K2172L6668K2416o858
7842c9344l0923k6656K585J7461n963l4830k4808J4685M1318M3494L5949J5124
7830H092k3833m5363j5918K4961J0619m1543m8329M656L8038J0308j8482M511
7818i2283L8702K8386o402j9746j7877k3387j8553Q953J7157k1758n2898j7072
$$ plain form
7906 94157 91791 21856 -44968 -39565 10597 32052 14291 6795 26916 36509 12400 -16199 -15471
7893 -15471 9873 37982 60635 74586 69371 44002 17821 7629 6834 727 -9232 -10597 -2283
7880 -2283 1917 -8277 -26564 -38852 -41800 -46318 -58647 -64936 -48574 -22141 -21556 -57719 -93057
7867 -93057 -86662 -50850 -36971 -66883 -104536 -104493 -68363 -35810 -29576 -31530 -18214 -1258 -11428
7854 -11428 -46352 -61292 -27182 21948 25346 -29005 -91911 -113742 -91570 -54902 -32486 -39344
7842 -39344 -70267 -96923 -94338 -76877 -82840 -117670 -142478 -127793 -86475 -42981 -7032 8092
7830 8092 -15741 -61104 -77022 -52061 -41442 -82985 -131314 -126658 -88620 -78312 -96794 -92283
7818 -92283 -53581 -25195 -31597 -51343 -69220 -92607 -111160 -102207 -85050 -106808 -159706 -176778
7806a76778M3664M3856j1851m0883j1607K5270K8649J1903n512k1233k1742N822
7794a30442L3046K1777p975m884K5521L0184L079o972J1534J2943j7793l5914
7782f5896j8968l700j2431j3929R118K2049N044p051Q284J7750j057j2446R153
7769f4080K5168K228k3132j0901O790j2471l3428N74N8730N8548o068n6005m2994
7756i7041O2K7709L2577J8731j3502m2031l4388K057K5012J8645O018r65j3087
7743g0203k1272R00L9642M2287l176m2119l2437j048Q358j538o095n872r062K43
7729a01392L2742N6859L4974j7410m8209l6355q717M909K281m590o845r51Q455
7716h4249R484K70k407J2598K8026J9150j0102l1286k6063J24L0996M8012L4555
$$ plain form
7806 -176778 -133114 -89258 -101109 -141992 -153599 -128329 -99680 -87777 -93289 -114522 -136264 -130442
7794 -130442 -97396 -75619 -83594 -88478 -62957 -32773 -29694 -36666 -25132 -12189 -29982 -65896
7782 -65896 -84864 -88564 -100995 -114924 -105806 -83757 -78713 -85764 -77480 -59730 -60787 -73233 -64080
7769 -64080 -38912 -36684 -59816 -70717 -63927 -76398 -109826 -109252 -50522 8026 1958 -54047 -97041
7756 -97041 -96979 -69270 -36693 -17962 -31464 -73495 -107883 -105826 -80814 -62169 -56151 -57116 -70203
7743 -70203 -91475 -90575 -50933 -8646 -11822 -53941 -86378 -87426 -79068 -80606 -86701 -92573 -101635 -101392
7729 -101392 -68650 -11791 23183 5773 -42436 -78791 -87508 -82599 -80318 -84908 -91753 -92704 -84249
7716 -84249 -74765 -74495 -76902 -64304 -36278 -17128 -27230 -58516 -84579 -84455 -53459 -5447 29108
7703B9108p110m7100n4214k7673R589L7425M2242J3127l7639o4580l5025K1141
7691a20709M3298J8621q874p201Q479J5772J4466K458k9930n9599l5704L8786
7679a20137P9217K6004n8607o6503N719N7002L0300j7484j6707J3947J3680k1362
7667g4931m1293k2018R197K1671J4974K900n904n920M804J6490J4976J025q712
7654g2741k219J4282K3787J5217n461j9447j5921o626p872j1512M779L6695N0704
7641C665L1693L488j3064k8890m9812m6716j027M7379M4577m82l0001j9475P27
7628e7938K582p466j6879k4107k0417N260L5354L5611O057j6806j5318r164j1812
7615i5043j1051l459n028j4467r069R477J0668r769j9869j0674q383r711K5360
$$ plain form
7703 29108 21998 -25102 -79316 -106989 -97400 -59975 -17733 -4606 -42245 -106825 -141850 -120709
7691 -120709 -77411 -58790 -67664 -74865 -66386 -50614 -36148 -33690 -63620 -123219 -158923 -120137
7679 -120137 -40920 -14916 -73523 -140026 -134307 -77305 -47005 -64489 -81196 -67249 -53569 -74931
7667 -74931 -116224 -138242 -129045 -107374 -92400 -89500 -95404 -101324 -96520 -80030 -65054 -64029 -72741
7654 -72741 -74960 -60678 -36891 -21674 -27135 -46582 -62503 -69129 -77001 -88513 -83734 -47039 3665
7641 3665 35358 38846 25782 -3108 -52920 -99636 -100663 -53284 -8707 -9189 -39190 -58665 -57938
7628 -57938 -55356 -62822 -79701 -103808 -124225 -118965 -83611 -48000 -41943 -58749 -74067 -83231 -95043
7615 -95043 -106094 -109553 -114581 -129048 -138117 -128640 -117972 -127741 -147610 -158284 -166667 -176378 -151018
7602a51018Q5034Q7816O177o6167m2691K4736L0247k2876m5650j6486R03j6374
7590a26349j7252J6442L1333J331k2605j514K7528K1709K894Q025K1291P914k2428
7577e1681l4243k1588n383K932M426K5k323Q919K2104R957k0857k7253K546K3762
7563h8657O836j2296N388L1835J6444k9514m9442k6213K357O794j615k796N405
7550a35474J7067K6985K6970J4165J313J436P682M239j0436k4918k8761j4755
7538a14487J6538M4308M1355J2053j0019j4410k7691n5890n7343q354M4482M4627
7526h4831P444q821J0107K9334K8447J6472m373l5404m9339j6629L6022M6290
7514b5281K253l9238l0686J0000L3821J8584j7865l8570j9227K2236L7550J0062
$$ plain form
7602 -151018 -65984 21832 28009 -38158 -80849 -56113 -25866 -48742 -94392 -110878 -109975 -126349
7590 -126349 -143601 -127159 -95826 -94495 -117100 -118614 -91086 -69377 -66483 -58458 -37167 -29253 -51681
7577 -51681 -85924 -107512 -112895 -109963 -105537 -105512 -107835 -98916 -76812 -66855 -87712 -114965 -112419 -88657
7563 -88657 -81821 -94117 -88729 -56894 -40450 -69964 -119406 -145619 -143262 -136468 -138083 -140879 -135474
7550 -135474 -118407 -91422 -64452 -50287 -48974 -47538 -39856 -35617 -46053 -70971 -99732 -114487
7538 -114487 -97949 -53641 -12286 -233 -10252 -24662 -52353 -108243 -165586 -173940 -129458 -84831
7526 -84831 -77387 -86208 -76101 -46767 -18320 -1848 -6221 -41625 -90964 -107593 -71571 -25281
7514 -25281 -23028 -62266 -92952 -82952 -49131 -30547 -48412 -86982 -106209 -83973 -46423 -36361
7502c6361j7763q463J1070m54k3621j4983J0199O569j1714L523L2328R557m8386
7489h8499m9865J7101N1103K840l9594J78N7795M0824j7143k4804R922J0876k1024
7476e0290j7597K0539K1344k1116k5146L4790O9508J1404p4432q0159k125O5470
7464d7810N4980q313n2417l6036J7155M6097J9296k7158l5750l003K4005K0744
7452b8210R463N810o807l0939l2842K757L7172L2948R355L046M456j8146n1138
7439f3075m6244L041M3555L2431j0669l6878k7287p49J9290K5237J8891K010k0803
7426f1250l5014k1359K1673O0630M9376j6362p7131o6131J0342P1118N1089k2973
7414c5992o6739l9111J7010L7659J4361j1608j3252m638m233l458J1956L0709
$$ plain form
7502 -36361 -54124 -62587 -51517 -51971 -75592 -90575 -80376 -73807 -85521 -81998 -49670 -40113 -88499
7489 -88499 -138364 -121263 -70160 -67320 -106914 -106736 -48941 -8117 -25260 -50064 -40142 -29266 -50290
7476 -50290 -67887 -47348 -26004 -47120 -72266 -37476 32032 43436 -30996 -111155 -113280 -47810
7464 -47810 7170 -1143 -53560 -89596 -72441 -26344 -7048 -34206 -69956 -72959 -48954 -28210
7452 -28210 -18747 -12937 -19744 -50683 -83525 -80768 -43596 -10648 -1293 1753 6209 -11937 -63075
7439 -63075 -109319 -106278 -62723 -30292 -40961 -77839 -105126 -105875 -86585 -61348 -42457 -40447 -61250
7426 -61250 -96264 -117623 -95950 -35320 14056 -2306 -79437 -145568 -135226 -64108 -13019 -35992
7414 -35992 -102731 -141842 -124832 -87173 -72812 -84420 -97672 -102310 -106543 -110001 -98045 -67336
7402f7336K9449Q341q802p767J529N236L597L283M097J624k709j058J0704K2982
7388C170J6415j5023m4624l4301J3632M5205J9008l2132l8439R949M5312J7283
7376E455l5255m2850o952R118j7595l6392r770K2687J1053j6334M173N8555O2562
7363H455o958o5498m4028Q976R520l0855l5406P869L5694K0915N825J3992J2983
7350e8516j1777k4635j2100j1786l2931k6619J8932L6607m282k5710L2146Q9697
7338c0974M1865o5312r6113k9313K8765K3638J2858L4223M1133O164k0746n002
7326e8814J4981R302Q644K7331K0309k8579n7234k5052J4130M158k0736o730K3273
7313g5017K2042P109J5697K3745m807l4837j5160K3943K0340q983m325J9377j061
$$ plain form
7402 -67336 -37887 -29546 -38348 -46115 -44586 -39350 -35753 -32470 -28373 -26749 -29458 -30516 -19812 3170
7388 3170 19585 4562 -40062 -74363 -60731 -15526 3482 -28650 -67089 -57140 -11828 5455
7376 5455 -29800 -72650 -79602 -70484 -88079 -124471 -134241 -111554 -100501 -116835 -112662 -54107 8455
7363 8455 1497 -64001 -108029 -99053 -89533 -120388 -155794 -147925 -112231 -91316 -85491 -71499 -58516
7350 -58516 -70293 -94928 -107028 -118814 -151745 -178364 -159432 -122825 -127107 -152817 -120671 -30974
7338 -30974 10891 -54421 -150534 -179847 -151082 -127444 -114586 -80363 -39230 -33066 -53812 -58814
7326 -58814 -43833 -34531 -25887 1444 21753 -6826 -64060 -89112 -74982 -70824 -91560 -98290 -75017
7313 -75017 -52975 -45866 -30169 -6424 -11231 -46068 -61228 -37285 -16945 -25928 -30253 -10876 -11937
7300a1937n0322m7952R807L4287r577m7216k0073K7098L2455J0964P363J8309
7288d6794J6998P585N142k6j5366j8936J906J8348L842k1165k4306j1875p655
7275i2302o662J1511L9980M9648K8929m780k5942k0859Q95R631j1208l5536k7617
7262h4312j347j967k5671j7293L1991N2073K309m9584k2480M9735O4551L281m7394
7249d6108k8575J6090K4163O205R307L3772L9711J6729l832m969q274k9185m4141
7236a9107k8431j387K216p646J0194N2306N9954P459m6290l6700J2634K8738j876
7223C2064k4822r517J4381J7908J1794J0112N323l983n117l675j8351l4635j7507
7210b6025J8184J3583l6028n7851j2496L9197L0516j0800j8280P162J6000m74
$$ plain form
7300 -11937 -62259 -110211 -100404 -66117 -75694 -122910 -142983 -115885 -83430 -72466 -65103 -46794
7288 -46794 -29796 -22211 -17069 -17095 -32461 -51397 -49491 -31143 -27301 -48466 -72772 -84647 -92302
7275 -92302 -98964 -87453 -47473 2175 31104 26324 382 -20477 -19582 -9951 -21159 -56695 -84312
7262 -84312 -85659 -87626 -113297 -130590 -98599 -46526 -44217 -93801 -116281 -66546 -1995 1286 -46108
7249 -46108 -74683 -58593 -34430 -28225 -18918 14854 54565 71294 67462 62493 54219 25034 -19107
7236 -19107 -47538 -48925 -46709 -54355 -44161 8145 68099 75558 29268 -7432 5202 33940 32064
7223 32064 7242 -2275 12106 30014 41808 51920 57243 53260 48143 44468 26117 -8518 -26025
7210 -26025 -7841 5742 -30286 -88137 -100633 -61436 -30920 -41720 -60000 -52838 -36838 -37312
7198c7312r293k713k953j3194j6198r451M47J8453L7686K6833j4993l0440J3659
7185c9469N8461L6310j8525k5571Q075P407l3633m1495N618L9468J8155j3401
7173A400j3265p361k2218k8662k059K4194J5181q103j3434j0847j7613j6333O568
7160i2552K2612P534j1039L038L5068M4958K4226p795l5753m5271k1070K1299
7148e4745L7490J6895Q26R079L536l2756m3038J2141O7326L9467l6438n4022J664
7135c2575L8911J0356k0825M268M5685L6746j0430l1948j0083J2097J321k4995
7123A8528l0646o433K3007K8123P247j0951l456J5374J4643m623p416K1932M9354
7110A14683L2888j8708n1400l0556J6524L3967O906k0537n993L0416L2525j0486
$$ plain form
7198 -37312 -46605 -49318 -52271 -65465 -81663 -91114 -90667 -72214 -34528 -7695 -22688 -53128 -39469
7185 -39469 18992 55302 36777 11206 19281 26688 -6945 -48440 -42822 -3354 14801 1400
7173 1400 -11865 -19226 -41444 -70106 -72165 -47971 -32790 -40893 -54327 -65174 -82787 -99120 -92552
7160 -92552 -69940 -62406 -73445 -70407 -35339 9619 33845 26050 -9703 -54974 -76044 -54745
7148 -54745 -17255 -360 466 9545 13081 -19675 -62713 -50572 16754 56221 19783 -34239 -32575
7135 -32575 6336 16692 -4133 135 45820 82566 72136 40188 30105 42202 43523 18528
7123 18528 -12118 -18551 4456 32579 39826 28875 25419 40793 55436 50813 43397 65329 114683
7110 114683 147571 128863 77463 46907 63431 97398 104304 83767 77774 108190 140715 130229
7098A30229m4761k5150K4205M5520K0904j5009k1686Q962M9002N5055R500m7024
7086A89747n0579K809M3890K5996p418N733M6049M6706M328j7935M035K0545l353
7073C10553l0778j8289J3582J8575j404o567J4359L0434J9163j146J618L0508
7061C80608N4767M6977J9711J5724N6195J10631J32808J17222R9423J04675J18714
7050A257455J11358P0599R637m6884q2032j00523j19396j39114j38559j09809
7040G12732p7599o5999o7705o8206p2936q0276n9842j933M0846J8970k8512k2072
7028B27468L4706N6081N485n1310m8699p949J4116N957r104j8617j8512k567J4860
7015B01915L382l0303l7726m148K1613O542j2465J444J6426p760l9472k6623P431
$$ plain form
7098 130229 85468 60318 84523 130043 150947 135938 114252 123214 172216 227271 236771 189747
7086 189747 139168 141977 185867 211863 204445 210178 256227 302933 307261 289326 293361 313906 310553
7073 310553 279775 261486 275068 293643 292239 285672 300031 330465 349628 348482 350100 380608
7061 380608 435375 482352 502063 517787 573982 684613 817421 934643 1034066 1138741 1257455
7050 1257455 1368813 1439412 1449049 1402165 1320133 1219610 1100214 961100 822541 712732
7040 712732 635133 569134 501429 433223 360287 280011 220169 218236 259082 278052 249540 227468
7028 227468 262174 318255 323740 272430 223731 215782 229898 235855 226751 208134 189622 187055 201915
7015 201915 205297 174994 137268 133120 154733 161275 148810 150254 166680 158920 119448 92825 100256
7002A00256o42m2615m6109O535M5959K1616k5682k9522J0127L7578J8849k2514
6990G3836l8383q191L9591N5202K0423l1587n4239l3305J1865N2628O3795L6000
6978A87635n269j6107J0231L0692J7059j568P483K2101N859k5456l0998j3616
6966A88046n081l336J4641L3496J8834j3691j6953M485K072k4930k4634Q286J2872
6953A94107k9679n0222j352N8765N2503l219l4513k0339K448J4411K5868K8932
6941B37710J510m1210n2418j8288K2468L0178M850k7782m4327l6364j6572j0047
6929D9708k2209k6566n314J5891N428j8678j2903J9949L1426M373j9760p766J5249
6916B8828J1044j1479j7015j671Q091J681o795j0287j4662j3976M800K8469K6467
$$ plain form
7002 100256 99614 56999 10890 17425 63384 85000 59318 29796 39923 77501 96350 73836
6990 73836 35453 27262 66853 122055 142478 110891 56652 23347 35212 87840 151635 187635
6978 187635 182366 166259 176490 207182 224241 222673 230156 252257 258116 232660 201662 188046
6966 188046 182965 179629 194270 227766 246600 232909 215956 220441 222513 197583 172949 181235 194107
6953 194107 164428 114206 112854 171619 224122 220903 186390 166051 168499 182910 208778 237710
6941 237710 239220 198010 145592 127304 149772 179950 184800 157018 112691 76327 59755 49708
6929 49708 27499 933 -4381 11510 16938 -1740 -14643 5306 36732 41105 21345 13579 28828
6916 28828 39872 28393 11378 9707 17798 19479 12684 2397 -12265 -26241 -21441 7028 33495
6903C3495L603L350L6889N1326P297m7968m0484J8135M2981j446n6447o1070k6917
6890c7256M674K2522K7578P729k6111k6282K0352N2153J9887k8819j9978K7731
6878D4180L4364j3126n0341m6065l6382m1328l1941J07J8216J3387K8450P6176
6866d303J00947O3405M858j6991p059m559j8972l4805m2719l2314P456N2260N1563
6853A18767K802l3075k0482K612K97k166J7631K2980j1225l2589R226O8352O9613
6840B12743K7546J2647L2177L5129J3333N712J3839L033j7651m961K8958K5913
6828C88418j2390j8813K1664M0121N37l7461j8042K2131J9836j6324l0798o156
6816C52723K6967L9214K3905q305k8767j0077L2392M7961J9342j1570q722P262
$$ plain form
6903 33495 37098 40448 77337 128663 135960 87992 47508 65643 108624 107178 50731 -10339 -37256
6890 -37256 -32582 -10060 17518 25247 -864 -27146 -6794 45359 65246 36427 16449 44180
6878 44180 78544 65418 15077 -30988 -67370 -108698 -140639 -140532 -122316 -108929 -80479 -4303
6866 -4303 96644 160049 164907 147916 140857 136298 117326 82521 39802 7488 14944 67204 118767
6853 118767 121569 88494 68012 70624 70921 68755 86386 109366 98141 65552 74778 143130 212743
6840 212743 240289 252936 285113 320242 333575 339287 353126 356159 338508 333547 362505 388418
6828 388418 376028 357215 378879 419000 419537 382076 364034 386165 406001 389677 358879 352723
6816 352723 379690 418904 442809 434504 405737 395660 428052 476013 495355 483785 475063 482325
6804D82325L149j1149r394M28m063j2342J097K4834K1933q462k2585M597M0441
6791E10809L9619P735p753J4236L9886L3710J1410O826P895k0647n6213l1149
6779E56364N3082J01694O3565J6855M4787R4388O1253l1599o2163j309M9686K5294
6767I71897k0679k9879k6106l7714l2212R932L9310K0744R64K6806N9253L8492
6755A020808j8099n0559m4827k4628L499L7003M7628K2461m56J1689L4439L9032
6743A077990M8450Q2737R9153N6794k524j3662P953J538k9290k7768J0634K9589
6731A341594R014n221K0195N9462P4541O2648M5046L9894M7956M4398R49o1743
6719A678733p7033k1636L7789L4091n076j0174J9394K8205M010r506J1078M3525
$$ plain form
6804 482325 485474 474325 464931 465359 461296 448954 450051 474885 496818 488356 465771 470368 510809
6791 510809 550428 558163 550410 564646 604532 638242 649652 656478 664373 643726 587513 556364
6779 556364 609446 711140 774705 791560 836347 930735 991988 960389 898226 896917 946603 971897
6767 971897 951218 921339 895233 857519 825307 835239 874549 895293 896257 923063 982316 1020808
6755 1020808 1002709 952150 907323 882695 886194 923197 970825 993286 992830 1004519 1038958 1077990
6743 1077990 1126440 1209177 1308330 1365124 1362600 1348938 1356891 1358429 1329139 1301371 1312005 1341594
6731 1341594 1350608 1345387 1365582 1425044 1499585 1562233 1607279 1647173 1695129 1739527 1740476 1678733
6719 1678733 1601700 1580064 1617853 1651944 1646868 1636694 1656088 1684293 1688303 1678797 1689875 1733400
6707A733400O3640O1440K8577j8306k3781L8965J09791J12310O0029K6583L3290
6696B225938L8697K2957P879J681q027j4270n282m289l3408n8962l7018J1923
6684B147819M0044M9986O2215M8503j1860n3932j2262N4962M7497n252P187P7100
6672B452007Q4679Q109l4497J4645O5965M9315K5131N8656J07760J15903J12999
6661C060672J44143J82877J86671J67834J53914J44495J45282J71318J90685J52574
6651D700465R2371J04666J85820K20949J64691J10483J29461J65519J53689J25100
6641F153214J25483J37854J50013J91653K46290K39142J70438J45015K13493L02936
6631H075531L53695L94101M33803M29191M02127M34460N01933M96002M53714N46531
$$ plain form
6707 1733400 1797040 1858480 1887057 1868751 1844970 1883935 1993726 2106036 2166065 2192648 2225938
6696 2225938 2264635 2287592 2295471 2297152 2289125 2274855 2269573 2265284 2231876 2172914 2135896 2147819
6684 2147819 2187863 2237849 2300064 2348567 2336707 2282775 2270513 2325475 2372972 2367720 2374907 2452007
6672 2452007 2536686 2544795 2510298 2524943 2590908 2640223 2665354 2724010 2831770 2947673 3060672
6661 3060672 3204815 3387692 3574363 3742197 3896111 4040606 4185888 4357206 4547891 4700465
6651 4700465 4792836 4897502 5083322 5304271 5468962 5579445 5708906 5874425 6028114 6153214
6641 6153214 6278697 6416551 6566564 6758217 7004507 7243649 7414087 7559102 7772595 8075531
6631 8075531 8429226 8823327 9257130 9686321 10088448 10522908 11024841 11520843 11974557 12521088
6621A2521088P76539R31288R32506R59981J106531J204970J168842J204730J462771
6612B2269246J749309J819848J689825J431963R85983M45211J86784L75433O75893
6603C1629495Q28982J130750J877705K735464L249857L644789M443414N582988
6595E5123444O632014P630747Q917248J0350763J1616113J3152414J5863676K0102757
6587A49389176K5831134L2955035L9415042L9291464K6334485J643001k4130364
6580B90728973l9091569m0327642l4254903k8014727k3374373j8860319j4234169
6573I2571271j0743859q766605p461929o278170n333162m579778l750363l002771
6565D2654634k725472k784389k670493k270655j854541j454222r17873m78127
$$ plain form
6621 12521088 13297627 14228915 15161421 16121402 17227933 18432903 19601745 20806475 22269246
6612 22269246 24018555 25838403 27528228 28960191 29946174 30391385 30578169 30953602 31629495
6603 31629495 32458477 33589227 35466932 38202396 41452253 45097042 49540456 55123444
6595 55123444 61755458 69386205 78303453 88654216 100270329 113422743 129286419 149389176
6587 149389176 175220310 208175345 247590387 286881851 313216336 314859337 290728973
6580 290728973 251637404 211309762 177054859 149040132 125665759 106805440 92571271
6573 92571271 81827412 73060807 65598878 59320708 53987546 49407768 45657405 42654634
6565 42654634 39929162 37144773 34474280 32203625 30349084 28894862 27976989 27498862
6557B7498862n96823j223088j774112j905520j807173j693751j498735j184576
6549A5815084r21915q02454p03439n60309m85264n18302n32485m75801m55039
6540A0360076n01531m96284m02508l39195l51399l34364k58098k41753l22526
6531G112418l66715l01162k30845k34034k35802j84240j64537k26346k68235k11459
6521D689043j38380j42919j78877j68112j35269j26739j09462n4895k0320m7836
6511C566234p7197m9145m139M155R44J6952J7713j5021k6626O774J6202l6802
6499C420044p7426m9746k7574q5670j56273j37395o6048n1877r5472j05684o2759
6488B504120l7011n8828q2049p6714o5292o1638m9801k8562j7611k1110l2536
$$ plain form
6557 27498862 26902039 25678951 23904839 21999319 20192146 18498395 16999660 15815084
6549 15815084 14893169 14090715 13387276 12826967 12341703 11823401 11290916 10815115 10360076
6540 10360076 9858545 9362261 8959753 8620558 8269159 7934795 7676697 7434944 7112418
6531 7112418 6745703 6444541 6213696 5979662 5743860 5559620 5395083 5168737 4900502 4689043
6521 4689043 4550663 4407744 4228867 4060755 3925486 3798747 3689285 3634390 3614070 3566234
6511 3566234 3489037 3439892 3435753 3439908 3440852 3457804 3475517 3460496 3433870 3440644 3456846 3420044
6499 3420044 3342618 3292872 3265298 3179628 3023355 2885960 2819912 2768035 2672563 2566879 2504120
6488 2504120 2467109 2408281 2326232 2249518 2184226 2122588 2072787 2044225 2026614 2005504 1972968
6477A972968o0861j04446j21740q1239k0209j385k9797o0758o9071o1363m0194
6466A321905m828K6784L5559K4223k928n0049r3086q2287k0873J2376k9614q5520
6454A051662p6296k0486J1063P320L584l699l9624p5838o3453k4860k4873o0011
6442F84489o4364k3066Q779O922R850L2284L0975j2086m5472k7757O701L535l3927
6429E76863o1725n6950k8976M910K6973K2888P81r926N398K7702L3319K4629J8168
6416E84054J5275K70l3085o2180n4043j1572J3930j5152n8224m1486K9758O6175
6404D33720K4054l0004k8686p941l2489p7472p3488k9055j0895k4960j6458K0141
6392A46467L0878P426O196M5493P3202O0682M4019M3571K5634k0332m5895k7112
$$ plain form
6477 1972968 1912107 1807661 1685921 1604682 1584473 1583088 1553291 1492533 1423462 1362099 1321905
6466 1321905 1317077 1343861 1379420 1403643 1400715 1350666 1257580 1175293 1154420 1166796 1137182 1051662
6454 1051662 975366 954880 965943 973263 976847 973148 933524 857686 794233 769373 744500 684489
6442 684489 620125 597059 605838 612760 622610 654894 685869 673783 628311 600554 607255 610790 576863
6429 576863 515138 458188 429212 434122 461095 483983 484764 474838 480236 507938 541257 565886 584054
6416 584054 599329 599599 566514 504334 450291 438719 452649 437497 379273 337787 367545 433720
6404 433720 457774 427770 399084 391143 358654 281182 207694 178639 167744 142784 126326 146467
6392 146467 177345 184771 190967 236460 309662 370344 414363 457934 483568 463236 417341 390229
6380C90229r585k4240l0148N773M0441K7730p62L409J6043j2073n7030n2772o3
6367B96952L2613J2787j8703k0402l641J537q972k1690l0633l5846l0789n468
6355A67745L7139P0964O3769J6510k5715k5466l905n995k8074l0368j4328k0699
6343B01577m3830k6548L3400N5511K897m4248j0681M9694L9875k4626m8476j1918
6331A72627J4462N24m449K4021L9645J4186q642J2166N0136O0917M4535K1796
6319D41924l950k6094k1419M609L007m4492p6704l2825M8139P0593J4071m2230
6307C34629l5566o46k978l5720l5247J5411N5721L6851l998P55M4651N4072N13
6294D28448n2026l9347J0074K0012k4595o6501o3053l2173p296P180J8800K0710
$$ plain form
6380 390229 380644 356404 326256 332029 372470 400200 399438 402847 418890 406817 349787 297015 296952
6367 296952 329565 342352 323649 303247 299606 301143 292171 270481 239848 204002 173213 167745
6355 167745 204884 275848 339617 356127 330412 304946 301041 295046 266972 236604 222276 201577
6343 201577 157747 131199 164599 220110 223007 178759 168078 217772 257647 233021 184545 172627
6331 172627 187089 187613 183164 207185 246830 261016 252374 264540 314676 375593 420128 441924
6319 441924 437974 411880 390461 395070 398077 353585 276881 244056 292195 362788 376859 334629
6307 334629 299063 298417 295439 259719 224472 239883 295604 332455 328457 329212 373863 427935 428448
6294 428448 376422 337075 347149 367161 342566 276065 213012 180839 173543 180723 199523 220233
6282B20233O311r838p196J2762K6768J5256j6617m1882l8433j4633J242m22j230
6269A52321Q081Q409j0504k2727o577J3752N734j4512q244K0547L6814L7309M3159
6256B63562L9131r019p2192p1711m25M6487N465n9235n3876O434L3795O027j5633
6243A18810K896K2283P658j5802j3914J401K052r026j5655k4055m3265n1466k3630
6230d1713J7747K3037j2091l7024k0818N149L454r369Q23J8787L565l3697l7292
6217a19442K328K7224K752k8870k0368Q193J4660N939Q995J0276j2114k7309M929
6204a22807N0285L7672k6723o2486l5141N500J8030J9982K4312O702k8788k8006
6192a41468K3413N7316K3494k9201l1649K069J6914J3530K6636M3168K3425j5911
$$ plain form
6282 220233 226544 216706 209510 222272 249040 264296 247679 205797 167364 152731 153973 153551 152321
6269 152321 160402 168811 158307 135580 129003 142755 148489 133977 125733 146280 183094 220403 263562
6256 263562 302693 293674 221482 149771 149346 195833 201298 142063 88187 94621 128416 134443 118810
6243 118810 121706 143989 151647 135845 121931 123332 125384 116358 100703 76648 33383 -18083 -41713
6230 -41713 -23966 -929 -13020 -50044 -70862 -65713 -62259 -71628 -70805 -52018 -48453 -82150 -119442
6217 -119442 -117114 -89890 -87138 -116008 -136376 -128183 -113523 -107584 -98589 -88313 -100427 -127736 -122807
6204 -122807 -72522 -34850 -61573 -124059 -159200 -153700 -135670 -115688 -91376 -84674 -113462 -141468
6192 -141468 -118055 -60739 -37245 -66446 -98095 -96026 -79112 -65582 -38946 4222 27647 11736
6180A1736j8971J5781L2751J1950m897O955J4695r361l6646k7611O228K0148n27
6167B2231k4064j7756Q755J6457q856l2358j7364J7773K4854K181l171K2520L3020
6154D4222K896k3846o804K2539J6478j1514k0511j0582m26J8705M4249K8084m2495
6141F0995q1322j6970P4684O7007j8320m2523K7204P3125L0475j2771K0617O7878
6129B50079M7845R16L518K8501M906m1955k6129N4273J13828J10202Q7283Q8575
6117G21842J05227J17618J24438J18315Q1195J5600n1822r8999j17833j09351
6107I06230r4611j06411j40423j46098j02051o0613o7716q0968l6304L6264M7607
6096A54906j1942n5851l1908J0479Q295k7060m5957l5556j9818j4613j4477r164
$$ plain form
6180 11736 -7235 8546 41297 53247 48350 55305 70000 60639 23993 -3618 2610 22758 22231
6167 22231 -1833 -19589 -10834 5623 -3233 -35591 -52955 -35182 -10328 -8147 -11318 11202 44222
6154 44222 47118 23272 16468 39007 55485 43971 23460 12878 12452 31157 75406 103490 60995
6141 60995 -20327 -37297 37387 104394 86074 43551 70755 143880 174355 161584 182201 250079
6129 250079 297924 298840 302358 330859 335765 293810 267681 321954 435782 545984 633267 721842
6117 721842 827069 944687 1069125 1187440 1268635 1284235 1232413 1133414 1015581 906230
6107 906230 811619 705208 564785 418687 316636 256023 188307 107339 71035 107299 154906
6096 154906 142964 87113 55205 65684 73979 46919 962 -34594 -54412 -69025 -83502 -92666
6084i2666L194J0419m270l2085l3551P348M3467K3058k7461l5777P409L6848J7891
6071g6176n236Q438K8803J0216l1705m5560j7609K1248M2330L8482J1513k7694
6059d2950n3309m3202m095L1699L2992l554m2250l4112K3634O6606L7594k8473
6047e9420m3854P657M6528J6243l5271l2384J8902N0178K9905p945k2374j0178
6035d2013O468Q995k356r838m26J1431K956j4844p885K1280K8090j643k1745R17
6021b0613K8835J2585l0741m7201k5538K977K1553L3755L0010p5l2356l2569p882
6008f7260Q759J3238K2936K8814R037j7666j0936J9026J8634k1112m4229j6650
5996e7409K1942K1577q819k8136k2026k226K2794M2757L4253j1087n9049o2058
$$ plain form
6084 -92666 -89472 -79053 -83323 -115408 -148959 -141611 -98144 -75086 -102547 -138324 -130915 -94067 -76176
6071 -76176 -81412 -72974 -44171 -33955 -65660 -111220 -128829 -107581 -65251 -26769 -15256 -42950
6059 -42950 -96259 -139461 -143556 -111857 -78865 -82419 -124669 -158781 -135147 -68541 -30947 -59420
6047 -59420 -103274 -95617 -49089 -32846 -68117 -100501 -81599 -31421 -1516 -9461 -31835 -42013
6035 -42013 -35545 -26550 -28906 -38744 -39170 -27739 -24783 -39627 -47512 -26232 1858 215 -21530 -20613
6021 -20613 8222 20807 -9934 -57135 -82673 -79696 -58143 -24388 5622 5547 -26809 -59378 -67260
6008 -67260 -58501 -45263 -22327 6487 15524 -2142 -13078 5948 24582 3470 -40759 -57409
5996 -57409 -35467 -13890 -22709 -50845 -72871 -75097 -52303 -9546 24707 13620 -45429 -107487
5984a07487j3088M5674O4995L2706j6862l5023r442K1797K0708M54k122Q741m368
5971F683m0417m9345r366L4230L4695O180j1547j3265j5116j2106P862K7476J9666
5958a4370p310k0868j2485k935n459j3307j9280k1317j3287N752J8741J0148p827
5945a03804j1216L9N197l975j4801j4004J738K7791M7244L7693K263k2360j2760
5932f0955N590l50j5617m100K5093K8175j581k4707k1742j6807k3911k1427j25
5919a32464J1951O7n730J6973L8842K6993L482R152L3411L0898m472l2197k9607
5906c2701j7217j4267j1411r21K476r193j5369K114K5495K3162m207k2257p914
5893h2210K0489K5416l540l4742l1548P72K0406N820j3420j186K8038K9326j676
$$ plain form
5984 -107487 -120575 -74901 -9906 22800 5938 -29085 -38527 -16730 3978 4432 2310 11051 6683
5971 6683 -33734 -83079 -92445 -58215 -23520 -17340 -28887 -42152 -57268 -69374 -61512 -34036 -14370
5958 -14370 -21680 -42548 -55033 -57968 -63427 -76734 -96014 -117331 -130618 -124866 -106125 -95977 -103804
5945 -103804 -115020 -114981 -109784 -113759 -128560 -142564 -140826 -113035 -65791 -28098 -25835 -48195 -60955
5932 -60955 -55365 -55715 -71332 -75432 -50339 -22164 -23745 -48452 -70194 -87001 -110912 -132339 -132464
5919 -132464 -120513 -120446 -126176 -109203 -70361 -43368 -39886 -30734 2677 33575 29103 -3094 -32701
5906 -32701 -49918 -64185 -75596 -76517 -74041 -83234 -98603 -96489 -70994 -47832 -52039 -74296 -82210
5893 -82210 -61721 -36305 -39845 -74587 -106135 -105363 -84957 -79137 -92557 -93743 -65705 -36379 -38055
5880c8055j8524M839L1606J6905k3948l7887r595K3398K8401J4475M063j145r216
5867a4683j4899q887J249p16j4262k0779q626J1449J9353Q350q670j4691q145
5854g3957k543m343n85J9526L8778K9849j044j5825N67J6251L136j7621j3081
5841b0892K468r257m0205m1270j924K7446J1018k1089k4363k794J3321J7648J7221
5828g2672K211k8577l6986P790O7735P6305L1936n938j1146j6200l4523k8195
5816d8260J6662M6480J8542k7917l2539o230k857k6862l3941j0450J1307J5388
5804h0677K0531L0163J9961j1151k8427j7317m634m273P936L7416M0828m374m5208
5791c9226k4190K6651K8368k3431n0820j3000L5013L0052r710k5405p154Q528
$$ plain form
5880 -38055 -56579 -51740 -20134 -3229 -27177 -65064 -74659 -51261 -22860 -8385 -4322 -5467 -14683
5867 -14683 -29582 -38469 -37220 -37936 -52198 -72977 -81603 -70154 -50801 -42451 -51121 -65812 -73957
5854 -73957 -76500 -80843 -81428 -61902 -23124 6725 5681 -10144 -9577 6674 9810 -7811 -20892
5841 -20892 -18424 -27681 -67886 -109156 -111080 -83634 -72616 -93705 -118068 -120862 -107541 -89893 -72672
5828 -72672 -70461 -99038 -136024 -128234 -60499 15806 47742 41804 30658 14458 -20065 -48260
5816 -48260 -31598 14882 33424 5507 -27032 -33262 -36119 -62981 -96922 -107372 -96065 -80677
5804 -80677 -60146 -29983 -10022 -21173 -49600 -66917 -71551 -75824 -67888 -30472 10356 5982 -39226
5791 -39226 -63416 -36765 -8397 -31828 -82648 -95648 -60635 -30583 -40293 -65698 -72852 -64324
5779f4324Q222J2709K2435O638l6885n7258j8695L7072L9226j3454m8266j9228
5767a31808L1641L8959N929j0222J0599K5335J568k8860j9816J6491K7917P91
5755c1476k3505j4394N601L515j0742m988J8524K3610l507l1785l0622j0832j008
5742a11609l134J732J4455J6086N594P575L0067M2275J6334k7759m5093k3306
5730g6783Q413K1855J5715J206j2131j3694J086J6234R390j5501l1131k4666q317
5717a08324Q432K5765L0009L449l1459k4020K6347N2901J7493k6042j4891K1701
5705a8639J2656l4777m5930K23M1511L0907q894m2494o2554n5674j133O8026P5770
5692d1002J3341l1934m869L2677P301m3789l8346J4275L5403O220j8169j0326
$$ plain form
5779 -64324 -56102 -43393 -20958 -14320 -51205 -108463 -127158 -90086 -50860 -64314 -112580 -131808
5767 -131808 -100167 -61208 -55279 -65501 -54902 -29567 -27999 -56859 -76675 -60184 -32267 -31476
5755 -31476 -54981 -69375 -63774 -60259 -71001 -75989 -57465 -33855 -37362 -69147 -99769 -110601 -111609
5742 -111609 -114743 -113011 -98556 -82470 -76876 -69301 -39234 3041 19375 -8384 -53477 -76783
5730 -76783 -68370 -46515 -30800 -29594 -41725 -55419 -54333 -38099 -28709 -44210 -75341 -100007 -108324
5717 -108324 -99892 -74127 -44118 -40669 -72128 -96148 -69801 -16900 593 -25449 -40340 -18639
5705 -18639 -5983 -40760 -86690 -86467 -44956 -14049 -22943 -65437 -127991 -183665 -184798 -116772 -41002
5692 -41002 -27661 -59595 -64464 -31787 -24486 -68275 -106621 -92346 -56943 -50723 -68892 -79218
5680g9218J364K742J0111J4956q185l4304j0100M6494N4590j940m2719j8952J4042
5667e1119r18l0526k2384K880K223o779R405K2970l945l0854M952O8242O1389
5654B5536k2285p8037m2119K2612L1087n886k0391N222K7936J7354j0583k7712
5642g7266k5779j1733N523J6424J1215j0533l0405k0602K2769N8285L6683l0121
5630e5540o8698l7883Q839k194n0869m4672M3958J23482R6452j3504q8574n6058
5618a45261L3423P2191K0193n5278o7756j7684K0631R903n266J6540M2058K4652
5606e1654j1281j3186P336K074j7278J691M4490L7301k6089o0727k2774K4903
5594h5194K0702o982j0856n568j5495j2870K2192M2635R744k8943j5234J9415
$$ plain form
5680 -79218 -77854 -75112 -65001 -50045 -58230 -92534 -102634 -56140 -1550 -3490 -46209 -65161 -51119
5667 -51119 -52037 -82563 -104947 -102067 -99844 -106623 -97218 -74248 -78193 -109047 -104095 -35853 25536
5654 25536 3251 -74786 -116905 -94293 -63206 -69092 -89483 -84261 -56325 -38971 -49554 -77266
5642 -77266 -103045 -114778 -109255 -92831 -81616 -92149 -122554 -143156 -120387 -62102 -25419 -55540
5630 -55540 -124238 -162121 -153282 -155476 -206345 -251017 -207059 -83577 12875 -629 -89203 -145261
5618 -145261 -111838 -39647 -19454 -74732 -142488 -160172 -139541 -129638 -134904 -118364 -76306 -51654
5606 -51654 -62935 -76121 -68785 -66711 -83989 -82298 -37808 -507 -26596 -87323 -110097 -85194
5594 -85194 -64492 -71474 -82330 -87898 -103393 -116263 -94071 -51436 -41692 -70635 -85869 -66454
5582f6454J4498q688O101L3826Q763m4866m1557J3361K3150l4462o2716n597N9613
5569a05028M9083k258j5489N511L467k5285l3505p547J7810J8082L641o348j059
5556i8925J8026K7525P73m3130m5306Q765N3285L1346k0537k9857L440J8763m880
5543h0712k7122k0519m284M420J7985L9220L9174k50m9515o1088k3068K8865M5422
5530i1472R524m1754m8882J343N1772M3123p896l2243k510L7266L8959P632k2372
5517e7510l4690l3729k4555j2003m851l975K254J8641L1589K7970J3403P76p438
5504h4118j3868j4378m837P522J1161M383m998q496n04J7793L1757K2552o572
5491d2603k5201j2123J3157J5337o023j6377K95J6068K695k3230k5233l055Q431
$$ plain form
5582 -66454 -51956 -60644 -54543 -20717 -11954 -56820 -98377 -85016 -61866 -96328 -159044 -164641 -105028
5569 -105028 -55945 -58203 -73692 -68181 -64714 -89999 -123504 -131051 -113241 -95159 -91518 -97866 -98925
5556 -98925 -80899 -53374 -52601 -95731 -141037 -132272 -78987 -47641 -68178 -98035 -94595 -75832 -80712
5543 -80712 -107834 -128353 -132637 -128217 -110232 -71012 -31838 -32088 -81603 -142691 -165759 -136894 -91472
5530 -91472 -81948 -123702 -172584 -171241 -119469 -76346 -84242 -116485 -118995 -81729 -42770 -35138 -57510
5517 -57510 -92200 -125929 -150484 -162487 -167338 -171313 -169059 -150418 -118829 -90859 -77456 -76680 -84118
5504 -84118 -97986 -112364 -117201 -109679 -98518 -94135 -99133 -107629 -108133 -90340 -58583 -36031 -42603
5491 -42603 -67804 -79927 -66770 -51433 -57456 -73833 -73538 -57470 -54775 -78005 -103238 -106293 -97862
5478i7862o600k4820k4016j1586J98J5969L3697K9479m514l2157j9489J1454J5978
5465a14269k356l130J7221J9432o174j8825L226K5055J4109r498j4780j0861j7233
5452a18083j7561J1342M6748M2073o620n1972n1037o611M1757N2953K0736j5964
5440e2239j5929Q941J1826j2789j9032R262K4591n234m0232l3896l558J4003K4885
5427h9401L9452K5930k8524o2089k4044L0545K1899k2330j9861J8182J2929k9970
5415a27282k7463K2445K9531k1218l3781K4829N6029J479m9957j6050L7078J5222
5403h9138m1151l5878J6599L0024j426j3130K858j079k0986p489L0127L0728p402
5390a07343j8853J6997M3807K2311j8998m1647l9954j6337K4196M8312K3145k4522
$$ plain form
5478 -97862 -104462 -129282 -153298 -164884 -164686 -148717 -115020 -85541 -90055 -122212 -141701 -130247 -114269
5465 -114269 -116625 -119755 -102534 -83102 -89276 -108101 -104875 -79820 -65711 -75209 -89989 -100850 -118083
5452 -118083 -135644 -124302 -77554 -35481 -42101 -94073 -145110 -151721 -109964 -57011 -36275 -52239
5440 -52239 -68168 -59227 -47401 -60190 -79222 -69960 -45369 -50603 -90835 -124731 -128289 -114286 -89401
5427 -89401 -49949 -24019 -52543 -114632 -138676 -108131 -86232 -108562 -128423 -110241 -97312 -127282
5415 -127282 -154745 -132300 -102769 -123987 -157768 -132939 -76910 -75431 -125388 -141438 -104360 -89138
5403 -89138 -130289 -166167 -149568 -119544 -120970 -134100 -131242 -132321 -153307 -160796 -130669 -99941 -107343
5390 -107343 -126196 -109199 -65392 -43081 -62079 -103726 -143680 -160017 -135821 -87509 -64364 -88886
5378h8886l6001p900R166k131o506J1556K2811J1279k980q316j2423n868K5685
5365i0514N2824L1760j6711k8688J6J0848j0811j3159J9379L1417k878l0741j4413
5352f1671O430n802j9949l036J5317L683r183O651K0378N08j9098n46K2361K604
5338d1353l0453j8571K1905K5149j4869l7178j0284K9509L8248J2776k1979l7343
5326h4443j8402J5843K6728J1046P373K3135R046n0933q5018l4546M3960N7599
5314g8612J4318q624J185q882l9898l3189J6300M0856J4474o068J5522L5155J1250
5301b6213k4753k6587n094K588p490j5117j0809M573K4222K6197l150l1410j4119
5288a07162K9286L3978o476k6279J789K0905o337k8401K957M0734J8012l6551
$$ plain form
5378 -88886 -124887 -132787 -123621 -125752 -132258 -120702 -97891 -86612 -89592 -97908 -110331 -116199 -90514
5365 -90514 -37690 -5930 -22641 -51329 -51313 -40465 -51276 -64435 -45056 -13639 -16517 -47258 -61671
5352 -61671 -55241 -61043 -80992 -84028 -68711 -65028 -74211 -67560 -47182 -46674 -65772 -66318 -43957 -41353
5338 -41353 -71806 -90377 -68472 -43323 -58192 -95370 -105654 -76145 -37897 -25121 -47100 -84443
5326 -84443 -102845 -87002 -60274 -49228 -41855 -18720 -9674 -60607 -145625 -180171 -136211 -78612
5314 -78612 -64294 -72918 -71733 -80615 -120513 -153702 -137402 -96546 -82072 -88140 -72618 -37463 -26213
5301 -26213 -50966 -77553 -82647 -80059 -87549 -102666 -113475 -108902 -84680 -58483 -61633 -93043 -107162
5288 -107162 -77876 -43898 -50374 -76653 -74864 -53959 -60296 -88697 -85740 -45006 -26994 -63545
5276f3545m2392M657L1795O297k4330j6010J2138K0231L650j4664j8639r510Q73
5263a09449m27j2856j8809o203J2669J8442J1036L331r65o175j0089o682K400
5250a23777J0102J1575N024m485k880J3373J9521p192m1915l6045Q877L7390K2699
5237h7733J698N860J2802M73n891J2730K0237j2880m3634j8682L3101M2653R721
5224b9545o882P503R913j3376k5427j2646o442j5425o463K4490L0548o636l8130
5211h8518k4970L238Q568Q293K6294L0624j3754o2888m0596M1157Q1903K7361
5199c288n5584o9311p954N0542N0425J1777j7652k2913j8423j2623k609Q326J2712
5186g6575J3267J3705K987k3847l8027j0813K7014J3710m2019n2902J6372P6361
$$ plain form
5276 -63545 -105937 -101280 -69485 -63188 -87518 -103528 -91390 -71159 -67509 -82173 -100812 -110322 -109449
5263 -109449 -109876 -122732 -141541 -147744 -135075 -116633 -105597 -102266 -103231 -109406 -119495 -126177 -123777
5250 -123777 -113675 -102100 -97076 -101561 -104441 -91068 -71547 -78739 -120654 -156699 -147822 -110432 -87733
5237 -87733 -86035 -80175 -67373 -66900 -72791 -60061 -39824 -52704 -96338 -115020 -81919 -39266 -29545
5224 -29545 -36427 -28924 -19011 -32387 -57814 -70460 -76902 -92327 -98790 -74300 -43752 -50388 -88518
5211 -88518 -113488 -110250 -101682 -93389 -67095 -36471 -50225 -113113 -153709 -112552 -30649 -3288
5199 -3288 -58872 -128183 -136137 -85595 -35170 -23393 -41045 -63958 -82381 -95004 -97613 -89287 -76575
5186 -76575 -63308 -49603 -46616 -70463 -108490 -119303 -92289 -78579 -120598 -173500 -157128 -80767
5174h0767L5862n5294p4988j0110L4328O094k2707J2098O0100M4819j1405k7784
5162h9754R262L5911J2117l0493m4242k1929J1440L1159K6600K527k3657l3622
5150a14681k0593P600L0389K4236j1923m3463l5522m08J8599R515P08N009J296
5137a29238j4379j0168K2438L9454J1896k0675r569K6245L3959R462q236n092
5125e3903N08M736J6974J9265j5207o2085o1420m602M5884M1785Q831k258J4500
5112d6992K8426K1153j829k8873m5607l5479m26K9476K7896N765o365k377m180
5099e9412k1043k9873r532K1742K6068r01k2284j3154N256M603k672J0607K9620
5086f0975J4375k9354m8266k1864P568O886J591J9512L4519J3468k0549k5406
$$ plain form
5174 -80767 -44905 -100199 -175187 -185297 -150969 -144875 -167582 -155484 -95384 -50565 -61970 -89754
5162 -89754 -80492 -44581 -32464 -62957 -107199 -129128 -117688 -86529 -59929 -57402 -81059 -114681
5150 -114681 -135274 -127674 -97285 -73049 -84972 -128435 -163957 -164365 -145766 -136251 -135543 -130534 -129238
5137 -129238 -143617 -153785 -131347 -91893 -79997 -100672 -110241 -83996 -50037 -40575 -48811 -53903
5125 -53903 -53395 -48659 -31685 -12420 -27627 -89712 -151132 -155734 -109850 -68065 -59234 -61492 -46992
5112 -46992 -18566 2587 758 -28115 -73722 -109201 -109627 -80151 -52255 -46490 -52855 -55232 -59412
5099 -59412 -80455 -110328 -119860 -98118 -72050 -72951 -95235 -108389 -103133 -98530 -101202 -90595 -60975
5086 -60975 -46600 -75954 -124220 -146084 -138516 -131630 -130039 -110527 -76008 -62540 -83089 -108495
5074a08495r298o690j0744Q530L6473K9884o296k3237r176k216j5898j7063O087
5061a28139J6492n123k2037l220K4673K4885J0380J3774K6886J5435k0654m2224
5049h8872k5231Q650K1534M091j6835j2799J0312K1839J1740L193R007P761j1081
5036e6691j5904J0596K2046k1883o8906m0581L2567M3106k1542n1204R458O7561
5024i1377L2249l9339l8837K2084M3999K568k8746p952J9761P840k4409l2669
5012a34828n870L4051N6883M1669l836m2763m9392l6536k2499N62L3402M0267
5000h8890n3m3630l6079O978L1017K9485L4227L9743J2358l2921m1821r976J0996
4987h8566L867P233L2299L5222j007k9218j7799k334j6300l0010p740K4441K1713
$$ plain form
5074 -108495 -117793 -124483 -135227 -126697 -90224 -60340 -66636 -89873 -99049 -101265 -117163 -134226 -128139
5061 -128139 -111647 -116770 -138807 -142027 -117354 -92469 -82089 -68315 -41429 -25994 -46648 -88872
5049 -88872 -114103 -105453 -83919 -79828 -96663 -109462 -99150 -77311 -65571 -62378 -53371 -45610 -56691
5036 -56691 -72595 -61999 -39953 -61836 -130742 -171323 -138756 -95650 -117192 -168396 -158938 -91377
5024 -91377 -59128 -98467 -137304 -115220 -71221 -68653 -97399 -105351 -85590 -77750 -102159 -134828
5012 -134828 -140698 -106647 -49764 -8095 -11931 -54694 -104086 -140622 -163121 -162559 -129157 -88890
5000 -88890 -88943 -132573 -168652 -161674 -130657 -101172 -66945 -27202 -14844 -47765 -89586 -99562 -88566
4987 -88566 -84699 -77466 -45167 -9945 -10952 -40170 -57969 -60303 -76603 -106613 -114353 -89912 -68199
4974f8199o625j9965j3035r332r590M297K5639K6188j40k7852l1940r381K3275
4961a16660L8190J6238k5365m2402j6956J7900K4203Q209Q88Q799J1804k00j2508
4948h7860o574J6555L3199J8169k2585m8408l1739J720R380m603l665J3180J2542
4935a00689n226l211J7524J1998j9644j6362L3519N0398q820o1627k2294N3147
4923g1287M8544k8992o3806j5543K9058M282m0135l3259J0925L4282K4136R572
4911i2223M776J533k573k028K426O482P890J778j3955k6570k1228m455O589J1631
4897a19927J8305J7029j445j5918l478J3674j7k4869j0185L4605M3355L33k9409
4884g7947m777K6838J2452k1760k3129J76N586o265k734J5296J8461O084M059
$$ plain form
4974 -68199 -74824 -94789 -107824 -117156 -126746 -122449 -96810 -70622 -70762 -98614 -130554 -139935 -116660
4961 -116660 -78470 -62232 -87597 -129999 -146955 -129055 -104852 -96643 -95755 -86956 -75152 -75352 -87860
4948 -87860 -94434 -77879 -44680 -26511 -49096 -97504 -129243 -127523 -118143 -122746 -126411 -113231 -100689
4935 -100689 -105915 -109126 -91602 -79604 -99248 -115610 -82091 -31693 -40513 -102140 -124434 -71287
4923 -71287 -22743 -51735 -115541 -131084 -102026 -97744 -137879 -171138 -160213 -125931 -101795 -92223
4911 -92223 -87447 -85914 -88487 -90515 -88089 -81607 -73717 -71939 -85894 -112464 -133692 -138147 -131558 -119927
4897 -119927 -101622 -84593 -86038 -101956 -105434 -91760 -91777 -116646 -126831 -92226 -48871 -48538 -77947
4884 -77947 -82724 -55886 -43434 -65194 -88323 -88147 -82561 -88826 -91560 -76264 -57803 -51719 -47660
4871d7660J2481N217j8769k8255r245J4430J7685M049p332m913P296J1728o823
4858e0111l5335l7988n151K3532J1629j8315j7135J6460L5246J4714j5989k2152
4846a00595q012K030K158O222K0434K9009J0170l1780n6206k7706K8192M1606
4834h4478j0156o0824m0189K7433N9098L0920M01J0476L2317K4289l431j5937
4822c0081r131l197m659o782j0240j5259q591J3817K5414J737l4292l4522N958
4809a09828L6124J6457k8106m2486j1112L0071M3378K6744m92k5838m4274m5198
4797a54560j8924K4066N4068M8155J2568k0457j9033J6452M5821K8818k1356m7236
4785e1618k4615Q38j3195l0600O126O5044N3083l6610r3786m6080L5071M4915
$$ plain form
4871 -47660 -35179 -29962 -48731 -76986 -86231 -71801 -54116 -50067 -57399 -62312 -55016 -43288 -50111
4858 -50111 -85446 -123434 -128585 -105053 -93424 -111739 -128874 -112414 -77168 -62454 -78443 -100595
4846 -100595 -108607 -106577 -104419 -98197 -77763 -48754 -38584 -70364 -126570 -154276 -126084 -84478
4834 -84478 -94634 -155458 -195647 -168214 -109116 -78196 -77795 -67319 -35002 -10713 -14144 -30081
4822 -30081 -39212 -42409 -47068 -53850 -64090 -79349 -87940 -74123 -48709 -46972 -81264 -115786 -109828
4809 -109828 -73704 -57247 -85353 -127839 -138951 -108880 -65502 -38758 -39250 -65088 -109362 -154560
4797 -154560 -173484 -149418 -95350 -47195 -34627 -55084 -74117 -57665 -11844 16974 -4382 -51618
4785 -51618 -76233 -75395 -88590 -119190 -113064 -48020 5063 -31547 -125333 -171413 -136342 -91427
4773i1427n110k7615j18K5147K4550K3176K1743o131m1534l2496J0560J8387j9612
4760a00480l1853J0091L6045j112l7032l166N1252L6547k8866m9091n142K3730
4748i9077n053l5427j2104L3001L5717p919m6902m5453j3462J8985L2539K8957
4736a16198K2813K1342J5256j837j5295j0001O12o986k4266j9054J2484L5779
4724h5351K8227P463m451j3339k7099k5587J0108N3076N3513P446l1697k3865
4712e1556M403L520k2973k6416N659K4937m3k7830r113K7659J8289k8013l7863
4699a19340M610K9130j17k0197J9618N9315K1378n3995o4603n539L1381Q706j2306
4686a01959O899J8832j2636l9674j2381L4031L7005K445j9518j7279j4193q738
$$ plain form
4773 -91427 -96537 -124152 -124270 -99123 -74573 -51397 -29654 -35785 -77319 -109815 -99255 -80868 -100480
4760 -100480 -132333 -122242 -86197 -87309 -124341 -127507 -76255 -39708 -68574 -117665 -122807 -99077
4748 -99077 -104130 -139557 -151661 -118660 -82943 -90862 -137764 -183217 -196679 -177694 -145155 -116198
4736 -116198 -93385 -72043 -56787 -58624 -73919 -83920 -83308 -90294 -114560 -133614 -121130 -85351
4724 -85351 -57124 -49661 -54112 -67451 -94550 -120137 -110029 -56953 -3440 4006 -27691 -51556
4712 -51556 -47153 -43633 -66606 -93022 -87363 -62426 -62469 -90299 -99412 -71753 -53464 -81477 -119340
4699 -119340 -114730 -85600 -85717 -105914 -86296 -26981 -5603 -59598 -124201 -129740 -98359 -89653 -101959
4686 -101959 -95060 -76228 -88864 -128538 -140919 -106888 -69883 -67438 -86956 -104235 -118428 -127166
4674a27166J9116N3328M9976J622m8289n9261l2325M276K2707J1756j3552k3398
4662a41210q675P893Q968P225J3483J0966q179j2415K0448N0663K5878l3157n4592
4649a12704j8824J9216J7540r78k502L876m414j8916j7251O61J8903K7488K0173
4636f7732n928l1609k3764J6993M4149K5162j2848k5419j2842m809n213L864J4934
4623h5062L45l3335m2275j0187K3926K4560J1321K0468M0924L0271j4303m3721
4611g7068k4299J6745L1779J4009o545j2543j5197k4155k9289j9534n26J4859
4599a31764J9571J1145p013j8277n330K2008L0986Q982j7572k0581n045J0018
4587a02872K1055K7476J5006j6799l2465n381L1701K5596j7970m2606k4960J968
$$ plain form
4674 -127166 -108050 -54722 -4746 -3124 -51413 -110674 -142999 -138723 -116016 -104260 -117812 -141210
4662 -141210 -149885 -141992 -133024 -125799 -112316 -101350 -109529 -121944 -101496 -50833 -24955 -58112 -112704
4649 -112704 -131528 -112312 -94772 -95750 -98252 -94376 -98790 -117706 -134957 -134296 -115393 -87905 -67732
4636 -67732 -73660 -105269 -129033 -112040 -67891 -42729 -55577 -80996 -93838 -98647 -103860 -99996 -85062
4623 -85062 -84717 -118052 -160327 -170514 -146588 -122028 -110707 -90239 -49315 -19044 -33347 -77068
4611 -77068 -101367 -84622 -52843 -38834 -45379 -57922 -73119 -97274 -126563 -146097 -146623 -131764
4599 -131764 -112193 -101048 -108061 -126338 -131668 -109660 -78674 -69692 -87264 -107845 -112890 -102872
4587 -102872 -81817 -54341 -39335 -56134 -88599 -93980 -62279 -36683 -54653 -97259 -122219 -120251
4575a20251J1954J5820J7226k827l4836l2414J2105L9309J1689k2921j0377J7873
4563i7650J441l8976l1609K4421N4642K9109K441J3703K3649j0258n8535o6896
4551a54518l5040k358J3128J9655K0831J7949K2769L5076K9057n476l1874j4154
4539h4955K4467L1874J392k6559k7508j4949l774N981Q578m146j6546n674J3200
4526i8619J402l4727l9064J0482N9993N3629J0906j0273J760J1660L502k111M417
4513b7043K369k0079m1470l7499j2337J3835K8897K7605N263k9615m8661k9734
4501a68469J3190M1500L4870J1044j399P14j834j4877j7108O077L0308J9173k0169
4488f6980l9435j5601J7788K4342J5892J7643J4069k0365n5643l4432L2277O2307
$$ plain form
4575 -120251 -108297 -92477 -75251 -78078 -112914 -145328 -133223 -93914 -82225 -105146 -115523 -97650
4563 -97650 -96209 -135185 -166794 -142373 -87731 -58622 -56181 -42478 -18829 -29087 -87622 -154518
4551 -154518 -189558 -191916 -178788 -159133 -138302 -120353 -97584 -62508 -33451 -38927 -70801 -84955
4539 -84955 -60488 -28614 -27222 -53781 -81289 -96238 -100012 -94031 -85453 -89599 -106145 -111819 -98619
4526 -98619 -97217 -131944 -171008 -160526 -100533 -46904 -35998 -46271 -44511 -32851 -29349 -31460 -27043
4513 -27043 -24674 -44753 -86223 -123722 -136059 -122224 -93327 -65722 -60459 -90074 -138735 -168469
4501 -168469 -155279 -113779 -78909 -67865 -69264 -68550 -70384 -85261 -102369 -96292 -65984 -46811 -66980
4488 -66980 -106415 -122016 -104228 -79886 -63994 -46351 -32282 -52647 -108290 -142722 -110445 -48138
4476d8138J6071m4511m5075K426L3754K5223J985j6990k8387j8974J5376L8426
4464f8814J4972k6364k7828O449J6673j3503l1872o921K4403K5167J2762J0015
4452f4861M95k4763l0672Q75K2986n023m2421k8751J7084L2913J8451K2138M1698
4439c9851K7597j6613k8429N841K4327m198k9638j2057J2397K526j8691j6860
4427i3649p505j0687j015L7543N8484J9757l9279n3662k7126n603L836J7254J6128
4414h5524j6696l9008j0775K1594l493m2496j0749N8532N3055k4770n0846J0371
4402a40805M3897j2268n5331Q63P1586M6329k7432m0196o362q199k8511L503N2177
4389a00749K6142m2052l6009L6501M9764j6002l7143K9507O5435K568n4383j6774
$$ plain form
4476 -48138 -32067 -76578 -121653 -119227 -85473 -60250 -58265 -75255 -103642 -122616 -107240 -68814
4464 -68814 -53842 -80206 -108034 -101585 -84912 -98415 -130287 -137208 -112805 -87638 -74876 -64861
4452 -64861 -64366 -89129 -119801 -118926 -95940 -100963 -143384 -172135 -155051 -122138 -103687 -81549 -39851
4439 -39851 -12254 -28867 -57296 -51455 -27128 -31326 -60964 -73021 -60624 -58098 -76789 -93649
4427 -93649 -101154 -111841 -112856 -75313 -16829 2928 -36351 -90013 -117139 -122742 -118906 -101652 -85524
4414 -85524 -102220 -141228 -152003 -130409 -133902 -176398 -187147 -128615 -75560 -100330 -151176 -140805
4402 -140805 -96908 -109176 -164507 -163644 -92058 -45729 -73161 -113357 -119719 -127918 -156429 -152926 -100749
4389 -100749 -74607 -116659 -152668 -116167 -66403 -82405 -119548 -90041 -24606 -22038 -76421 -93195
4377i3195L1369r007p0240m1158L2422L1969k3420j9563M3882N6564m002l8947
4365a03326n587K0774m996k2647J1077M1878J9750j7003k2309k0515l8210l5907
4353a77021J8037O8946N0700p022k4208P752K4665n196m1124l6270M966M1979
4341g3796M0762J486l8709l9405n175J8919J0100m547R93J0785L014r398o774
4328i1745J83m688r103K898J7783J5199j022j9581l8060m0297j463N5497O2861
4315e1538Q161l0100k292K4553k1602q2345n3654L6875O5042P638k9130P222L7769
4302h3401J631l9326j5172L3158L3548L312Q46J6105J308l0198k6398O683J5489
4289h2415o013j0307J6264L1293R553k1911l4295l2130k4685o487J8077K6595
$$ plain form
4377 -93195 -61826 -70833 -141073 -182231 -149809 -117840 -141260 -160823 -116941 -60377 -64379 -103326
4365 -103326 -108913 -88139 -93135 -115782 -104705 -62827 -43077 -60080 -82389 -102904 -141114 -177021
4353 -177021 -158984 -90038 -39338 -46360 -70568 -62816 -38151 -43347 -84471 -120741 -115775 -73796
4341 -73796 -33034 -31548 -70257 -109662 -114837 -95918 -85818 -90365 -89372 -78587 -75573 -84971 -91745
4328 -91745 -91562 -96250 -105353 -102455 -84672 -69473 -70495 -90076 -128136 -168433 -169896 -114399 -51538
4315 -51538 -43377 -73477 -75769 -51216 -72818 -155163 -208817 -171942 -106900 -99262 -128392 -121170 -83401
4302 -83401 -81770 -121096 -136268 -103110 -69562 -66250 -65404 -49299 -47991 -78189 -104587 -97904 -82415
4289 -82415 -88428 -98735 -82471 -51178 -41625 -63536 -97831 -129961 -154646 -161133 -143056 -116461
4277a16461J0436j1481k0070j5073m086N239L551o619k024K9186N5301L5786j6956
4264e3271m9362l9782j8248q526L855K9207M1874J9434j5988k6712j1145K079
4252a26585q8k466P628J9158J3549p954k1567p926K0808L0149N043k8338l3733
4239a32322p876K1391L0050J4928j2286k8465j0525L0948M4938J332n3724m8892
4227a50503J0531M5503J6672k2927j5073J8053K0549n601j3244N708R101k0668
4215a01899m3083j9669K8189M7707K2080j4830k4423l837K1723L1609K3607K948
4203b9878k3983m0884k7094J0761K9242j982m8939m6725J3332O5948N4236k881
4191d8847m5068m3380j4033J6087K8624J5701r010j3890J0851L1150J3628k2653
$$ plain form
4277 -116461 -106025 -117506 -137576 -152649 -156735 -151496 -147945 -154564 -156588 -127402 -72101 -36315 -53271
4264 -53271 -102633 -142415 -160663 -169189 -165334 -136127 -94253 -74819 -90807 -117519 -128664 -126585
4252 -126585 -126673 -129139 -121511 -102353 -88804 -96758 -118325 -126251 -105443 -75294 -70251 -98589 -132322
4239 -132322 -140198 -118807 -88757 -73829 -86115 -114580 -125105 -94157 -49219 -47887 -101611 -150503
4227 -150503 -139972 -94469 -77797 -100724 -115797 -97744 -77195 -82796 -96040 -90332 -81231 -101899
4215 -101899 -144982 -164651 -136462 -88755 -66675 -81505 -105928 -109765 -88042 -56433 -32826 -29878
4203 -29878 -53861 -94745 -121839 -111078 -81836 -83818 -132757 -179482 -166150 -100202 -45966 -48847
4191 -48847 -93915 -137295 -151328 -135241 -106617 -90916 -99926 -113816 -102965 -71815 -58187 -80840
4179h0840l1583o648J4637R989j697N03Q751Q235K798K557M844K480k613n636
4165g4223p443q198m012K773K096p089j0932j053J0565R194J403O581K6262L6193
4151a7883J5653k2136l9637j8144J6796K3503n151l3640k9760k383J7083J6090
4139g9609O587j347j0427k0877k1953n723J8388K8100Q708k7120m3443j8823K0228
4126a47311K5847m951k0923Q628M3616L1918j0748k7869j0969l415j9060k0613
4114a55850O818K2447N43k0287k116K3537Q139k4905j1252M5479O6570J3251n3053
4101h0679n8067j5242O953j0052j6974J9951O7274P3401L5277q812l1120l1610
4089d9700j7436L813J4585P55k3062k7774j1860p57j291P078K5510K3176o612
$$ plain form
4179 -80840 -112423 -119071 -104434 -94445 -96142 -95639 -86888 -78653 -75855 -73298 -68454 -65974 -68587 -74223
4165 -74223 -81666 -89864 -93876 -91103 -89007 -96096 -107028 -108081 -97516 -88322 -86919 -80338 -54076 -17883
4151 -17883 -2230 -24366 -64003 -82147 -65351 -41848 -46999 -80639 -110399 -112782 -95699 -79609
4139 -79609 -73022 -74369 -84796 -105673 -127626 -133349 -114961 -86861 -78153 -105273 -148716 -167539 -147311
4126 -147311 -121464 -126415 -147338 -138710 -95094 -63176 -73924 -101793 -112762 -116177 -135237 -155850
4114 -155850 -149032 -126585 -126042 -146329 -148445 -124908 -116769 -141674 -152926 -107447 -40877 -27626 -80679
4101 -80679 -138746 -153988 -147035 -157087 -174061 -154110 -86836 -13435 21842 13030 -18090 -49700
4089 -49700 -67136 -63323 -48738 -47983 -71045 -98819 -110679 -111436 -112727 -105649 -80139 -56963 -63575
4076f3575k2276k75J8629l191k8544n026L7595K9793j6661k2879K0307K9840k8341
4063e4604p3581l7860K7037L9392J3766J4191L4799K0380k5110m3618k4017j1906
4051a21131k0757j5356R548J4300m979J882M7346O7742J9820m3460m7085j028
4039i3158K4771O641j0574P504L4261K5490j6414m3994k4652J6936K7843m832
4027e0178l6538k8832m379p155k8213j8850K7382N9104M4047J1271l661r032k3391
4014f8425l2324j5908J0054J7213P886K211J278m787q958N8J0559M271j0273j0085
4000i7230M456J1194M68j5086k0545j1071Q522K3015J7942K576J603J2145Q64
3987f1147l4527m1190J1158O4995M5530k5416n3770q018L9639K3515k6292l9343
$$ plain form
4076 -63575 -85851 -86126 -67497 -70688 -99232 -104258 -66663 -36870 -53531 -76410 -56103 -26263 -54604
4063 -54604 -128185 -166045 -139008 -99616 -85850 -71659 -36860 -16480 -41590 -85208 -109225 -121131
4051 -121131 -141888 -157244 -147696 -133396 -138375 -136493 -89147 -21405 -1585 -45045 -92130 -93158
4039 -93158 -68387 -61746 -72320 -64816 -30555 -5065 -21479 -65473 -90125 -73189 -45346 -50178
4027 -50178 -86716 -115548 -119927 -127082 -155295 -174145 -146763 -87659 -43612 -32341 -36002 -45034 -68425
4014 -68425 -100749 -116657 -106603 -89390 -81504 -79293 -78015 -82802 -91760 -91702 -81143 -76872 -87145 -97230
4000 -97230 -92774 -81580 -81112 -96198 -116743 -127814 -119292 -96277 -78335 -75759 -74156 -62011 -61147
3987 -61147 -95674 -136864 -125706 -60711 -15181 -40597 -94367 -102385 -62746 -39231 -65523 -104866
3975a04866m976K5993J7561j1732k1618N4K4525J5773k1969m1295j1088L5651
3963i7987M2543P909j7702r928J057q606j6750j968J3209K467j4145k806K3486
3950g9221K2392r635l1050j8666K039J722r946o902Q806J1969k335p287J3611
3937a04503L3920J8170j9979k7843R030L6805P989m5708n7847k3122N019M063
3925a64006Q408L6669N3433K9198j0731k7350j7493M464L2262M7147J8414l9973
3913b9558o1292j7815K7368J2598k6945k2239J4843K1520j407J968L1749K6925
3901b2285k1078m2978m872L6448K6444j1600l3079l8388m0056k3453J3706L5030
3889a26161K2754J0992K0251J5290k3111m4408p911L9011L3576q43n539N432j8746
$$ plain form
3975 -104866 -109842 -83849 -66288 -78020 -99638 -99584 -75059 -59286 -81255 -122550 -133638 -97987
3963 -97987 -55444 -47535 -65237 -75165 -74108 -82714 -99464 -101432 -88223 -85756 -99901 -102707 -79221
3950 -79221 -56829 -66464 -97514 -116180 -114141 -112419 -122365 -129267 -120461 -108492 -110827 -118114 -104503
3937 -104503 -70583 -52413 -72392 -100235 -91205 -54400 -46411 -92119 -149966 -173088 -168069 -164006
3925 -164006 -155598 -118929 -65496 -36298 -47029 -74379 -91872 -87408 -55146 -7999 10415 -29558
3913 -29558 -90850 -108665 -81297 -68699 -95644 -117883 -103040 -81520 -82927 -80959 -49210 -22285
3901 -22285 -43363 -86341 -91213 -54765 -28321 -39921 -73000 -111388 -151444 -174897 -161191 -126161
3889 -126161 -103407 -92415 -72164 -56874 -79985 -124393 -132304 -93293 -59717 -60560 -66099 -60667 -79413
3876g9413n3367k7050M7173P5568K7951k1120j7699n68j2114k4131l409J9757
3864f8422N784k5412l3439k1087j1104j65J8209K3074L165j1452K905K0983J5331
3851h1630M639R629N052k9028n0777j7482L2409L1294r634k2420M275J5982p005
3838a14696k1699n192R245j995j5593j1126j153P412K7014M6711L1651j4817m3143
3825a07381l1466j1778m010J2628L8182L1562j2219l3830n126J5654j7477m9896
3813a75157j1650O0449P1563Q847m9748n0535j4036K0691L5484K3228m290r362
3801i4516J8769K7409k2159p1935m2721L2235M7705p647l5943N519L8475L028
3789a01781m2740k6083K3981L8557J9618J0374P358j7468m4361l3698j278O513
$$ plain form
3876 -79413 -132780 -159830 -112657 -37089 -9138 -30258 -47957 -48525 -60639 -84770 -88179 -68422
3864 -68422 -62638 -88050 -121489 -142576 -153680 -153845 -135636 -112562 -109397 -120849 -117944 -96961 -81630
3851 -81630 -76991 -67362 -62310 -91338 -142115 -159597 -127188 -95894 -105528 -127948 -123673 -107691 -114696
3838 -114696 -136395 -141587 -132342 -134337 -149930 -161056 -162209 -154797 -127783 -81072 -49421 -64238 -107381
3825 -107381 -138847 -150625 -154635 -142007 -103825 -72263 -84482 -118312 -123438 -107784 -125261 -175157
3813 -175157 -186807 -126358 -54795 -45948 -95696 -146231 -160267 -139576 -104092 -80864 -85154 -94516
3801 -94516 -75747 -48338 -70497 -142432 -185153 -152918 -105213 -112860 -148803 -143284 -104809 -101781
3789 -101781 -144521 -170604 -146623 -108066 -88448 -78074 -70716 -88184 -132545 -166243 -167521 -161008
3777a61008n428O612M2091N3163K3314j1159k2262j9915j4586N04J9271J7458
3765g1945q343k8851k1553K204J6509Q222j5464l0936j7313J2664J8770q693k3827
3752a68556Q718N1408M4487m037l4604k6875j2797o945R194L0424K3548o836j3856
3739a06727J0974J8481j0066k3192J2540M8083K9249j4296j9853Q126J5667q394
3727c9408k4444j4051P31M820K648j1919m3451n6108q569O5169P5234m98p2794
3714a22640n8608R519M1489J6730r369m702L007q469j7394o299K914o371q167
3701a68360J8885M1755K0925j5902q428L6192M5012p396n3810l4743J3488J9342
3689i3040j7787l8862j6874J9191L8769L6977J5299j8637l7880k5344p037j3458
$$ plain form
3777 -161008 -166436 -159824 -117733 -64570 -41256 -52415 -74677 -94592 -109178 -108674 -89403 -71945
3765 -71945 -80288 -109139 -130692 -128488 -111979 -103757 -119221 -150157 -167470 -154806 -136036 -144729 -168556
3752 -168556 -159838 -108430 -63943 -67980 -102584 -129459 -142256 -149201 -140007 -109583 -86035 -92871 -106727
3739 -106727 -95753 -77272 -87338 -110530 -97990 -49907 -20658 -34954 -54807 -46681 -31014 -39408
3727 -39408 -63852 -77903 -77172 -72352 -69704 -81623 -125074 -181182 -189751 -124582 -49348 -49846 -122640
3714 -122640 -181248 -171729 -130240 -113510 -122879 -127581 -124574 -133043 -150437 -156736 -153822 -160193 -168360
3701 -168360 -149475 -107720 -86795 -102697 -111125 -74933 -29921 -37317 -91127 -125870 -112382 -93040
3689 -93040 -110827 -149689 -166563 -147372 -108603 -71626 -56327 -74964 -112844 -138188 -145225 -158683
3677a58683k3609l62L4571K7980r844j4418K2403L3614q919m3325j9125K4414
3665a35303L0379J0142K635M009m548q021N859P234k1154l6039j981L8271K9489
3652g9028l702n097J2791L33k9988k6337L003O100j1107L872M2543L8786j3060
3639f0891m1069j4268J4551Q688J67J1628J1803j3268k4660n966K553j4892j3406
3626a39030K2898L6729k456l4820j0625K2516O617k4145j1904J7389P824j8305
3614a27312n742K2217K998m2808l7175J9879M7742J9357n150Q169J8426l47j1268
3601i1014P991J9216l737k4722j1163R968O309l595N892J5662K591j0023N301
3588g1324K2147R2m1103m4790n574J9903l933m1250l5622J5254N7811M8484M354
$$ plain form
3677 -158683 -182292 -182654 -148083 -120103 -129947 -144365 -121962 -88348 -97267 -140592 -159717 -135303
3665 -135303 -104924 -94782 -92147 -88138 -92686 -100707 -94848 -87614 -108768 -144807 -146788 -108517 -79028
3652 -79028 -82730 -87827 -75036 -74703 -104691 -131028 -128025 -121925 -133032 -129160 -86617 -47831 -60891
3639 -60891 -101960 -116228 -101677 -92989 -92822 -81194 -69391 -82659 -107319 -113285 -110732 -125624 -139030
3626 -139030 -116132 -79403 -81859 -116679 -127304 -104788 -98171 -122316 -134220 -116831 -109007 -127312
3614 -127312 -133054 -110837 -107839 -150647 -187822 -167943 -120201 -100844 -105994 -97825 -79399 -79746 -91014
3601 -91014 -83023 -63807 -67544 -92266 -103429 -93461 -87152 -90747 -84855 -69193 -66602 -76625 -71324
3588 -71324 -49177 -49085 -90188 -134978 -140552 -120649 -124582 -165832 -201454 -186200 -128389 -79905 -75551
3575g5551k0173j609K6141K3117o72p607M850M650j4386j9421K078J5511l396
3562f6468k4232j0524J7584J2825k3293l9976j2285K3951K5564k48j4349l942
3550a15393O649J631p6J9183L7029K0241j7491k7725q61J7488M7k0601j4154o137
3536a00170k2673k9168J0929N4147L4136k2878l0931J4840K9736j5483m4083m699
3524a26297M2865L0837q404q332K0604K2609n223k1128j5557j2497j4661o041
3512a01225O893N635n157j1952j7653j8561O218M3505L4522l2032p0635j5244
3500a75686O5278N8156k4065o7538l0599J5115J7439J0080K4664L2602J1261r306
3488g2599m229M492k850q940j825J33j1048j6733j1609q715J342L4560N5727J5298
$$ plain form
3575 -75551 -95724 -97333 -71192 -48075 -48747 -56354 -51504 -46854 -61240 -80661 -78583 -63072 -66468
3562 -66468 -90700 -101224 -83640 -70815 -94108 -134084 -146369 -122418 -96854 -97102 -111451 -115393
3550 -115393 -108744 -107113 -107189 -88006 -50977 -30736 -48227 -75952 -76813 -59325 -59278 -79879 -94033 -100170
3536 -100170 -122843 -152011 -141082 -86935 -52799 -75677 -106608 -91768 -62032 -77515 -121598 -126297
3524 -126297 -83432 -52595 -60999 -69331 -48727 -26118 -31341 -52469 -68026 -80523 -95184 -101225
3512 -101225 -94332 -88697 -93854 -105806 -123459 -142020 -135802 -92297 -57775 -89807 -160442 -175686
3500 -175686 -110408 -52252 -76317 -143855 -174454 -159339 -141900 -131820 -107156 -74554 -63293 -72599
3488 -72599 -76828 -72336 -75186 -84126 -85951 -85818 -96866 -113599 -125208 -133923 -132581 -98021 -42294 -26996
3474b6996m8921m2271L2941O0736q816p4312m4411K2193K8932j206P413L3999
3462f0719Q029m3183k8575M4167O9578J1725m6923m3229j4106p754p838R597J9683
3449h9548r61k3976j5842P058R592p955j9128j0653R881K6102K1744j581j4772
3436a10039L838K9598K2437j1143k9023j8671l118R983K8281L0206j1414n9733
3424a18798m4710K3430N3034Q770l4162j4639J9913M433l2099k2690K3647M4262
3412h9609K3399l477j7905k2646m822L6173N0074l11n7878l6407M3574P2430J0933
3399C528n5489m6314R243L6396J9646n332j8845k5743k4295r801N237N440m037
3386a10366r150q529o923k150O509J1170Q314M644K768j251j401J3623L2472K5740
$$ plain form
3474 -26996 -75917 -118188 -85247 -24511 -33327 -107639 -152050 -129857 -100925 -102131 -94718 -60719
3462 -60719 -52690 -95873 -124448 -80281 -10703 1022 -45901 -89130 -103236 -110990 -118828 -109231 -89548
3449 -89548 -90509 -114485 -130327 -123269 -113677 -121632 -140760 -151413 -141532 -115430 -93686 -95267 -110039
3436 -110039 -106201 -76603 -54166 -65309 -94332 -113003 -116121 -106138 -77857 -47651 -59065 -118798
3424 -118798 -163508 -140078 -87044 -78274 -112436 -127075 -107162 -102729 -134828 -157518 -133871 -89609
3412 -89609 -66210 -69687 -87592 -110238 -115060 -78887 -28813 -29124 -87002 -123409 -79835 -7405 3528
3399 3528 -51961 -98275 -89032 -52636 -32990 -38322 -57167 -82910 -107205 -117006 -111769 -106329 -110366
3386 -110366 -119516 -128045 -134968 -137118 -130609 -119439 -111125 -106481 -103713 -104964 -106365 -92742 -60270 -34530
3372c4530r193l5528k6163m43P481m834j4122o652J1642K6743K4583K244k0181
3359g8953j8923m129q733k9570j9792L5169P5391M2234l3566o9449l9624N381
3347a44564K0849J6545J6695J9154J3516N407J759m321j6783k4222j8935j1092
3335a25992j0525j0248j812P298O825L323R908K1785J9110k863j9652n731K6155
3322h2419L1665p085m6585l3285J7478L6049L72k7887O59M2859L3394o855r760
3309e1400J6257l973p3406r4429j8682O5226N9702J802o433L8307M7317o818m6333
3296g2863j5842L2002K1309l4981n9984k0582L5808M5245j137n2397n3970o277
3284a83669L7599L7937J4947R047J5680M34l1347l3443M798L4036J9407q435r185
$$ plain form
3372 -34530 -43723 -79251 -105414 -105857 -98376 -103210 -117332 -123984 -112342 -85599 -61016 -58772 -78953
3359 -78953 -97876 -102005 -110738 -140308 -160100 -124931 -49540 -7306 -40872 -110321 -149945 -144564
3347 -144564 -123715 -107170 -90475 -71321 -57805 -52398 -50639 -54960 -71743 -95965 -114900 -125992
3335 -125992 -136517 -146765 -148577 -141279 -134454 -131131 -121223 -99438 -80328 -83191 -102843 -108574 -82419
3322 -82419 -50754 -57839 -104424 -137709 -120231 -84182 -83810 -111697 -111038 -68179 -34785 -41640 -51400
3309 -51400 -35143 -39116 -112522 -206951 -225633 -160407 -100705 -98903 -105336 -67029 -19712 -26530 -72863
3296 -72863 -88705 -56703 -35394 -70375 -130359 -150941 -115133 -69888 -71025 -123422 -177392 -183669
3284 -183669 -146070 -108133 -93186 -84139 -68459 -68025 -99372 -132815 -128017 -93981 -74574 -83009 -92194
3271i2194K520q284k9080j7966K4964N2987L8359L239j8755j9731j0336j798k140
3258g8215j0382j0905Q340L1422K8334m255l5554l8029j5461R851K1328J5291
3246g8235q68j2403j0802n488r213j2966M683L7991M6323M245n3244o0780k780
3233a53537N6960M5819k4528o5400k3550M5572N2076l933l8660j2712J6976j087
3221a06004k9153j2686K0453R205k8827k2658K9017N1849J9331q233O945J8813
3209e1948j0757l6806r606L3047K4021k4469m4465j9033O747R337J2139K6072
3197h5721K6466K499j8586j3769M339J2409N926n584j1420m389Q912O961j6995
3184h8952l4854j9973R545J7251N160L063J0451j614l0477l5521l141K9255L1060
$$ plain form
3271 -92194 -89674 -97958 -127038 -145004 -120040 -67053 -28694 -25455 -44210 -63941 -74277 -76075 -78215
3258 -78215 -88597 -99502 -91162 -59740 -31406 -35661 -71215 -109244 -124705 -114854 -93526 -78235
3246 -78235 -79103 -91506 -102308 -107796 -117009 -129975 -125292 -87301 -40978 -36733 -89977 -150757 -153537
3233 -153537 -96577 -50758 -75286 -140686 -164236 -118664 -66588 -70521 -109181 -121893 -104917 -106004
3221 -106004 -135157 -147843 -127390 -118185 -147012 -169670 -140653 -88804 -69473 -77706 -70761 -51948
3209 -51948 -62705 -99511 -109117 -76070 -52049 -76518 -120983 -140016 -133269 -123932 -111793 -85721
3197 -85721 -59255 -56756 -75342 -89111 -84772 -72363 -66437 -72021 -83441 -87830 -78918 -71957 -88952
3184 -88952 -123806 -143779 -134234 -116983 -111823 -108760 -98309 -99923 -130400 -165921 -169062 -139807 -108747
3171a08747J7285J0155L527r851j3454J299J0199o017k4984j4599J8893M3316
3159g2978M3590K6380j118l0024m1248k4888L88Q638q14r040n287O631J8572K0822
3145f0376P090j1981j6383p604r791k7672l1314l048K8865L0476J0980O66K150
$$ plain form
3171 -108747 -91462 -81307 -77780 -87631 -101085 -99786 -89587 -95604 -120588 -135187 -116294 -72978
3159 -72978 -29388 -3008 -4126 -34150 -75398 -100286 -99898 -91260 -92074 -101114 -106401 -99770 -81198 -60376
3145 -60376 -53286 -65267 -81650 -89254 -99045 -126717 -158031 -161079 -132214 -101738 -90758 -90092 -87942
$$ [...]
##END NTUPLES=NMR SPECTRUM
##END=
