##TITLE=H1
##JCAMPDX= 6.0         $$ Bruker NMR JCAMP-DX V2.0
##DATA TYPE= NMR SPECTRUM
##DATA CLASS= NTUPLES
##ORIGIN= UXNMR, Bruker Analytische Messtechnik GmbH
##OWNER= root
$$ XWIN-NMR		Version 3.5
$$ Thu Jan  7 10:20:03 2016 Russian Standard Time (UT+4h)  servis@DPX200
##.OBSERVE FREQUENCY= 200.131235884673
##.OBSERVE NUCLEUS= ^1H
##.ACQUISITION MODE= SIMULTANEOUS
##.ACQUISITION SCHEME= undefined
##.AVERAGES= 1
##.DIGITISER RES= 18
##SPECTROMETER/DATA SYSTEM= spect
##.PULSE SEQUENCE= zg
##.SOLVENT NAME= DMSO
##.SHIFT REFERENCE= (INTERNAL, DMSO, 0, 16.5164)
##AUDIT TRAIL= $$ (NUMBER, WHEN, WHO, WHERE, WHAT)
$$ ##TITLE= Audit trail, XWIN-NMR		Version 3.5
$$ ##JCAMPDX= 5.01
$$ ##ORIGIN= Bruker BioSpin GmbH
$$ ##OWNER= servis
$$ F:/spectra/data/servis-vadim/nmr/H1/1/pdata/1/auditp.txt
$$ ##AUDIT TRAIL=  $$ (NUMBER, WHEN, WHO, WHERE, WHAT)
(   1,<2016-01-07 10:18:43.87 +0400>,<servis>,<DPX200>,
      <created by zg, POWCHK disabled, PULCHK disabled
       configuration hash MD5:
       00 E9 B6 7A A2 85 ED C7 34 08 36 98 17 FE 4E 26
       data hash MD5: 16K
       07 74 EE 12 A2 F4 B3 46 5D E0 5C 57 29 A5 32 08>)
(   2,<2016-01-07 10:18:46.50 +0400>,<servis>,<DPX200>,
      <Start of raw data processing
       efp BC_mod = 2 LB = 0.3 FT_mod = 6 PKNL = 1 PHC0 = -221.7752 PHC1 = 3.843713 SI = 32K 
       data hash MD5: 32K
       F5 A3 66 12 AB 2B A0 F6 24 36 D1 BD 7D 44 52 3E>)
(   3,<2016-01-07 10:19:07.37 +0400>,<servis>,<DPX200>,
      <pk PHC0 = 2.2 PHC1 = 0 
       data hash MD5: 32K
       AD 33 46 97 9B A1 8B CE 0C 7F 3D 85 30 58 9E B9>)
$$ ##END=
$$ 
$$ hash MD5
$$ E1 15 22 FA B4 1F 78 BD 89 F1 9F 67 27 56 A4 BD
##$RELAX= 
##$RELAX= 
##$RELAX= 
##$RELAX= 
##$RELAX= 
##$RELAX= 
$$ Bruker specific parameters
$$ --------------------------
##$DU= <F:/spectra>
##$EXPNO= 1
##$NAME= <H1>
##$PROCNO= 1
##$TYPE= <nmr>
##$USER= <servis-vadim>
##$AMP= (0..31)
100 100 100 100 100 100 100 100 100 100 100 100 100 100 100 100 100 100 
100 100 100 100 100 100 100 100 100 100 100 100 100 100 
##$AQSEQ= 0
##$AQ_mod= 1
##$AUNM= <au_zg>
##$AUTOPOS= <>
##$BF1= 200.13
##$BF2= 200.13
##$BF3= 200.13
##$BF4= 200.13
##$BF5= 500.13
##$BF6= 500.13
##$BF7= 500.13
##$BF8= 500.13
##$BYTORDA= 1
##$CFDGTYP= 0
##$CFRGTYP= 5
##$CHEMSTR= <none>
##$CNST= (0..31)
1 1 145 1 1 1 1 1 1 1 1 1 1 1 1 1 1 1 1 1 1 1 1 1 1 1 1 1 1 1 1 1 
##$CPDPRG= <>
##$CPDPRG1= <>
##$CPDPRG2= <>
##$CPDPRG3= <>
##$CPDPRG4= <mlev>
##$CPDPRG5= <mlev>
##$CPDPRG6= <mlev>
##$CPDPRG7= <mlev>
##$CPDPRG8= <mlev>
##$CPDPRGB= <>
##$CPDPRGT= <>
##$D= (0..31)
0 1 0 0 0 0 0 0 0 0.06 0 0 0 0 0 0 0.0002 0 0 0 0 0 0 0 0 0 0 0 0 0 0 
0 
##$DATE= 1452147523
##$DBL= (0..7)
120 120 120 120 120 120 120 120 
##$DBP= (0..7)
150 150 150 150 150 150 150 150 
##$DBP07= 0
##$DBPNAM0= <>
##$DBPNAM1= <>
##$DBPNAM2= <>
##$DBPNAM3= <>
##$DBPNAM4= <>
##$DBPNAM5= <>
##$DBPNAM6= <>
##$DBPNAM7= <>
##$DBPOAL= (0..7)
0.5 0.5 0.5 0.5 0.5 0.5 0.5 0.5 
##$DBPOFFS= (0..7)
0 0 0 0 0 0 0 0 
##$DE= 6
##$DECBNUC= <off>
##$DECIM= 32
$$ [...]
##$SUBNAM3= <"">
##$SUBNAM4= <"">
##$SUBNAM5= <"">
##$SUBNAM6= <"">
##$SUBNAM7= <"">
##$SUBNAM8= <"">
##$SUBNAM9= <"">
##$SW= 20.6817932712277
##$SWIBOX= (0..15)
0 0 3 0 0 0 0 0 0 0 0 0 0 0 0 0 
##$SW_h= 4139.07284768212
##$TD= 16384
##$TD0= 1
##$TE= 0
##$TE2= 300
##$TE3= 300
##$TEG= 300
##$TL= (0..7)
0 120 120 120 120 120 120 120 
##$TP= (0..7)
150 150 150 150 150 150 150 150 
##$TP07= 0
##$TPNAME0= <>
##$TPNAME1= <>
##$TPNAME2= <>
##$TPNAME3= <>
##$TPNAME4= <>
##$TPNAME5= <>
##$TPNAME6= <>
##$TPNAME7= <>
##$TPOAL= (0..7)
0.5 0.5 0.5 0.5 0.5 0.5 0.5 0.5 
##$TPOFFS= (0..7)
0 0 0 0 0 0 0 0 
##$TUNHIN= 0
##$TUNHOUT= 0
##$TUNXOUT= 0
##$USERA1= <user>
##$USERA2= <user>
##$USERA3= <user>
##$USERA4= <user>
##$USERA5= <user>
##$V9= 5
##$VALIST= <valist>
##$VCLIST= <CCCCCCCCCCCCCCC>
##$VD= 0
##$VDLIST= <DDDDDDDDDDDDDDD>
##$VPLIST= <PPPPPPPPPPPPPPP>
##$VTLIST= <TTTTTTTTTTTTTTT>
##$WBST= 1024
##$WBSW= 4
##$XGAIN= (0..3)
0 0 0 0 
##$XL= 0
##$YL= 0
##$YMAX_a= 4795
##$YMIN_a= -6898
##$ZGOPTNS= <>
##$ZL1= 120
##$ZL2= 120
##$ZL3= 120
##$ZL4= 120
##$ABSF1= 0
##$ABSF2= 0
##$ABSG= 0
##$ABSL= 0
##$ALPHA= 0
##$AQORDER= 0
##$ASSFAC= 0
##$ASSFACI= 0
##$ASSFACX= 0
##$ASSWID= 0
##$AUNMP= <proc_1d>
##$AZFE= 0.1
##$AZFW= 0.1
##$BCFW= 0
##$BC_mod= 2
##$BYTORDP= 0
##$COROFFS= 0
##$CY= 18.4799938201904
##$DATMOD= 1
##$DC= 0
##$DFILT= <>
##$DTYPP= 0
##$F1P= 9.9274215381318
##$F2P= -0.165520771350173
##$FCOR= 1
##$FTSIZE= 32768
##$FT_mod= 6
##$GAMMA= 0
##$GB= 0
##$INTBC= 1
##$INTSCL= 1
##$ISEN= 128
##$LB= 0.3
##$LEV0= 0
##$LPBIN= 0
##$MAXI= 10000
##$MC2= 0
##$MEAN= 0
##$ME_mod= 0
##$MI= 50
##$NCOEF= 0
##$NC_proc= -13
##$NLEV= 6
##$NOISF1= 3.799351
##$NOISF2= 2.8
##$NSP= 0
##$NTH_PI= 0
##$NZP= 0
##$OFFSET= 16.51637
##$PC= 4
##$PHC0= -219.5752
##$PHC1= 3.843713
##$PH_mod= 1
##$PKNL= yes
##$PPARMOD= 0
##$PSCAL= 4
##$PSIGN= 0
##$REVERSE= no
##$SF= 200.13
##$SI= 32768
##$SIGF1= 3
##$SIGF2= 2
##$SINO= 400
##$SIOLD= 16384
##$SREGLST= <1H.CDCl3>
##$SSB= 0
##$STSI= 32768
##$STSR= 0
##$SW_p= 4139.07284768211
##$SYMM= 0
##$S_DEV= 0
##$TDeff= 16384
##$TDoff= 0
##$TI= <>
##$TILT= no
##$TM1= 0
##$TM2= 0
##$TOPLEV= 0
##$USERP1= <user>
##$USERP2= <user>
##$USERP3= <user>
##$USERP4= <user>
##$USERP5= <user>
##$WDW= 1
##$XDIM= 32768
##$YMAX_p= 524718191
##$YMIN_p= -9056409
$$ End of Bruker specific parameters
$$ ---------------------------------
##NTUPLES= NMR SPECTRUM
##VAR_NAME=  FREQUENCY,     SPECTRUM/REAL,   SPECTRUM/IMAG
##SYMBOL=    X,             R,               I
##VAR_TYPE=  INDEPENDENT,   DEPENDENT,       DEPENDENT
##VAR_FORM=  AFFN,          ASDF,            ASDF
##VAR_DIM=   32768,         32768,           32768
##UNITS=     HZ,            ARBITRARY UNITS, ARBITRARY UNITS
##FACTOR=    0.126318333923829, 1,           1
##FIRST=     3305.42128286362, 0,            0
##LAST=      -833.651564818493, 0,           0
##MIN=       -833.651564818493, -9056409,    0
##MAX=       3305.42128286362, 524718191,    0
$$ Real data points
##PAGE= N=1
##DATA TABLE= (X++(R..R)), XYDATA
$$ [...]
23758 -909293 -930289 -854444 -778184 -848679 -1056108 -1247714 -1319020 -1306646 -1297875 -1310693 -1275594
23747 -1275594 -1113018 -830243 -545793 -398149 -423677 -535050 -598964 -513194 -266117 2606
23737 2606 54386 -206402 -557552 -674302 -535861 -448006 -600928 -792637 -730735 -456134
23727 -456134 -266952 -302469 -418827 -464525 -469303 -505604 -535880 -500877 -447046 -451573 -480827
23716 -480827 -428777 -277635 -140562 -140614 -292967 -502536 -641291 -639410 -541683 -469242 -491160
23705 -491160 -549325 -556856 -545386 -623895 -780914 -844353 -710275 -508156 -417655 -402783 -302403
23694 -302403 -146315 -152877 -363744 -516452 -416676 -234435 -232591 -367451 -416819 -391706 -503408
23683 -503408 -738613 -799257 -556761 -284053 -279894 -478966 -613938 -598024 -552888 -569505 -627863
23672 -627863 -688865 -714274 -648790 -506975 -416338 -458025 -537491 -533358 -489695 -516706 -578078
23661 -578078 -545728 -417200 -306432 -245033 -168614 -103843 -197887 -511576 -899327 -1140918
23651 -1140918 -1123672 -892554 -595856 -374711 -246387 -133997 -57323 -173810 -504390 -755573
23641 -755573 -639046 -294864 -137866 -304794 -536042 -635649 -732421 -954548 -1135920 -1074385
23631 -1074385 -885634 -844092 -980515 -1079062 -1023039 -920174 -884293 -886258 -864203 -829432 -792484
23620 -792484 -691582 -487177 -283096 -266204 -500978 -817830 -951079 -801289 -525116 -342660
23610 -342660 -313265 -357337 -424059 -516251 -589791 -582914 -551877 -624522 -785771 -857949 -747952
23599 -747952 -577624 -513360 -600727 -810966 -1080960 -1238699 -1087536 -687871 -373734 -344221
23589 -344221 -417673 -358573 -247327 -284016 -397185 -361378 -210980 -199647 -360105 -436083 -315159
23578 -315159 -225498 -367400 -589195 -605249 -380500 -132130 -42592 -106971 -213900 -280037
23568 -280037 -320178 -412162 -564479 -655454 -593818 -488414 -507070 -603429 -591968 -498718 -577345
23557 -577345 -883047 -1084012 -879459 -422946 -126198 -172169 -425064 -714053 -971785 -1137308
23547 -1137308 -1152778 -1084305 -1077779 -1155412 -1177874 -1033046 -761094 -484774 -315352 -325516 -502660
23536 -502660 -714009 -817244 -816048 -809674 -796157 -666371 -430528 -301749 -448736 -753813
23526 -753813 -932881 -859128 -671096 -573388 -618704 -704944 -725200 -680435 -659271 -725293 -829061
23515 -829061 -849957 -744301 -625752 -644968 -790717 -883546 -805976 -664263 -633509 -697860 -688067
23504 -688067 -576085 -551135 -717065 -884634 -830746 -640835 -574414 -656435 -661292 -512265 -423937
23493 -423937 -549731 -727852 -737063 -618015 -553250 -569378 -559817 -503609 -459739 -412979 -323984
23482 -323984 -283805 -414962 -639988 -749940 -708057 -688672 -783074 -857484 -773696 -595722 -490225
23471 -490225 -528748 -651749 -738254 -676973 -469657 -284792 -288353 -403786 -390753 -198044 -58080
23460 -58080 -148484 -343857 -440783 -469784 -598765 -833759 -1020255 -1092813 -1128019 -1158154 -1117187
23449 -1117187 -1005738 -949388 -1021418 -1122391 -1116724 -1012108 -927317 -934228 -1003025 -1070864 -1094988
23438 -1094988 -1048423 -928634 -789346 -721675 -771307 -888740 -983195 -1011175 -986242 -923710 -831368
23427 -831368 -752440 -739949 -755789 -678221 -479119 -317981 -352671 -507682 -562510 -449838 -319156
23416 -319156 -291881 -309993 -285697 -260446 -318854 -441668 -537667 -551344 -467940 -291701 -95324
23405 -95324 -9670 -77987 -190042 -238186 -256723 -320378 -401327 -447275 -519063 -702507 -927033
23394 -927033 -1016526 -910251 -720751 -587560 -569277 -644594 -712838 -634806 -394218 -179911
23384 -179911 -177063 -316118 -375686 -295803 -212100 -197969 -180535 -141698 -191953 -361999 -498317
23373 -498317 -472256 -355874 -294119 -329585 -444873 -644162 -881626 -1029753 -1038978 -1023257 -1072779
23362 -1072779 -1098771 -1001335 -873807 -861739 -902100 -803410 -547316 -310747 -191815 -112990
23352 -112990 -32855 -59198 -255450 -481976 -557888 -497255 -465521 -544466 -646281 -651573 -549172
23341 -549172 -426475 -377938 -441270 -580288 -699541 -700881 -569350 -409879 -364837 -470992
23331 -470992 -618799 -677186 -630868 -557191 -505739 -474140 -480229 -552925 -634476 -601936 -442229
23320 -442229 -314298 -359088 -513395 -592707 -511814 -351255 -245974 -273420 -414097 -567718
23310 -567718 -647944 -692921 -807186 -961390 -977455 -796769 -619753 -638333 -764736 -815497
23300 -815497 -838948 -994215 -1170416 -1050115 -599548 -197198 -153679 -354801 -531444 -643702
23290 -643702 -781514 -874516 -778440 -566827 -478005 -582126 -710472 -727614 -685179 -664272 -631001
23279 -631001 -526790 -386772 -281861 -211166 -128470 -44657 -42571 -178887 -387157 -503877
23269 -503877 -428450 -254461 -179392 -267938 -391857 -445870 -504766 -659062 -796769 -717902 -434417
23258 -434417 -189555 -161721 -287050 -405086 -449284 -439527 -397252 -343530 -315176 -329393 -381186
23247 -381186 -492202 -682781 -873092 -916303 -790574 -667828 -707714 -847659 -891359 -769242
23237 -769242 -613719 -574626 -640472 -678717 -611094 -495640 -426685 -402233 -355685 -308322 -381453
23226 -381453 -596993 -773739 -748096 -625259 -645253 -831258 -962939 -913204 -805240 -769430
23216 -769430 -750776 -679812 -649308 -746145 -843699 -760777 -546241 -414287 -444383 -525466 -571907
23205 -571907 -621567 -718571 -846219 -981924 -1096166 -1112522 -996820 -859057 -825901 -848542
23195 -848542 -802389 -733790 -791046 -923284 -906916 -718633 -611559 -713440 -815214 -725777
23185 -725777 -586127 -596672 -644215 -501808 -263486 -239963 -462238 -623481 -554733 -447438
23175 -447438 -492132 -573236 -511585 -404959 -484925 -735050 -890181 -806548 -635398 -579887 -629947
23164 -629947 -631901 -532571 -440931 -465392 -581464 -682338 -694280 -601814 -415442 -184837 -11933
23153 -11933 39241 42249 120225 242491 224959 -11968 -301965 -441221 -435310 -416558 -406810
23142 -406810 -327930 -200496 -146047 -183718 -194841 -128444 -87085 -144830 -216710 -198013 -132810
23131 -132810 -152823 -312776 -551501 -760258 -848031 -805560 -737596 -758920 -843145 -874101 -853161
23120 -853161 -900395 -1002932 -953279 -664075 -377841 -380720 -618770 -796527 -785746 -726662 -749282
23109 -749282 -805827 -812956 -784956 -759996 -720246 -651575 -593501 -577029 -577543 -561869 -529848 -498666
23097 -498666 -495341 -551542 -644366 -668433 -545814 -342863 -204016 -206091 -353559 -642149 -1000075
23086 -1000075 -1238308 -1231845 -1110283 -1087390 -1142545 -1090891 -941730 -904814 -1002521 -988565 -774706
23075 -774706 -630825 -754144 -910879 -787705 -495059 -390690 -523497 -600132 -471379 -320870
23065 -320870 -326981 -421751 -476159 -495253 -520536 -521885 -497243 -530098 -639780 -698454 -603200 -436080
23053 -436080 -362444 -445296 -623870 -792129 -840990 -717266 -511370 -404743 -464288 -564120
23043 -564120 -562198 -461063 -334458 -205198 -86861 -48029 -121755 -222331 -262000 -287081 -384197
23032 -384197 -512191 -562716 -549271 -584418 -672164 -678904 -552991 -432356 -445428 -507851 -441824
23021 -441824 -257472 -183220 -382606 -735237 -975140 -995240 -909785 -821883 -672694 -411738
23011 -411738 -199838 -258960 -533060 -684972 -498406 -139348 75332 45131 -95640 -215492
23001 -215492 -281811 -282395 -225690 -210607 -340154 -545190 -627660 -507067 -298515 -117229 47433
22990 47433 194611 197565 -38259 -387929 -622631 -680564 -695557 -766036 -825915 -778866 -651808
22979 -651808 -543548 -484490 -425310 -339794 -271090 -274073 -358175 -492985 -630903 -713550 -694374
22968 -694374 -580255 -429202 -289389 -165563 -63207 -25118 -79952 -185149 -281675 -387493
22958 -387493 -559269 -757150 -838401 -731214 -546831 -457885 -510488 -614139 -672743 -652979
22948 -652979 -555677 -411042 -305900 -334470 -490570 -658772 -740422 -748542 -748233 -739842 -657141
22937 -657141 -491364 -372454 -461863 -737346 -941106 -832078 -489267 -262163 -374466 -673077
22927 -673077 -851256 -831897 -796995 -879534 -986926 -963332 -800702 -618354 -512886 -502850
22917 -502850 -574884 -706704 -844129 -903097 -829610 -676460 -607602 -761915 -1068226 -1253949
22907 -1253949 -1119528 -773673 -512451 -495729 -643059 -813840 -940470 -972048 -856097 -658781
22897 -658781 -576246 -718591 -959968 -1092832 -1065102 -983479 -947146 -965213 -988597 -946980 -801968
22886 -801968 -626324 -564693 -647226 -726382 -689221 -634398 -702713 -814776 -761791 -531585 -350938
22875 -350938 -372172 -489468 -534218 -505422 -506975 -567979 -643665 -726191 -834847 -926129 -925792 -858666
22863 -858666 -854110 -978208 -1115780 -1086174 -874081 -682904 -709907 -900189 -1008479 -919415
22853 -919415 -802269 -866821 -1049384 -1084957 -877046 -640054 -614574 -761580 -844480 -749689
22843 -749689 -605386 -586601 -708113 -859360 -978347 -1102390 -1244472 -1309243 -1208331 -1020197
22833 -1020197 -927317 -977126 -1014279 -910249 -757418 -730104 -827873 -892009 -843094 -762937 -741957
22822 -741957 -773680 -814316 -826819 -749040 -543729 -307882 -203639 -244470 -286869 -275206 -322970
22811 -322970 -463282 -507024 -316886 -79921 -92228 -349095 -573498 -624180 -637919 -727170
22801 -727170 -767793 -615777 -375066 -280914 -389084 -533933 -573993 -542410 -530303 -536012 -501384
22790 -501384 -431727 -389754 -389900 -390501 -405464 -521550 -736242 -868370 -757528 -511226 -399380
22779 -399380 -498745 -615669 -616163 -638676 -838321 -1080652 -1103493 -902520 -728078 -716633 -748139
22768 -748139 -698670 -616439 -564471 -485630 -356500 -318641 -487447 -729076 -802108 -670426 -511845
22757 -511845 -438720 -374257 -224254 -23830 138356 224728 217093 87629 -114173 -231932
22747 -231932 -167083 -21777 32426 -7451 -1708 67470 11343 -310244 -763002 -1075211 -1128582
22736 -1128582 -1004416 -808949 -600895 -462146 -464427 -530881 -484605 -296333 -143158 -144828
22726 -144828 -190491 -141024 -56794 -60100 -92042 -18314 94080 47870 -142888 -226387 -87986
22715 -87986 64721 -4337 -259387 -509184 -664270 -721273 -617547 -304078 75143 254435
22705 254435 124589 -161860 -374971 -417825 -351547 -289249 -291009 -331722 -367175 -428495 -595078
22694 -595078 -847606 -1027258 -1007255 -839266 -656459 -509418 -404734 -428307 -660086 -973186
22684 -973186 -1090305 -903507 -617392 -498308 -575312 -678859 -700455 -689625 -708086 -713692 -651506
22673 -651506 -591480 -678095 -933407 -1181397 -1215112 -1004794 -700270 -469734 -397726 -494584
22663 -494584 -695422 -853148 -850069 -745630 -709715 -782747 -825118 -748136 -649878 -641654 -688693
22652 -688693 -734975 -831641 -986173 -1032678 -859764 -650345 -650900 -784946 -774181 -606489 -573947
22641 -573947 -812698 -1107412 -1237341 -1229920 -1154404 -957849 -684869 -586353 -769331 -964688
22631 -964688 -913569 -786976 -900157 -1159273 -1173693 -871987 -620592 -675909 -863416 -923511
22621 -923511 -880103 -889345 -953580 -988396 -1008041 -1044651 -1010476 -844629 -708324 -822868 -1147765
22610 -1147765 -1408042 -1433657 -1296361 -1102429 -849804 -574975 -468306 -670107 -1013761 -1145457
22600 -1145457 -933301 -636461 -590181 -799413 -959718 -864180 -655725 -613464 -794253 -1008144
22590 -1008144 -1100182 -1104139 -1094789 -1034071 -859529 -639735 -525558 -570570 -688519 -780056 -819659
22579 -819659 -809535 -730508 -586734 -456039 -438411 -550151 -692931 -735496 -619338 -385731
22569 -385731 -117732 121019 290845 358639 316713 212312 120484 79611 76046 83554 77100
22558 77100 12815 -142103 -335323 -444456 -413045 -331573 -332476 -433451 -537441 -566611 -538616
22547 -538616 -517576 -545296 -627372 -741354 -842617 -887894 -859869 -757878 -590301 -412533
22537 -412533 -339651 -448882 -670733 -845915 -895447 -857417 -749952 -521201 -206931 -19348
22527 -19348 -130959 -419008 -588259 -550525 -510473 -620016 -730609 -632694 -405561 -319529
22517 -319529 -442923 -572425 -570166 -537050 -561725 -524622 -332934 -176236 -296610 -593138
22507 -593138 -732491 -639916 -588382 -731133 -841532 -696918 -482236 -545341 -882496 -1150048
22497 -1150048 -1143543 -997257 -891984 -819806 -719977 -633875 -600854 -558431 -472051 -434019 -507157
22486 -507157 -589455 -574304 -538708 -609997 -729131 -731197 -614377 -536027 -552093 -554530 -492611
22475 -492611 -465249 -526834 -572723 -517851 -449801 -488466 -603864 -692860 -744472 -803810 -850269
22464 -850269 -847091 -853426 -946168 -1069517 -1104574 -1063698 -1066613 -1129204 -1133843 -1036011 -949203 -966418
22452 -966418 -1024325 -1017251 -943959 -868989 -823559 -807910 -809561 -766041 -608532 -405878 -348998
22441 -348998 -496243 -645451 -584574 -374536 -235076 -229670 -245171 -242047 -318846 -505234 -673830
22430 -673830 -719313 -680148 -619028 -520467 -386845 -307793 -331135 -367392 -328067 -264474 -252423
22419 -252423 -232851 -121306 -10335 -72054 -265535 -339993 -187221 -6656 -618 -61732 44236
22408 44236 268892 295935 -8616 -387361 -548349 -544884 -609327 -738503 -710192 -490554 -342920
22397 -342920 -442524 -624986 -671236 -637467 -691210 -778235 -715941 -531974 -431557 -453705 -439686
22386 -439686 -364947 -414232 -640703 -821694 -796398 -711811 -754791 -843852 -801582 -673352 -636557
22375 -636557 -696623 -702557 -596527 -436904 -234805 13186 173260 87731 -164915 -340011
22365 -340011 -366417 -403646 -538599 -655076 -674769 -713620 -880047 -1076451 -1122560 -966401
22355 -966401 -691017 -428560 -336172 -512636 -835083 -1005736 -882988 -669107 -657207 -883533
22345 -883533 -1143588 -1260905 -1206710 -1025669 -797550 -652859 -694836 -885206 -1077865 -1166073
22335 -1166073 -1150090 -1085666 -1018924 -953200 -851014 -704625 -611532 -696634 -928196 -1111431
22325 -1111431 -1116663 -1005752 -871164 -690838 -458050 -321480 -425733 -691414 -917641 -1037435
22315 -1037435 -1100271 -1067422 -847921 -539389 -411131 -574559 -832601 -937878 -871525 -785179
22305 -785179 -781569 -853866 -967146 -1096133 -1204209 -1250936 -1224061 -1151441 -1091899 -1096714 -1147004
22294 -1147004 -1159634 -1101878 -1048818 -1051942 -1019488 -857081 -680263 -712610 -964968 -1193258 -1222561
22283 -1222561 -1141630 -1093828 -1041969 -878033 -649015 -513246 -525354 -600530 -668112 -745835 -864710
22272 -864710 -1006757 -1119375 -1132993 -983967 -691163 -401870 -287920 -375972 -524271 -585264
22262 -585264 -560429 -570723 -689086 -843344 -918192 -926595 -994421 -1146807 -1215594 -1057711 -786659
22251 -786659 -646006 -692572 -760376 -723588 -622656 -515606 -389325 -268687 -233416 -252962
22241 -252962 -180873 -1253 105368 56780 33716 190926 390114 425118 352949 360035 425257
22230 425257 385183 247751 151661 61559 -181460 -493568 -555875 -278330 29219 84499
22220 84499 -14860 -28705 56102 99258 82995 82799 61280 -83076 -302364 -434302 -447921
22209 -447921 -482902 -618944 -749484 -736442 -588609 -430028 -359634 -394222 -504211 -648836
22199 -648836 -780850 -849108 -816533 -684949 -501053 -328990 -220815 -217880 -344888 -555472
22189 -555472 -708481 -676302 -491772 -323945 -283466 -305056 -249234 -76353 104067 126889
22179 126889 -83263 -414679 -631779 -603318 -452773 -399023 -474332 -527203 -493783 -484754 -546052
22168 -546052 -523686 -298981 -9344 135826 152745 202527 278793 201539 -61965 -278312
22158 -278312 -242129 -52332 18878 -139035 -375261 -487957 -446720 -383327 -408786 -492298 -535287
22147 -535287 -520690 -521644 -564426 -568589 -465859 -305021 -174168 -81537 4004 44443 -31522
22136 -31522 -201892 -360769 -461462 -564635 -722239 -885449 -967087 -954371 -921901 -941938
22126 -941938 -999384 -1007172 -917219 -794313 -731009 -704395 -606472 -432354 -324298 -367912 -457205
22115 -457205 -460218 -417152 -439636 -489063 -421305 -229175 -82084 -105846 -245865 -371005 -408261
22104 -408261 -353472 -245271 -157584 -145724 -183027 -204841 -203399 -220069 -275961 -378817 -544914
22093 -544914 -724733 -778198 -648660 -493466 -491677 -590632 -627342 -634239 -778284 -1010059 -1050318
22082 -1050318 -790385 -461138 -309728 -327913 -403107 -517676 -663638 -755288 -772703 -824419
22072 -824419 -940768 -983293 -885541 -784710 -770151 -718025 -548719 -417033 -433598 -437690 -311788
22061 -311788 -278921 -546283 -863377 -848847 -611298 -577946 -772486 -773731 -437927 -156051
22051 -156051 -238102 -499449 -683847 -876680 -1190076 -1391804 -1233752 -915974 -832557 -992212
22041 -992212 -1054643 -867016 -623844 -516660 -538169 -655556 -888272 -1136227 -1168745 -902041
22031 -902041 -533526 -309877 -283325 -362252 -474222 -589052 -673962 -720136 -766836 -837533 -888538
22020 -888538 -862035 -754625 -602666 -438799 -299841 -248404 -336206 -532850 -715368 -767660
22010 -767660 -708094 -677764 -750133 -794552 -634014 -330499 -169304 -302015 -537471 -585999
22000 -585999 -401706 -163535 -15741 19527 -62579 -264536 -502704 -655751 -712305 -756924
21990 -756924 -806745 -779124 -635022 -448958 -320602 -305512 -427303 -651247 -844537 -874655
21980 -874655 -757619 -608893 -462654 -275422 -103971 -104041 -300802 -519365 -618399 -647065 -682637
21969 -682637 -667305 -545365 -442385 -529643 -757484 -885647 -785303 -592668 -535015 -680130
21959 -680130 -890459 -990858 -957252 -925525 -998310 -1088953 -1043492 -887807 -804862 -841299 -817284
21948 -817284 -626217 -450592 -511313 -727994 -830256 -729589 -568383 -443845 -315003 -188742
21938 -188742 -162297 -220513 -204487 -76147 -17914 -141289 -275054 -216256 -54716 -43960 -231696
21927 -231696 -430042 -518931 -567392 -637714 -667757 -612278 -539119 -501051 -448311 -361555 -341422
21916 -341422 -443266 -532363 -454678 -274373 -174698 -178197 -165731 -160894 -354728 -763741 -1079306
21905 -1079306 -1022056 -702422 -445634 -363422 -312214 -219614 -205155 -342111 -517241 -622235
21895 -622235 -716788 -879891 -1023073 -988277 -761590 -478701 -272887 -206364 -280256 -403014
21885 -403014 -410588 -245344 -79029 -130499 -379461 -587357 -596770 -478593 -371397 -321029 -332412
21874 -332412 -438824 -608753 -676626 -510019 -227001 -116497 -301132 -570862 -628926 -453776
21864 -453776 -310952 -398727 -601160 -672474 -569383 -456296 -428327 -418249 -397429 -458588 -602749
21853 -602749 -644453 -495780 -379907 -543411 -873156 -1048889 -1000839 -934315 -926853 -819189
21843 -819189 -565069 -378770 -395491 -449441 -373624 -298408 -429417 -691276 -824909 -733849
21833 -733849 -528271 -320368 -180042 -204879 -410865 -610025 -613637 -513636 -544406 -707618
21823 -707618 -784309 -709882 -660268 -714157 -702964 -511592 -289405 -204346 -186160 -105605 -56221
21812 -56221 -231835 -595104 -878637 -913655 -802166 -745446 -818533 -941406 -990306 -906778 -739516
21801 -739516 -590111 -502089 -429557 -335602 -267062 -281150 -344410 -370569 -334642 -291759 -293524
21790 -293524 -325811 -323198 -232556 -86407 -6880 -78055 -215788 -252943 -169701 -125463 -216523
21779 -216523 -331072 -331399 -257242 -228400 -254999 -293321 -395517 -616170 -823831 -815466 -620984
21768 -620984 -495016 -565229 -673701 -641781 -523451 -478334 -518029 -520022 -432024 -337744 -332589
21757 -332589 -413086 -489004 -470864 -366017 -303206 -416083 -682294 -929732 -1016510 -939643 -760391
21746 -760391 -530430 -338025 -308859 -457628 -609242 -574574 -371627 -193043 -190778 -365253
21736 -365253 -620532 -839697 -937502 -929048 -930854 -1021881 -1132922 -1152010 -1099067 -1089473 -1144542
21725 -1144542 -1156371 -1049072 -867244 -686090 -538238 -457898 -488559 -590700 -630538 -529767
21715 -529767 -367477 -280345 -319727 -452130 -625202 -765448 -783351 -676849 -584674 -634891
21705 -634891 -763969 -791517 -670611 -549133 -549105 -592254 -524608 -348660 -229128 -277958 -424266
21694 -424266 -527863 -553358 -568219 -602100 -598966 -537361 -519955 -655286 -870532 -944026 -763136
21683 -763136 -472337 -297085 -277203 -270738 -195387 -140230 -199476 -306244 -328986 -279378 -310492
21672 -310492 -499274 -717552 -763401 -582077 -323157 -193582 -263650 -401520 -405945 -231748
21662 -231748 -62262 -99227 -298033 -411091 -313512 -161130 -146426 -217455 -186855 -51136
21652 -51136 -13956 -184217 -425157 -560175 -580271 -564203 -526101 -460421 -439046 -525994 -650752
21641 -650752 -693426 -659739 -650218 -681907 -671283 -595438 -543511 -573737 -618957 -585195 -483862
21630 -483862 -424914 -503950 -696657 -841488 -769797 -511915 -317080 -370018 -537779 -532703 -299519
21619 -299519 -77892 -70546 -221386 -370324 -458951 -498732 -485653 -455105 -500970 -634314 -733746
21608 -733746 -735162 -744504 -842159 -909021 -805078 -606186 -481914 -434601 -365070 -320593 -436113
21597 -436113 -656081 -766628 -728483 -733876 -866554 -940206 -792222 -538143 -383787 -343501
21587 -343501 -313611 -303228 -401632 -578817 -697488 -711573 -709911 -753141 -782508 -718925 -573165
21576 -573165 -425581 -339106 -309361 -281296 -217277 -152561 -154589 -223790 -284846 -286413 -244343 -172039
21564 -172039 -58397 47862 36729 -108014 -246993 -273377 -282053 -437299 -730302 -991285
21554 -991285 -1109389 -1120103 -1086554 -1007053 -856372 -646744 -444732 -365543 -494717 -739777
21544 -739777 -829545 -582510 -138660 190959 261205 151128 -50094 -318876 -565205 -636571
21534 -636571 -511690 -321354 -129334 116289 343652 299726 -102329 -555067 -681867 -476809
21524 -476809 -223264 -80098 12341 75629 23245 -120702 -188255 -149548 -210632 -486917 -759737
21513 -759737 -755420 -553873 -494060 -705499 -954634 -997214 -886585 -824064 -850809 -846792 -759296
21502 -759296 -658723 -577349 -458626 -312754 -277651 -429291 -632467 -696667 -619569 -559401
21492 -559401 -604108 -685663 -701754 -606343 -399452 -161823 -90781 -331653 -731929 -932792
21482 -932792 -790768 -557725 -535182 -700164 -821123 -805820 -730827 -617232 -419559 -221872
21472 -221872 -209450 -400819 -608755 -729607 -868718 -1072841 -1138149 -874687 -443398 -215362
21462 -215362 -324661 -542593 -608263 -520619 -441989 -441646 -447144 -398384 -338540 -329346 -339482 -273052
21450 -273052 -103990 64679 103007 -14413 -216772 -441866 -657827 -794343 -765271 -607875
21440 -607875 -500269 -550880 -640783 -586643 -414459 -332575 -432982 -568621 -585825 -547740 -612034
21429 -612034 -767116 -838987 -754860 -662686 -730611 -918501 -1034968 -978737 -832643 -720786
21419 -720786 -659785 -594220 -522733 -516764 -614198 -745043 -791334 -710413 -582799 -531761 -592504
21408 -592504 -666758 -623800 -448978 -268831 -218481 -310212 -446929 -525251 -490239 -332065 -99975
21397 -99975 88727 124301 11524 -133326 -190890 -108073 109100 385377 563425 511006
21387 511006 278515 51015 -103213 -317037 -668305 -963847 -943817 -640915 -350978 -249660
21377 -249660 -223074 -120223 16479 83142 120472 218222 298960 186013 -123050 -418115
21367 -418115 -547856 -589216 -677836 -788732 -799109 -703627 -634961 -668113 -712174 -642829 -475466
21356 -475466 -342856 -327067 -375073 -387819 -344778 -306493 -313407 -326044 -282566 -191741 -136111
21345 -136111 -178997 -293137 -400263 -469301 -546485 -676288 -812857 -844667 -721934 -535713
21335 -535713 -432546 -450293 -485189 -447351 -395688 -446383 -570832 -589296 -401984 -138533 -8499
21324 -8499 -68354 -219145 -373605 -506336 -569046 -502915 -361613 -296742 -376437 -528855 -700840
21313 -700840 -924592 -1147789 -1163967 -869930 -474647 -266683 -257425 -260494 -256518 -409322 -704726
21302 -704726 -859381 -709121 -461178 -396743 -499978 -571136 -569598 -619949 -742769 -798217 -702998
21291 -702998 -540979 -436867 -434531 -500491 -545904 -466857 -275705 -159132 -266769 -468479
21281 -468479 -492611 -311083 -194991 -328719 -553419 -606599 -468132 -320944 -269920 -266654
21271 -266654 -267308 -299705 -360205 -377849 -332975 -318592 -410528 -527192 -505237 -318760 -150274
21260 -150274 -192797 -416933 -602116 -589642 -423224 -227047 -53574 83392 128921 55760
21250 55760 -49858 -88315 -79544 -74257 -2328 214674 439901 428937 183615 -19726 -22636
21239 -22636 7913 -122203 -322577 -366870 -214754 -22227 70571 23593 -131434 -272087
21229 -272087 -247698 -100069 -98969 -390310 -730990 -775815 -524566 -257994 -120180 -30304
21219 -30304 43043 16932 -87450 -147349 -198459 -401877 -680183 -701502 -375633 -72514 -130004
21208 -130004 -394371 -517054 -498151 -594968 -804526 -815993 -504284 -148046 -43619 -143312
21198 -143312 -223875 -233092 -287291 -424520 -544812 -580644 -583909 -609200 -604575 -478971 -236723
21187 -236723 13563 174560 229486 187074 31988 -201615 -357596 -278672 -17819 179379
21177 179379 154455 399 -123874 -233810 -439687 -693967 -800074 -696151 -570764 -612539
21167 -612539 -759650 -817756 -759132 -751145 -876826 -977020 -870880 -645797 -575776 -748527
21157 -748527 -921916 -830389 -526227 -293706 -285793 -393278 -464882 -502761 -583806 -698436 -751062
21146 -751062 -672606 -486598 -299395 -232991 -308789 -399907 -374366 -268566 -209561 -192267 -110716
21135 -110716 -26133 -172770 -587699 -950822 -974548 -784923 -702522 -779009 -801380 -673156
21125 -673156 -518305 -421019 -319284 -192943 -136082 -182833 -244072 -269699 -305058 -347866 -334149
21114 -334149 -314267 -438007 -682641 -802097 -667827 -469738 -424321 -454686 -358342 -170494
21104 -170494 -134113 -347097 -626786 -729800 -577500 -273620 -17377 8353 -221111 -522421
21094 -522421 -668962 -608300 -466405 -371170 -346929 -354868 -352002 -317379 -285796 -343039 -528714
21083 -528714 -761113 -914031 -948671 -920943 -888544 -866236 -846304 -810213 -740747 -656814 -599473
21072 -599473 -557259 -467064 -325301 -220164 -201441 -201934 -149180 -62809 26704 141773 247816
21061 247816 210774 -2170 -207500 -263120 -322304 -609424 -1027450 -1252380 -1194176 -1089921
21051 -1089921 -1105269 -1110528 -943474 -660040 -398525 -191453 -51907 -74675 -289354 -538252
21041 -538252 -650519 -638300 -596793 -529674 -422591 -379030 -499573 -685757 -734627 -597557
21031 -597557 -399421 -236916 -117107 -81034 -212579 -474968 -665946 -612694 -358551 -120445
21021 -120445 -93007 -291187 -541757 -640848 -560371 -468956 -502880 -574655 -496979 -254537 -40634
21010 -40634 -29096 -205845 -427785 -558091 -536690 -404014 -272789 -212023 -164696 -54446
21000 -54446 50886 -620 -214665 -410344 -454946 -419688 -428688 -460810 -413947 -301260 -252412
20989 -252412 -323348 -413414 -409514 -341925 -335626 -430760 -513692 -447581 -232128 8817 173004
20978 173004 244787 219954 69355 -170566 -368179 -452506 -523233 -687140 -853604 -857175 -749729
20967 -749729 -764489 -955309 -1082468 -957624 -712524 -570095 -508272 -364571 -175686 -158341
20957 -158341 -355144 -534321 -510286 -377707 -326441 -375462 -423521 -456574 -545554 -678550 -741866
20946 -741866 -682692 -587727 -569445 -641278 -730612 -764119 -718618 -627804 -555160 -528662 -500251
20935 -500251 -410397 -287944 -223301 -232211 -222068 -129751 -18354 20886 -9545 -73325 -213738
20924 -213738 -478121 -756577 -851467 -740088 -623777 -643816 -684511 -578426 -394703 -345801
20914 -345801 -452543 -499664 -359260 -183948 -182676 -332370 -444724 -446741 -444851 -518030 -585001
20903 -585001 -531077 -380511 -267420 -269153 -329634 -339976 -252817 -120887 -59052 -163199 -418257
20892 -418257 -672859 -753698 -641343 -502049 -508979 -662485 -830538 -926135 -966125 -973353 -924165
20881 -924165 -818439 -710125 -621027 -503656 -349255 -258426 -323367 -491401 -627780 -675552
20871 -675552 -674537 -661678 -645307 -652575 -701495 -726926 -625418 -393221 -159855 -72627 -179296
20860 -179296 -397226 -555438 -520121 -346114 -242700 -306810 -374510 -259962 -47889 33851
20850 33851 -35442 -74909 -29313 -24941 -71685 -641 198007 256541 19698 -292240 -420073
20839 -420073 -444871 -574148 -734371 -691108 -471392 -342324 -398434 -471745 -468928 -513254 -681752
20828 -681752 -842107 -850315 -729311 -572012 -432944 -384852 -511656 -755455 -915611 -886141
20818 -886141 -769193 -690476 -646361 -608367 -625503 -714044 -767129 -683906 -499135 -306885 -154851
20807 -154851 -79286 -124826 -253474 -355158 -419799 -555896 -756544 -823406 -657008 -455045
20797 -455045 -448071 -580418 -649657 -636100 -662367 -715704 -669217 -548151 -523186 -621005 -665014
20786 -665014 -544744 -345052 -160750 19238 172436 177865 -1636 -220132 -340728 -405657
20776 -405657 -514652 -652754 -753146 -828351 -911895 -946043 -855922 -684503 -536151 -426216
20766 -426216 -303567 -193439 -190443 -304316 -426239 -478821 -507418 -576119 -644075 -609975 -449904
20755 -449904 -259139 -161207 -201456 -323455 -429955 -471093 -483946 -534680 -613628 -620517 -495799
20744 -495799 -342804 -336969 -485840 -562171 -355914 52123 359355 361449 112633 -203699
20734 -203699 -431134 -463631 -279163 -25660 58703 -90815 -282379 -329985 -277201 -256064
20724 -256064 -262495 -224415 -171073 -150451 -81230 100565 229392 89007 -238791 -456861 -465804
20713 -465804 -426432 -407069 -276827 -22130 135754 75644 -34096 -30751 10757 10319 87695
20702 87695 311314 468617 346550 64499 -123975 -190203 -226626 -163157 92404 367231
20692 367231 423438 350069 399431 512581 413804 152875 103932 352756 527458 397734
20682 397734 232945 328043 524718 496991 244174 -1138 -146369 -229431 -214699 -91530
20672 -91530 -32514 -166903 -320372 -265699 -112400 -133338 -299092 -336480 -212902 -194401 -384367
20661 -384367 -552741 -523215 -423778 -418080 -456748 -455540 -487614 -618043 -737796 -744173 -723736
20650 -723736 -776945 -814620 -725794 -614683 -650942 -780382 -813481 -742635 -738985 -853480 -950262
20639 -950262 -959067 -976727 -1052756 -1064850 -912138 -690518 -562804 -555866 -589039 -615418 -624468
20628 -624468 -572016 -428955 -268583 -197279 -208959 -202929 -140330 -78379 -28142 110947 396759
20617 396759 691442 770155 584687 337812 265418 403556 610707 758070 814189 771119
20607 771119 606526 363332 177502 148429 229862 316273 379936 429588 391634 184109 -91372
20596 -91372 -200432 -83340 39981 -20285 -151361 -144865 -71298 -206611 -589645 -902723
20586 -902723 -891391 -700833 -634629 -727665 -769893 -681162 -623911 -714052 -819615 -743791 -481253
20575 -481253 -192961 -16505 4285 -115819 -287491 -340632 -164283 140775 347852 361086
20565 361086 304492 332083 433230 479848 410993 304411 279057 368140 486558 509183 397721
20554 397721 261062 261647 442993 679465 818228 831251 788227 723906 611495 463404 371032
20543 371032 396732 475885 487554 407458 336748 373671 500728 617381 650657 605377 528501
20532 528501 461402 421083 392735 336180 232151 132806 131495 257927 431126 548688 599518
20521 599518 645104 705725 728340 680540 613937 588572 573635 486537 324608 198272 209471
20510 209471 333103 449087 471991 418920 361051 344537 365814 394903 403612 386121 367937
20499 367937 381341 418575 431945 405751 399679 468584 553590 530462 388549 281867 339958
20488 339958 484286 515098 352391 107730 -64487 -91826 33384 273123 501216 551299
20478 551299 391459 185753 109249 164475 251873 334091 410150 401081 240739 71285 150671
20467 150671 495840 786162 744186 490386 371780 520125 746643 835202 758291 586274
20457 586274 359731 132910 13969 50443 143949 168891 120939 67462 13251 -77703 -165179
20446 -165179 -160365 -75950 -44418 -156618 -354811 -508388 -531708 -416254 -224761 -77070
20436 -77070 -62197 -130746 -149250 -87983 -55343 -98970 -99462 32429 164255 107173 -88458
20425 -88458 -185050 -96591 10927 156 -34929 53586 226443 327587 309790 253251 208956
20414 208956 162633 144905 245040 472890 689280 728358 563885 337773 241264 356095
20404 356095 579461 716491 677202 559489 502848 505232 458785 339960 263757 330409 499685
20393 499685 655826 739488 773296 795279 808105 780959 685335 540428 418629 384764 444718
20382 444718 577444 769619 952468 959173 678854 261187 30730 141313 424957 640114
20372 640114 738488 785756 754773 580448 358638 287742 395775 499689 491527 508491 714533
20361 714533 1027477 1203819 1150773 1025298 1019300 1150930 1305569 1406197 1472640 1534087
20351 1534087 1550847 1456258 1257325 1057933 966898 994236 1050244 1038493 937538 800710
20341 800710 695804 649343 642541 656615 706584 804340 895817 889416 776587 676351 705923
20330 705923 834384 921757 884950 764657 641642 558056 522358 516529 479453 352154 170290
20319 170290 54516 77717 192228 309911 384939 379556 233007 -45868 -297312 -323018
20309 -323018 -92466 222431 432002 503923 536702 594270 612463 495841 293820 211773
20299 211773 384090 678993 832235 766211 649330 614650 576335 415359 203273 96097
20289 96097 106908 143474 189246 264445 272292 103538 -127171 -185265 -75058 -43396 -160687
20278 -160687 -171212 93812 408760 481389 386247 396275 522930 542300 419659 370972 467927
20267 467927 501017 352766 230533 340427 539210 544359 362758 260537 350221 447430
20257 447430 378140 234442 219517 353924 461987 414929 283684 231439 318946 460248
20247 460248 541103 522962 427179 283808 142378 85263 160436 319944 484849 642906
20237 642906 806263 908210 861116 717165 640726 686858 731387 671515 570053 530472 554561
20226 554561 612990 728863 877679 933704 860775 829892 958921 1046548 813279 356087
20216 356087 84892 179868 379296 394393 289503 302950 484050 685710 783550 734027
20206 734027 524664 239805 94049 223663 488369 630203 584658 486159 416916 335930
20196 335930 250210 264975 410162 561611 601332 550157 488028 441833 409816 409179 434689
20185 434689 435345 385705 324322 283515 249541 237820 332142 576326 873895 1068016 1101763
20174 1101763 1050464 1014816 1021739 1016961 934395 794469 732765 867941 1116045 1215320 1004453
20163 1004453 624666 367881 360049 481129 574065 615332 643874 627954 508729 350547
20153 350547 336847 560030 870642 1020395 952051 857165 905135 1006325 946912 706893
20143 706893 499117 475446 535919 506687 398101 367558 479847 627891 688039 654163 595671
20132 595671 558578 547389 559160 591658 627951 635619 586526 481679 360461 276447 258894
20121 258894 305753 404044 525819 607946 583900 452298 279666 135540 75817 174105 458720
20110 458720 782558 880242 652817 308636 112518 74571 21546 -96865 -163156 -141307
20100 -141307 -163250 -295476 -385940 -262504 20773 257422 345595 355635 370926 372769 304881
20089 304881 188300 132685 231560 442193 584921 505819 246805 10232 -49824 52542
20079 52542 219964 386082 510644 549616 499962 422776 367678 323304 284672 298246 376147
20068 376147 436362 412873 367946 399098 475981 472005 339005 162246 57253 84563 228590
20057 228590 370940 333682 76291 -177875 -158826 107453 331077 352484 319474 394812
20047 394812 476937 373204 127996 -17643 48000 193494 253904 204493 102381 -10133
20037 -10133 -90339 -86796 -13387 37320 12068 -28634 -6074 63478 114277 142367 193643 266358
20025 266358 311061 331436 403275 555722 692005 687604 547016 409358 394179 482169 564124
20014 564124 573195 533723 494346 459606 406197 335676 273253 216904 121159 -47282 -243439
20003 -243439 -347540 -250088 42375 371588 522259 397885 110452 -135566 -248817 -294618
19993 -294618 -331126 -293451 -113852 110437 193151 95658 -33711 -80677 -94646 -129759 -90650
19982 -90650 120589 380382 444143 270398 85174 80768 191727 250222 246292 311611 502734
19971 502734 719685 828679 777630 594528 356361 179597 171677 338955 555403 654929
19961 654929 575847 425225 388616 549638 804923 987004 1046555 1047595 1005886 854095 601314
19950 601314 395548 334532 316310 196640 16762 -65193 -19814 29228 11167 -9441 31847
19939 31847 113041 195478 258276 243698 96695 -111061 -230534 -251399 -325617 -507147 -616348
19928 -616348 -478113 -181442 29138 42705 -60822 -171954 -228695 -170343 35909 302127
19918 302127 458261 422143 278968 177315 182543 234544 227057 135273 59700 100881 208859
19907 208859 256348 265416 406797 703737 906977 816139 595268 570883 791578 997362
19897 997362 990930 824187 615246 401506 224764 158931 162226 67235 -179407 -405749 -447112
19886 -447112 -365717 -326067 -363756 -407856 -444682 -512887 -578325 -545841 -392188 -202597 -86768
19875 -86768 -115690 -297770 -540417 -676694 -621560 -479526 -412763 -423848 -366540 -173387 26589
19864 26589 55555 -114278 -355311 -532668 -598312 -552158 -385820 -120175 135778 257713
19854 257713 265595 320682 497778 652097 622501 479056 399484 360156 185417 -84586 -149911
19843 -149911 106023 369353 286096 -74539 -363279 -422050 -369276 -304775 -202496 -87916
19833 -87916 -72609 -160696 -209675 -137077 -11172 100437 216030 332433 388529 391361 433966
19822 433966 524898 535957 392410 197725 101034 146387 305803 543677 790773 975987
19812 975987 1144790 1418567 1772430 1999243 1985482 1881098 1886144 2004804 2133640 2253350
19802 2253350 2378132 2439955 2404904 2404780 2553997 2709890 2632060 2343982 2117759 2103229 2187083
19791 2187083 2241004 2283417 2319777 2230783 1954163 1634492 1448008 1365976 1219497 945505
19781 945505 661122 521818 579963 755629 894253 890990 800742 773494 841877 854289 692535
19770 692535 473342 411682 521633 591073 471506 271478 197824 287265 387917 379144 318323
19759 318323 345541 503395 698983 813782 796385 661553 471428 336879 360889 521761
19749 521761 661249 651328 530303 406892 290225 132189 4403 70287 339812 592494
19739 592494 624825 465196 254723 27109 -256639 -528330 -635195 -537316 -343865 -139655
19729 -139655 89966 326514 453063 411534 321036 322885 371803 310409 124650 -13699 19952
19718 19952 155969 275865 387883 545472 665903 585994 306561 47631 1814 123899
19708 123899 232014 238796 190444 128999 33579 -94378 -179798 -150074 -22327 111916 173697
19697 173697 168003 180311 278134 397191 378715 174278 -42314 -58338 117888 288609 337799
19686 337799 336109 359904 355131 254483 111815 19883 -26628 -88635 -163946 -209103 -238234
19675 -238234 -303257 -391688 -421053 -331064 -136281 90435 252328 291910 261425 273761 341295
19664 341295 348246 248759 182098 269781 396106 365030 224760 233885 488163 766162 809865
19653 809865 615490 373344 237892 232783 283526 269990 129242 -35770 -38780 146145 329003
19642 329003 357050 303177 306384 348203 330649 284305 323346 431314 463468 367080 247480
19631 247480 186434 131741 21646 -93092 -124689 -72648 -6904 26588 37772 68773 164899
19620 164899 323716 457967 473450 404011 385937 457940 483539 350299 157065 85039 141707
19609 141707 178463 144535 160023 300248 464863 548181 602566 700264 739746 570391 265171
19598 265171 74925 98893 187192 216158 258763 374133 426916 307401 186070 301421
19588 301421 563825 640921 445496 271841 365656 593420 670173 520367 255760 -33323
19578 -33323 -273667 -335721 -187889 -35984 -80688 -194908 -91154 209086 352178 161678
19568 161678 -88415 -46915 269314 572102 688180 650213 502316 238274 -74367 -287835
19558 -287835 -330894 -259936 -137327 27979 191145 241378 135603 -6665 -19395 125337
19548 125337 300721 375329 335658 264855 236797 245536 231265 167181 105292 117079 198476
19537 198476 273455 304042 350619 479428 639591 698421 603630 447166 343241 304563 281873
19526 281873 259110 233934 164258 49340 26484 228788 533426 634281 446336 261000
19516 261000 354013 589912 621549 382737 136650 69405 97909 115023 167938 288642 365040
19505 365040 327988 300737 406129 554396 575754 456606 298390 145115 3421 -63616
19495 -63616 -23960 30723 40338 118556 343958 516883 386166 63838 -82187 39271 124907
19484 124907 -25100 -193588 -105940 139456 239402 138560 68191 189560 407780 543106
19474 543106 537357 468234 453246 550859 701101 780599 757011 740963 833701 983242 1055807
19463 1055807 994893 851326 719789 700789 840436 1037582 1107146 1021687 979222 1116455
19453 1116455 1275066 1216222 969339 768666 706101 669248 602459 590144 643560 628494 489575
19442 489575 361176 354640 394334 376326 350875 422526 576782 723876 822503 853233 768259
19431 768259 592071 486181 575094 767370 881226 895126 934451 1048653 1153840 1189491
19421 1189491 1187156 1164393 1079495 930622 795068 725151 687642 642999 605599 586805 554742
19410 554742 499620 476310 530406 631124 725440 815371 930649 1056220 1136458 1135494 1060448
19399 1060448 946763 853927 849301 945490 1057990 1074450 986555 921216 1003430 1192350 1295139
19388 1295139 1172488 904615 703924 669926 697421 648510 540018 499417 592053 776538
19378 776538 997672 1222580 1383753 1384940 1204387 937983 714118 603901 611251 687142
19368 687142 749924 765021 810574 973576 1165715 1164294 900704 594036 491133 560743 582404
19357 582404 487512 446458 599808 851031 1001407 996976 950745 967002 1034603 1091980 1122769
19346 1122769 1146343 1146144 1067938 914022 797495 836498 992652 1089520 1031159 933374 964587
19335 964587 1105700 1170660 1058487 884522 835008 970716 1209791 1431633 1543924 1505318
19325 1505318 1358647 1227546 1220513 1325227 1419930 1392284 1242398 1083986 1051930 1187285
19315 1187285 1399383 1555058 1607206 1614296 1641911 1689723 1719877 1703319 1619951 1471061 1324358
19304 1324358 1288731 1394138 1541580 1624442 1656429 1721594 1843878 1981030 2107344 2207913
19294 2207913 2218472 2092393 1939458 1972344 2254933 2597344 2776237 2788446 2803141 2921249
19284 2921249 3087486 3215499 3286050 3301100 3236375 3096146 2962080 2927838 3002192 3114131
19274 3114131 3196760 3226980 3192657 3073239 2878910 2679035 2548704 2483711 2403608 2261257
19264 2261257 2124808 2112638 2251486 2439608 2561888 2603373 2622520 2642873 2616861 2500320
19254 2500320 2336760 2250063 2340478 2572607 2780475 2825216 2747752 2708411 2766071 2806327 2739497
19243 2739497 2664330 2715733 2824804 2803182 2652044 2592795 2737611 2918055 2952342 2911976
19233 2911976 2954088 3027455 2975247 2858853 2914834 3175022 3387811 3404175 3404661 3585521 3813128
19222 3813128 3811760 3581994 3392235 3390501 3453853 3446516 3415957 3447876 3491840 3454751 3363359
19211 3363359 3304547 3259233 3120947 2876787 2673909 2668271 2845249 3024997 3050975 2958708
19201 2958708 2921432 3013477 3092644 2991989 2772117 2647402 2668075 2643802 2445932 2222943
19191 2222943 2187392 2311480 2400248 2392334 2403853 2497677 2591009 2612494 2589649 2538580 2419420
19180 2419420 2268286 2230209 2358262 2490674 2447621 2273666 2160065 2174605 2198975 2126015
19170 2126015 2002174 1943917 1989257 2070525 2094774 2025513 1904880 1809995 1786974 1830289 1905064
19159 1905064 1945214 1848979 1574145 1269821 1206733 1491334 1921110 2209844 2284171 2259100
19149 2259100 2211577 2139150 2093092 2159337 2295198 2363636 2367498 2468971 2703069 2851893 2732106
19138 2732106 2468434 2330181 2395218 2532391 2644046 2757465 2905060 3064575 3214812 3334478
19128 3334478 3366250 3300658 3263617 3378330 3563702 3636526 3610331 3696636 3965942 4212258
19118 4212258 4256237 4199913 4234493 4346876 4400292 4396677 4444672 4515215 4449876 4233651 4069315
19107 4069315 4110452 4258079 4303499 4175772 3971074 3808457 3728375 3691007 3627711 3527864
19097 3527864 3486540 3599040 3791510 3852346 3683969 3432508 3293012 3271277 3241339 3170215
19087 3170215 3147859 3212133 3280768 3285356 3263833 3271437 3285735 3263539 3235278 3278088 3423230
19076 3423230 3632769 3837067 3957737 3936803 3805906 3705399 3766173 3964698 4142490 4177729
19066 4177729 4099999 4035578 4088640 4282687 4552811 4758032 4761829 4571591 4370569 4335757
19056 4335757 4432107 4469953 4378316 4321658 4482764 4809394 5079644 5182062 5211250 5276273
19046 5276273 5335902 5289467 5144084 4994757 4878995 4753634 4617831 4564807 4662843 4834622
19036 4834622 4914339 4821819 4645288 4538936 4553179 4586995 4516678 4353952 4242846 4292440
19026 4292440 4447875 4555888 4535128 4441123 4366935 4322738 4240791 4088590 3945045 3929379
19016 3929379 4044834 4139251 4081509 3954886 3978684 4214995 4460075 4497339 4362331 4246592
19006 4246592 4214349 4165769 4051492 3956637 3952338 4019809 4166427 4457621 4847996 5128367
18996 5128367 5169995 5111853 5160298 5289168 5311468 5205291 5176454 5366685 5652056 5799889
18986 5799889 5730866 5565212 5473541 5530401 5676082 5798473 5873572 5999103 6238923 6490286
18976 6490286 6613704 6652285 6767925 6969643 7099932 7136776 7287243 7646540 7965409 7980783
18966 7980783 7854220 8013828 8588733 9257962 9698195 9938721 10171616 10429703 10634066
18957 10634066 10820865 11105498 11465702 11748733 11905936 12068035 12343537 12660046 12870284
18948 12870284 12937151 12949813 13008576 13150806 13353670 13556008 13693491 13743959 13720187 13607671
18938 13607671 13363184 13013730 12700967 12555790 12552246 12547097 12440047 12229028 11940263 11605719
18928 11605719 11307331 11127505 11017199 10813712 10446911 10041133 9749210 9577205 9459880
18919 9459880 9416387 9499253 9643620 9716424 9708153 9745326 9904015 10128137 10340020 10506811
18909 10506811 10583847 10540041 10488764 10645685 11067202 11549160 11882362 12101492 12373297 12741506
18899 12741506 13116649 13440999 13721059 13953977 14168085 14489645 15005826 15581404 15982116
18890 15982116 16187208 16403165 16728168 16990482 17026860 16971915 17106334 17475723 17812000 17847943
18880 17847943 17612795 17373491 17326574 17396415 17347273 17062814 16657952 16303637 16022072 15719453
18870 15719453 15344252 14903666 14385306 13819189 13394261 13319205 13515928 13622136 13387049
18861 13387049 12925955 12497656 12190989 11967292 11858701 11910437 11995043 11904319 11637407 11423058
18851 11423058 11413679 11496051 11469859 11315527 11205340 11282793 11476546 11539716 11293862 10844478
18841 10844478 10498435 10433392 10532005 10607795 10676146 10853978 11077109 11128860 10950942 10731274
18831 10731274 10635219 10617674 10571308 10508171 10494946 10523574 10547748 10564292 10578761 10573173 10575876
18820 10575876 10665875 10831520 10933642 10905966 10880571 10990387 11153154 11210163 11195530 11274880
18810 11274880 11458421 11588976 11629834 11748799 12034406 12312546 12383179 12318417 12367406 12620902
18800 12620902 12917037 13071931 13079342 13053569 13068358 13106620 13119286 13079411 12992186 12887563 12806243
18789 12806243 12780285 12828070 12967846 13215562 13548770 13884339 14128242 14266290 14385991 14581685
18779 14581685 14843801 15069295 15185197 15234888 15327022 15516453 15754665 15953231 16083979 16213017
18769 16213017 16433583 16765434 17133742 17452239 17698217 17884278 18001840 18057229 18139790 18365437
18759 18365437 18741357 19170154 19608356 20119518 20716880 21261641 21626893 21896357 22272015
18750 22272015 22808869 23368082 23839431 24287038 24831511 25486466 26177012 26856072 27538930
18741 27538930 28262106 29053920 29900434 30686990 31221329 31403930 31378281 31437332 31744162 32184970
18731 32184970 32533818 32726416 32906800 33207463 33570376 33848928 34030312 34246621 34560541
18722 34560541 34851863 34972029 34924309 34814108 34693475 34556470 34440742 34416451 34487582 34608066
18712 34608066 34784883 35053143 35354454 35579015 35761302 36093374 36672778 37362135 37995862
18703 37995862 38613398 39356030 40218145 41067875 41884379 42801623 43889481 45043695 46162258
18694 46162258 47308363 48597160 50007895 51436790 52899958 54546313 56444603 58469691
18686 58469691 60463385 62432555 64511263 66778343 69198434 71703786 74221068 76625781
18678 76625781 78811002 80860989 83044758 85544082 88260728 90981726 93662054 96435417
18670 96435417 99416227 102641666 106177837 110106530 114369470 118768400 123186619 127716616
18662 127716616 132528494 137719908 143353198 149541036 156420350 164104969 172704360 182306805
18654 182306805 192906418 204446012 216975323 230644100 245460068 261155790 277356342
18647 277356342 293734297 309889094 325223464 339125903 351221730 361333905 369328129
18640 369328129 375205008 379285209 382088235 384013933 385256563 385914948 385905928 384750436
18632 384750436 381714432 376290431 368412424 358190165 345700006 331205163 315400862
18625 315400862 299208008 283343917 268196505 254025538 241095048 229572617 219413755
18618 219413755 210435923 202519719 195717766 190133098 185693767 182134609 179260354 177117859
18610 177117859 175777148 175049774 174650826 174608673 175256872 176781299 179028800 181842474 185316100
18601 185316100 189570355 194532493 200148831 206608854 214124779 222670030 232198265 242959013
18593 242959013 255278555 269126161 284236088 300624923 318637885 338423777 359640583
18586 359640583 381720791 404119802 426198911 447163312 466317999 483220941 497479462
18579 497479462 508642771 516512725 521416681 523980012 524718191 523953839 521913425 518616638
18571 518616638 513709266 506613052 496849790 484137367 468322036 449485945 428137547
18564 428137547 405110951 381236772 357199580 333623126 311045067 289756424 269843324
18557 269843324 251435909 234743934 219788287 206294746 193990556 182873183 173042336
18550 173042336 164373999 156538416 149305113 142676864 136720892 131396566 126576982 122139824
18542 122139824 117994845 114092696 110450629 107126190 104137338 101444239 99020138 96881797
18534 96881797 95015846 93327733 91723324 90222958 88942633 87960060 87235663 86674652
18526 86674652 86238702 85972497 85920858 86040929 86233754 86485720 86938041 87738287 88818698
18517 88818698 89917594 90877624 91842192 93066929 94601210 96277316 97973155 99729021
18509 99729021 101600102 103569042 105671364 108051521 110789563 113802912 117040553 120641489
18501 120641489 124732023 129178075 133767934 138599531 144038034 150251702 157018572 164097538
18493 164097538 171614799 179949571 189362612 199877532 211440958 224045974 237712866
18486 237712866 252442927 268171011 284675043 301514693 318081147 333698875 347714828
18479 347714828 359616336 369158266 376369100 381449428 384751939 386844517 388407009 389930665
18471 389930665 391552032 393167486 394527081 395135269 394274347 391343619 386108713 378516444
18463 378516444 368464767 356018218 341751569 326586445 311276615 296253921 281910346
18456 281910346 268698839 256871349 246375384 237123525 229156832 222441861 216737890
18449 216737890 211837263 207779039 204673185 202465450 201044430 200449283 200780713 201988628
18441 201988628 203918475 206504411 209765159 213674972 218199202 223417573 229478910 236486356
18433 236486356 244553005 253887125 264657223 276845991 290424123 305593103 322609737
18426 322609737 341382792 361480503 382516548 404194146 425850792 446274590 464236044
18419 464236044 479069597 490584854 498675966 503414121 505490941 506179424 506639353 507341101
18411 507341101 508170457 508839190 508981955 507954098 504792664 498517492 488498616 474597758
18403 474597758 457080627 436484407 413573419 389335009 364850506 341000151 318239936
18396 318239936 296718192 276610214 258230524 241765953 227027495 213621006 201340571
18389 201340571 190271345 180513310 171940041 164270349 157270341 150831589 144941918 139645256
18381 139645256 134964314 130811358 127036799 123588585 120514662 117761243 115112613 112433365
18373 112433365 109833647 107461155 105272918 103187444 101298179 99668720 98059640 96252305
18365 96252305 94615228 93870326 94126258 94565351 94391762 93763073 93407135 93570963 93828304
18356 93828304 93831914 93754816 93901573 94291388 94808520 95477167 96388785 97553058 98987599
18347 98987599 100793387 102991071 105428708 108004271 110859580 114208844 118079272 122365629
18339 122365629 127058481 132279770 138148072 144715553 151974337 159826071 168107851 176723886
18331 176723886 185649728 194699429 203388382 211156325 217657134 222750889 226386352 228709588
18323 228709588 230190148 231376004 232511836 233584554 234710232 236200155 238140226 240082204
18315 240082204 241261248 241020069 239009751 235201758 229874268 223489027 216436672 208930700
18307 208930700 201192794 193616736 186624939 180434383 175072376 170542593 166830551 163791117
18299 163791117 161203745 158981342 157228975 156077999 155558089 155658466 156412004 157850660
18291 157850660 159938366 162617711 165893594 169815413 174399929 179635014 185561235 192290772
18283 192290772 199916664 208443320 217855639 228247149 239827543 252778802 267126791
18276 267126791 282766181 299566945 317399094 336041853 355074902 373824235 391381540
18269 391381540 406742467 419074462 427957333 433394187 435641672 435135088 432597788 429053797
18261 429053797 425494432 422414306 419683543 416870422 413619789 409688562 404716944 398141339
18253 398141339 389439235 378448620 365404218 350696177 334696516 317853695 300825373
18246 300825373 284327119 268787436 254232296 240560494 227858549 216372713 206240343
18239 206240343 197373182 189599684 182799594 176858875 171616069 166976211 163039523 159995029
18231 159995029 157860376 156406419 155375034 154709485 154532083 154965348 156048753 157781856
18223 157781856 160144810 163078445 166545024 170643550 175582682 181479551 188239607 195703459
18215 195703459 203880568 212957272 223051056 233981324 245281356 256404466 266891444
18208 266891444 276321957 284132700 289613902 292257735 292164754 290024593 286661180 282678117
18200 282678117 278536179 274730710 271649269 269287938 267273714 265153659 262531204 258978642
18192 258978642 254061922 247568727 239628749 230582146 220831496 210813898 200930944 191406085
18184 191406085 182311690 173787253 166094413 159374780 153488707 148212988 143503059 139450469
18176 139450469 136073545 133278043 130969486 129101434 127663185 126696389 126245669 126211253
18168 126211253 126355599 126571071 127041863 128012937 129506440 131419021 133772474 136641836
18160 136641836 139919007 143425315 147258693 151764016 157108791 163136216 169723341 177039881
18152 177039881 185311006 194539559 204659284 215803409 228182050 241751382 256201917
18145 256201917 271247656 286727680 302363176 317531142 331359523 343045697 352132392
18138 352132392 358588685 362699400 364892898 365670296 365630610 365398388 365372643 365500002 365288166
18129 365288166 364007026 360900218 355360687 347092840 336196265 323109924 308484009
18122 308484009 293061674 277557274 262533787 248360747 235262140 223353920 212651383
18115 212651383 203128170 194788107 187617333 181491749 176258078 171910867 168535532 166043377
18107 166043377 164147422 162691011 161825379 161736982 162369705 163583132 165429071 168055024
18099 168055024 171440752 175460038 180137611 185623939 191973703 199193297 207478334 217132727
18091 217132727 228214092 240500930 253873760 268494412 284492499 301641891 319432235
18084 319432235 337278543 354540069 370484192 384391652 395676750 403925309 409006871
18077 409006871 411252331 411392080 410213658 408320667 406140046 403857959 401194113 397421539
18069 397421539 391760961 383660528 372717013 358704020 341947224 323442746 304295876
18062 304295876 285142458 266303333 248248227 231511011 216242343 202237625 189413458
18055 189413458 177928857 167826096 158896288 150970458 144029647 137934420 132363286 127180588
18047 127180588 122606706 118846816 115765855 113102050 110798001 108926921 107462881 106328305
18039 106328305 105540096 105126731 105022364 105217690 105890055 107192964 109025897 111207673 113772441
18030 113772441 116875655 120490704 124443247 128710838 133439433 138625804 143961047 149010589
18022 149010589 153396532 156813714 159068878 160174198 160288134 159550945 158100619 156224975
18014 156224975 154295015 152469871 150576395 148300855 145377260 141599001 136846926 131197470
18006 131197470 124888251 118131889 111084979 104012650 97287444 91121598 85435088 80081094
17998 80081094 75078846 70534876 66461287 62785918 59455380 56439905 53714282 51288273
17990 51288273 49155305 47179318 45188723 43242299 41609638 40374471 39248131 37929234
17982 37929234 36466333 35080345 33810315 32575076 31436739 30517318 29738024 28921276
17974 28921276 28098461 27436707 26891534 26223892 25367864 24499923 23725660 22989416 22326396
17965 22326396 21878739 21576484 21135294 20508316 20008125 19785962 19519204 18893598 18114412
17956 18114412 17595964 17352905 17079116 16694073 16402122 16250326 16025566 15640684 15278403
17947 15278403 15056326 14847610 14556890 14307685 14200434 14108835 13893374 13637280 13483712
17938 13483712 13378878 13171438 12873325 12635815 12519956 12453606 12382025 12310001 12208098 12019027
17928 12019027 11776045 11606584 11588019 11670582 11754618 11777625 11719799 11598166 11477942 11425206
17918 11425206 11411024 11310477 11047961 10722112 10527101 10531715 10583056 10482030 10231889 10027231
17908 10027231 9975921 9938868 9733265 9404848 9149174 9001731 8794771 8460977 8197992 8215165
17898 8215165 8436733 8592413 8538239 8367826 8248755 8262042 8379012 8488273 8445857 8190393
17888 8190393 7829145 7555521 7471117 7517068 7557281 7489076 7304785 7097503 6979543 6948806
17878 6948806 6875619 6677451 6456395 6381592 6468190 6562241 6531861 6391782 6240642 6144827
17868 6144827 6089552 6000971 5831352 5652844 5611304 5732266 5851347 5830090 5756242 5790342
17858 5790342 5884414 5848063 5681922 5632297 5853872 6196411 6418908 6471788 6462831 6464203 6472650
17847 6472650 6479518 6475167 6440506 6402280 6420827 6468124 6434480 6341575 6408219 6754441 7150533
17836 7150533 7253908 7044004 6828012 6826341 6943891 6983341 6909141 6823625 6807811 6869070 6967490
17825 6967490 7042684 7085507 7199944 7486208 7836003 7983535 7828406 7570038 7424744 7355511
17815 7355511 7231924 7120418 7183707 7352467 7365691 7171584 7027943 7088935 7128926 6879881
17805 6879881 6470844 6265862 6347255 6450059 6412465 6388540 6506310 6588564 6424940 6137829
17795 6137829 6025453 6139426 6272538 6322427 6399539 6546477 6610686 6503162 6374390 6382711
17785 6382711 6441907 6370671 6191918 6105374 6208508 6405362 6584682 6748547 6933009 7096888
17775 7096888 7140530 7009927 6777140 6623140 6695889 6953757 7198584 7292982 7274177 7221883
17765 7221883 7132483 7011320 6965435 7053485 7125400 6987567 6689653 6470618 6430323 6435095 6369568
17754 6369568 6301142 6328082 6410555 6438982 6371528 6239946 6102918 6032421 6053834 6074585 5982837
17743 5982837 5835098 5800636 5883509 5881116 5707427 5569791 5671807 5895231 5976867 5903620
17733 5903620 5912952 6130527 6403593 6510081 6381817 6102496 5819498 5684646 5763094 5959402
17723 5959402 6112733 6176792 6228298 6311617 6382233 6404529 6391148 6331498 6196016 6036285 5967254
17712 5967254 6013376 6077934 6100276 6129131 6192797 6220044 6165665 6104391 6108131 6124641 6076700
17701 6076700 5991707 5917975 5795500 5556333 5306174 5247424 5419868 5648894 5763227 5746698
17691 5746698 5667040 5591635 5610045 5796088 6063854 6175646 6001360 5695159 5513426 5524913
17681 5524913 5613501 5705607 5844907 6056465 6292186 6545545 6885455 7310241 7676097 7855439
17671 7855439 7891273 7917324 7994529 8105175 8229568 8316193 8237893 7926383 7543066 7373584
17661 7373584 7513515 7760588 7854402 7730485 7504109 7309072 7217332 7230760 7270062 7227792
17651 7227792 7102572 7031190 7122849 7313660 7456567 7503829 7514591 7523411 7506408 7467495 7453443
17640 7453443 7458985 7401373 7241027 7082797 7099216 7347841 7691070 7922466 7978078 7991602
17630 7991602 8110563 8301859 8415535 8409610 8387596 8403443 8380663 8288953 8247249 8335473 8439674
17619 8439674 8435681 8404109 8466354 8505180 8307529 7964509 7847192 8102506 8407392 8365861
17609 8365861 7986316 7612575 7498278 7607833 7768920 7862527 7860883 7779791 7626159 7380986
17599 7380986 7061799 6797094 6747189 6901187 7030514 6918256 6593268 6282393 6164304 6209901
17589 6209901 6237271 6103499 5864832 5726642 5784765 5869287 5751203 5456391 5223989 5186130
17579 5186130 5275181 5418829 5572439 5553339 5194398 4792391 5021763 6098534 7308040
17570 7308040 7739739 7317162 6716161 6405618 6240649 5991659 5772411 5763894 5884678 5973431
17560 5973431 6052617 6198165 6335764 6357640 6293076 6207705 6082076 5933437 5896317 6020067
17550 6020067 6140809 6131700 6130124 6308688 6549746 6588886 6399579 6184865 6029336 5823379
17540 5823379 5552409 5407540 5515144 5743961 5890924 5917311 5889516 5807866 5640309 5466714
17530 5466714 5440937 5591195 5752233 5742144 5565579 5399739 5392971 5518091 5631348 5628881
17520 5628881 5506661 5310461 5104974 4977108 4974097 5025707 5026737 5018010 5157344 5450235 5656886
17509 5656886 5598297 5438238 5477297 5726283 5893894 5809408 5654005 5687334 5897830 6050904
17499 6050904 6000053 5827530 5709667 5742719 5897154 6065142 6135281 6071964 5948889 5880350
17489 5880350 5897355 5906735 5802914 5623013 5551470 5728234 6064591 6302877 6272690 6044791
17479 6044791 5817332 5703755 5665940 5607893 5484567 5337738 5252350 5257392 5269679 5189748 5054952
17468 5054952 5005992 5071788 5102072 4988962 4845610 4847756 4981150 5086907 5106443 5129799 5213325
17457 5213325 5289006 5273392 5166304 5034145 4974151 5068206 5274434 5405447 5340757 5225386
17447 5225386 5307172 5599575 5875842 5987111 5987315 5927918 5767670 5571532 5565416 5834428 6144280
17436 6144280 6242012 6193602 6228873 6366537 6423324 6343620 6284875 6352671 6445722 6432298 6340066
17425 6340066 6284868 6297275 6302453 6237821 6138769 6111175 6222512 6405075 6485719 6347607 6050209
17414 6050209 5755092 5550517 5390677 5197732 4980602 4839387 4857366 4987387 5070695 5010457
17404 5010457 4901249 4911661 5056468 5193841 5249264 5298097 5383147 5409646 5315287 5199026
17394 5199026 5155531 5113179 4988887 4886617 4958650 5158041 5327922 5469304 5696783 5960264
17384 5960264 6054671 5934803 5798931 5797147 5852505 5851069 5827300 5852090 5883442 5847668 5765882
17373 5765882 5703486 5681133 5705254 5788267 5874594 5857397 5738682 5655665 5671793 5670335 5552146
17362 5552146 5407391 5365239 5388151 5358124 5271403 5195715 5114209 4975962 4847176 4847757 4964685
17351 4964685 5070982 5099854 5064723 4957336 4794760 4727165 4890745 5147172 5187945 4954571
17341 4954571 4746074 4808551 5011087 5079732 4996952 4971079 5094547 5238643 5275155 5225139
17331 5225139 5151267 5038985 4854183 4642918 4512353 4542157 4732241 4997046 5199791 5243189
17321 5243189 5157125 5073005 5097503 5226951 5373669 5439050 5373736 5223840 5123341 5182891
17311 5182891 5368023 5531998 5572554 5497862 5345347 5141615 4976911 4993421 5200520 5393511
17301 5393511 5380419 5225005 5126036 5108466 5013554 4791817 4609999 4604927 4698795 4754658 4776095
17290 4776095 4835108 4909662 4919270 4852059 4756132 4673625 4660800 4771351 4926949 4933666 4758472
17279 4758472 4651363 4813528 5072429 5115347 4946427 4840490 4899358 4959288 4941096 4972336
17269 4972336 5093576 5148624 5082287 5064188 5174056 5243338 5191542 5241163 5547561 5853214
17259 5853214 5818846 5535501 5384757 5489237 5623197 5625607 5587923 5608713 5633978 5608772 5581659
17248 5581659 5593154 5617027 5649911 5720415 5796199 5817587 5815900 5855420 5881585 5789364 5617617
17237 5617617 5497575 5432560 5327616 5223819 5282076 5517333 5760729 5906689 5984396 5971779
17227 5971779 5787922 5515282 5371462 5386416 5362666 5238921 5212009 5371014 5497176 5407452
17217 5407452 5234236 5155166 5096212 4951177 4865116 5002405 5212187 5242275 5155514 5207945
17207 5207945 5400996 5489542 5402850 5337435 5417734 5552935 5664877 5789594 5902340 5897933
17197 5897933 5816156 5848064 6031149 6161706 6111327 6016737 6032899 6100040 6108926 6115615 6197563
17186 6197563 6229187 6026691 5666194 5450520 5541231 5780667 5927902 5948791 5984777 6103666
17176 6103666 6201425 6171170 6072526 6041288 6068864 5994609 5740352 5431504 5223261 5123231
17166 5123231 5079045 5124238 5297116 5499396 5590753 5565819 5489788 5332037 5052826 4804565
17156 4804565 4822442 5107884 5422471 5607849 5700756 5713068 5556823 5284140 5162020 5344719
17146 5344719 5639058 5757111 5671315 5563641 5536498 5544224 5541890 5545133 5571285 5633585 5762423
17135 5762423 5942884 6073700 6074443 5991505 5916217 5841850 5694340 5485953 5353322 5420464 5650808
17124 5650808 5851727 5851692 5693608 5602472 5708653 5879034 5923458 5877913 5909726 6001452 5954542
17113 5954542 5709606 5438982 5288707 5246103 5296912 5465941 5635181 5585542 5331696 5167707
17103 5167707 5253070 5400670 5416120 5387908 5467932 5616273 5753723 5918238 6074446 6039902
17093 6039902 5824418 5749476 5963816 6151455 6049448 5938698 6203384 6676275 6902988 6844534
17083 6844534 6798418 6779809 6544678 6161451 6002782 6153104 6316161 6326322 6284807 6201900
17073 6201900 6005111 5895643 6155936 6578663 6645048 6308879 6018489 5926243 5741885 5453016
17063 5453016 5451743 5774569 5969317 5911592 5933738 5945528 5440769 4697759 4705814 5262314 4641737
17052 4641737 2430540 1320980 4084058 9425149 13046264 12822785 10843559 9912335
17044 9912335 10133914 10046082 9386967 9069448 9331667 9526066 9410340 9370364 9479744 9372884
17034 9372884 9027859 8814635 8760034 8526453 8155320 8126256 8573797 9049478 9186571 9084362
17024 9084362 8926952 8713399 8504362 8501858 8724401 8944840 9052468 9155137 9270013 9269530
17014 9269530 9198732 9277041 9491634 9546917 9331143 9094550 9046579 9109252 9193450 9374189
17004 9374189 9631158 9746636 9653092 9581333 9666047 9702445 9522496 9328114 9374680 9554993
16994 9554993 9593806 9488524 9473789 9663162 9967898 10271032 10471720 10463531 10268502 10084618
16984 10084618 10018544 9912940 9645241 9430435 9546175 9875845 10044408 9963723 9930159 10162267
16974 10162267 10521575 10754545 10780840 10667674 10514685 10448557 10574535 10848810 11103239 11233745
16964 11233745 11268708 11264622 11269144 11364921 11575240 11732124 11642539 11410690 11370428 11626140 11886528
16953 11886528 11875309 11697072 11624647 11701492 11779790 11842200 12029149 12355300 12623035 12690765
16943 12690765 12681576 12822133 13138780 13408196 13417111 13221674 13103734 13263788 13607445 13881158
16933 13881158 13964892 13935855 13882234 13805685 13731474 13756816 13912158 14103386 14276184 14503445
16923 14503445 14801961 15008282 14997073 14901372 14919656 14998664 14942227 14781060 14760715 14943071
16913 14943071 15096193 15069179 15020932 15128487 15290464 15323089 15285494 15379170 15627223 15881628
16903 15881628 16084251 16293857 16488471 16570236 16563952 16587453 16616669 16528968 16420687 16589808
16893 16589808 17071065 17470046 17484046 17356561 17514931 17914403 18106625 17922145 17716088
16884 17716088 17852847 18256740 18626368 18848030 18999208 19120942 19210170 19340711 19588867
16875 19588867 19881944 20081492 20185354 20308833 20496450 20685259 20830073 20936321 20988042
16866 20988042 20972041 20965425 21079053 21319745 21618081 21966212 22389824 22800537 23044711 23124109
16856 23124109 23208642 23385091 23549404 23614352 23669190 23829576 24050434 24204039 24262800 24309435
16846 24309435 24433651 24685997 25047796 25385024 25544169 25570842 25700645 26029221 26344249
16837 26344249 26441742 26460710 26680533 27087673 27411395 27556579 27717668 28021793 28331176 28515958
16827 28515958 28696785 29046800 29506613 29875042 30092770 30280640 30555399 30937953 31391705
16818 31391705 31826838 32114196 32231445 32372827 32774976 33421750 34042744 34435047 34675780
16809 34675780 34960626 35333315 35682060 35960838 36283821 36756448 37304846 37769656 38128261
16800 38128261 38494778 38886995 39156213 39252897 39414272 39891463 40568452 41091552 41364493
16791 41364493 41645383 42094099 42518078 42727743 42872793 43176595 43563267 43880179 44328859
16782 44328859 45244361 46456400 47310248 47472613 47368375 47605553 48255436 48968462 49561734
16773 49561734 50132052 50696138 51101777 51345659 51685821 52319210 53141992 53941397 54663933
16764 54663933 55366868 56037886 56627350 57194086 57856624 58602869 59282225 59822306 60346396
16755 60346396 61001931 61737926 62356086 62781310 63183485 63772896 64537774 65280955 65902808
16746 65902808 66533923 67339891 68290044 69213679 70029258 70800023 71576761 72321397 73040171
16737 73040171 73882518 74993469 76300166 77552066 78591691 79503088 80446684 81417513 82259798
16728 82259798 82902436 83472322 84138125 84940598 85855701 86931052 88210543 89558807 90744571
16719 90744571 91738936 92756140 93911065 95018669 95899952 96733649 97846585 99210831
16711 99210831 100440911 101350111 102244685 103508298 105082825 106565838 107718254 108664568
16703 108664568 109626399 110662319 111714027 112762748 113859154 115062862 116391422 117779572
16695 117779572 119082201 120191641 121171676 122201574 123363696 124570522 125740837 126942953
16687 126942953 128261923 129593614 130719154 131599077 132466899 133561031 134844527 136075092
16679 136075092 137097101 137961603 138790485 139657885 140626684 141753978 142963511 144017103
16671 144017103 144745066 145254829 145793453 146455985 147169475 147908240 148714123 149495246 150050622
16662 150050622 150396787 150842782 151560738 152264978 152563450 152520473 152593716 153033956 153615834
16653 153615834 154012824 154193855 154327096 154472340 154531798 154423823 154183924 153927409 153766207
16644 153766207 153712981 153644926 153436563 153130201 152858609 152593770 152142570 151447595 150708646
16635 150708646 150099820 149538125 148869927 148121233 147390908 146651912 145872838 145199443 144745848
16626 144745848 144285948 143450963 142226849 140975071 139932029 138966423 137897243 136767379
16618 136767379 135673146 134572442 133429629 132345337 131365336 130342567 129178370 128036178
16610 128036178 127106436 126295720 125362819 124240259 123001816 121646687 120188468 118848183
16602 118848183 117825779 116919043 115727336 114268991 113027319 112257034 111591613 110555779
16594 110555779 109180271 107824499 106599718 105303760 103832314 102332519 100949277 99681297
16586 99681297 98520940 97508267 96581192 95561664 94379711 93175068 92104965 91170684
16578 91170684 90290625 89409669 88455343 87318070 85997130 84679336 83549425 82576776 81597676
16569 81597676 80552803 79515055 78517936 77514872 76534603 75726368 75155455 74644855 73941020
16560 73941020 73010918 72064660 71267030 70523835 69620958 68527735 67481532 66757714 66386901
16551 66386901 66104261 65569897 64670755 63636796 62818849 62299885 61782019 60954030 59911005
16542 59911005 59036344 58474401 57957988 57256426 56539218 56063817 55699782 55105378 54297778
16533 54297778 53653142 53281332 52792182 51884975 50854566 50214730 50020969 49884253 49528691
16524 49528691 48999450 48374062 47628549 46849222 46264083 45923947 45576417 45002800 44307442
16515 44307442 43734884 43349225 43030179 42650177 42119875 41402171 40647726 40181369 40137965
16506 40137965 40194232 39892081 39194888 38498971 38101877 37903962 37683815 37416827 37184759
16497 37184759 36961043 36662082 36292092 35874298 35337894 34652568 34008722 33664339 33616414
16488 33616414 33595077 33399302 33076546 32739378 32383443 31978340 31591146 31287463 31002156
16479 31002156 30638153 30229863 29880488 29582955 29238614 28834977 28468294 28174811 27856798
16470 27856798 27409839 26837993 26227232 25696192 25383176 25363433 25526901 25626273 25502349 25212059
16460 25212059 24933483 24827860 24964366 25221854 25266244 24844518 24162438 23719937 23645468 23482215
16450 23482215 22873784 22176122 21996941 22308923 22507113 22305923 22050008 22018951 21948578 21543791
16440 21543791 21052052 20906107 21049245 21061936 20842553 20725110 20900376 21088806 20916886
16431 20916886 20385084 19825941 19525749 19489196 19524739 19508548 19532297 19710727 19868520 19645612
16421 19645612 19015669 18431940 18234895 18179190 17888080 17541933 17625420 18085366 18292167 17912710
16411 17912710 17314613 16937727 16738120 16513116 16364742 16504209 16888489 17344172 17773245
16402 17773245 17959707 17512822 16409841 15345927 15080376 15539437 15951237 15791337 15257651
16393 15257651 14877786 14915903 15045185 14412800 12397684 9729413 8418771 9785374 12690069
16384 12690069 14547824 14129213 12554035 11462330 11261656 11592943 12411311 13651947 14529477
16375 14529477 14294038 13411106 12997178 13206007 13151463 12457395 11855506 11924427 12153267 11851686
16365 11851686 11335606 11475246 12385961 13243130 13326812 12751239 12140358 11948250 12166325
16356 12166325 12462095 12532736 12411901 12392573 12601791 12814500 12800380 12646584 12544326 12453613
16346 12453613 12238486 11987515 11911673 12001826 12040038 11885734 11537795 11036552 10568464 10524762
16336 10524762 11095045 11872601 12248240 12173307 12121768 12285224 12300349 11928118 11513913 11458942
16326 11458942 11601049 11488214 11016348 10445263 9982828 9704418 9720003 10045910 10400926
16317 10400926 10474052 10336045 10275887 10313139 10227264 10018554 9945771 10086706 10242956 10336484
16307 10336484 10512585 10747785 10758056 10481209 10283208 10440600 10732214 10813894 10708304 10609505
16297 10609505 10461067 10111225 9717383 9593077 9722366 9791130 9683040 9612347 9738552 9935972
16287 9935972 9997207 9846712 9540535 9255097 9231820 9483882 9615420 9250607 8623675 8372581
16277 8372581 8697134 9115226 9177865 9018906 8969124 9000829 8890274 8657133 8467492 8276929
16267 8276929 7947290 7618376 7587929 7830526 7965854 7761350 7405668 7207674 7236723 7354175
16257 7354175 7439080 7474608 7493665 7507789 7461430 7264424 6910615 6520817 6219699 6044012
16247 6044012 6020617 6199345 6505695 6714003 6715018 6655463 6643977 6523401 6196986 5977413
16237 5977413 6228327 6767064 7046720 6900408 6664838 6549793 6387392 6137872 6123415 6473978
16227 6473978 6777632 6649871 6309429 6195820 6303805 6332653 6266511 6319418 6436066 6344959
16217 6344959 6071544 5929589 5983316 5972651 5841562 5881799 6202793 6492183 6526899 6529101
16207 6529101 6722231 6882327 6707923 6374331 6279325 6384603 6283778 5912617 5721583 5995855
16197 5995855 6388526 6393349 6033771 5778665 5896920 6199413 6404823 6474399 6486958 6404480
16187 6404480 6151245 5826213 5643448 5664823 5736325 5714576 5631622 5583728 5566763 5507915 5391036
16176 5391036 5262135 5151428 5065097 5020080 5016366 5004866 4950240 4897146 4910481 4982852 5063671
16165 5063671 5131370 5155782 5045631 4756859 4437721 4341859 4567792 4954212 5232692 5224903
16155 5224903 4935662 4561483 4378910 4495797 4720156 4795963 4740893 4783969 4975429 5076578
16145 5076578 4912539 4637609 4517292 4587798 4673256 4638366 4489772 4306545 4193528 4234060
16135 4234060 4373354 4417452 4266285 4082442 4102099 4334022 4577570 4688726 4678352 4576923
16125 4576923 4376958 4141743 4023252 4093446 4241219 4307344 4274781 4263824 4350981 4441853
16115 4441853 4363790 4094970 3846112 3831775 3985274 4033312 3877160 3732121 3792348 3924973
16105 3924973 3876890 3673999 3591298 3758398 4005561 4118475 4063003 3919551 3763169 3672531
16095 3672531 3715853 3847473 3918095 3845795 3688860 3521003 3354195 3228750 3240630 3392318
16085 3392318 3529737 3524130 3418981 3298618 3122150 2838173 2591181 2616807 2907428 3146843
16075 3146843 3070693 2792736 2652800 2782856 2971393 3000465 2970271 3131778 3462406 3637044
16065 3637044 3486802 3271907 3326512 3586596 3710437 3593196 3488379 3599312 3805777 3885687
16055 3885687 3802158 3657309 3531496 3486656 3572337 3695941 3631985 3316319 3014902 3035876
16045 3035876 3362171 3724664 3948581 4045539 4029601 3859274 3576169 3329739 3214758 3188281
16035 3188281 3169000 3131299 3094170 3092499 3150688 3221632 3193437 3034969 2873454 2827597 2841436
16024 2841436 2820527 2850743 3086398 3456595 3695705 3673945 3495345 3257541 2959732 2715538
16014 2715538 2785954 3221962 3665244 3713267 3369179 2954016 2691229 2586275 2625297 2830934
16004 2830934 3109956 3267875 3244164 3181790 3209015 3291286 3355219 3414087 3481951 3491999 3419051
15993 3419051 3382855 3483382 3590610 3462255 3078547 2720344 2662104 2878996 3110560 3140612
15983 3140612 2957338 2699640 2518793 2465321 2457817 2381063 2240862 2172081 2253424 2385382
15973 2385382 2429050 2400285 2414682 2482824 2494090 2392098 2230027 2050679 1862727 1752887
15963 1752887 1839407 2049827 2135860 2026668 1984717 2237499 2611311 2762137 2671121 2642522
15953 2642522 2827486 3014786 2959948 2713933 2523926 2549586 2761040 2999663 3069158 2877990
15943 2877990 2563659 2381448 2414351 2491816 2442532 2305601 2217482 2208143 2213876 2209594 2226847
15932 2226847 2292484 2417877 2586701 2700109 2628244 2399560 2247876 2357940 2621687 2757047
15922 2757047 2631136 2364706 2145141 2040718 1999912 1948421 1860375 1770037 1723330 1714352 1697385
15911 1697385 1664630 1657868 1687029 1699990 1657193 1573933 1476101 1398743 1441998 1705039 2105541
15900 2105541 2381302 2363903 2173339 2065801 2160571 2374326 2534643 2498068 2256755 1990004
15890 1990004 1899358 1941767 1875973 1636028 1454196 1491199 1572812 1492441 1360639 1386713 1492226
15879 1492226 1467009 1383704 1488443 1739149 1848303 1797885 1899523 2236390 2440322 2229527
15869 2229527 1845415 1698277 1826959 1989166 2098155 2256725 2449891 2501303 2340497 2100988
15859 2100988 1931726 1868522 1901791 2023933 2175966 2259360 2243561 2191465 2152578 2090911 1953021
15848 1953021 1774045 1672798 1723944 1852859 1909281 1860761 1836353 1925584 2034041 2045501
15838 2045501 2021638 2071419 2113477 2004395 1855337 1926757 2178811 2244345 1968142 1674909
15828 1674909 1708882 1958828 2078866 1981374 1843085 1764642 1705522 1681356 1764630 1911725
15818 1911725 1998740 2012158 2026663 2022879 1901723 1660772 1404183 1208400 1119566 1224256
15808 1224256 1545996 1910462 2099825 2131235 2212620 2424287 2607939 2589362 2375768 2113664
15798 2113664 1955787 1968690 2082016 2146786 2110830 2076171 2116143 2150189 2104566 2052915 2044502
15787 2044502 1949457 1685103 1454097 1495724 1703437 1778993 1703108 1742008 1992360 2219650
15777 2219650 2196705 1958675 1677525 1491693 1476425 1580819 1603376 1435751 1284003 1403278
15767 1403278 1675168 1748951 1560178 1369028 1297936 1207662 1065801 1045722 1169850 1227417
15757 1227417 1161692 1183452 1376348 1541063 1562296 1576618 1638011 1581734 1376965 1249562
15747 1249562 1286653 1280541 1127354 1008878 1030561 1082719 1192828 1542508 1983963 2085684
15737 2085684 1853916 1802413 2073431 2188068 1970155 1906325 2164694 2168267 1721345 1536894
15727 1536894 1855823 1693749 571340 -289965 -166337 -977119 -4681074 -9035979 -9056409
15718 -9056409 -3441257 3163636 5748068 4539360 3200937 3417696 3867589 3532502 3176091
15709 3176091 3406842 3542191 3053537 2535676 2531647 2608503 2282073 1889316 1880036 2013526
15699 2013526 1881754 1621743 1550760 1590257 1542081 1513558 1635791 1734241 1665088 1635100 1832156
15688 1832156 2054023 2036500 1864701 1755810 1701708 1608477 1540627 1568532 1601950 1587152 1627935
15677 1627935 1734309 1732017 1593474 1536365 1605825 1526138 1205486 995622 1136376 1318550
15667 1318550 1181355 911287 910145 1137730 1253017 1213289 1260437 1433554 1539611 1536119
15657 1536119 1542796 1536513 1415669 1307990 1434091 1708146 1845161 1825639 1877134 2028815
15647 2028815 2084125 2026564 2033784 2065593 1878914 1524463 1372684 1508636 1555168 1304987
15637 1304987 1082461 1176320 1318146 1134249 815151 852700 1259889 1532052 1374537 1045082
15627 1045082 883448 861441 785871 691134 777940 1069835 1358713 1491160 1538680 1624031
15617 1624031 1704427 1653056 1508495 1482477 1666583 1864046 1829925 1591627 1386381 1334159
15607 1334159 1340834 1307949 1251925 1187294 1078423 977595 1035682 1263017 1424882 1318215
15597 1318215 1056983 944011 1120085 1455095 1725524 1783038 1606668 1326602 1172176 1264753
15587 1264753 1457772 1488385 1289473 1041693 904578 826503 690154 541282 546874 751037
15577 751037 993959 1112568 1132478 1184286 1289670 1345149 1304281 1241855 1203670 1137820 1061106
15566 1061106 1141710 1450463 1737396 1679692 1323269 1048043 1062060 1152521 1031241 733244
15556 733244 524425 540578 677961 786370 845419 958292 1224139 1593428 1854607 1851372
15546 1851372 1706328 1683867 1807425 1803206 1509265 1139593 985771 1025487 1030875 944239 914630
15535 914630 1018663 1164333 1258967 1285243 1215643 1032800 850597 850105 1061956 1342166 1569400
15524 1569400 1718928 1737148 1533435 1170060 900354 901575 1065059 1152997 1090969 1000147
15514 1000147 978977 963918 837178 618990 490720 595987 846007 997189 944665 855958
15504 855958 950363 1215486 1428306 1409949 1177792 889113 714397 724174 830310 888260
15494 888260 899178 996384 1159545 1121528 733107 262685 91303 221441 362738 413433
15484 413433 515408 654381 595794 316016 147993 327484 673870 899119 976793 1008326
15474 1008326 968276 823122 708998 741462 798433 727569 631230 701882 889136 976640 902668
15463 902668 773423 643148 515790 484042 614868 753574 693795 502331 426479 516782
15453 516782 608183 651895 769310 952039 1007547 879142 749717 731449 711912 629776 646526
15442 646526 866729 1096871 1091357 895699 745390 721984 698536 575716 413955 341448
15432 341448 426539 624048 799416 853892 850526 928607 1073708 1111142 981862 857909 872596
15421 872596 894273 734778 470126 358883 488834 684135 761230 724397 672908 627939
15411 627939 522197 328465 147901 130260 283222 418321 379565 283275 377899 667506
15401 667506 867261 788634 568625 415463 330644 237731 198199 290018 409208 414123 368956
15390 368956 428167 561097 610515 558764 516596 506687 485548 526029 727447 974761 1049618
15379 1049618 975336 982777 1118435 1169218 1026470 842056 742184 664121 583068 621661 790890
15368 790890 888145 824028 796559 941216 1051948 889867 557813 309806 180719 88393
15358 88393 124978 409855 767347 896034 798450 719152 716437 653681 585835 743266 1072539
15347 1072539 1205392 1025574 876563 994970 1108838 906342 595938 602907 895133 1034672
15337 1034672 836380 577350 522941 598030 628684 616082 623853 618521 579471 594531 698182
15326 698182 769093 743375 783326 1042161 1366876 1452350 1244614 980714 833979 729188
15316 729188 555418 369914 286839 296705 310485 297764 284622 284863 320398 440311 627924
15305 627924 756164 739631 672718 700906 805948 854554 824720 820137 855151 799263 594505
15294 594505 381214 319084 393257 485155 536282 547223 506628 434094 423770 527829 646195
15283 646195 645273 544061 463912 425552 329201 139422 -28054 -30818 165646 477047 743805
15272 743805 804232 635200 425334 399365 555017 680816 645762 541444 502573 530888
15262 530888 573703 645424 757673 827506 784569 706016 718850 813267 880303 903121 967781
15251 967781 1080836 1121875 1028120 909667 903686 992945 1049862 1005525 894426 775006 698201
15240 698201 729643 891639 1068105 1077897 900509 741029 790588 993258 1148645 1177693
15230 1177693 1144328 1052965 818267 473914 222139 178519 229389 263951 379466 671217
15220 671217 956543 953645 676419 414195 342115 383105 444604 532505 597590 535250 415209
15209 415209 456327 669933 782764 644066 447496 381662 328714 126251 -139273 -371638
15199 -371638 -723220 -1243151 -1492192 -991594 23537 782859 934156 861018 970371 1144996
15189 1144996 1121485 997138 1031283 1208332 1318976 1304922 1247860 1151496 985240 834367
15179 834367 779524 727930 576373 434199 461255 586785 631900 625891 735851 935008 1021281
15168 1021281 956314 907071 921714 845836 646176 554842 738637 1017358 1082788 875576
15158 875576 595248 426310 392403 422503 436706 388193 304467 272252 333667 429242 479196
15147 479196 473384 442890 397112 335477 273385 210359 116326 -3294 -66002 13528 221046
15136 221046 442231 556079 528261 437435 406877 484620 607199 705091 787290 856717 814876
15125 814876 581164 274104 117223 152516 200144 136737 55550 86587 212380 355633
15115 355633 506682 642657 642897 433815 141477 -33989 -36499 67795 251921 521844
15105 521844 796937 945169 926052 792023 588985 377306 298802 456592 733765 886488
15095 886488 832451 709370 641455 610457 593767 654824 801206 885958 768256 495182 233752
15084 233752 91980 84524 194373 368049 508966 579257 666567 848277 1025001 1008616
15074 1008616 775597 519724 422644 467812 533615 586868 689572 841557 916663 795912
15064 795912 519362 259349 152041 183989 237262 214856 121836 56013 124248 332297 547231
15053 547231 610938 510306 388645 361337 381055 343936 275737 317219 529437 794794 934184
15042 934184 877261 709446 589540 616663 734889 776644 646475 449339 383119 516759
15032 516759 735184 890914 938593 924036 917270 964313 1037111 1029520 875139 663510 548454
15021 548454 539062 492937 344559 220836 259354 400611 451208 318550 125776 107119 392121
15010 392121 849343 1160780 1129860 896075 738463 703023 606029 412361 359399 581090
15000 581090 831570 792496 510253 296801 285286 327198 300334 277873 349730 464445 522792
14989 522792 506155 454063 399867 360241 320318 226504 60575 -100791 -173317 -169384 -134649
14978 -134649 -55504 55773 78195 -47124 -145503 -21227 213220 268566 119179 32287
14968 32287 128479 214679 150194 81670 151762 239815 205251 170372 316812 561787 680398
14957 680398 629836 526002 410133 270254 194150 255935 330000 269125 198691 355615 671215
14946 671215 816837 684717 524527 529988 576658 501901 397076 437145 591499 689313 663410
14935 663410 574580 476039 387802 345207 363126 396564 408959 420858 438716 420993 373149
14924 373149 375595 446185 482623 427235 376807 421490 482832 444467 352541 331048 359095 301532
14912 301532 146076 52864 137615 315820 403894 314500 132718 32280 105376 255607
14902 255607 307070 237022 200989 277733 334485 268283 234237 425991 719333 787967 561309
14891 561309 316765 277538 362025 417175 460324 537672 542571 378075 171496 120659 206498
14880 206498 254935 228214 246847 338132 376221 312402 274879 355947 452981 431034 329861
14869 329861 286631 330287 378890 393014 401077 389013 298193 158394 106565 213902 377186
14858 377186 448666 405969 314414 181345 -37148 -297856 -456589 -427257 -271462 -93058
14848 -93058 75577 232641 336534 360093 360086 399881 434042 362439 186012 21131 -39436
14837 -39436 -1453 89437 193831 261572 260332 240147 286543 392921 466663 474566 475041 482019
14825 482019 427720 316081 273026 347940 393144 267403 50492 -88049 -130593 -146824 -77720
14814 -77720 189678 561299 783516 771818 674376 577183 396930 157563 108066 375773
14804 375773 703263 760877 585101 468941 516426 565908 510894 434378 413513 428256 495671
14793 495671 661735 807714 714449 423402 287687 497586 773611 756502 529478 466210
14783 466210 645662 733848 482237 77460 -121828 -20372 174266 245122 177264 115480
14773 115480 190527 385687 560663 617558 603560 596288 557456 425723 308993 400685 679408
14762 679408 873480 802702 603190 511644 557026 587088 504061 357998 277291 390612 727073
14751 727073 1114394 1292052 1215830 1107535 1097000 1017700 750948 555286 731628 1096623
14741 1096623 1181807 923845 737371 837940 929961 755739 547166 616130 810307 772087
14731 772087 539908 460824 586229 587169 309494 27146 13286 172528 280235 339376 474318
14720 474318 634887 649200 501893 353027 297500 279271 261308 324268 521230 733599
14710 733599 780992 658218 572446 704692 987995 1191770 1201187 1113275 1043608 969760 850584
14699 850584 778165 856253 994559 1003968 880050 809947 880706 970321 984631 1007806 1103525
14688 1103525 1135907 955593 657912 480685 495452 551676 500690 342343 166879 76112
14678 76112 153831 390484 625379 674006 539360 409910 426100 527842 553655 416593
14668 416593 161978 -77279 -161754 -56031 109598 150832 36150 -71463 -6817 218761
14658 218761 458522 587950 580291 484705 391468 383304 458953 522117 497724 440333 464120
14647 464120 570648 625308 538502 398841 350389 378992 335636 190916 138350 343691 674802
14636 674802 829500 711716 522971 453724 448193 357501 176500 -5349 -176629 -364348
14626 -364348 -492116 -453980 -301151 -183948 -112632 49269 332178 583046 703860 797570
14616 797570 971111 1133115 1125774 967636 825091 793089 831503 889999 969432 1049073 1051894
14605 1051894 921022 688175 452192 312056 306073 385993 468835 537979 655331 838875
14595 838875 984165 980842 874638 821531 873505 892347 722232 406448 176514 216737 465795
14584 465795 680393 696267 587172 536777 599892 665293 637063 555574 516357 555338 651668
14573 651668 764394 822220 761363 636691 616979 788598 1024475 1132396 1083178 1003652
14563 1003652 984120 988643 941286 824323 698253 671759 815450 1051188 1181846 1108958
14553 1108958 972111 983529 1167329 1360021 1431299 1392819 1307380 1205374 1101133 1004345
14543 1004345 902167 784740 673171 578834 490730 460116 596893 870609 1027045 883822
14533 883822 638564 668937 1044467 1445444 1571857 1426210 1175533 961401 903225 1066811
14523 1066811 1332010 1469139 1421542 1334338 1262420 1099420 882249 867216 1119004 1296918
14513 1296918 1103172 721526 522159 517453 447964 285785 279607 520227 797136 925240
14503 925240 933896 884560 760909 605980 534458 535573 476242 364296 385737 594882 788986
14492 788986 806616 746150 747613 743467 602698 387892 284859 352310 493768 626921 751392
14481 751392 876504 981520 1041473 1048131 1026738 1028967 1043551 940168 629713 270423 139224
14470 139224 270206 420765 456878 535918 777497 991321 946523 732056 604317 607004
14460 607004 600477 569872 615017 673699 554799 281735 131496 242499 410570 395111 240905
14449 240905 148638 166439 178339 122080 57674 38882 48271 80829 193395 412155 635570
14438 635570 700688 562716 365062 292081 378999 514577 596168 598110 510551 334008 149161
14427 149161 62783 54323 18531 -7399 147050 468955 680370 627292 527591 613656 741643
14416 741643 651087 439207 410253 552584 567691 391446 262240 227940 37568 -320940
14406 -320940 -403741 94455 849640 1314807 1379005 1322940 1311293 1251770 1057871 775913
14396 775913 499403 344713 419969 646409 741790 573060 376715 411862 560230 538375
14386 538375 353103 227359 190084 93485 -30318 -2078 136005 158733 78353 141024 354894
14375 354894 435520 334075 384262 712330 920339 681698 308704 319471 672536 875847
14365 875847 737814 560533 585101 656987 556983 350067 242323 302240 469591 678265
14355 678265 837650 832146 681760 597672 731198 940349 959912 768518 622059 697363
14345 697363 855388 852030 680180 562276 640452 830401 1005384 1161254 1309664 1363124
14335 1363124 1289253 1262443 1437879 1632806 1506020 1083197 815593 988618 1326232 1385529
14325 1385529 1144905 943004 960934 1055980 1077298 1071862 1123296 1193751 1209852 1165779 1074261
14314 1074261 928962 772572 704306 763668 877393 954672 970119 940512 896598 889543 945204
14303 945204 1000011 961896 845315 765641 789269 867129 923050 929970 897322 862429 888538
14292 888538 988177 1065550 1028941 929018 866046 799470 617459 385098 320157 472788 620943
14281 620943 572775 409468 326564 379648 494376 595541 618397 521351 394995 420645 603233
14270 603233 699654 560721 382025 415082 571370 568380 383960 280949 385460 507312
14260 507312 439740 225481 45218 7137 119277 326292 504459 544129 491673 493111 568161
14249 568161 589052 525651 533675 707892 911939 978563 939422 911136 875296 751155 609586
14238 609586 615059 762783 846613 726803 502386 365115 376482 451501 500400 513349 518721
14227 518721 513703 466728 379886 310862 301609 311136 271951 195723 148772 129739 71375 -20215
14215 -20215 -47711 8005 30814 -29443 -26522 174234 455854 585952 531970 457581 435743
14204 435743 372793 243571 196863 337448 559288 698556 727628 696641 607590 475283
14194 475283 410317 490118 615210 644795 621229 689779 822501 818469 612823 401808 375883
14183 375883 480282 555368 589750 682849 829802 906021 849166 723940 610946 554822 617858
14172 617858 835925 1087017 1157129 1018790 910916 1025939 1229202 1242767 1034341 839253
14162 839253 812128 847785 795248 680565 616002 605943 565417 471426 393276 402869 521169
14151 521169 709671 857999 850342 726469 700844 906571 1184995 1277305 1181679 1132850 1222322
14140 1222322 1257563 1089044 878853 873499 1038817 1124024 1028428 897742 862591 888673 937697
14129 937697 1079489 1321467 1473038 1347404 1027682 774848 707144 728050 760637 867466
14119 867466 1072598 1224533 1169538 980790 885421 996332 1222891 1426103 1552938 1609704
14109 1609704 1597968 1510436 1339389 1085678 811241 659288 731559 947449 1122077 1188344
14099 1188344 1228034 1271262 1221350 1051498 924058 981228 1122490 1140647 1008443 872894
14089 872894 809609 748423 631283 484506 322918 132669 -25325 -42482 66276 161622
14079 161622 200910 306024 526790 690939 627968 434072 354978 461859 595604 611897
14069 611897 539907 483126 480879 513016 566189 643276 733918 800697 792276 686384 535077
14058 535077 438345 449237 537766 663561 819040 960611 981867 848558 708261 751040
14048 751040 966118 1133090 1072448 836011 630118 600701 711687 805604 775925 682930
14038 682930 671017 770669 855664 829624 761692 765347 834195 897521 948988 989506 925138 694909
14026 694909 453895 436660 641966 837146 887359 888124 938488 993718 1026339 1135219 1363189
14015 1363189 1556752 1546106 1354209 1111952 879438 668560 528014 474770 439445 399296
14005 399296 451104 616912 708851 573838 372862 401539 683874 953632 1018096 939698
13995 939698 854503 801662 762464 710192 596316 423836 328900 431271 614982 648600 531365
13984 531365 500772 649692 771793 695369 555796 575307 733132 830394 771911 620728
13974 620728 460836 363638 419811 638086 842099 817082 567957 330638 317482 514834
13964 514834 724361 760588 631695 549646 707413 1025852 1211057 1102287 853523 707219
13954 707219 711277 756490 774896 769356 732997 672239 648092 684287 703998 658383 627257 681838
13942 681838 754270 771065 795410 882928 923138 809625 646224 579236 555172 483200 490269
13931 490269 703883 908085 801918 528363 499755 697813 653091 233626 -71463 99041
13921 99041 431432 489177 385026 454132 599345 501008 272643 338983 722801 983387
13911 983387 902986 760251 816876 954602 985159 966269 1009861 1049294 992371 899103 850970
13900 850970 827013 828811 928744 1075429 1064265 842810 642118 648590 736435 693196 529875
13889 529875 385351 289822 220205 243884 396404 528213 474283 289948 149337 112549
13879 112549 157627 311355 547016 677122 577651 415810 415778 498919 427173 219260 112827
13868 112827 154721 167500 135035 264910 583120 809393 784634 714993 799054 893718 798835
13857 798835 641790 678590 861881 918728 785005 660162 637867 572455 386339 269247
13847 269247 425817 769525 1025682 1077601 1066862 1140799 1219894 1110534 814165 593619
13837 593619 660405 893719 1004365 917743 806915 757085 642222 423947 328695 533006
13827 533006 845886 940311 793338 650291 617262 558662 402559 285840 321270 427872
13817 427872 490233 522594 574924 612639 592216 547771 510486 437653 306964 194397 177971
13806 177971 241800 343264 489076 671787 816543 870652 872355 865350 832621 782279 792271
13795 792271 880221 938082 902910 876254 937871 960088 794605 557559 504519 653608 763912
13784 763912 702783 604313 604082 641256 635393 658214 766941 823566 682198 467919 461331 726275
13772 726275 1030000 1145922 1081144 966498 862549 755786 654835 593792 571460 553497
13762 553497 526905 515515 545613 613972 685317 722503 735505 789619 930151 1103983 1201462
13751 1201462 1181664 1108034 1049692 1006265 958101 929316 948824 995513 1043849 1124002 1256512
13740 1256512 1352625 1287034 1091352 974531 1086522 1326943 1461757 1385408 1189617 1009588
13730 1009588 905737 894178 975345 1077747 1061092 861007 591851 433994 443417 533940
13720 533940 614385 659901 665492 632164 615037 684146 797831 817289 717741 684011 871964
13709 871964 1137144 1165457 883750 581271 550839 737351 859491 795219 694159 724762
13699 724762 859264 954549 933803 813473 630289 439009 342064 412506 577008 664011
$$ [...]
##END NTUPLES=NMR SPECTRUM
##END=
