##TITLE=H1
##JCAMPDX= 6.0         $$ Bruker NMR JCAMP-DX V2.0
##DATA TYPE= NMR FID
##DATA CLASS= NTUPLES
##ORIGIN= UXNMR, Bruker Analytische Messtechnik GmbH
##OWNER= root
$$ XWIN-NMR		Version 3.5
$$ Tue Jan  5 11:22:21 2016 Russian Standard Time (UT+4h)  servis@DPX200
##.OBSERVE FREQUENCY= 200.131235884673
##.OBSERVE NUCLEUS= ^1H
##.DELAY= (6, 6)
##.ACQUISITION MODE= SIMULTANEOUS
##.ACQUISITION SCHEME= undefined
##.AVERAGES= 16
##.DIGITISER RES= 18
##SPECTROMETER/DATA SYSTEM= spect
##.PULSE SEQUENCE= zg
##.SOLVENT NAME= DMSO
##.SHIFT REFERENCE= (INTERNAL, DMSO, 0, 16.5164)
##AUDIT TRAIL= $$ (NUMBER, WHEN, WHO, WHERE, WHAT)
$$ ##TITLE= Audit trail, XWIN-NMR		Version 3.5
$$ ##JCAMPDX= 5.01
$$ ##ORIGIN= Bruker BioSpin GmbH
$$ ##OWNER= servis
$$ F:/spectra/data/servis-vadim/nmr/H1/1/audita.txt
$$ ##AUDIT TRAIL=  $$ (NUMBER, WHEN, WHO, WHERE, WHAT)
(   1,<2016-01-05 11:21:32.50 +0400>,<servis>,<DPX200>,
      <created by zg, POWCHK disabled, PULCHK disabled
       configuration hash MD5:
       00 E9 B6 7A A2 85 ED C7 34 08 36 98 17 FE 4E 26
       data hash MD5: 16K
       1A C1 B2 E6 6A 29 23 93 EC DE 69 45 87 CC A4 07>)
$$ ##END=
$$ 
$$ hash MD5
$$ 2C 62 7C 77 F1 87 72 E7 6E 7F 29 76 5A F3 0F 8F
##$RELAX= 
##$RELAX= 
##$RELAX= 
##$RELAX= 
##$RELAX= 
##$RELAX= 
$$ Bruker specific parameters
$$ --------------------------
##$DU= <F:/spectra>
##$EXPNO= 1
##$NAME= <H1>
##$PROCNO= 1
##$TYPE= <nmr>
##$USER= <servis-vadim>
##$AMP= (0..31)
100 100 100 100 100 100 100 100 100 100 100 100 100 100 100 100 100 100 
100 100 100 100 100 100 100 100 100 100 100 100 100 100 
##$AQSEQ= 0
##$AQ_mod= 1
##$AUNM= <au_zg>
##$AUTOPOS= <>
##$BF1= 200.13
##$BF2= 200.13
##$BF3= 200.13
##$BF4= 200.13
##$BF5= 500.13
##$BF6= 500.13
##$BF7= 500.13
##$BF8= 500.13
##$BYTORDA= 1
##$CFDGTYP= 0
##$CFRGTYP= 5
##$CHEMSTR= <none>
##$CNST= (0..31)
1 1 145 1 1 1 1 1 1 1 1 1 1 1 1 1 1 1 1 1 1 1 1 1 1 1 1 1 1 1 1 1 
##$CPDPRG= <>
##$CPDPRG1= <>
##$CPDPRG2= <>
##$CPDPRG3= <>
##$CPDPRG4= <mlev>
##$CPDPRG5= <mlev>
##$CPDPRG6= <mlev>
##$CPDPRG7= <mlev>
##$CPDPRG8= <mlev>
##$CPDPRGB= <>
##$CPDPRGT= <>
##$D= (0..31)
0 1 0 0 0 0 0 0 0 0.06 0 0 0 0 0 0 0.0002 0 0 0 0 0 0 0 0 0 0 0 0 0 0 
0 
##$DATE= 1451978491
##$DBL= (0..7)
120 120 120 120 120 120 120 120 
##$DBP= (0..7)
150 150 150 150 150 150 150 150 
##$DBP07= 0
##$DBPNAM0= <>
##$DBPNAM1= <>
##$DBPNAM2= <>
##$DBPNAM3= <>
##$DBPNAM4= <>
##$DBPNAM5= <>
##$DBPNAM6= <>
##$DBPNAM7= <>
##$DBPOAL= (0..7)
0.5 0.5 0.5 0.5 0.5 0.5 0.5 0.5 
##$DBPOFFS= (0..7)
0 0 0 0 0 0 0 0 
##$DE= 6
##$DECBNUC= <off>
##$DECIM= 32
##$DECNUC= <off>
##$DECSTAT= 4
##$DIGMOD= 1
##$DIGTYP= 9
##$DL= (0..7)
0 120 120 120 120 120 120 120 
##$DP= (0..7)
150 150 150 150 150 150 150 150 
##$DP07= 0
##$DPNAME0= <>
##$DPNAME1= <>
##$DPNAME2= <>
##$DPNAME3= <>
##$DPNAME4= <>
##$DPNAME5= <>
##$DPNAME6= <>
##$DPNAME7= <>
##$DPOAL= (0..7)
0.5 0.5 0.5 0.5 0.5 0.5 0.5 0.5 
##$DPOFFS= (0..7)
0 0 0 0 0 0 0 0 
##$DQDMODE= 0
##$DR= 18
##$DS= 0
##$DSLIST= <SSSSSSSSSSSSSSS>
##$DSPFIRM= 0
$$ [...]
##$SUBNAM0= <"">
##$SUBNAM1= <"">
##$SUBNAM2= <"">
##$SUBNAM3= <"">
##$SUBNAM4= <"">
##$SUBNAM5= <"">
##$SUBNAM6= <"">
##$SUBNAM7= <"">
##$SUBNAM8= <"">
##$SUBNAM9= <"">
##$SW= 20.6817932712277
##$SWIBOX= (0..15)
0 0 3 0 0 0 0 0 0 0 0 0 0 0 0 0 
##$SW_h= 4139.07284768212
##$TD= 16384
##$TD0= 1
##$TE= 0
##$TE2= 300
##$TE3= 300
##$TEG= 300
##$TL= (0..7)
0 120 120 120 120 120 120 120 
##$TP= (0..7)
150 150 150 150 150 150 150 150 
##$TP07= 0
##$TPNAME0= <>
##$TPNAME1= <>
##$TPNAME2= <>
##$TPNAME3= <>
##$TPNAME4= <>
##$TPNAME5= <>
##$TPNAME6= <>
##$TPNAME7= <>
##$TPOAL= (0..7)
0.5 0.5 0.5 0.5 0.5 0.5 0.5 0.5 
##$TPOFFS= (0..7)
0 0 0 0 0 0 0 0 
##$TUNHIN= 0
##$TUNHOUT= 0
##$TUNXOUT= 0
##$USERA1= <user>
##$USERA2= <user>
##$USERA3= <user>
##$USERA4= <user>
##$USERA5= <user>
##$V9= 5
##$VALIST= <valist>
##$VCLIST= <CCCCCCCCCCCCCCC>
##$VD= 0
##$VDLIST= <DDDDDDDDDDDDDDD>
##$VPLIST= <PPPPPPPPPPPPPPP>
##$VTLIST= <TTTTTTTTTTTTTTT>
##$WBST= 1024
##$WBSW= 4
##$XGAIN= (0..3)
0 0 0 0 
##$XL= 0
##$YL= 0
##$YMAX_a= 62505
##$YMIN_a= -39187
##$ZGOPTNS= <>
##$ZL1= 120
##$ZL2= 120
##$ZL3= 120
##$ZL4= 120
##$ABSF1= 10
##$ABSF2= 0
##$ABSG= 5
##$ABSL= 3
##$ALPHA= 0
##$AQORDER= 0
##$ASSFAC= 0
##$ASSFACI= 0
##$ASSFACX= 0
##$ASSWID= 0
##$AUNMP= <proc_1d>
##$AZFE= 0.1
##$AZFW= 0.1
##$BCFW= 1
##$BC_mod= 2
##$BYTORDP= 0
##$COROFFS= 0
##$CY= 12.5
##$DATMOD= 1
##$DC= 2
##$DFILT= <>
##$DTYPP= 0
##$F1P= 11.0000006437302
##$F2P= -0.999999642372123
##$FCOR= 0.5
##$FTSIZE= 0
##$FT_mod= 4
##$GAMMA= 1
##$GB= 0
##$INTBC= 1
##$INTSCL= 1
##$ISEN= 128
##$LB= 0.3
##$LEV0= 0
##$LPBIN= 0
##$MAXI= 10000
##$MC2= 0
##$MEAN= 0
##$ME_mod= 0
##$MI= 0
##$NCOEF= 0
##$NC_proc= 0
##$NLEV= 6
##$NOISF1= 0
##$NOISF2= 0
##$NSP= 1
##$NTH_PI= 0
##$NZP= 0
##$OFFSET= 16.51637
##$PC= 1
##$PHC0= -221.7752
##$PHC1= 3.843713
##$PH_mod= 0
##$PKNL= yes
##$PPARMOD= 0
##$PSCAL= 4
##$PSIGN= 0
##$REVERSE= no
##$SF= 200.13
##$SI= 32768
##$SIGF1= 0
##$SIGF2= 0
##$SINO= 400
##$SIOLD= 32768
##$SREGLST= <1H.CDCl3>
##$SSB= 0
##$STSI= 0
##$STSR= 0
##$SW_p= 4139.07284768211
##$SYMM= 0
##$S_DEV= 0
##$TDeff= 0
##$TDoff= 0
##$TI= <>
##$TILT= no
##$TM1= 0
##$TM2= 0
##$TOPLEV= 0
##$USERP1= <user>
##$USERP2= <user>
##$USERP3= <user>
##$USERP4= <user>
##$USERP5= <user>
##$WDW= 1
##$XDIM= 8192
##$YMAX_p= 0
##$YMIN_p= 0
$$ End of Bruker specific parameters
$$ ---------------------------------
##NTUPLES= NMR FID
##VAR_NAME=  TIME,          FID/REAL,        FID/IMAG
##SYMBOL=    X,             R,               I
##VAR_TYPE=  INDEPENDENT,   DEPENDENT,       DEPENDENT
##VAR_FORM=  AFFN,          ASDF,            ASDF
##VAR_DIM=   8192,          8192,            8192
##UNITS=     SECONDS,       ARBITRARY UNITS, ARBITRARY UNITS
##FACTOR=    0.0002416,     1,               1
##FIRST=     0,             0,               0
##LAST=      1.9789456,     0,               0
##MIN=       0,             -39187,          0
##MAX=       1.9789456,     62505,           0
$$ Real data points
##PAGE= N=1
##DATA TABLE= (X++(R..R)), XYDATA
0 0 0 0 0 0 0 0 0 0 0 0 0 0 0 0 0 0 0 0 0 0 0 0 0 -12 16 -16 16 -16 16 -16 16 -32 32 -32 32 -48 48 -49 64 -64 79 -80
42 -80 96 -97 112 -128 133 -148 162 -181 198 -224 241 -270 295 -326 363 -406 454 -508 579 -662
62 -662 767 -900 1087 -1354 1780 -2555 4470 -19654 -9599 37026 29525 10338 -8748 -16748
76 -16748 -23968 -11880 13308 33144 24960 3827 -13753 -20108 -20564 -8991 9780 20687 11763
89 11763 -2482 -9152 -9862 -11252 -5098 10439 21350 13516 -3355 -12827 -12141 -9577 -4200 7874
103 7874 18515 13429 -4057 -16605 -15083 -5714 5626 15272 15625 2527 -12309 -13945 -4535 2693
117 2693 4578 7515 9699 2248 -10677 -12579 -611 7962 3083 -3471 -939 2662 -1192 -4838 49
132 49 6378 4964 382 191 577 -4508 -8783 -3862 5060 6770 2385 471 327 -3786 -7601 -2626
148 -2626 6438 7527 714 -3557 -2246 -1383 -1976 1297 6616 5377 -2898 -7935 -4938 -461 385 1155
164 1155 3762 3586 -128 -1196 1986 2568 -1750 -3862 -281 2460 -620 -3903 -1859 1417 512 -1089
180 -1089 1409 3955 1310 -2560 -1218 2450 1957 -892 -651 799 -1626 -5243 -3550 1976 3919 1425
196 1425 382 1780 825 -2144 -1525 2314 2533 -1940 -4174 -1327 1200 138 -590 1494 2571 502
212 502 -919 617 1028 -1941 -3747 -914 2263 1459 -458 459 1932 503 -1438 -512 1036 -366
228 -366 -2525 -1372 1368 1354 -463 25 1922 1089 -1741 -1923 490 1415 57 -325 728 360 -1416
245 -1416 -1432 593 1131 -625 -1331 538 1650 321 -669 425 1002 -466 -1233 98 801 -820 -1991
262 -1991 -355 1711 1359 -156 -120 729 128 -1087 -640 438 -69 -1147 -301 1431 1266 -201 -415 428
280 428 147 -1134 -1231 12 574 -101 -15 1186 1298 -330 -1133 -138 467 -578 -1244 -171 951 651 -33
299 -33 79 327 -130 -474 0 268 -496 -1056 6 1272 765 -446 -343 447 125 -706 -543 185 205 -324
319 -324 -130 669 771 -4 -401 -86 -23 -556 -541 166 374 -116 -50 683 789 -15 -510 -320 -222 -534 -576 24
341 24 604 415 45 289 610 77 -685 -584 -122 -139 -325 -38 454 606 409 99 -224 -503 -525 -129 315
362 315 190 -237 -68 643 720 -133 -737 -607 -156 64 217 255 172 128 189 229 49 -367 -583 -314 79 126 -31
385 -31 123 386 348 193 70 -132 -398 -425 -264 -129 -117 -112 77 576 835 489 -180 -467 -385 -326 -369 -430 -255 203
409 203 585 648 487 202 -164 -449 -453 -213 -113 -139 21 253 292 145 -25 -80 -42 -94 -99 22 245 162 -23 -58
433 -58 -5 -124 -273 -205 -71 37 76 93 102 132 180 174 44 -201 -378 -298 -108 -93 -96 108 339 318 138 103 22 -307
459 -307 -576 -390 91 319 226 293 517 425 -143 -536 -430 -325 -497 -469 120 613 549 338 375 421 12 -444 -443
482 -443 -171 -232 -511 -326 223 324 11 75 408 443 65 -159 -93 -101 -280 -269 -66 -13 -149 -84 249 281 -97 -266
506 -266 42 298 178 11 49 21 -242 -323 -155 -60 -221 -136 393 743 398 -105 -109 29 -275 -696 -578 -101 126
529 126 229 487 689 412 -105 -112 68 -150 -740 -784 -191 195 34 -7 344 485 226 53 168 116 -300 -475
551 -475 -166 114 -93 -253 61 363 55 -312 -171 157 85 -98 118 387 212 -73 47 150 -178 -587 -449
572 -449 46 199 -59 -12 353 325 -34 -79 171 145 -187 -188 130 135 -178 -271 -7 37 -282 -357 33 380 154 -60
596 -60 203 375 127 -119 0 48 -325 -601 -330 44 13 -98 190 584 508 73 -5 109 -148 -613 -539 -81
618 -81 124 34 210 527 406 -36 -223 -58 -34 -367 -419 -53 252 115 -14 195 283 -60 -227 42 202 -73
640 -73 -277 -90 86 -108 -331 -110 163 76 -83 106 415 283 -81 -52 143 -28 -378 -345 -19 -90 -300 -163
662 -163 246 395 176 160 379 300 -163 -375 -166 -92 -327 -374 63 348 164 35 210 250 -100 -315 -114 81
684 81 4 -175 38 304 131 -179 -126 44 -107 -317 -136 188 162 -26 61 260 182 -119 -194 -12 -23 -231 -215
707 -215 98 230 10 -61 171 205 -98 -212 -17 89 -77 -152 82 239 54 -133 13 104 -92 -280 -44 181
729 181 71 -121 30 214 89 -145 -124 1 -45 -174 -24 243 158 -52 -24 188 76 -217 -256 -46 30 -140
751 -140 -71 229 313 99 4 100 87 -162 -275 -122 37 -59 -148 113 342 166 -43 -18 51 -48 -203 -78 72 6
775 6 -100 18 194 121 -125 -157 -12 21 -108 -71 117 153 -6 -38 43 20 -111 -138 13 17 -84 -33 169 224 25
800 25 -127 -38 65 -93 -164 -55 67 1 -23 174 235 91 -92 -86 14 -35 -188 -76 117 102 -3 5 142 66 -76
825 -76 -105 -31 -73 -125 -34 138 179 6 -91 19 66 -64 -148 -79 16 -3 16 119 124 6 -87 -64 -17 -73 -119 -19 115
852 115 73 5 48 130 39 -128 -110 -58 -62 -71 21 131 157 10 25 122 75 -102 -188 -96 -35 -74 -14 89 98 28 0 52 40
881 40 -64 -121 -30 13 -32 -67 3 101 15 -89 -58 2 -16 -79 -3 72 57 24 45 114 27 -86 -113 -61 -23 -39 30 132 116
910 116 47 -8 30 -8 -115 -138 -40 22 28 41 70 81 5 -90 -68 -31 -61 -90 -5 64 55 5 89 95 -18 -83 -86 -47 -62 -54 -16 44
942 44 71 14 35 60 30 -58 -117 -46 -41 -28 -9 52 73 44 29 26 -10 -60 -83 -45 -16 -8 3 79 100 34 -29 -31 0 -15 -52 -7 45
975 45 30 41 13 25 -24 -74 -88 -20 13 25 19 62 55 6 -12 -27 -51 -91 -64 -25 -2 24 53 69 69 47 -38 -43 -37 -65 -65 -17 17 47
1009 47 47 94 69 10 -5 -53 -44 -54 -50 -15 19 74 31 29 19 -21 -21 -53 -31 -31 -10 -7 28 30 30 0 -12 -49 -20 -39 -37 -8 29 37 28 39
1045 39 7 -1 -18 -34 -35 0 9 23 32 46 19 1 -21 -46 -58 -47 11 24 45 72 85 30 -16 -54 -88 -74 -66 -35 -29 35 46 64 53
1078 53 64 21 -46 -67 -56 -46 -33 -16 23 35 21 27 17 12 -36 -56 -10 -4 16 20 30 53 10 -8 -11 -6 -32 -45 -24 7 25 11 29
1111 29 43 -3 -43 -45 -18 -16 -48 -16 30 37 28 -1 -12 -32 -78 -57 -40 6 3 3 61 68 19 -22 -18 -14 -62 -58 -31 8 32 23 44 49 4 -6
1147 -6 -6 13 -13 -20 1 64 66 31 32 34 -13 -65 -61 -31 -10 -29 17 36 51 19 11 20 -1 -81 -65 -51 -1 -24 -3 22 43 -15 -43 0 8
1182 8 -5 -56 -19 29 20 11 20 -3 -15 -65 -39 -1 13 -18 27 70 75 18 20 38 -4 -76 -59 -9 21 -5 26 51 47 5 -17 26 -11 -42
1216 -42 -36 -12 31 3 0 44 56 1 -58 -12 0 -34 -59 -19 30 38 22 18 27 2 -55 -24 5 -6 -19 20 66 22 0 10 18 -8 -50
1249 -50 -48 38 58 13 18 59 32 -28 -46 7 -8 -47 -40 3 30 4 -7 49 28 -8 -62 -42 -6 -20 -47 -10 42 -3 -18 -2 23 -17
1281 -17 -65 -45 -7 8 -25 7 31 18 -4 -11 20 -24 -43 -36 17 12 -18 28 68 30 -40 -25 -11 4 -31 -66 12 40 29 -6 40 33
1313 33 -15 -68 -18 13 -20 -31 0 42 30 -10 -1 24 -12 -42 -31 16 -9 -11 13 62 28 -9 -15 13 9 -37 -17 6 7 -1 13 46 33
1346 33 -28 -39 -6 3 -24 -37 39 33 21 -3 16 16 -17 -47 -7 -6 -6 -15 6 43 18 -18 1 20 -25 -67 -15 7 4 -21 -2 35 33 -23
1380 -23 -22 6 -16 -13 -19 22 33 5 5 27 25 -44 -29 -10 -2 1 -4 39 40 -8 -5 6 12 -21 -32 -7 22 -29 -3 4 40 17 0 -8 5 -19 -37
1417 -37 -2 5 20 0 7 36 -9 8 -18 -8 9 -37 -13 19 23 -6 7 31 20 -19 -44 -3 -13 0 11 29 43 13 8 -3 14 -9
1449 -9 -40 10 20 5 -8 13 25 20 -21 -12 -12 -28 -26 -3 8 12 10 15 31 -1 -41 -28 -6 2 -10 -5 27 15 6 -13 -1 16 -45 -22 -11 32
1485 32 5 4 37 17 18 3 0 4 -23 -33 -12 10 35 21 7 28 -2 -22 5 -23 -36 -26 -2 7 10 14 -6 2 -8 -36 -14 -21 -24 -20 -13 3
1521 3 8 11 -17 -21 -9 -39 -39 -22 8 16 10 21 43 16 -12 -3 5 -9 -9 -10 12 13 2 29 13 -1 10 -5 -17 -17 -8 8 37 11 -5 19 7
1558 7 -12 -39 -32 -9 16 1 3 -5 16 -8 4 5 -9 -26 -14 -6 22 8 11 28 21 -4 -17 -6 17 -20 -5 6 26 24 21 15 5 12 7 -2 -16
1595 -16 6 -12 10 18 -14 -4 -17 15 -4 -12 -15 3 -1 9 2 5 4 -18 0 -15 -23 -14 -9 -3 -19 9 -13 0 10 -10 -11 -16 14 -10 0 17 27
1632 27 11 31 13 34 9 -12 -7 13 9 12 18 25 45 6 8 -9 13 2 -9 7 2 7 36 14 1 11 -18 6 1 -5 -7 0 17 8 12 14 6 -6
1670 -6 -27 -14 -20 -11 6 0 1 1 -5 3 -3 3 -18 8 12 20 5 18 19 19 13 11 2 6 -11 -14 3 20 -9 14 18 0 -3 -9 -27 -21 -6 -20 -3 -5 8 3 4
1713 4 0 -23 -22 0 -29 -13 -7 26 24 -5 16 0 -5 -13 15 -12 -16 -4 -1 20 10 4 -11 0 -23 -16 -3 7 23 20 9 21 8 22 12 1
1749 1 4 4 -1 -4 -13 10 3 12 6 -15 -13 -38 -16 -13 -17 15 9 -13 8 1 4 -4 -10 -18 14 -4 2 4 -4 -6 -12 12 -4 10 -2 -1 9 12 14 15 6 12 -1 -4 7
1794 7 -6 2 9 3 1 19 5 -4 -1 7 -15 -8 -19 -7 -12 0 1 14 7 -13 8 -11 3 13 5 16 20 8 17 4 1 11 -21 -20 -12 -11 12 28 13 21
1834 21 19 10 -2 -6 1 -15 4 -1 17 25 12 11 19 -7 -21 -20 -3 -17 24 21 7 10 -2 -28 -5 -13 -29 -17 -22 14 -1 17 17 -7 -17 4 11 3
1872 3 -10 6 3 13 8 13 14 1 -4 12 -8 -5 -21 -9 22 38 14 -7 -3 10 -11 -14 -8 -10 -12 -2 1 18 -2 0 7 7 10 0 1 4 -6 -2 12 5 1
1913 1 -4 2 -14 -27 -23 -13 -5 14 19 6 15 14 1 -23 -3 -4 20 4 3 14 23 -10 23 19 6 3 -5 5 -5 2 -3 -11 8 20 -11 -27 4 -8 -23
1952 -23 8 3 -4 14 10 1 -15 -13 1 5 2 8 -8 1 5 21 -7 10 -26 -2 1 19 17 12 3 29 17 4 15 7 -17 -11 -1 -29 -14 -2 6 41 -4
1991 -4 5 -26 -8 -1 -11 -16 -2 -7 -2 8 18 -11 -22 -23 -34 -3 2 7 -8 9 5 9 -10 -18 -19 -9 -7 22 14 -2 6 -5 24 10 4 6 -2 -3 -3 9 12
2032 12 10 16 32 -11 -11 -6 -23 -12 2 -10 17 26 -1 -14 22 -22 -20 -28 -22 -31 1 24 -18 -12 -15 -16 6 -13 1 -10 0 3 -3 -3 9 20 0 -9
2070 -9 -15 -13 -6 16 -4 -5 11 20 28 -1 0 14 -16 -10 -2 -9 14 6 2 -16 -12 2 17 -17 -16 -19 -19 -11 -10 4 14 0 -17 -7 -9 -14 9 -18 -4 -18 2
2111 2 -9 6 13 3 -26 -14 -12 -17 19 15 -2 1 7 9 8 -11 -1 -12 -12 9 9 26 35 23 1 1 -3 -2 -5 2 -1 -6 31 4 -14 21 -19 -17 -12 -23 -7
2152 -7 -18 -18 -2 4 3 1 -14 -15 -12 -15 -6 9 26 0 8 9 -11 -18 7 -9 0 4 1 26 8 7 18 10 -14 14 -5 0 -5 -7 9 12 6 2 9 -11 0 -16
2194 -16 -24 7 -8 0 -3 -8 0 -17 -7 -1 -18 -13 -39 -10 3 -6 14 1 3 -22 -6 -13 -7 2 -14 -14 -6 30 10 -5 4 0 2 -9 1 -12 9 9 1 5
2234 5 2 -9 9 -5 -21 -34 -18 -28 14 4 -11 -1 17 21 -6 -17 -6 -9 -15 -9 -2 -1 7 6 9 -12 1 -9 -2 6 3 19 -11 18 13 15 -1 13
2272 13 -9 -13 -2 -1 -3 0 14 -5 12 -23 15 -3 -23 -10 -8 1 -2 -8 7 -8 -9 -1 -9 -7 -4 9 -20 0 -9 4 -15 1 -19 -38 -11 -40 -9
2309 -9 -25 -4 -22 2 -1 0 5 -2 8 -4 7 -2 10 4 2 -9 2 -3 11 11 -3 -16 -14 -16 -27 6 6 -5 4 -31 -21 -21 2 -29 -9 6 -5 -26
2347 -26 -18 -18 -21 -6 -18 12 -1 -16 -32 -7 5 -13 8 -16 7 2 -6 -6 -9 -6 1 -10 0 -10 -11 -13 10 6 -1 4 -8 -10 7 -10 -13 -8 12 5 -15
2386 -15 -12 7 10 1 13 -4 -12 -7 -25 0 -34 -16 -24 5 -12 7 -2 -20 -18 -21 -24 -8 -12 22 14 17 -16 0 9 -13 8 -6 -1 3 2 8 21 -5 -1 -4
2426 -4 2 -8 -30 10 2 -18 1 7 -16 11 -9 -11 -2 -14 9 -8 -3 -5 -13 -8 -18 1 -15 8 -17 -8 -11 -19 13 -8 2 12 13 8 3 5 18 4 18
2465 18 4 1 29 1 10 22 13 5 7 5 8 11 -6 14 14 19 5 -2 6 -16 -19 -3 -2 8 -1 -1 -5 -2 -9 4 -1 -23 -26 -6 -17 -7 -15 -6 -11 -5 -14 5 -9
2508 -9 18 0 -8 15 14 2 -22 -10 7 -10 -10 -7 3 21 1 -3 -19 -8 -11 -1 -18 2 -22 -15 -2 4 -7 -23 -9 -21 5 -26 -3 -3 2 -12
2544 -12 4 -2 4 -12 6 20 6 -22 1 -23 0 6 9 6 19 -1 8 19 6 6 -6 8 9 11 18 2 0 12 -6 9 -5 4 15 5 16 -15
2580 -15 -10 -27 -23 -10 -16 -5 -12 -5 -13 -26 3 -13 3 -31 -30 -12 5 10 -2 3 -10 3 -13 5 -17 12 6 -13 -11 14 8 18 20 11 -2 -13 7
2617 7 6 12 10 -1 3 -4 4 -13 0 16 -10 2 -13 14 -8 27 -7 11 -1 6 12 -7 -15 26 6 1 -3 18 10 -2 -16 4 -15 -9 0 14 -3 6
2655 6 -7 23 13 -2 -15 8 8 -2 -2 -8 22 -18 -4 -8 -16 2 7 -6 -21 10 -8 -13 -5 7 9 7 -15 -15 -12 7 -18 -11 -3 -4 -7 -13 -12 8 -19 -5
2695 -5 -15 -23 7 6 -30 2 4 5 -7 17 3 8 5 -3 -1 3 -1 20 5 12 2 -31 5 -15 1 -1 -8 5 -15 16 0 -3 -17 -7 9 -8 7 -8
2733 -8 6 -27 -7 -10 8 3 1 -25 14 -1 -11 -3 2 -21 -7 15 -11 13 4 2 16 -6 12 16 14 -10 -7 -5 2 5 -3 -5 -24 18 0 -13 -5 6 -8
2772 -8 -3 -19 3 -17 0 -7 2 -4 -16 9 -39 -20 -11 -10 -9 -4 -23 -3 -5 -4 -2 2 3 5 10 -13 -5 -9 0 -6 10 -9 -10 3 14 26 19 26 12 -2 -22 -6
2814 -6 10 12 -2 -10 4 0 -3 1 -9 -7 -8 -3 -20 -5 1 -13 -18 19 -14 4 -3 -13 -6 4 -19 4 -5 -3 0 -22 -25 -2 2 0 1 4 -8 -15 -5 13 -4
2855 -4 0 20 3 10 0 -9 1 -11 -14 -2 15 -1 -34 8 -13 -25 -4 6 -4 -33 -9 -5 10 -25 9 -12 -21 -6 -23 -17 -17 -29 -26 1 -4 -5
2891 -5 0 17 -3 -18 9 7 -16 -11 -13 -1 4 9 -8 20 1 12 18 27 3 2 -25 1 -6 5 -15 6 12 -2 -6 -5 -28 11 11 -8 -6 -9 -2 9 11 -12
2931 -12 -1 -10 7 -15 -21 5 -11 1 16 11 -6 1 -4 19 18 5 -8 -3 -2 -3 3 15 -5 4 21 15 -2 2 13 4 -9 -12 -17 8 15 1 12 7 -25
2970 -25 -18 6 -11 -2 -12 -4 -9 5 2 4 -11 5 -2 -25 8 4 -24 -15 6 14 5 -3 15 8 3 14 -12 -4 -2 -12 4 2 -14 12 -2 2 22 3 -17
3009 -17 4 -8 8 -9 -3 19 -5 -15 -39 -13 -6 5 -7 -19 -20 -9 -20 6 -21 -10 4 -18 -20 -7 3 -19 -4 -14 -24 -13 8 -7
3041 -7 -11 4 5 9 -1 -12 -14 3 8 5 -4 -14 3 1 16 -19 -2 -8 2 2 -8 -19 -18 -17 -5 -19 -16 -19 -15 -19 -21 2 -15 -4 -3 -32 12 -10 -18 -28
3081 -28 -34 11 4 -12 -11 -7 -11 1 -6 -11 -13 6 -2 1 -1 -5 3 10 5 -4 11 -12 -1 12 12 -9 1 -7 2 3 5 -1 1 -11 6 5 -9 -11 -8 -16 -5 -9 -8 -7 -10 -32
3127 -32 -16 -19 -2 -1 -5 15 0 -22 10 -1 -12 1 2 -7 12 23 -10 3 34 -6 -15 6 4 17 10 12 -3 7 1 5 -13 -10 7 -1 11 3 20
3164 20 10 4 5 7 -24 -32 -17 -29 -5 1 -11 -15 -5 -6 -16 -13 -11 -6 -18 -14 7 -11 -5 -8 24 6 2 -17 4 3 5 12 3 3 16 6 13 8 0 6 5 -7
3206 -7 -8 -18 4 22 3 -10 6 16 -14 -12 -13 -34 -16 -24 -10 -5 -12 -1 -13 -4 -2 -20 -11 -33 -11 5 -1 -25 -8 6 1 -15 0 8 -10 1 -4
3243 -4 -18 2 0 10 -8 -15 2 -3 9 -7 18 -7 -32 -4 -3 -3 -5 -17 -7 13 -2 11 7 -10 0 -10 -6 -4 7 3 -14 -8 -7 -7 -23 -6 -3 -18
3281 -18 -15 -11 0 2 8 -20 -3 7 20 -11 -6 13 11 -18 2 13 17 2 -1 0 3 5 17 -14 4 0 16 17 11 15 5 -2 12 -18 -9 -4 -1 4 13 -13 5
3322 5 -10 -8 -15 -12 -15 -27 6 3 -15 -19 15 -12 -13 -16 5 7 1 -20 3 6 2 -6 -17 7 -4 12 12 -12 -10 24 -2 12 -5 0 -7 10 7 7 10 -12 0
3363 0 4 -6 -4 -6 7 -10 -10 -6 2 5 -3 -11 1 -4 -8 0 -11 12 28 7 14 -1 2 -7 6 28 20 22 36 -7 2 -10 15 11 -5 11 14 1 -9 8 0
3404 0 6 -8 -11 -20 -7 -15 0 -24 -10 -18 -14 -1 -27 9 -11 -21 2 -7 -14 3 -16 11 10 3 -18 -31 4 1 -28 -17 14 0 20 13 10 10 -3 3
3442 3 9 27 -9 -1 1 1 10 4 -2 1 -10 4 -2 -10 -5 5 -1 -16 -14 -20 8 6 3 4 8 -20 -11 2 -8 17 -11 24 0 -4 -15 -17 -17 -1 -13 4 5 -3 -7
3485 -7 2 5 22 49 -18 26 7 -1 -4 -10 12 -1 -2 2 13 -13 -3 -26 -13 -9 -14 -5 -11 -4 -6 3 -4 -14 -21 -3 4 -7 10 -23 -25 8 -8 9 -11 -16
3525 -16 20 -1 -10 -18 1 -7 -15 3 12 21 25 15 10 27 7 7 0 7 17 13 20 5 -3 2 3 -21 9 18 -4 3 3 4 -17 -1 4 13 -13 -6 4 -3 3 6 -4
3568 -4 26 21 12 6 3 14 -20 18 -2 6 16 -3 20 -18 -12 11 1 17 11 0 19 10 -13 10 -10 5 2 -11 3 -6 -19 -20 -11 -6 -28 -20 -23 -5
3606 -5 -15 -22 -1 -17 3 -14 -8 -14 -14 -9 -7 5 -3 -30 -1 6 -16 11 17 7 -9 -1 14 -1 4 -4 3 14 0 12 -1 1 18 8 26 -6 9 -3
3644 -3 -9 9 -8 -5 7 9 10 18 18 -6 12 2 -16 -6 -20 -21 -5 -16 -13 -9 -10 5 -26 6 2 -26 -12 24 12 5 11 7 -7 4 -3 14 14 -15 -22
3683 -22 6 9 0 7 20 -8 5 9 10 -2 12 -2 -4 19 -7 -9 -17 -9 -19 -24 16 11 -11 -3 21 8 -12 2 -7 -6 14 -9 -4 -13 3 1 -2 -22 -9
3722 -9 25 -11 2 2 -15 7 -5 8 5 -4 -5 9 26 2 21 6 11 -10 0 4 -15 11 -20 -9 -20 -26 6 -3 -17 0 -1 -11 -5 -4 -16 -16 -3
3759 -3 1 8 7 5 10 -1 -9 12 -12 -9 20 -1 10 4 3 0 -10 -3 -15 2 -13 22 0 9 15 -12 21 6 5 -3 23 -9 1 -24 -13 26 7 15 -5
3798 -5 7 10 -4 2 5 -12 -8 -30 -4 -9 -21 -4 -28 -9 -13 20 -3 0 -8 -9 -23 4 -9 17 2 15 19 -2 1 0 5 0 12 16 9 3 7 9 -5 -15
3838 -15 11 -5 15 2 0 -14 -5 -2 -11 -13 -21 -12 -11 -3 -19 -23 -15 24 0 2 -5 -37 -22 -11 -13 -15 -4 -4 8 -4 -2 -2 3 10 -1 8 18 13 7 2 21 -4
3880 -4 14 16 17 -2 13 -3 -1 4 -17 11 10 4 3 -20 -10 -14 2 3 -9 -14 -10 -7 -16 -3 -23 -13 -5 -11 -16 19 -11 -15 -5 6 -18 -6 -4 -16 -7 9
3920 9 20 -4 11 9 2 7 -18 5 19 -7 24 14 5 -2 8 11 7 12 -20 20 -13 0 -18 5 0 -6 -6 7 -22 -19 11 -6 5 -5 -2 1 2 6 -6
3959 -6 11 21 9 -5 -5 20 10 8 -16 -4 3 -8 2 6 0 4 -5 9 7 14 4 3 7 2 14 1 4 -6 -11 13 -10 -15 -24 -22 -3 -15 -6 -13 0 -18
3999 -18 8 0 -16 3 -24 -18 -9 -6 -17 2 2 -9 11 5 -11 5 4 15 -6 -12 -1 5 15 5 21 11 6 -18 -2 2 31 9 4 18 5 12 1
4036 1 -4 4 22 -4 19 20 14 -13 6 -12 6 -9 10 -1 0 4 7 0 -1 12 -31 -5 -3 -18 -17 2 2 2 -1 -6 -4 2 20 3 21 11 2 -12 24 -22
4076 -22 3 3 22 -8 -22 12 -15 9 -2 -1 6 -3 1 16 18 2 -11 1 -20 3 -18 -2 -3 9 1 -7 2 8 -11 -7 2 -5 -22 -11 -9 -4 -7 10 12
4115 12 10 -12 -1 0 8 10 5 16 10 20 16 -12 20 4 -4 19 6 8 11 6 12 8 -5 -5 -2 -8 -6 7 -12 5 19 -3 -14 22 -15 4 -4 4 -7 4
4155 4 5 -11 2 -2 1 3 15 4 14 -1 29 13 1 -12 1 23 16 24 19 -6 4 16 9 6 -7 3 8 8 8 -3 -10 14 -3 -6 27 32 5 -5
4193 -5 5 0 11 -12 14 5 0 -12 1 19 -11 10 -7 31 28 -5 -12 1 20 -7 -11 -12 -2 2 -3 17 21 19 12 -7 -3 -3 6 -2 4 -2 13 10 -1 23
4233 23 -10 12 -16 -27 -3 -13 5 -26 -6 -1 1 -18 -5 -3 -6 -4 -24 0 15 -1 2 11 1 1 -1 2 6 6 -13 8 9 27 14 14 22 -12 12 -15
4271 -15 -1 13 13 -4 -8 -14 14 8 -7 0 4 17 22 5 12 -2 7 5 9 3 3 -3 14 -17 -3 -9 -18 6 1 -2 8 22 -11 -23 -13 10 -15 8 13 -11
4311 -11 14 6 -7 7 18 -4 15 -8 4 0 6 10 -2 4 4 17 -1 25 -9 -1 9 9 -15 0 -5 22 8 0 -10 -1 -10 -4 -21 -12 -12 -7 -2 -18 5
4350 5 -14 -13 6 15 -8 -1 11 10 11 -4 17 2 -18 5 6 -9 17 13 3 20 17 14 2 8 7 9 23 8 -10 3 11 10 11 1 -6 0 3 4 -17 -8 15
4391 15 -7 4 -8 -7 8 -7 5 -6 -15 -2 12 -9 11 10 2 -9 0 2 -6 22 6 -7 -7 -3 15 -7 7 20 14 3 8 18 -5 -10 6 9 9
4428 9 7 -25 -4 2 11 -1 15 -21 -4 4 -10 1 -5 -5 2 0 -15 8 -11 13 6 10 10 -3 -13 -6 5 -3 19 14 13 -2 11 -3 14 9 26 21 -7
4467 -7 12 1 18 9 11 2 1 1 14 10 13 19 -4 8 23 -3 -20 -30 -4 18 21 -2 7 -14 -4 3 -3 -7 -7 -16 -16 -31 0 8 23 11 -9 -11 -10 -7 -8
4508 -8 5 5 10 2 24 16 9 6 4 2 5 -4 -4 -26 4 5 -10 33 6 -1 28 -4 -7 1 -22 22 -8 1 -15 8 1 -10 -9 -5 -23 -11 30 15 -12 -11 11
4549 11 -13 -6 5 -5 -29 -13 -16 6 5 7 12 10 9 9 18 21 -1 7 22 17 4 2 3 6 -1 -15 4 9 0 -8 8 5 -5 2 -16 3 9 -1 -7 -7 -13 1 -13
4592 -13 -3 -16 -14 -3 8 -15 -10 6 10 0 9 -12 11 -28 -20 14 -3 6 -4 10 12 -2 0 2 12 17 -15 -21 9 6 -5 2 -5 13 6 -3 -12 -16 -10 14
4632 14 -10 3 -11 -21 -24 -25 8 0 18 -10 15 -6 -18 18 -1 -10 3 -2 -9 1 10 18 0 6 9 0 5 -9 2 8 3 -7 -5 -3 12 9 -22 -4 11
4671 11 23 -7 -4 7 -1 -8 -9 -2 1 -13 -6 -6 1 -13 -21 -33 -5 -9 -17 2 -15 12 3 -14 -8 3 -8 -8 -1 21 3 -2 3 3 0 -4 16 -15 19 2 -10
4712 -10 3 -5 18 7 1 7 -17 4 1 -20 -3 -8 7 -8 -7 -1 2 -6 3 -3 -11 -2 3 -11 -18 -4 -23 6 19 -23 -3 15 -2 -19 0 -10 -13 -5 -4
4751 -4 18 14 0 2 -1 5 2 7 2 1 24 -4 2 12 -27 -3 13 -9 7 7 2 -1 2 -6 7 -2 -8 -7 -10 -7 2 0 -19 18 2 5 10 29 11 -13 4 -14
4793 -14 -8 -4 5 -12 1 -12 4 9 7 -3 5 -3 19 12 4 10 8 18 9 -5 3 1 -5 6 -22 -5 2 -2 13 -13 -25 -21 -17 -1 -1 -23 -8 -11 -8 -8 -7 -14 6
4836 6 -15 5 -5 3 -6 -11 8 -11 -12 9 9 0 -5 -1 -9 -8 11 7 -1 7 20 15 -3 16 9 9 -2 -6 -18 2 19 9 7 -3 22 15 8 5 14 -10 -18 0
4878 0 -7 12 -8 18 -13 2 1 7 1 -40 -1 14 5 6 15 15 -4 -12 7 -12 -1 17 -4 2 9 -2 1 15 11 20 1 0 -6 16 10 7 2 16 -2 -13
4918 -13 -13 3 -25 -6 -5 -8 -13 -16 -31 -12 14 -3 2 -8 -10 -6 -17 -6 -8 -12 5 14 0 3 8 0 -3 12 7 11 11 16 22 19 12 16 5 -6 10 -1 -7 21
4960 21 4 21 -20 19 11 20 12 6 7 8 -3 2 -8 9 -4 -10 -12 -7 2 -2 11 10 -18 5 10 -7 -1 -8 -10 7 10 -5 20 11 -5 -5 -4 -2 23 6 9 25
5002 25 10 4 8 1 -12 11 -1 10 7 -5 -9 -7 2 -13 6 -6 -10 -23 -7 -3 -32 -16 -10 -30 -21 -31 -24 7 -22 -13 -5 -24 -3 -8 -25 -7 -6 -13 -6
5041 -6 -5 1 17 2 17 1 -2 14 12 -8 0 -2 20 13 -9 8 -3 4 -2 -21 -13 -8 1 -14 -1 -4 -19 -9 -3 -7 -5 -9 0 15 -14 -23 7 -21 19 -3
5081 -3 -6 -11 -2 5 -22 -14 -9 2 2 6 5 -1 5 7 0 -2 -3 0 -22 -19 5 -7 -6 -10 0 2 9 12 -15 -11 -3 17 27 -13 1 11 8 15 -15 1 14 -3 -19 -3
5125 -3 -4 15 -1 -6 -7 -13 8 -4 -22 6 -9 -17 1 21 5 18 2 12 6 -13 -9 -11 -9 13 12 6 13 -20 9 -9 1 0 -2 -1 -18 8 -2 -11 2
5164 2 14 -14 -3 -13 -17 8 -10 -11 -26 -8 -13 14 -6 -15 -7 1 -13 10 -3 -4 2 1 -12 5 5 -8 12 11 8 -3 0 -1 -8 -10 9 8 6 17 8 -4
5204 -4 -6 -4 -18 3 -7 16 2 11 -10 1 -10 -14 -3 18 -12 -3 -4 3 4 8 9 -2 -12 -19 7 7 18 -20 -2 3 -1 -6 -33 1 18 5 -8 -23
5242 -23 23 14 -21 -11 -5 -19 -3 -4 -2 -9 7 7 -7 9 0 0 8 19 -6 11 -8 -8 6 -9 -9 -4 -10 -8 -2 3 -16 1 -1 -11 7 16 -9 -8 15 5
5282 5 -9 10 3 19 7 -2 7 14 27 2 8 8 4 2 3 23 -11 -4 0 12 -4 9 -3 -1 -13 -15 -9 -15 8 -12 -3 -16 7 2 -2 -6 -17 -5 -15 -16 -11
5323 -11 -34 -22 -8 -18 19 -20 0 -9 -5 10 -1 -11 -21 -5 3 -3 2 -17 6 3 10 -4 0 -18 8 -9 -5 -7 -29 8 -7 1 -13 -6 -18 12
5359 12 -25 19 5 -10 -16 -29 7 -13 -3 8 8 -1 2 -14 -7 -7 -3 5 9 1 -1 1 15 9 -8 -3 -18 7 10 8 14 13 8 9 1 -16 -1 1 5 -9 6 0
5401 0 -7 -10 1 -8 -17 4 4 -11 -12 -16 -7 -2 7 -11 0 -5 3 -9 -14 -11 -21 8 -22 3 7 -7 17 -4 -14 13 -6 16 1 -16 -2 20 -12 -6 10
5440 10 -10 10 0 -10 10 3 -6 -2 -5 15 -3 5 7 -15 -11 4 2 -1 7 12 -17 -7 -6 -9 -11 -11 -7 8 -24 -1 14 -13 -1 -13 0 10 20 -11
5478 -11 7 10 18 13 1 -1 17 3 6 10 -18 5 -8 -10 -28 -10 5 -9 -9 -3 -8 -11 27 3 -7 0 2 -20 -4 2 -11 -6 18 -14 16 -14 13 -6
5516 -6 -7 -3 -12 -6 3 3 1 7 10 -4 6 1 -8 -5 5 4 12 -8 18 12 -4 7 -10 24 8 25 -2 16 0 22 21 1 -10 -1 3 9 -2 -2 1 12 12 -6
5558 -6 12 -3 -23 -20 -9 1 -7 -3 5 -18 -19 -3 -4 -14 11 -11 -11 -6 0 -12 -12 -11 6 13 -3 9 6 10 9 10 6 -11 6 -6 10 -1 19 -12 -6 -1
5598 -1 -15 -4 -13 12 -4 18 13 7 -11 6 -15 -1 -2 -20 -8 -10 -5 7 -25 9 -6 -10 14 -3 7 11 11 13 14 0 6 1 2 -2 -14 11 -5 -2 17
5637 17 18 14 3 6 -2 9 -7 11 10 0 -8 12 18 2 10 12 -5 -6 -8 -5 1 -9 4 -11 4 -17 -3 8 0 1 -2 -24 5 -11 -12 6 -4 3 -15
5676 -15 -3 -33 12 1 -4 0 3 5 -8 5 2 -10 7 -5 9 1 -3 -5 -5 -13 17 16 -24 3 -7 10 2 -5 -4 13 10 4 -4 15 4 7 -5 -23 -3
5715 -3 -15 -3 -12 -16 -12 4 16 13 1 -7 10 0 6 0 -1 1 -2 8 -1 13 7 1 -4 16 16 27 17 -3 28 3 3 12 -12 1 2 -9 -14 -6 -12 1 -2 -23
5757 -23 -8 -25 6 0 -11 -10 -2 -13 1 1 2 -12 -12 -2 6 -2 5 2 -1 0 10 7 2 16 15 -7 -12 -8 -5 7 13 -2 6 5 11 1 6 3 3 7 9 -13 12 3
5801 3 4 -16 -7 -7 -12 2 -1 6 5 -19 -32 3 -8 12 -11 -1 -14 -12 -11 4 4 -11 -12 12 1 23 -7 -4 9 19 20 14 -1 18 -6 -9 2 12
5839 12 6 2 7 -10 6 10 10 -3 13 12 21 8 3 11 -4 -10 -3 16 -7 15 8 9 5 12 18 6 9 -10 13 -10 -3 -18 -3 -7 10 -11 13 6 2 11 11 21
5881 21 -4 24 6 11 4 8 1 28 -6 2 -28 2 6 -22 -27 -2 2 -7 7 -7 0 19 -13 2 -6 11 -5 2 -12 7 -4 5 11 10 -5 8 -3 20
5919 20 15 -7 8 5 0 -1 7 14 20 -3 4 9 -1 18 5 4 12 -14 22 9 -15 -4 14 15 16 16 22 -7 18 -11 -4 0 -10 8 -11 -12 21 7 2 4
5959 4 -4 -8 -16 -15 16 13 31 -12 12 5 19 -3 5 5 -14 33 28 25 6 11 3 3 13 -2 -4 8 -10 -8 -4 17 0 -22 11 -5 2 -12 24 -7 2 1
5999 1 -10 3 -2 -10 -13 8 -2 -11 -17 1 -3 -1 -1 1 17 8 -3 14 1 10 7 9 12 12 9 15 4 31 10 -4 3 -12 22 -2 11 22 19 20 -3 23 -3
6040 -3 -5 -1 3 -10 -10 -10 -1 2 -11 -24 -13 10 14 13 4 11 -4 -9 -4 11 4 -11 8 1 -4 0 22 -6 8 -7 11 -10 3 -3 -1 3 11 3 9 3 19 -2 2
6083 2 -6 -3 5 11 14 8 10 -2 12 -5 11 -4 -20 -16 7 10 20 4 -3 -4 12 -12 1 -13 12 -1 -24 5 -23 -9 -12 3 12 3 1 -1 7 -3 13
6122 13 -10 1 -1 6 17 -13 -6 4 -4 0 -7 -1 6 -3 6 19 -4 -9 -9 -13 4 7 3 -2 5 -2 -15 -36 -19 -40 11 5 -11 10 10 -6 15 -8 -2 -6 -7 0
6164 0 2 -9 8 2 7 7 10 -1 12 6 -6 3 11 20 22 15 -4 -7 -5 8 20 -2 -3 10 -15 7 13 -9 25 2 -1 9 18 -9 5 5 -8 -3 7 -8
6204 -8 -12 -4 -9 -11 4 20 -7 6 12 14 -5 -7 5 18 -6 16 13 -7 17 -12 -3 10 4 0 18 -7 -9 -6 10 8 2 -11 13 -1 21 20 -2 1 23
6243 23 7 -2 -16 -4 -10 0 -15 8 -9 3 -5 16 -9 2 -12 5 12 25 1 12 13 2 -1 17 13 15 8 1 20 8 23 28 -15 8 3 3 5
6280 5 18 2 2 13 -3 13 2 2 4 -14 -10 24 9 -15 -7 -14 13 -4 -16 8 14 27 -4 -16 -6 12 17 11 -13 -1 8 -19 1 14 13 -5
6316 -5 6 -9 11 13 6 8 18 18 3 15 20 -1 12 -2 1 15 16 3 -4 7 2 -1 -26 -5 1 -5 -4 -9 -13 -13 24 2 8 8 6 -1 23 0 12 -15 -6
6357 -6 10 -10 11 -9 9 -12 24 2 26 14 23 13 14 19 0 8 7 -6 12 27 1 -6 9 -12 0 -15 11 5 -9 -7 10 20 12 15 1 3
6393 3 8 8 18 0 0 5 -1 -21 -2 18 6 8 13 0 -1 13 -6 1 19 8 27 -1 12 10 1 16 18 11 -3 11 10 42 1 -13 8 13 6 26 -7
6432 -7 5 2 9 10 -20 9 -5 -12 11 -10 6 9 -6 -9 -3 11 9 -4 -13 -2 -2 16 -11 24 -8 21 -1 12 23 -4 27 15 7 -2 26 9 16
6469 16 6 4 4 7 5 20 14 -7 0 3 -8 -6 13 1 -3 0 8 16 -16 10 3 2 11 -22 5 -5 4 -8 5 8 -8 4 7 -6 -11 4 3 23 7 7 1
6510 1 18 2 24 4 0 7 4 -6 5 5 7 -12 15 2 7 15 1 -1 -8 1 -4 -4 10 -3 -2 -2 -6 3 13 -7 25 3 -8 -12 -5 2 -27 -16 2 -11
6550 -11 6 -22 -2 -3 7 10 9 3 11 4 17 17 29 19 5 -3 -2 22 32 14 21 -2 -1 12 -4 -4 -4 0 5 -17 -3 14 22 -4 8 14 6 -3 -4 3 -23
6591 -23 -13 14 7 3 6 4 -4 3 13 13 29 16 11 19 11 24 -17 4 10 9 7 22 16 24 -2 -2 22 9 25 6 0 12 8 12 -5 -6 20 16 6 20 5
6632 5 21 -5 -13 1 3 -5 0 -25 3 25 2 18 -1 -3 -32 16 -1 3 -14 -13 -10 -8 28 17 -6 0 -6 8 9 5 0 13 0 25 32 5 28 0
6670 0 3 1 15 23 10 -3 19 2 -7 9 19 0 -1 -7 17 9 8 17 11 10 10 2 5 7 -3 4 -5 9 10 0 12 24 18 9 8 6 15 5 25 -1 6 8 2 0
6714 0 14 4 1 8 12 3 8 -7 5 0 29 6 -4 -14 9 2 4 -12 -12 -17 -11 -8 -25 4 -5 7 -19 8 -3 -9 -13 0 -15 7 0 -7 14 -15 5
6753 5 -31 13 0 -1 -6 13 -7 4 16 16 17 -6 11 -1 5 4 4 8 1 -1 -9 -4 -34 -6 -7 -6 -21 -5 12 1 9 19 0 1 15 -14 21 4 -12
6792 -12 5 -2 8 2 13 27 -3 5 6 22 13 10 6 17 11 0 3 16 11 5 -10 5 15 -4 -11 -2 -2 -11 3 -5 3 -7 16 -16 -3 9 -5 12 21
6831 21 0 2 0 -4 -4 3 -2 -8 -9 -1 -4 2 1 -7 -1 15 13 20 3 25 31 8 -5 9 16 2 35 29 8 3 -6 13 44 10 20 17 3 17 -7 22 14 22
6873 22 19 -12 -5 9 -11 -7 13 2 6 0 -4 -33 -11 3 -9 -1 -21 11 6 -12 26 16 6 -11 -1 0 -8 11 -5 4 -5 14 8 14 17 13 10 1 1 4
6913 4 9 9 26 -6 -8 1 -2 17 -1 -4 7 2 2 -7 20 -12 13 -4 15 19 -15 -3 19 5 11 4 16 16 10 5 -13 16 -10 -6 24 17 13 24 3 -1
6953 -1 10 -19 22 1 0 37 25 -1 12 5 10 -4 6 -8 -5 1 -1 -11 1 8 -22 -13 14 7 -8 2 -10 -12 8 9 4 3 -12 -2 -12 12 -11
6990 -11 19 -6 -15 15 -13 22 9 8 -4 14 -10 28 12 3 9 -2 12 17 6 6 1 2 -3 -9 1 22 15 16 17 5 5 13 7 -1 10 -13 -8 2 2 -7
7030 -7 -1 -9 -5 -2 10 -5 -3 -1 -11 10 14 3 -3 23 3 8 -7 2 19 18 0 18 -13 21 2 -14 11 2 0 2 3 -5 6 -4 -14 -9 -11 -1 -3 6 -7
7071 -7 -4 -12 -6 6 -9 4 -10 -2 -8 -24 -14 -7 -2 -6 -3 0 -9 -18 -8 -6 7 0 -18 -4 -7 10 9 30 6 21 26 4 11 20 7 -6 11 -7 17 -5
7111 -5 -8 9 4 27 -2 7 1 -2 2 -12 -5 -8 16 2 -5 18 -15 4 15 -5 -3 4 2 2 -1 -12 3 13 9 -11 -2 12 -3 -7 1 0 -2 15 7 0 13 6
7153 6 -4 1 5 6 13 9 -5 -4 10 12 -6 10 -13 -1 13 19 8 3 -13 -5 -9 -1 -10 2 1 -2 1 -1 6 1 4 2 -16 2 -2 -5 28 -12 -8 6 7 9 25 16
7197 16 -12 19 9 -18 13 -12 -7 -12 16 16 12 3 -13 9 -5 -7 13 -24 -7 -12 -7 -12 -12 -1 -15 -13 0 -8 8 2 -5 -12 -16 6 16 5 5 -13 -15
7236 -15 0 -2 -16 0 25 8 3 11 -14 9 9 -10 11 4 11 14 4 9 6 1 7 20 -7 -10 7 7 7 -2 -6 -16 -1 3 -9 -5 7 -6 -15 -8 -12 6 -2
7277 -2 29 -11 -18 16 20 -24 7 0 -12 9 13 0 -3 7 17 14 32 13 11 5 18 18 3 19 24 -7 24 8 -6 3 0 -11 3 -17 -8 15 -8
7314 -8 -6 -6 -11 -23 6 -30 -15 1 21 -28 -5 2 5 -1 10 1 -3 4 3 -9 1 -9 -16 4 -7 8 21 10 17 17 4 23 19 34 20 9 12 12 2
7353 2 2 3 -1 10 15 19 -9 1 2 13 2 -19 7 -9 -13 4 10 -9 5 10 13 -5 -10 -6 7 10 3 -5 8 -7 1 1 -16 0 7 -10 9 2 2 -21 11
7394 11 -4 -8 -4 10 -1 0 -2 8 22 1 3 3 -6 -2 0 -2 4 -15 -6 -3 -11 -31 -3 9 10 16 -21 -20 -5 -7 -4 4 4 -1 -7 -2 18 11 -10 9 26 15 -8
7437 -8 6 5 -6 27 -16 18 23 -9 11 4 14 11 7 10 8 -3 1 10 -2 20 9 25 -4 13 8 0 -5 -9 10 -9 0 -7 -19 0 -1 -13 -6 -12 -10 17
7477 17 6 0 -1 -16 9 -10 10 8 -16 -20 7 -8 8 13 14 28 30 23 17 9 6 20 6 -10 15 16 0 13 -10 7 -5 -11 7 -7 -3 10 25
7514 25 -2 3 -17 -8 -4 -7 -7 -3 -3 -4 11 -10 -8 -5 10 13 1 -1 -2 4 18 -6 -7 5 16 14 3 29 22 20 21 0 4 -9 -4 3 12 4 -11 -9 14 4 -6
7557 -6 12 2 17 1 -2 -13 -2 -16 7 8 -7 -14 -3 -15 -19 -2 -17 -3 -4 1 25 8 11 2 -5 -5 7 21 -2 2 0 11 8 11 -8 18 -5 14
7595 14 18 16 -12 -7 13 -9 15 -18 31 -23 -5 -8 -16 -13 -2 1 -5 -8 -22 -2 -2 4 0 23 -4 1 -1 -5 10 20 2 -2 7 -5 10 11 12 -1 9 4
7635 4 -20 3 -4 -10 12 -9 -5 9 -3 14 23 -15 -5 16 5 4 32 13 -4 -6 -1 8 -23 3 4 -6 -4 -12 6 -22 -30 2 -6 -10 5 -6 -3 12
7673 12 6 1 7 -3 -1 1 19 22 -3 9 -18 13 2 -2 10 -6 14 -7 0 2 13 6 39 0 -5 15 -13 17 6 -16 -3 -20 -15 -5 -8 2 -15
7710 -15 -6 5 1 -12 -11 17 -15 -6 -7 -12 -28 -13 19 -12 -7 -19 -11 -5 -1 -3 -15 -3 11 5 -5 -25 -11 -1 -20 0 3 -3 -6 11 1 -2 3 -9 -9
7749 -9 -7 -11 -6 5 -4 -1 3 0 -8 17 -17 -16 3 -15 -3 -10 17 6 7 -3 1 2 -1 -14 11 18 6 14 12 -6 -6 -5 -5 -21 -30 0 -7 7 18 -4 9 18
7791 18 -3 1 -10 -4 4 6 2 -15 13 15 5 16 10 0 6 -14 -1 -11 3 -5 -7 4 2 2 -24 -15 -2 5 4 -4 -6 -7 12 -4 -6 14 21 -5 -3 -15 -7
7832 -7 1 -1 -7 4 -6 -6 5 2 -10 -14 5 -9 17 -6 11 -16 18 -3 0 -17 16 -9 -17 18 -7 5 -15 23 9 -13 1 -15 -19 -19 18 7
7868 7 -16 5 4 -10 -2 -20 12 3 6 -1 16 -4 -12 0 -6 23 18 -14 11 -11 -12 -1 11 1 -2 1 -7 10 -18 26 -17 -8 5 -8 -19 -3 -9 -10
7906 -10 3 -7 -7 3 1 -24 1 1 7 -11 -28 -5 -9 3 2 -4 -23 -11 5 -14 4 -1 -33 -32 -11 14 -14 -14 -5 -23 11 -14 -9 7 21 -3
7942 -3 -23 -11 -2 -18 -18 -6 -5 -20 5 5 -19 1 -4 -7 -8 -34 3 -4 1 -4 -6 8 8 -9 13 -24 -9 9 -20 -7 -13 -8 -22 3 6 -4 14 -3
7980 -3 -17 8 12 -15 -8 -4 -8 -15 4 4 6 9 -16 15 -13 13 -18 -12 1 -26 -9 12 -17 -23 6 5 -12 10 -19 2 -6 -6 20 -6 4 -6 -3 -6
8018 -6 10 -3 -4 -12 -6 -19 -10 21 18 -4 -19 -21 4 -18 -7 5 -9 0 -8 -12 -2 34 -3 9 8 -15 -1 1 -1 1 -12 -12 15 -2 -29 -1 15 8
8056 8 -18 -24 13 -9 -12 -3 0 -23 -5 -10 9 13 -3 -6 -3 6 23 -8 10 -9 -11 15 9 -6 15 2 -7 -7 3 8 3 0 -3 16 -3 2 6 7 -22 13 -1
8097 -1 -8 -12 4 4 -3 -14 -7 2 -1 11 -9 9 13 -24 8 4 4 -13 -1 -2 8 -6 -4 -4 2 3 12 -14 -8 -9 -16 11 12 -6 -1 -6 1 -7 -14 7 8 -9 -3 -14
8141 -14 -13 -12 -10 -13 -20 -2 2 -1 19 4 0 -15 -6 18 -19 9 -11 -1 -9 -16 0 -15 -4 1 11 13 -12 -14 5 2 0 0 -14 -7 -4 -1 2 0 11 1 15
8182 15 -9 -9 8 2 -21 1 18 10 -6
8191f
$$ Imaginary data points
##PAGE= N=2
##DATA TABLE= (X++(I..I)), XYDATA
0 0 0 0 0 0 0 0 0 0 0 0 0 0 0 0 0 0 0 0 0 0 0 0 0 6 -16 16 -16 16 -16 16 -16 32 -32 32 -32 44 -48 48 -60 64 -70 80
42 80 -87 97 -111 118 -129 145 -161 177 -193 213 -236 260 -285 316 -352 394 -442 497 -564 646
62 646 -755 892 -1085 1373 -1837 2739 -5112 24883 62505 17270 -21638 -39187 -31153 -20968
76 -20968 1343 25378 34829 14809 -10831 -22405 -15913 -5164 9210 21166 20195 1322 -16075
89 -16075 -18553 -11056 -5342 3069 14771 18280 4809 -11568 -14759 -6286 1047 5680 11519 13700
103 13700 2893 -13610 -18571 -7820 5754 12790 12771 5232 -8514 -16725 -9609 5047 11058 6980
117 6980 2772 573 -5685 -12115 -6673 8541 14863 5247 -5189 -4663 -1799 -5409 -7628 -560 7344
132 7344 6190 1084 472 1057 -2933 -5928 -716 6416 5013 -1816 -3913 -1737 -2383 -3458 1793 8272
148 8272 5563 -3657 -7412 -3608 -308 244 2926 6646 4291 -3220 -5873 -747 3552 1658 -1317
163 -1317 -1473 -2131 -4221 -2682 2773 4884 1511 -403 2398 3478 -1019 -4706 -2286 1449 614 -1427
179 -1427 130 1646 -1399 -4527 -1682 3341 3666 1024 1126 2401 -75 -3636 -2353 1799 1795 -2098
195 -2098 -3155 -510 456 -804 631 4173 3691 -1113 -3156 -209 1647 -705 -2495 -757 726 -542
211 -542 -887 1678 2857 251 -1728 120 1668 -773 -3316 -1802 978 971 105 1495 2754 614 -2331
228 -2331 -1804 461 226 -1448 -561 1705 1100 -1436 -1336 1102 1557 -391 -966 405 655 -571 -409
245 -409 1231 1183 -1106 -1900 -84 981 -383 -1151 337 1366 245 -410 848 1282 -562 -1834 -447
262 -447 1055 121 -1474 -864 820 954 91 412 1085 4 -1579 -1128 355 290 -713 -192 1298 1284
280 1284 -112 -574 91 42 -1053 -1095 272 822 -125 -338 974 1421 -57 -1161 -397 363 -177 -833 -274
299 -274 504 482 237 486 481 -466 -1122 -236 748 124 -926 -364 844 712 -163 -164 334 -14 -785 -654 148
320 148 358 -121 -137 476 675 46 -291 23 -90 -782 -723 225 581 134 23 485 582 15 -420 -261 -135
341 -135 -469 -687 -63 695 592 109 200 484 8 -674 -645 -219 24 34 141 262 277 209 173 28 -462 -839
363 -839 -447 458 705 115 -269 34 297 63 -336 -510 -457 -208 229 508 418 85 -111 5 102 -164 -521
384 -521 -390 -36 111 120 236 303 226 253 268 35 -379 -638 -567 -174 175 128 39 290 672 651 163 -421 -713 -642
408 -642 -362 -137 6 222 374 401 359 277 -72 -464 -478 -238 -27 57 85 137 135 14 -147 -112 8 1 -69 84 277
433 277 221 9 -47 -48 -107 -173 -216 -164 -70 66 201 226 162 90 153 153 -93 -372 -357 -176 -107 -38 278 451 285 -40
459 -40 -103 -78 -261 -580 -446 57 404 344 330 538 409 -219 -662 -527 -314 -405 -435 16 500 487 283 362 461 138
483 138 -379 -376 -32 -132 -488 -407 71 255 74 67 308 347 159 -19 -13 -102 -327 -251 83 156 -144 -279 25 193
507 193 -39 -172 39 215 176 120 190 44 -402 -557 -236 60 -101 -147 313 778 539 -40 -194 -140 -346 -629
529 -629 -477 -57 43 74 441 835 617 -58 -275 58 32 -453 -651 -296 29 -52 12 374 465 148 -15 170
551 170 204 -172 -450 -128 200 8 -287 -49 235 15 -324 -208 36 -37 -68 228 550 313 -106 -115 125 -30
573 -30 -434 -456 -31 106 -77 -5 313 261 -106 -134 189 228 -23 -53 204 208 -162 -351 -68 91 -190 -456 -119
596 -119 234 130 19 283 469 188 -89 37 113 -248 -633 -492 -60 15 -110 162 615 521 69 -94 30
617 30 -146 -529 -468 -4 153 26 130 487 463 -20 -321 -126 -16 -217 -311 -10 219 36 -88 193 348 51
639 51 -161 36 257 53 -191 -89 35 -140 -382 -195 121 108 -121 37 392 280 -19 24 226 57 -349
660 -349 -397 -129 -149 -341 -241 179 369 169 134 399 378 -100 -402 -182 -62 -280 -293 79 309 136 -7 135
682 135 247 -36 -312 -131 142 94 -82 83 296 133 -186 -136 47 -91 -303 -174 163 172 -28 17 240 181
704 181 -151 -222 -2 17 -221 -232 74 188 -9 -86 97 146 -105 -244 -49 99 -26 -132 69 232 48 -128
726 -128 -3 139 -75 -265 -63 207 123 -43 27 171 58 -183 -131 40 -34 -211 -76 240 226 -11 -38 126
748 126 58 -229 -275 -61 -1 -138 -138 159 298 131 10 90 78 -184 -321 -147 46 -14 -128 42 235 157 12
771 12 3 53 -82 -198 -89 135 99 -69 -18 139 92 -85 -126 3 31 -84 -54 110 171 28 -7 15 -22 -193 -152
796 -152 34 107 -72 -105 83 230 84 -86 -38 -26 -154 -193 -27 112 21 -62 89 213 90 -111 -117 10 -41 -155
820 -155 -88 99 142 33 44 92 21 -83 -91 26 5 -71 -83 129 221 67 -56 -24 -12 -85 -114 -7 27 -24 -39 70
846 70 125 30 -104 -83 -16 -89 -139 -24 127 122 7 17 74 -14 -113 -124 -50 -87 -133 -21 164 203 72 8 68 62 -50 -133
874 -133 -57 -31 -105 -54 90 126 48 -1 40 39 -48 -99 -33 67 34 -73 -1 107 27 -54 -52 -40 -81 -109 -14 86 83 15 16 29
904 29 -19 -67 -147 -73 -38 -56 14 115 119 20 -55 -18 -36 -95 -105 -3 54 40 34 92 92 43 -79 -99 -29 -63 -71 6 89 65 3
935 3 54 81 38 -54 -87 -69 -55 -75 -51 64 66 0 0 28 30 -83 -82 -62 -48 -63 -10 56 74 48 5 -14 -23 -43 -94 -30 12 9 12 66
969 66 81 39 -13 -45 -32 -19 -2 46 61 52 19 11 -14 -30 -66 -94 -9 17 13 59 66 69 31 -34 -54 -69 -106 -85 -19 -5 23 45 45 62
1003 62 -2 -39 -64 -66 -82 -85 -45 29 35 55 62 59 19 -39 -60 -57 -30 -3 2 41 52 49 26 5 -26 -29 -15 -39 -24 1 19 35 45 11 -2
1038 -2 -29 -41 -60 -59 -19 -28 -9 11 1 -26 -31 -17 -30 -26 -30 -5 -5 21 33 19 7 -21 -55 -54 -45 -34 8 21 80 76 81 65 24 -40 -73 -53
1074 -53 -67 -47 -5 56 42 51 45 33 17 -24 -56 -43 -42 -28 -33 13 33 15 7 -2 -12 -32 -44 -22 -26 -14 -5 36 30 -4 -31 -39 -21 -32 -38 -1
1110 -1 19 33 21 19 30 14 -37 -71 -23 9 10 14 59 50 32 21 -7 -14 -47 -71 -16 -38 3 10 49 70 13 -37 -50 -35 -46 -66 -36 -3
1144 -3 -7 12 39 45 -20 -48 -56 -35 -13 -24 7 42 18 -2 27 45 4 -41 -61 -16 -5 -10 15 71 58 10 2 35 16 -38 -47 -23 -23 3
1178 3 -11 53 50 3 -34 -24 22 -35 -35 8 37 16 -5 -19 10 -42 -71 -77 -39 -9 -15 6 51 42 4 -26 30 -8 -75 -49 -7 -6 1 18
1212 18 65 59 1 -32 11 10 -33 -38 11 16 7 10 63 79 -23 -20 -37 -10 -41 -49 6 42 15 -1 2 6 -21 -64 -47 -5 -43 -51 5 21 38
1247 38 -40 -32 -1 -5 -61 -56 22 20 4 18 65 16 -16 -25 4 12 -32 -27 32 48 31 7 51 55 9 -41 -43 2 -32 -19 24 58 14 3 -8
1282 -8 25 -25 -65 -42 -20 -18 -27 -12 -2 2 -28 -37 -4 -17 -46 -51 -7 25 -27 8 34 41 -18 -42 12 -6 -41 -40 27 52 -6 11 35 47
1316 47 -3 -41 10 9 -3 -26 9 59 37 -20 0 9 -20 -34 -32 3 21 -33 20 55 25 -40 -29 -8 -12 -68 -51 7 5 4 -12 31 21
1349 21 -30 -47 -2 -4 -34 -27 30 47 3 -2 20 35 -5 -16 -8 11 -6 -12 39 63 24 -14 29 -6 -23 -29 -28 -4 6 -10 -4 21 4 -35
1383 -35 -39 -10 -29 -37 -29 9 -4 -21 -21 -8 -18 -38 -50 -27 -3 -16 -6 20 21 14 -21 -11 9 -37 -41 -15 -17 23 -1 36 46 16 -8 -3 5
1418 5 -9 -26 -26 27 12 -2 2 20 9 -24 -29 2 -13 -27 -35 8 22 9 -16 -15 0 -37 -34 -22 7 -20 -33 17 14 -11 -38 -2 4 -25 -36
1453 -36 -13 -1 30 -3 36 51 -5 -18 -18 -3 1 -9 1 17 20 19 9 26 11 -28 -46 -20 -16 -37 1 8 15 8 -23 7 -1 -25 -56 -35 -21
1488 -21 -10 -13 -10 21 -12 -27 2 -26 -15 -25 -9 8 7 18 38 38 11 -2 -26 12 -7 17 -2 30 33 25 5 22 0 -7 -8 0 1 -10 20
1523 20 16 3 1 -9 -12 -29 -21 -29 1 -5 -10 -11 -11 -2 -13 3 -40 -16 -17 -36 -15 11 -4 8 -7 17 2 -13 -39 -18 -14 -11 12 41 9 0 13
1560 13 5 -2 5 2 -7 8 16 3 -6 24 10 -17 -21 -13 -11 -38 0 -9 -5 -9 -6 1 -11 -23 -31 -9 -18 -8 -10 -14 -6 6 14 22 18 -2 -26 -36 -21 2 17 17
1602 17 17 3 5 7 -11 -24 -3 6 6 11 9 22 18 1 -5 -18 -22 -25 -3 8 5 -8 -8 -23 -20 -20 -30 -47 -10 -9 -25 -33 -1 -17 -13 -12 -22 -9 -43 -28
1642 -28 -13 -8 6 6 33 23 -6 -2 -13 -6 -2 -18 12 -7 23 1 -3 22 8 6 -6 -14 -17 2 16 -9 22 -6 22 13 -13 -44 -19 -31 -15
1677 -15 -30 -18 -1 -2 16 -15 -1 -14 -6 -19 -14 -11 5 -1 -4 -9 11 18 -19 -30 4 0 9 14 18 25 15 1 15 9 -14 -9 -13 11 0 7 3 20 10
1716 10 2 -25 -28 -29 -14 -21 -8 -3 -12 -12 -19 -8 -20 -28 -19 -18 -4 -3 -10 -2 -5 -21 -16 -16 -41 -2 -20 6 9 27 3 6 11 14 18 12 -13 -11 15 8 37 17 3
1759 3 7 7 11 -34 -6 -18 -5 -14 5 -5 -22 17 -17 -5 -37 -19 -31 -27 -29 -23 13 4 1 -15 -12 -22 -22 -29 -23 8 1 -10 25 0 -7 3 1 16 2
1798 2 -12 18 -2 21 20 6 16 14 7 -1 -19 8 16 -1 43 13 5 -12 -21 1 -17 -20 5 10 -4 5 -14 -14 -23 -22 -5 -22 -26 -36 -11 -14 1 -18
1836 -18 3 8 -14 1 -9 -10 4 24 0 0 10 14 16 -1 4 3 2 11 1 14 7 36 1 3 4 -11 17 -18 -35 -4 -10 -18 7 17 -4 -15 -26
1873 -26 -10 -6 -30 -33 -16 -11 -9 5 -8 -21 -30 -26 -23 -20 -11 -22 3 8 19 0 5 -7 14 14 -21 4 11 21 13 21 14 16 10 -15 -11 -15 7 0 15 -6 2
1914 2 17 3 2 -4 -32 -22 -30 -41 -9 0 8 -19 -8 -15 -16 -17 -14 -10 -6 -1 -10 6 13 0 16 -11 -25 -4 23 -8 2 22 10 32 18 -8 -1 0 -1
1953 -1 -12 14 -7 2 -1 13 14 17 3 -15 -11 -3 -21 -8 -17 -22 -8 -12 -27 -25 -22 -33 -26 -30 -9 -5 -2 1 15 15 -14 11 -7 -28 -15 -18 2 -3 15 30
1993 30 30 0 16 -3 14 -4 -6 -8 26 34 2 9 -3 -15 -20 -15 -12 -8 -8 -3 6 20 7 9 -18 -25 -20 -35 -12 -16 -11 11 6 -11 -7 -9 -15 -16 -26 6 9 15
2035 15 3 5 -3 18 -2 -28 -10 10 -1 17 20 24 17 25 2 -15 -2 -8 -10 4 7 7 16 6 9 -7 14 6 -5 -17 -9 0 -2 -5 1 -7 -2 -12 -8 -20 -11
2076 -11 -9 -1 -11 -12 2 13 -19 -13 3 8 -8 8 11 6 8 22 2 -1 -5 14 -17 -4 15 0 16 11 18 17 4 -1 -4 -31 -18 1 -16 -2 12 16
2114 16 8 -3 -8 -8 -10 -29 -12 -21 -28 -8 -9 -3 11 -4 8 -22 -9 -5 3 0 -16 8 17 0 8 -9 29 36 15 7 23 9 24 35 18 8 -19 15
2152 15 5 -10 -12 4 16 -11 -1 -9 -24 0 -22 -25 -2 -21 0 -31 -6 -19 8 -14 -3 25 -17 -17 -15 -3 17 -8 4 -7 -5 -8 -14 4
2186 4 -7 6 14 10 13 13 1 22 34 12 -6 -9 0 -14 -12 2 5 6 16 11 -1 -15 -19 10 -18 -11 4 -2 -14 -26 -5 -2 -26 -24 -26 -34 -23 -1 -3 5
2226 5 10 10 -16 1 0 -14 -1 5 18 -6 13 11 21 39 0 -14 -1 12 10 17 26 13 -1 5 15 -11 -1 -1 -13 9 -8 -17 -4 -3 -6 -3 0 -20
2264 -20 -6 -9 -10 -25 3 -12 -9 -24 -19 -7 -7 -27 10 -6 -7 8 11 -3 7 2 -6 -18 -2 -8 29 18 24 11 8 9 -6 -10 -8 -5 -6 -6 28 -14 9
2303 9 -16 0 -16 -9 -31 -6 -13 -17 -2 -9 -24 -19 1 -9 -20 -28 -3 -25 -3 -19 -16 10 -11 -5 -1 8 -8 -21 -4 -5 -4 20 1 13 23 9 17
2340 17 7 -14 -11 0 4 -3 17 -15 11 6 -22 2 -26 -16 0 1 -16 -11 -12 -23 19 -5 -40 -21 -24 -16 -25 -2 -30 -13 -29 -4 -20 -18 -26 10
2376 10 -15 -6 -5 -12 -1 -1 -11 12 1 10 -1 -1 11 6 24 15 18 7 10 21 2 0 -1 -6 -9 3 -20 -20 2 -4 -15 -14 -23 -20 -2 -17 -7 -17 -19 -19 -26
2417 -26 -37 -20 -27 -16 -11 -5 -14 -8 13 7 4 11 -4 -13 2 -2 -2 10 38 1 13 11 -6 -19 -8 -7 15 12 16 0 13 -3 -7 -6 -15 -23 -18 -22 -32 7 2
2458 2 -14 -34 -17 -6 -10 -19 -37 -13 -36 -23 -9 -9 -7 -20 -17 -13 19 12 2 1 14 4 7 18 3 22 7 1 -10 19 16 6 18 27 1 3 9 1
2496 1 19 16 -3 4 0 -5 -11 17 -7 -18 -28 -15 -24 0 -2 -24 4 -7 -3 -17 -14 -27 -7 -10 -7 -24 6 20 10 18 6 27 20 10 25 9 12 20
2534 20 14 11 25 21 4 25 23 9 8 8 11 -1 -4 6 -11 -5 14 -10 -14 -7 -5 -14 -16 0 8 -22 18 -16 -8 -28 -13 14 -8 10 3 1 6 16 4 -22
2574 -22 -12 6 17 -7 28 12 -5 -6 7 8 24 17 12 11 0 8 -23 0 18 -4 2 17 5 -14 -16 -7 -3 -9 -20 -14 -12 -8 -24 -2 -28 -10 -15 -7
2612 -7 -21 -11 11 11 -10 -4 -14 -26 -10 2 -5 5 -20 20 7 8 13 3 8 9 19 0 1 7 15 7 23 19 -14 -4 -2 -27 7 -7 24 -2 -10 -14
2650 -14 6 -1 -2 -7 -13 -22 5 -21 -6 -11 -29 -7 17 -2 2 -2 5 -3 -2 -5 9 -8 -3 -5 23 -5 26 15 17 21 11 23 28 16 17 -3 6 7 8 5 19
2691 19 12 5 1 -2 -2 -9 -14 -14 -26 -6 -21 -28 -12 -27 -28 -18 -10 -10 -18 -25 -23 -3 0 8 -22 3 3 -11 -5 0 -3 14 18 18 29 18 20 29 27 15 -5 -5 -2 7 6
2736 6 4 2 -1 8 1 -6 -4 11 -13 -2 -2 4 0 4 -1 -30 -15 9 -5 -22 -10 -20 -18 1 1 -23 -1 -16 5 8 -10 4 4 -24 18 -14 32 20 -6
2775 -6 13 0 26 -11 16 23 -7 17 3 -5 7 -13 0 1 0 -14 -4 -3 2 -6 -17 8 -40 -37 -21 6 -11 6 -4 0 -23 -12 -4 -10 2 -20
2811 -20 -25 -16 4 -25 9 -12 -3 2 4 6 4 18 -8 18 10 14 10 10 9 -5 -3 8 3 -7 -5 -2 14 2 -13 -13 15 6 -5 -10 -30 -22 11 6 -7 -8 -12 -23
2853 -23 -21 -15 0 -14 -16 -11 -27 5 10 -12 -5 -17 12 -7 17 10 13 23 22 16 10 -2 0 2 8 9 6 14 1 17 11 -1 -8 0 12 -9 -16 -17 -2 -8 -21 -11
2895 -11 -22 -1 -31 -14 -17 -40 -2 -16 -21 -15 -25 7 -2 -24 -8 -15 -20 5 4 -2 34 2 4 9 3 19 28 12 3 6 6 14 -6 -13 -10 -10 -20 6 -2 -23
2935 -23 -10 6 7 -4 -10 -15 -21 -16 1 -10 -19 -9 -21 -11 -3 -5 -12 -13 -12 -19 -6 -3 -16 -28 -26 11 1 -17 -13 19 18 6 7 7 7 22 -4 16 17 5
2975 5 20 11 15 22 -19 18 11 7 3 -12 4 4 -9 10 -23 -18 6 1 -1 -17 1 -18 -1 6 -8 -12 -9 -29 -14 -11 -6 -28 -13 -10 -2 0 -14 18 14 11 -11
3016 -11 23 12 1 7 26 -2 1 0 5 12 -2 8 -4 17 2 6 2 -12 -1 -6 -7 7 -1 3 -19 -8 -22 -14 -23 3 -5 -6 -10 -14 -8 10 -5 -8 5 -8
3056 -8 -10 6 -1 -13 3 18 3 -10 -4 -7 -13 -5 -6 6 6 10 10 10 11 3 21 3 13 0 2 5 -14 0 9 -6 -9 -18 -22 -30 -13 -16 -9 -13 -1 -14 -19 -7 -13
3099 -13 -8 9 3 -14 -1 -10 -27 -7 -27 12 -13 -15 9 23 -3 4 3 -4 -2 25 0 11 9 11 -5 14 17 13 20 5 -2 -2 -13 -2 5 -16 -5 -12 -2
3138 -2 -11 3 -18 -12 -17 -25 -32 -25 -20 0 2 -4 -15 -5 -26 -20 -14 9 11 1 13 -5 -3 22 1 -4 25 28 13 12 10 13 9 10 7 35 6 4 2 -1 7 -16 12
3181 12 -5 6 9 -26 2 -4 -33 -9 -16 -15 -19 -27 -20 -2 -23 -17 2 -11 3 -8 -21 12 20 -24 -1 1 8 -9 -12 16 10 10 8 28 6 -2 9 18 -6
3220 -6 3 11 18 -4 5 3 -6 13 4 9 -10 2 -7 -7 3 -7 -17 -20 -2 -7 4 -7 -8 2 -7 -24 -8 -3 -6 2 -24 -2 21 8 -7 7 23 -4 15
3259 15 2 -11 -3 -3 8 1 14 5 -2 0 16 18 8 19 19 17 2 10 -7 -3 8 -18 14 -4 5 -24 -21 -15 -12 -12 -21 -10 -28 -11 -25 -12 -7 -28 -18
3298 -18 -2 17 10 -1 -3 -16 18 12 -4 -5 0 8 9 -2 16 21 15 16 36 28 14 22 -13 10 6 1 9 -2 -2 0 -19 8 -11 -2 -11 8 -15 1 -10 -11
3338 -11 1 1 -20 -20 -14 1 -15 -2 10 -3 -5 -15 -6 -10 -3 8 21 3 15 -16 3 13 5 -4 -1 22 18 4 7 14 0 18 10 27 0 0 -7 11
3376 11 -19 14 -6 -12 -1 -8 -8 -9 -15 -19 9 -7 -7 4 -1 0 -27 -17 -13 -7 -14 2 11 -3 6 21 -18 18 17 15 -1 7 3 6 -3 16 15 18 20 9 9 8 3
3419 3 6 10 7 8 -4 13 -7 16 -1 3 -8 7 -16 -25 -11 19 -14 4 -18 2 1 0 5 -6 -18 -10 -6 5 1 7 5 3 4 0 6 1 17 11 10 15 25 24
3461 24 10 6 39 23 15 14 14 7 14 11 16 18 -3 6 3 -1 -7 -11 8 12 -9 -8 0 -16 -5 -9 3 -16 -32 -6 -25 -3 0 25 3 -7 -6 7 17 3
3501 3 14 15 2 21 5 17 12 -10 -5 21 -1 19 22 15 21 -3 10 17 -1 13 22 -1 -12 2 8 -16 6 -1 -1 1 0 -10 4 -7 -8 -17 -14 -25 0
3540 0 5 -1 7 -22 -6 -1 -5 18 7 4 24 -8 -3 27 16 -2 24 33 20 14 15 2 12 26 1 23 20 3 -8 8 42 -2 3 -3 6 11 -22 -19 3
3579 3 4 2 -7 19 -2 -9 -15 1 -5 -1 8 -20 -26 -5 -4 2 29 1 15 23 1 24 13 5 -6 12 -6 14 8 -2 24 8 9 3 1 13 -7 -4 -4 0 -4
3620 -4 -9 8 -21 -7 -31 -11 -14 -4 -17 -21 -30 -16 -4 -28 -7 8 4 10 5 4 4 20 -2 1 3 2 12 5 13 24 8 10 17 14 3 -8 25 13 10 8
3660 8 16 -10 13 1 16 26 -14 6 5 7 -1 -6 6 18 -12 -3 -8 -16 -16 5 -21 -17 -16 -14 -23 -5 -7 -10 9 -3 -7 18 17 19 -11 -3 -3 -6 12 12 5 -1 12
3703 12 11 5 -1 9 11 -1 1 7 18 -9 11 5 11 -15 10 -6 16 14 -13 -14 -5 1 -33 -10 -2 -11 -20 14 -12 -17 -14 6 -16 -8 -18 -12 8 -21 11 15
3743 15 -6 8 12 14 9 16 5 9 13 12 6 23 21 1 24 17 8 14 5 11 22 -6 4 5 2 5 -18 -11 -7 -13 -22 -32 -15 -18 -26 -34 -29 -2 -24 -25 -2 -1 9 -10
3787 -10 4 -2 -5 16 12 7 11 2 0 12 7 18 11 10 20 10 0 4 9 21 -12 -4 10 7 10 0 11 6 18 -6 -2 0 2 13 19 -12 -11 -20 4 -11 -5 -4
3829 -4 7 -10 -17 12 -15 -3 6 21 5 3 13 1 -6 18 15 20 22 8 11 22 1 -6 13 16 6 -8 14 2 1 5 22 8 14 8 6 8 -23 5 0
3868 0 -16 -25 -13 -4 -23 8 1 -27 -22 -19 -6 5 3 5 -7 -2 -2 4 -5 6 -9 21 19 1 -1 14 18 20 26 13 11 4 4 11 14 4 14 27 9 -3 -10 12
3910 12 9 -2 9 -17 -28 -1 -9 -4 2 1 -21 -21 -17 -5 -23 0 -17 -25 -15 6 -3 3 7 21 -9 -7 11 19 -6 16 -6 -3 21 17 23 26 17 4 9 0
3950 0 7 -10 12 -2 17 19 4 1 1 3 -5 -3 -20 -26 -7 4 -13 -11 15 -5 -14 -16 -19 -6 -6 -14 -2 -20 -42 -7 14 -8 -4 8 7 3 4 0 19 11 6
3991 6 11 12 8 18 -13 -3 4 -11 5 20 0 8 -4 10 -9 -16 2 7 19 -20 6 6 -9 -7 7 -2 -12 -13 -7 -11 -25 -13 -2 -40 -12 -20 -21 2
4029 2 5 -3 -20 -16 1 5 1 -11 -9 29 9 4 -4 1 7 15 19 25 20 19 5 4 0 10 14 -4 10 4 7 -1 -23 -6 11 5 -7 12 5 -14 0 -14 -10 -32 -21
4072 -21 -16 -10 -20 -13 13 16 -8 -4 24 15 -29 3 1 5 9 10 18 3 10 8 1 20 9 26 -3 0 19 7 25 -15 3 -13 -1 8 -15 -3 2 -9 -17
4111 -17 5 -18 3 1 11 -4 -12 -2 -20 -2 5 3 6 -26 -6 2 8 -15 -3 -4 8 0 8 10 4 19 37 -1 19 16 25 3 5 7 10 5 2 37 16 7
4151 7 20 2 -2 -10 -5 -5 -1 19 -4 5 0 -27 -31 -13 -11 7 -31 2 -26 -13 -16 -15 -10 -22 -15 -1 -21 -29 7 4 2 -8 16 -6 4 -1 0 0 0 -8 7
4192 7 18 19 3 1 -12 30 -22 -3 -15 -4 11 -13 0 -16 11 -2 -27 -15 -6 -5 -30 -14 -13 -45 -30 0 -11 -11 -27 -4 -14 -15 -1 1 3
4227 3 6 1 -9 -18 4 1 19 12 10 19 17 -18 18 21 21 12 8 -5 6 24 12 15 -5 18 14 1 -11 -3 -9 -10 -4 -5 0 -15 -13 -9 -13 7 -24 -30 -9 -32 -1
4270 -1 -14 -10 -10 -13 9 1 9 16 -7 6 0 14 9 11 6 5 9 24 15 16 1 12 17 -3 9 4 6 -7 -3 -6 5 6 5 -18 -4 -18 -16 -6 -25 -3 -23 0
4312 0 -18 -19 -3 -14 -14 -18 -6 -8 -18 -10 0 2 -6 8 13 -8 5 -6 3 12 7 2 0 -13 -8 25 17 24 26 -2 -5 20 5 19 -2 -1 1 6 0 -4 -7 -7 5
4355 5 -9 -36 -17 -20 -21 -6 -9 -17 -13 -24 -16 -19 -8 -29 -28 -14 -11 -7 -27 -1 7 9 23 -4 -8 -5 2 8 -6 18 2 2 4 -3 -19 20 -2 29 -7 8
4395 8 -13 1 -15 -5 -12 1 -11 -34 -2 -10 1 4 -10 -9 -14 -20 -16 -24 -18 -22 -20 -14 -11 -35 -11 -34 7 -22 -11 0 -6 5 -15 19 -2 29 20 19 34
4434 34 11 0 21 18 -5 4 -8 11 5 20 18 13 12 4 -21 -9 0 -7 -9 -5 -19 -19 -27 -15 6 -6 -16 -7 -4 6 8 -30 -24 -13 4 -1 -18 -11 9 10
4474 10 -8 -13 1 15 12 10 6 13 -8 5 18 12 -8 5 18 -16 16 20 8 3 4 17 4 -18 -7 -2 -23 8 -13 -8 -20 -21 -23 -26 -30 -37 -25 -27 -23
4513 -23 -29 -8 -15 -25 -5 -16 -17 -4 -8 -15 -9 13 2 1 -6 21 13 2 9 6 30 -5 11 6 1 -8 -3 18 4 8 -12 4 9 -18 7 6 -14 -23 -14 -20 -32
4554 -32 -17 -7 -23 -15 -12 -8 -21 -14 1 -8 -4 -20 -5 23 -9 -8 5 -13 -3 15 8 10 -7 -9 10 5 1 16 10 12 23 10 -4 -7 -1 9 7 -13 3
4593 3 -2 -16 -1 -4 -6 -2 -1 10 -23 -27 -17 -30 3 -33 -20 9 -11 -6 -13 -2 -4 -11 -2 -3 -16 -3 -6 2 -15 -24 15 -8 5 6 9 -9 15 10 12 -7
4633 -7 8 5 -3 23 2 6 3 -19 15 -12 -20 0 -7 -3 12 3 -15 -15 -18 -8 -5 -25 -9 -34 -14 -23 -17 11 -5 -5 -14 4 -9 9 2 10 2 23 22 -2
4673 -2 1 -9 -20 11 -6 21 18 -3 -9 1 6 11 3 8 3 2 -6 -9 2 4 19 -2 4 -24 -13 -31 -25 -17 -19 -36 -30 -22 -16 -20 -16 -12 -18 0 -7 2 -14 2 19
4716 19 -7 -3 -8 6 -6 12 10 17 26 27 -1 -18 13 18 15 -7 19 12 25 -8 19 -11 22 2 -18 -21 -11 -3 -2 -6 -29 -22 -10 -23 -32 -1 -20 -12
4754 -12 -6 -3 0 -17 -26 -12 -22 -13 -12 -14 -5 -10 -6 -4 -9 6 32 17 4 27 34 8 18 32 8 0 7 -6 29 21 8 12 8 -5 -1 -2 -7 -6 0 -13 0 -8
4796 -8 6 -7 -16 -1 -41 -15 -3 5 -17 -8 7 3 12 -14 1 -6 -14 -2 19 14 16 23 9 -14 -3 8 -7 7 18 16 2 23 19 28 5 1 17 10
4834 10 2 -8 -16 -1 20 -8 -5 -4 2 -6 -13 -15 -30 2 -29 -23 8 -14 7 -13 -15 -19 -2 3 3 -7 -4 -1 12 -1 5 25 -3 7 7 17 33 6 14
4873 14 6 33 6 22 -6 26 8 -13 6 5 -5 -2 21 -3 6 0 12 -10 12 -13 14 -9 -12 -9 -22 -16 -14 -35 -8 5 -28 -1 0 14 6 4
4909 4 -4 -22 14 0 0 6 9 12 -4 2 4 -12 17 7 12 13 21 1 21 8 18 11 4 22 15 29 -21 -10 -20 5 6 2 5 -2 7 -23 -4 3 -8 -7 -7
4950 -7 -15 -7 -1 -21 1 2 3 4 -3 8 18 3 2 -3 10 18 14 7 3 3 5 8 20 27 20 8 7 14 0 26 18 -12 12 18 16 23 -8 13 -2 7 1 -11 3 -21
4994 -21 -18 -19 -9 -19 -7 -14 -10 2 -7 -5 5 -2 14 0 12 14 3 7 -6 -5 4 1 6 4 11 21 11 32 -4 19 15 -3 1 3 8 18 12 7 8 7 -7 15
5036 15 3 -12 2 0 2 -5 1 5 14 -9 -1 6 -11 -20 -16 -23 8 -2 -33 16 -9 -12 9 -4 19 17 24 2 -3 -2 23 26 24 18 12 10 36 15 3 4 10 23
5078 23 15 13 -4 12 11 -8 -8 -27 -15 -19 3 -5 -5 -3 -8 -19 -27 -17 -15 -25 4 -25 -13 2 7 5 -21 1 -10 -13 -13 -10 -9 17 22 2 15 8 11 3 10
5119 10 23 9 13 10 11 7 2 27 4 -9 -3 9 9 -9 2 10 27 -19 -15 -8 -21 -7 -19 -28 -37 -11 12 -1 -19 2 -13 -12 -10 18 -23 -3 -21
5156 -21 12 8 13 25 35 4 6 10 -12 16 24 22 23 7 5 1 12 15 11 13 17 8 -1 4 -3 -7 4 -16 0 -12 -8 -1 -2 -14 -21 -12 -18 -12 -28 -25 -15 -4 -2 -16
5200 -16 -8 -14 7 6 0 16 11 15 -3 12 21 5 7 9 17 15 11 2 31 8 -3 -6 2 -7 3 8 9 -1 -3 11 -7 -13 0 0 -5 -12 4 -14 -5 -2 6 -16 -36
5243 -36 0 -7 5 0 -20 -7 -23 2 -6 12 7 2 0 18 0 11 -3 10 9 15 8 9 16 6 11 27 4 9 8 5 5 5 -6 -27 -1 5 14 -8 -3 -26
5283 -26 -22 -8 -4 -23 -19 -16 -16 -16 16 -26 2 -5 13 13 -14 -1 -9 -3 -21 5 -10 13 -13 22 14 21 18 11 3 -8 7 3 26 18 -4 10 18 14 20 -7
5323 -7 6 2 4 -10 5 -15 -10 1 -20 -11 8 -3 -16 10 -17 -19 -5 -14 -15 0 -21 -5 -10 1 -4 6 -13 19 -5 7 20 19 -2 24 -2 8
5359 8 15 3 7 28 8 -26 25 4 8 -4 6 3 2 15 5 9 -4 -5 -17 9 -22 -25 -10 -13 -18 -5 2 -10 1 -10 5 -6 -4 -12 -1 -15 4
5396 4 -1 13 -2 11 12 -2 -9 3 15 8 26 9 5 14 14 -4 7 -10 -8 5 21 18 -8 1 -8 4 -19 4 -12 3 -12 -15 -15 -22 -19 -35 -21 -12 -5
5435 -5 -19 -23 -19 -9 -17 -16 -6 -28 -12 -13 -12 -4 17 0 -2 0 5 17 -4 22 -2 6 15 5 12 -13 27 3 -1 1 13 6 16 0 -7 -3 13 -3 -1 -9 -18
5476 -18 -3 0 -8 -17 2 -15 -3 -19 -16 -15 -7 -26 8 -10 -5 -6 -1 4 -4 -11 -2 1 -9 7 9 8 14 18 -2 11 29 -1 -15 2 -6 0 -7 35 22 3 7
5517 7 -15 15 3 5 9 13 -8 -11 5 -16 -21 -2 -6 3 -21 -9 7 -8 -9 -14 -5 -4 -14 1 -7 -11 13 18 3 13 -13 19 -3 8 4 12 4 4 25 24
5557 24 12 29 10 15 16 -6 11 -7 19 -1 9 -6 -17 -4 -2 -8 -12 -14 -5 -18 -13 0 -3 11 -3 -10 -9 -19 -15 -20 -24 -16 -6 -19 -16 -14 -5 -3 12 9
5597 9 9 -16 7 5 5 7 18 -2 -1 23 -7 6 6 30 11 7 -10 1 -19 -6 -8 -2 14 5 1 -1 -28 -19 -32 -14 -10 -19 -22 -4 -6 -15 -1 -2 -12 -15 12
5638 12 -34 -9 -10 10 18 25 8 -3 1 -8 31 27 12 6 17 23 16 2 11 26 11 14 -16 14 24 13 12 1 9 -1 3 11 2 20 -5 -5 -15 -19 -10 4
5678 4 -9 3 -22 -14 -9 6 17 -6 21 -1 0 -20 14 23 11 -1 -15 -11 8 10 7 -1 17 10 12 -7 14 -10 13 -6 5 4 7 8 6 24 -3 -17
5716 -17 19 -1 3 6 12 3 -8 -13 -28 -31 -1 -19 -28 -15 -4 -6 -15 -1 -4 -11 -21 -12 21 0 -6 -2 7 13 18 8 9 6 12 10 10 2 25 22 8 7 42 26 6
5759 6 8 15 7 3 -9 -15 -8 -5 0 -7 -11 -12 -18 -7 -29 -2 -11 -33 -15 -18 -12 -20 3 -5 -2 -18 -21 11 -13 -1 -4 9 -9 7 8 29 -3 2 11 13 31 12 -4
5802 -4 24 14 4 6 9 16 11 2 25 2 2 -2 -6 -9 -8 31 -4 -9 -7 -12 -14 -16 2 -10 -20 -18 -7 -25 -14 -12 8 9 -15 -7 7 -12 -2 11 7 4 2 2
5844 2 14 -3 -14 29 10 8 7 -3 4 -6 13 20 -5 9 7 7 -12 5 -4 9 -2 -4 5 -27 -14 -11 12 16 -11 -14 -7 -8 -11 -9 -7 3 -14 -26 5
5883 5 -1 -5 -1 0 -9 18 -10 0 -2 16 -3 -6 1 37 8 6 -10 15 19 5 1 10 16 15 2 5 1 -3 9 1 1 5 7 -17 7 1 -16 -30 -26 -23 -26 -13 3
5926 3 12 -14 -10 -10 -1 -10 1 -24 4 0 -8 1 -5 16 11 8 -1 19 26 43 2 13 2 16 18 26 7 -1 -20 -4 2 -2 7 4 8 -18 0 -3 14 -12 -10 -15 -6
5969 -6 1 -18 6 -7 -13 -6 5 -12 -6 -9 3 -15 -6 4 3 9 -7 10 25 7 6 13 6 12 18 14 -1 14 19 17 11 31 11 -7 8 11 -4 -18 -6 -1
6009 -1 -8 -27 4 4 -8 -7 3 4 -5 -7 -1 -22 -8 -18 -18 -5 4 -18 -9 10 -3 7 4 9 6 18 -4 24 11 8 18 -11 15 7 21 22 -16 38 5
6048 5 14 25 2 29 31 36 13 18 21 18 -13 8 -12 -19 9 -18 7 -5 -12 10 -8 -10 -29 -16 -16 4 -1 -14 -10 -12 6 9 -11 -17 12 3 19 16 45
6087 45 3 0 18 10 6 26 18 13 12 14 7 33 16 7 4 -1 9 -3 -3 -10 5 -13 6 -17 18 -25 -28 17 5 9 -24 -9 -28 17 2 4 -7 -13 -24
6126 -24 -2 11 -1 -2 4 -8 15 -1 5 4 15 13 9 -5 1 24 8 24 10 19 -13 6 -5 10 -4 -4 19 10 -12 -31 -1 4 -4 -11 -15 -11 -13 -18 -22
6165 -22 1 -19 1 -3 -10 -17 -9 0 -8 -26 -3 -1 5 4 -5 -4 4 1 7 16 8 19 8 3 -2 -2 12 -2 9 9 -2 -6 -8 8 4 -6 0 -10 10 -3 -10 -4 -6 -6
6209 -6 -7 -7 -13 -7 -7 13 -15 2 4 -2 -1 -5 -18 -17 -6 -11 -12 1 18 5 5 9 -9 -10 10 22 15 31 -3 -1 24 -10 -12 13 24 12 -8 25 5 16
6249 16 17 6 3 17 -5 -3 -3 -16 -9 -19 -5 -17 -10 -25 -19 -7 -11 -4 -44 -21 7 -8 9 -7 9 -6 -11 -16 -10 13 40 29 22 -6 -5 29 3
6286 3 43 20 21 18 18 6 15 26 23 22 8 18 23 5 9 6 2 2 -3 -5 -11 -2 -14 -19 2 -7 17 -6 -15 -12 -19 10 -5 7 1 4 -5 18 0 -11 8 0 15
6329 15 16 14 16 6 26 15 13 10 3 6 11 31 18 7 -1 16 -9 9 19 -1 7 27 -11 7 -11 13 -4 -14 -8 -1 1 -17 -14 -6 -1 9 16 12 -1
6368 -1 -8 10 -9 -12 1 6 -8 11 10 22 1 22 11 7 17 4 29 25 45 4 22 10 12 21 33 12 2 12 24 6 13 1 -2 2 -10 14
6404 14 -16 -1 12 -8 -1 0 -8 -1 3 0 -4 8 -17 -5 9 -18 5 3 3 26 -1 3 2 12 -2 0 11 30 16 2 10 15 14 26 11 44 12 10
6442 10 15 17 9 16 7 3 15 15 -9 0 -9 -7 1 -8 -19 -30 -6 5 9 18 -9 4 4 4 7 -17 -8 -11 -6 1 14 0 11 15 -11 13 16 -1 24 16 34 21
6484 21 30 32 10 7 26 26 4 8 4 13 10 10 24 21 -8 20 -8 5 -3 5 4 5 13 3 -7 2 -34 4 11 -2 -3 7 -12 -5 -5 3 -22 1 -3 11 0
6525 0 -15 7 4 11 12 14 9 9 6 31 27 25 14 19 4 11 13 16 9 23 14 8 13 6 19 -16 -19 9 4 3 -24 9 -7 7 -13 0 3 -1 19 16 16 -1 14
6568 14 6 -4 4 3 22 5 1 34 9 10 9 26 39 18 14 28 8 33 -7 22 2 16 22 7 4 15 -13 -8 -4 6 4 7 5 1 15 1 -31 -11
6606 -11 -6 -19 1 -32 -12 -5 11 6 3 11 17 2 -17 16 -14 16 -2 19 20 -1 24 16 16 24 6 21 19 28 42 -2 11 16 3 22 3 -18 -8
6643 -8 -7 -11 -16 5 6 3 -9 -3 -14 -12 2 -17 -28 6 -7 14 -1 -16 1 3 7 -3 -14 5 12 11 24 19 29 22 -3 20 -18 5 8 16 7 28 10
6682 10 13 15 23 12 11 13 20 24 -9 17 -16 -18 -4 -8 -12 -11 10 -4 9 2 -15 1 -29 1 -20 -24 -1 -5 4 8 -6 4 12 16 25 1 7 9 18 5 11 12
6724 12 27 7 15 7 8 3 7 19 29 18 13 6 13 10 0 -14 -12 12 2 -14 -6 10 -10 -8 -20 9 -8 -6 -23 -9 4 -5 0 -6 2 -25 1 2 -9
6763 -9 4 7 -4 10 12 5 -16 11 6 6 -1 18 -6 8 18 28 20 10 23 -4 1 27 15 -8 -8 3 -9 9 -5 15 -19 6 -3 -20 -4 8
6799 8 2 -12 -33 -15 -9 2 -9 -5 -13 0 -2 -8 2 11 11 13 31 16 -1 4 28 12 15 -9 10 17 9 14 11 3 -2 17 3 23 -11 10 -8 -9 -19 -4
6839 -4 -9 -23 -5 -21 -10 -13 -14 3 -8 -14 -5 -11 -21 -3 -25 -2 -7 -24 12 12 13 5 -3 3 1 -7 6 -1 16 7 12 24 16 32 31 12 12 -6 -1 0 0 12
6881 12 25 23 5 2 17 -5 0 0 13 0 4 -18 -8 -5 -13 -19 -12 -12 -9 -16 -9 3 -4 -41 -8 3 3 14 -6 -3 17 -13 -4 15 9 -4 -16 15 12 17
6921 17 20 30 17 -12 10 16 15 25 -6 26 -14 7 0 -2 20 -5 -7 10 4 -7 1 -7 10 11 9 -9 -13 3 2 -12 -16 0 -13 -17 -21 -5 0 5 23
6960 23 22 7 25 -1 6 -6 17 33 13 16 18 9 7 17 28 34 9 31 32 19 9 21 17 -10 0 -13 10 12 -14 -7 9 -9 1 -6 -3 -7 3
6997 3 -9 -4 15 -4 -4 1 -7 3 -3 18 6 12 18 7 0 3 5 10 17 18 15 0 3 4 -17 5 4 2 15 -6 3 6 19 6 -6 6 4 -6 2 9 -5 2 -1
7040 -1 -6 -12 13 1 -21 -12 -15 -12 1 -9 -25 26 0 -5 -8 -1 3 28 26 28 4 20 18 9 17 25 -2 21 1 8 19 16 22 12 13 -8 4 17 4 13 1
7081 1 -12 10 -14 8 -13 -7 12 -5 17 -25 -12 -1 -11 -10 3 3 19 -6 -1 -16 -15 -4 2 6 -8 14 0 18 6 3 16 15 5 26 9
7116 9 18 3 -4 7 19 15 18 8 22 7 3 9 -3 -4 -12 3 2 -18 -11 -19 -14 -17 5 -11 -18 13 -8 -19 -1 -13 5 -3 -17 -12 -17 -6 20 8 5 4
7156 4 -6 10 8 9 13 11 24 13 4 13 -1 29 -8 10 15 9 16 4 9 19 -4 33 -2 -11 -8 -2 -1 7 -20 -12 13 -18 -10 -15 3 -10 21 6 0 9 -11
7197 -11 3 -12 -2 18 -5 35 3 19 26 24 31 17 8 6 17 17 37 14 9 19 7 8 9 10 4 -4 31 11 -2 13 11 14 6 -4 -18 -11 1 -2 -3
7236 -3 -6 -2 0 3 7 -18 1 -3 -15 -3 -14 0 -2 -6 19 10 20 -1 -6 18 -5 -8 22 16 17 12 0 22 -1 18 4 27 25 5 2 19 17 -6 -8 -8
7276 -8 -2 7 -18 7 -10 8 10 3 -6 -7 -9 -2 20 -11 9 -25 -12 -12 -11 -14 -1 -26 -7 13 26 21 15 16 23 18 2 16 24 29 15 29 27 19 8 20 37
7317 37 -2 14 15 -11 10 33 -12 2 7 15 -20 -4 9 -16 17 8 27 -6 -16 -29 -19 6 -22 10 -17 2 20 14 -5 15 4 10 -5
7350 -5 9 -8 15 18 2 16 16 32 19 5 15 1 1 14 1 31 3 -8 1 5 8 5 3 16 -6 -22 2 -15 15 2 1 -11 -20 -11 7 0 -12
7387 -12 13 4 -7 -19 -15 0 28 -4 -17 -1 -20 2 1 -8 2 6 -2 15 19 4 20 20 10 35 31 11 -4 -4 22 -2 14 -5 -1 3 2 10 -3
7424 -3 -1 -6 -7 -16 22 -13 -19 -28 -2 -14 -19 -21 -7 -4 1 5 -6 -7 -7 -1 -6 1 1 6 5 -3 -10 14 0 1 14 2 18 7 15 26 11 20 27 0 1 -4 19 7
7468 7 14 -12 7 11 -18 3 -10 -11 3 11 -12 -9 -5 -17 -10 -27 0 8 13 -7 1 1 -3 -8 -13 -11 10 3 -11 1 25 4 8 24 36 23 14 14 27 15
7508 15 33 18 -4 13 14 12 12 -8 -5 1 -12 -14 -11 0 5 -18 2 -3 -7 -12 -16 -4 -10 1 -25 -22 -12 10 3 8 9 8 -4 8 -15 -7 -1 1 5 33 3
7549 3 11 17 7 11 19 24 11 14 9 24 21 26 4 12 2 -8 20 11 11 -14 -6 -13 -1 -11 8 -9 -15 -14 -9 -21 4 -22 -12 -3 -21 19 -14 -6 -3 2 -4 -6
7591 -6 7 0 -21 8 8 -5 16 10 -6 24 13 6 8 13 -7 14 -2 30 15 15 7 -13 2 6 -8 -3 12 -11 -6 -10 5 2 -13 -14 -3 18 -2 -10
7629 -10 0 -14 -20 6 -6 -6 -6 -8 2 -2 -10 0 -19 13 -5 -13 5 22 14 20 0 -13 17 27 11 4 6 26 29 0 18 8 14 10 9 17 -3 -22
7667 -22 12 6 -12 -20 20 2 -28 -7 -11 -23 -28 -10 2 -4 -6 -5 -7 -1 7 8 23 25 -4 -1 12 -1 4 -1 -6 -6 16 5 3 14 13 11 26 31 2 14 2
7708 2 6 12 12 -10 25 -2 -11 -13 -5 -10 7 -3 3 -2 -2 -12 -8 -15 -12 -3 -30 -22 -35 -7 -8 -4 -5 -21 -7 17 3 15 24 -20 -20 1 8 12 7 31 32 16 4
7751 4 14 21 15 20 -7 13 5 5 10 14 2 39 -14 -12 1 -26 -3 4 -10 -10 3 4 -9 -14 -3 -12 -25 -2 -6 16 -20 -8 -23 -13 7 -3 15 13
7789 13 -12 9 18 13 31 18 25 -16 11 25 18 14 15 14 4 10 2 13 16 3 -6 10 12 -8 -9 22 17 12 19 -5 4 8 -13 -4 2 -11 -10 -7 -1 -13 -4 -4 -1
7832 -1 -10 -7 -17 -10 -15 5 28 19 4 22 19 -7 18 14 24 5 4 15 10 19 1 3 12 26 16 -12 -22 -11 6 -2 -37 -12 0 13 -6 -13 1 -10
7870 -10 -1 -5 -2 -2 -2 -7 -6 -36 -38 -7 2 -28 -1 4 -12 -27 13 -3 -5 21 -12 5 6 7 16 10 13 23 19 14 15 26 26 19 3 10 0 -10 -5 7 -7 -16
7912 -16 -3 -8 -2 -13 8 -17 -11 -29 -2 6 -11 -26 -19 -14 -11 14 5 -11 -16 10 0 -13 -3 6 2 20 4 5 20 16 10 2 -2 -1 5 8 7 14 19 27 6 2
7954 2 1 5 20 21 -16 -6 11 6 -4 -2 -3 -5 -8 -7 -22 -14 -7 -10 1 6 1 -13 0 -11 -14 3 -8 -12 -14 -13 9 1 17 3 8 5 -1 -2 9 7 15 12 12 25
7998 25 4 7 4 7 12 12 -15 -5 -14 -16 1 2 7 -22 -14 -25 -18 -16 -26 -7 -7 -10 -7 6 -14 0 -23 3 5 12 -7 -1 2 15 19 29 11 29 12 20 17
8039 17 22 24 12 34 17 12 11 -1 30 13 4 18 -1 14 -12 15 -3 2 -1 -9 -18 -7 -7 -7 -21 -10 6 -4 -14 -23 -21 -10 -11 4 5 -15 -11 6
8077 6 -6 1 4 -2 5 17 -7 17 12 20 11 5 1 6 4 11 18 4 8 27 3 11 11 15 24 -1 -2 7 -1 2 9 -16 -8 24 -3 -14 -3 1 0 5 -22 -2 1 -17 -14
8122 -14 19 -1 7 9 -12 13 -5 10 25 -1 2 10 -11 -1 20 23 26 19 9 27 22 11 12 17 26 36 3 8 13 11 6 -2 10 -4 9 -12 0 -8 -5
8161 -5 0 -23 8 -25 -20 -1 -27 -22 -21 -5 -24 -13 17 -37 -4 -7 -6 -3 16 -14 7 16 13 -2 -4 5 25 25 17 -5
8191e
##END NTUPLES=NMR FID
##END=
