##TITLE=H1
##JCAMPDX= 6.0         $$ Bruker NMR JCAMP-DX V2.0
##DATA TYPE= NMR SPECTRUM
##DATA CLASS= NTUPLES
##ORIGIN= UXNMR, Bruker Analytische Messtechnik GmbH
##OWNER= root
$$ XWIN-NMR		Version 3.5
$$ Mon Jan  4 09:53:06 2016 Russian Standard Time (UT+4h)  servis@DPX200
##.OBSERVE FREQUENCY= 200.131235884673
##.OBSERVE NUCLEUS= ^1H
##.ACQUISITION MODE= SIMULTANEOUS
##.ACQUISITION SCHEME= undefined
##.AVERAGES= 32
##.DIGITISER RES= 18
##SPECTROMETER/DATA SYSTEM= spect
##.PULSE SEQUENCE= zg
##.SOLVENT NAME= DMSO
##.SHIFT REFERENCE= (INTERNAL, DMSO, 0, 16.5164)
##AUDIT TRAIL= $$ (NUMBER, WHEN, WHO, WHERE, WHAT)
$$ ##TITLE= Audit trail, XWIN-NMR		Version 3.5
$$ ##JCAMPDX= 5.01
$$ ##ORIGIN= Bruker BioSpin GmbH
$$ ##OWNER= servis
$$ F:/spectra/data/servis-vadim/nmr/H1/1/pdata/1/auditp.txt
$$ ##AUDIT TRAIL=  $$ (NUMBER, WHEN, WHO, WHERE, WHAT)
(   1,<2016-01-04 09:51:07.53 +0400>,<servis>,<DPX200>,
      <created by zg, POWCHK disabled, PULCHK disabled
       configuration hash MD5:
       00 E9 B6 7A A2 85 ED C7 34 08 36 98 17 FE 4E 26
       data hash MD5: 16K
       F9 49 4F 9B 67 CA 1B 6D 74 3D F2 71 39 01 98 6E>)
(   2,<2016-01-04 09:51:26.64 +0400>,<servis>,<DPX200>,
      <Start of raw data processing
       efp BC_mod = 2 LB = 0.3 FT_mod = 6 PKNL = 1 PHC0 = -105.5286 PHC1 = 3.843713 SI = 32K 
       data hash MD5: 32K
       9A 24 F1 F7 1F A2 71 A8 CE 68 7A 8A 63 F8 DB A8>)
(   3,<2016-01-04 09:51:38.10 +0400>,<servis>,<DPX200>,
      <pk PHC0 = -2.030905 PHC1 = 0 
       data hash MD5: 32K
       89 61 02 B0 7A 6A BE 10 DB 56 D5 25 EE DB B4 35>)
$$ ##END=
$$ 
$$ hash MD5
$$ 69 8A 8E 94 F4 D0 25 72 0E 24 3A 03 55 67 D0 F8
##$RELAX= 
##$RELAX= 
##$RELAX= 
##$RELAX= 
##$RELAX= 
##$RELAX= 
$$ Bruker specific parameters
$$ --------------------------
##$DU= <F:/spectra>
##$EXPNO= 1
##$NAME= <H1>
##$PROCNO= 1
##$TYPE= <nmr>
##$USER= <servis-vadim>
##$AMP= (0..31)
100 100 100 100 100 100 100 100 100 100 100 100 100 100 100 100 100 100 
100 100 100 100 100 100 100 100 100 100 100 100 100 100 
##$AQSEQ= 0
##$AQ_mod= 1
##$AUNM= <au_zg>
##$AUTOPOS= <>
##$BF1= 200.13
##$BF2= 200.13
##$BF3= 200.13
##$BF4= 200.13
##$BF5= 500.13
##$BF6= 500.13
##$BF7= 500.13
##$BF8= 500.13
##$BYTORDA= 1
##$CFDGTYP= 0
##$CFRGTYP= 5
##$CHEMSTR= <none>
##$CNST= (0..31)
1 1 145 1 1 1 1 1 1 1 1 1 1 1 1 1 1 1 1 1 1 1 1 1 1 1 1 1 1 1 1 1 
##$CPDPRG= <>
##$CPDPRG1= <>
##$CPDPRG2= <>
##$CPDPRG3= <>
##$CPDPRG4= <mlev>
##$CPDPRG5= <mlev>
##$CPDPRG6= <mlev>
##$CPDPRG7= <mlev>
##$CPDPRG8= <mlev>
##$CPDPRGB= <>
##$CPDPRGT= <>
##$D= (0..31)
0 1 0 0 0 0 0 0 0 0.06 0 0 0 0 0 0 0.0002 0 0 0 0 0 0 0 0 0 0 0 0 0 0 
0 
##$DATE= 1451886666
##$DBL= (0..7)
120 120 120 120 120 120 120 120 
##$DBP= (0..7)
150 150 150 150 150 150 150 150 
##$DBP07= 0
##$DBPNAM0= <>
##$DBPNAM1= <>
##$DBPNAM2= <>
##$DBPNAM3= <>
##$DBPNAM4= <>
##$DBPNAM5= <>
##$DBPNAM6= <>
##$DBPNAM7= <>
##$DBPOAL= (0..7)
0.5 0.5 0.5 0.5 0.5 0.5 0.5 0.5 
##$DBPOFFS= (0..7)
0 0 0 0 0 0 0 0 
##$DE= 6
##$DECBNUC= <off>
##$DECIM= 32
$$ [...]
##$SUBNAM3= <"">
##$SUBNAM4= <"">
##$SUBNAM5= <"">
##$SUBNAM6= <"">
##$SUBNAM7= <"">
##$SUBNAM8= <"">
##$SUBNAM9= <"">
##$SW= 20.6817932712277
##$SWIBOX= (0..15)
0 0 3 0 0 0 0 0 0 0 0 0 0 0 0 0 
##$SW_h= 4139.07284768212
##$TD= 16384
##$TD0= 1
##$TE= 0
##$TE2= 300
##$TE3= 300
##$TEG= 300
##$TL= (0..7)
0 120 120 120 120 120 120 120 
##$TP= (0..7)
150 150 150 150 150 150 150 150 
##$TP07= 0
##$TPNAME0= <>
##$TPNAME1= <>
##$TPNAME2= <>
##$TPNAME3= <>
##$TPNAME4= <>
##$TPNAME5= <>
##$TPNAME6= <>
##$TPNAME7= <>
##$TPOAL= (0..7)
0.5 0.5 0.5 0.5 0.5 0.5 0.5 0.5 
##$TPOFFS= (0..7)
0 0 0 0 0 0 0 0 
##$TUNHIN= 0
##$TUNHOUT= 0
##$TUNXOUT= 0
##$USERA1= <user>
##$USERA2= <user>
##$USERA3= <user>
##$USERA4= <user>
##$USERA5= <user>
##$V9= 5
##$VALIST= <valist>
##$VCLIST= <CCCCCCCCCCCCCCC>
##$VD= 0
##$VDLIST= <DDDDDDDDDDDDDDD>
##$VPLIST= <PPPPPPPPPPPPPPP>
##$VTLIST= <TTTTTTTTTTTTTTT>
##$WBST= 1024
##$WBSW= 4
##$XGAIN= (0..3)
0 0 0 0 
##$XL= 0
##$YL= 0
##$YMAX_a= 967344
##$YMIN_a= -1146076
##$ZGOPTNS= <>
##$ZL1= 120
##$ZL2= 120
##$ZL3= 120
##$ZL4= 120
##$ABSF1= 0
##$ABSF2= 0
##$ABSG= 0
##$ABSL= 0
##$ALPHA= 0
##$AQORDER= 0
##$ASSFAC= 0
##$ASSFACI= 0
##$ASSFACX= 0
##$ASSWID= 0
##$AUNMP= <proc_1d>
##$AZFE= 0.1
##$AZFW= 0.1
##$BCFW= 0
##$BC_mod= 2
##$BYTORDP= 0
##$COROFFS= 0
##$CY= 18.4799938201904
##$DATMOD= 1
##$DC= 0
##$DFILT= <>
##$DTYPP= 0
##$F1P= 9.9274215381318
##$F2P= -0.165520771350173
##$FCOR= 1
##$FTSIZE= 32768
##$FT_mod= 6
##$GAMMA= 0
##$GB= 0
##$INTBC= 1
##$INTSCL= 1
##$ISEN= 128
##$LB= 0.3
##$LEV0= 0
##$LPBIN= 0
##$MAXI= 10000
##$MC2= 0
##$MEAN= 0
##$ME_mod= 0
##$MI= 50
##$NCOEF= 0
##$NC_proc= -2
##$NLEV= 6
##$NOISF1= 3.799351
##$NOISF2= 2.8
##$NSP= 0
##$NTH_PI= 0
##$NZP= 0
##$OFFSET= 16.51637
##$PC= 4
##$PHC0= -107.5595
##$PHC1= 3.843713
##$PH_mod= 1
##$PKNL= yes
##$PPARMOD= 0
##$PSCAL= 4
##$PSIGN= 0
##$REVERSE= no
##$SF= 200.13
##$SI= 32768
##$SIGF1= 3
##$SIGF2= 2
##$SINO= 400
##$SIOLD= 16384
##$SREGLST= <1H.CDCl3>
##$SSB= 0
##$STSI= 32768
##$STSR= 0
##$SW_p= 4139.07284768211
##$SYMM= 0
##$S_DEV= 0
##$TDeff= 16384
##$TDoff= 0
##$TI= <>
##$TILT= no
##$TM1= 0
##$TM2= 0
##$TOPLEV= 0
##$USERP1= <user>
##$USERP2= <user>
##$USERP3= <user>
##$USERP4= <user>
##$USERP5= <user>
##$WDW= 1
##$XDIM= 32768
##$YMAX_p= 394382186
##$YMIN_p= -118490
$$ End of Bruker specific parameters
$$ ---------------------------------
##NTUPLES= NMR SPECTRUM
##VAR_NAME=  FREQUENCY,     SPECTRUM/REAL,   SPECTRUM/IMAG
##SYMBOL=    X,             R,               I
##VAR_TYPE=  INDEPENDENT,   DEPENDENT,       DEPENDENT
##VAR_FORM=  AFFN,          ASDF,            ASDF
##VAR_DIM=   32768,         32768,           32768
##UNITS=     HZ,            ARBITRARY UNITS, ARBITRARY UNITS
##FACTOR=    0.126318333923829, 1,           1
##FIRST=     3305.42128286362, 0,            0
##LAST=      -833.651564818493, 0,           0
##MIN=       -833.651564818493, -118490,     0
##MAX=       3305.42128286362, 394382186,    0
$$ Real data points
##PAGE= N=1
##DATA TABLE= (X++(R..R)), XYDATA
$$ [...]
15966e6800K084K855M270L288N61q99q33j269k166j367J445L928M245K751N64
15951c7343j615l283m113m028k698j9K361J923j119l073j301K415M741M882L722
15936c8548J241k372m971m842l437k836k226q4J991J521q6N63L046L656J501m78
15920d6361q22j247k261j729P07K039N60j584k302k298k004J00L617M648J513
15905d7424j483j6L396L199n28k392k15J954K95l343m561k318N17J256M9j209
15889e2823j292n03M01J294K226K598J884O88j67j098k328j815K142O319M897
15874c7577j996o539l207L311M512l69m387k999J253L961L801J516j667l426j789
15859d5602J524K447J90j805j346o3P28K294M470L877m31l519j217K956K589k015
$$ plain form
15966 -56800 -54716 -51861 -47591 -44303 -43742 -44641 -45474 -46743 -48909 -50276 -48831 -44903 -40658 -37907 -37343
15951 -37343 -38958 -42241 -46354 -50382 -53080 -53099 -50738 -48815 -49934 -53007 -54308 -51893 -47152 -42270 -38548
15936 -38548 -37307 -39679 -44650 -49492 -52929 -55765 -57991 -58075 -56084 -54563 -54649 -54086 -51040 -47384 -45883 -46361
15920 -46361 -47183 -48430 -50691 -52420 -51713 -49674 -49114 -50698 -53000 -55298 -57302 -57202 -53585 -48937 -47424
15905 -47424 -48907 -48923 -45527 -42328 -42856 -45248 -45463 -43509 -43214 -46557 -51118 -53436 -52919 -51663 -51614 -52823
15889 -52823 -54115 -54618 -54217 -52923 -50697 -48099 -46215 -45527 -45694 -46792 -49120 -50935 -48793 -42474 -37577
15874 -37577 -39573 -46112 -49319 -46008 -41496 -41865 -46252 -49251 -47998 -44037 -40236 -38720 -40387 -43813 -45602
15859 -45602 -44078 -41631 -41441 -43246 -44592 -44655 -43927 -41633 -37163 -33286 -33717 -37236 -38453 -35497 -32908 -34923
15843c4923m730l133j160j731k526j181L18m69j904j202P95J371N55M01J013R22
15827d7584N72J684L441K952j5k312k217j581j973k132j013o5j42O68L188M235
15811d2294J295k467k439K21Q22p53l79K013J364l493o437l257J592K147J04Q59
15795e1102L804L319j869o607o780l656k71K107L031K349J625K730M487L925J190
15780d1718n23l37q95l280m913l993k027k10K536N773O035K118j938k552j792
15765d7716k877l880j016L972N331J857j362o41J175n92n346p484l302L922O960
15750e0999L059k179j762L013M209r37n607l670J331K440j49j274j30j29j411
15735e4195j035M31J1p53J898N097K191m865o690k389j938p163l878J5879L4884
$$ plain form
15843 -34923 -39653 -42786 -43946 -45677 -48203 -49384 -49066 -49535 -51439 -52641 -51846 -50475 -49920 -49519 -48506 -47584
15827 -47584 -47012 -45328 -41887 -38935 -38950 -41262 -43479 -45060 -47033 -49165 -50178 -50243 -50385 -49717 -46529 -42294
15811 -42294 -40999 -43466 -45905 -45684 -44862 -45615 -45994 -43981 -42617 -46110 -52547 -55804 -54212 -52065 -51961 -51102
15795 -51102 -47298 -43979 -45848 -52455 -59235 -62891 -63162 -61055 -58024 -55675 -54050 -51320 -46833 -42908 -41718
15780 -41718 -42241 -42578 -43473 -46753 -51666 -55659 -57686 -57896 -55360 -49587 -43552 -41434 -43372 -45924 -47716
15765 -47716 -50593 -54473 -55489 -51517 -46186 -44329 -45691 -46332 -45157 -45749 -51095 -58579 -61881 -57959 -50999
15750 -50999 -47940 -50119 -51881 -48868 -44659 -45596 -51203 -54873 -53542 -51102 -51251 -52525 -52655 -52784 -54195
15735 -54195 -55230 -54799 -54788 -55541 -53643 -48546 -46355 -51220 -57910 -60299 -62237 -69400 -73278 -57399 -22515
15720b2515K9738L499j7156j6466n409m65k094j927P78P87j848k583j264j576
15706c8501l263k380J148K699L26k385k103j70L83o50j037N29K588K173j822o258
15690d8723o239j134L876M032O44j797j926j581j363j87J412J527L47j37K23k07
15674e1233j159o58R46J103k72l98J234J778M01J34K215L244R16j818j785o11
15658d5963o10J88L691O061K744l166m521r94Q04j844m203k947j323k255k639
15643e6977Q54N267N866L546K389K503R89j596j679N74O19l092n976l893P48K429
15627d7429j55l278l618j713N2Q06J475K545K842J176j316j885J33J744J02l047
15611e1566l195N79L974L363O62o1J158Q38j766l203j474P18O90L99K675N273
$$ plain form
15720 -22515 7223 10722 -6434 -22900 -28309 -28774 -30868 -32795 -32017 -31230 -33078 -35661 -36925 -38501
15706 -38501 -41764 -44144 -42996 -40297 -39971 -42356 -44459 -44629 -44246 -44896 -45933 -45404 -42816 -40643 -42465 -48723
15690 -48723 -54962 -56096 -52220 -48188 -47544 -49341 -51267 -52848 -54211 -54398 -52986 -51459 -51112 -51249 -51026 -51233
15674 -51233 -52392 -53050 -52104 -51001 -51273 -51671 -50437 -48659 -48258 -48124 -45909 -42665 -41749 -43567 -45352 -45963
15658 -45963 -46573 -46385 -42694 -36633 -33889 -37055 -41576 -42570 -41766 -43610 -47813 -50760 -52083 -54338 -56977
15643 -56977 -56123 -50856 -44990 -41444 -39055 -36552 -35563 -37159 -38838 -38264 -37645 -40737 -46713 -50606 -49858 -47429
15627 -47429 -47584 -50862 -54480 -56193 -56141 -55335 -53860 -51315 -48473 -47297 -48613 -50498 -50365 -48621 -48519 -51566
15611 -51566 -54761 -54182 -50208 -46845 -46183 -46244 -45086 -44248 -46014 -49217 -50691 -49973 -49283 -48884 -46209 -40936
15595d0936L608j389l625r37J594j94l224k742J53J483J332K005K000j411n078
15580d7361l028L329N817J701k406j559L52j239l474k121K55o98k566l05M276
15565d9027N106K038O91K803M121K147o76k260l243l411j580L68q35l475k471
15550d9704J798L067p35m079l103j144j494j507J294L413J298k069k186k46L76
15535e5021O58K818M314J779j856j067L241N128K856K46n21j058j880j417l23
15520d2103j095k873k182N62Q95k068l557o84L069L463J238n49j264j927k441
15505e1516k170j329m4J976L758L347P31j741k461j715K18L061M579K435j583
15490d2454l051j246J90n58j404j417k456l945j997L370O081K977p25J39K193
$$ plain form
15595 -40936 -37328 -38717 -42342 -43279 -41685 -41879 -45103 -47845 -47692 -46209 -44877 -42872 -40872 -42283 -47361
15580 -47361 -50389 -47060 -41243 -39542 -41948 -43507 -43155 -44394 -47868 -49989 -49734 -50432 -52998 -53303 -49027
15565 -49027 -43921 -41883 -41192 -38389 -34268 -32121 -32797 -35057 -38300 -41711 -43291 -42923 -43758 -47233 -49704
15550 -49704 -47906 -44839 -45574 -49653 -52756 -53900 -55394 -56901 -55607 -52194 -50896 -52965 -55151 -55397 -55021
15535 -55021 -54363 -51545 -47231 -45452 -47308 -48375 -45134 -40006 -37150 -36904 -37425 -38483 -40363 -41780 -42103
15520 -42103 -43198 -46071 -48253 -47691 -46796 -48864 -52421 -53105 -50036 -46573 -45335 -45884 -47148 -49075 -51516
15505 -51516 -53686 -55015 -55059 -53083 -49325 -45978 -45247 -46988 -49449 -51164 -50946 -47885 -43306 -40871 -42454
15490 -42454 -45505 -46751 -46561 -47119 -48523 -49940 -52396 -56341 -58338 -54968 -48887 -45910 -46635 -46496 -44303
15475d4303l13n197n665j351J521J25j724p22J532K476K026R91j70j97J867M075
15459d5029L384J73k310k787k527j672O29K555R59k920m044j096J378K13j674
15444e4768n39K423L701K662R40n80j257J73K950L270p75n309n283j324J677J548
15428e0491N76P25R52o6j519j804m07K035M081L868R99j974j898Q96K794J639
15412c9594o50j045P65K598K598O26k228m276l966j201K133L581K149j143m077
15397d3730m416j500K389L262k86m547m383L57M301L308l59j509Q85K862J319
15382d2047k098l691k345k27Q1j652k965j332K169L062p58m783k912L739P504
15367d8255M534l00j062J380K617J590q1k194m435l873N37L682Q09l894k485M207
$$ plain form
15475 -44303 -44616 -49813 -55478 -56829 -55308 -55183 -56907 -57629 -56097 -53621 -51595 -50604 -50774 -50971 -49104 -45029
15459 -45029 -41645 -41472 -43782 -46569 -49096 -50768 -50139 -47584 -46625 -49545 -53589 -54685 -53307 -53094 -54768
15444 -54768 -55307 -52884 -49183 -46521 -45581 -46161 -47418 -47245 -44295 -41025 -41800 -47109 -52392 -53716 -52039 -50491
15428 -50491 -49915 -49190 -48238 -48304 -49823 -51627 -52034 -49999 -45918 -42050 -41051 -43025 -44923 -44027 -41233 -39594
15412 -39594 -40244 -41289 -40524 -37926 -35328 -34702 -36930 -41206 -45172 -46373 -44240 -40659 -38510 -39653 -43730
15397 -43730 -48146 -49646 -47257 -43995 -44281 -48828 -53211 -52854 -48553 -45245 -45604 -47113 -46228 -43366 -42047
15382 -42047 -44145 -47836 -50181 -50408 -50327 -51979 -54944 -56276 -54107 -51045 -51803 -56586 -59498 -55759 -48255
15367 -48255 -43721 -44021 -45083 -43703 -41086 -39496 -39577 -41771 -46206 -50079 -49542 -45860 -45051 -48945 -51430 -47223
15351d7223P405L838k81n05m57l305n156k424J183J163j07J182K450j19k998l78
15335d5732N050N383L49k191Q55L268K48m092l884q0K680L243L291K656m1l559
15319c2556m764k722L88K089J655m2j411j355m18j05p52j172o20L30J042J416
15303c8997R35r25k901k606J65K658K684J303Q59J772K525J983P40L55J338J832
15287b6280m96m404n000j21N314N122N21j833J19J612k86k199j186J70n82n37
15271c0066K740M829P59n531n721J95L650O11k900j006L151L281k68k086k15K261
15255b6316K952K726K527J686K04m69j39p53l173n156m338j639K42O57J021J576
15239b8392P03j892l609k121J165K540M98k705l963k677p73j32o19o89K84R78
$$ plain form
15351 -47223 -39818 -35980 -36261 -36766 -37223 -40528 -45684 -48108 -46925 -45762 -45869 -44687 -42237 -42356 -45354 -45732
15335 -45732 -40682 -35299 -34950 -37141 -36286 -33018 -32770 -36862 -40746 -40826 -38146 -34903 -31612 -28956 -28997 -32556
15319 -32556 -37320 -40042 -39654 -37565 -35910 -35952 -37363 -38718 -39136 -39241 -39993 -41165 -41785 -41455 -40413 -38997
15303 -38997 -38062 -38987 -41888 -44494 -44329 -41671 -38987 -37684 -36825 -35053 -32528 -30545 -29805 -29450 -28112 -26280
15287 -26280 -26776 -31180 -36180 -36301 -30987 -25865 -25344 -27177 -27058 -25446 -25732 -27931 -29117 -28947 -29529 -30066
15271 -30066 -27326 -22497 -21738 -27269 -32990 -32795 -29145 -28534 -31434 -32440 -29289 -26008 -26276 -28362 -28577 -26316
15255 -26316 -23364 -20638 -18111 -16425 -16221 -16690 -16829 -17582 -20755 -25911 -30249 -31888 -31646 -30989 -29968 -28392
15239 -28392 -27689 -29581 -33190 -35311 -34146 -31606 -31108 -33813 -37776 -40453 -41226 -41358 -41977 -42666 -42382 -41404
15223d1404J45j016j12K683M259K871O29P0K52j219l732m331k244J99J197J459
15207d0294K095K760K381L33l005n685n182j778O63j77j112J616N464M858L19
15192c6744j958J62J977M49j283o57m43k869m791l308r80o22k6K631L287j415
15176d6590o436m937O89K627K01j23L514N589L053k41r87j068k080j687J321L587
15160d3568K201r81k636k040n7K296K949M66k499j860J214J688n51j11L887M842
15144c4760m91n571l813J485L286J528P28J105k57k338j871l30j811m830l682
15129e1622J721M533J160l393l075J076L499J621k173m195k829P79L929M661L188
15114d1120J044m46l42J561L405K300j586m117k555N20J441J013K113L864K800
$$ plain form
15223 -41404 -41259 -42275 -42387 -39704 -35445 -32574 -31945 -31875 -31623 -32842 -36574 -40905 -43149 -42950 -41753 -40294
15207 -40294 -38199 -35439 -33058 -32725 -35730 -41415 -46597 -48375 -47712 -47889 -49001 -47385 -41921 -37063 -36744
15192 -36744 -38702 -38540 -36563 -36114 -37397 -38054 -38497 -41366 -46157 -49465 -50445 -51067 -51093 -48462 -45175 -46590
15176 -46590 -53026 -57963 -57274 -54647 -54446 -54569 -51055 -45466 -42413 -42654 -43641 -44709 -46789 -48476 -47155 -43568
15160 -43568 -41367 -42348 -44984 -47024 -47081 -44785 -41836 -41370 -43869 -45729 -44515 -42827 -43378 -43489 -39602 -34760
15144 -34760 -35251 -40822 -44635 -43150 -39864 -38336 -37608 -36503 -36760 -39098 -40969 -41299 -43110 -47940 -51622
15129 -51622 -49901 -45368 -44208 -47601 -50676 -49600 -46101 -44480 -46653 -50848 -53677 -52898 -48969 -44308 -41120
15114 -41120 -40076 -40522 -40864 -39303 -35898 -33598 -35184 -39301 -41856 -41336 -39895 -38882 -36769 -32905 -30105
15099c0105j143m222m088j686J377L649K876j404m933l000K477M847J874j899
15085c5380k552j436r56o09M94J082J87q76q97m08L18J862L064J361k812n415
15069d2973m210j520K5Q27J684J551J39o65j51j99j282r45J426K536Q30k05J762
15052d1370K938l64m382k910K796N558K684j326k406j547r27m06L93M34n54j151
15036d2540p68n98j146j349p81k80K52J921L952L608L54k493j996N25J592L7k377
15019d2087l684l441k311j207o08j18R08K031J913K92j177q61Q46K326K986L457
15003d0735L636K092j439m044k410K069L621n05n304m251J093K617k553p305m625
14988e8043K197M495O06k771j130J853J016k200k183K326O124M475o01l125j037
$$ plain form
15099 -30105 -31248 -35470 -39558 -41244 -39867 -36218 -33342 -34746 -39679 -42679 -40202 -35355 -33481 -35380
15085 -35380 -37932 -39368 -40324 -40933 -40439 -39357 -39170 -40046 -40943 -41351 -41033 -39171 -36107 -34746 -37558 -42973
15069 -42973 -47183 -48703 -48678 -47851 -46167 -44616 -44477 -45142 -45293 -45492 -46774 -47719 -46293 -43757 -42927 -43132 -41370
15052 -41370 -38432 -38796 -43178 -46088 -43292 -37734 -35050 -36376 -38782 -40329 -41256 -41662 -41269 -40835 -41389 -42540
15036 -42540 -43308 -43906 -45052 -46401 -47182 -47462 -47210 -45289 -41337 -37729 -37375 -39868 -41864 -41339 -39747 -39710 -42087
15019 -42087 -45771 -49212 -51523 -52730 -53338 -53456 -52548 -50517 -48604 -48312 -49489 -50350 -49504 -47178 -44192 -40735
15003 -40735 -37099 -35007 -36446 -40490 -42900 -40831 -37210 -37715 -43019 -47270 -46177 -43560 -46113 -53418 -58043
14988 -58043 -55846 -51351 -50745 -53516 -54646 -52793 -51777 -53977 -56160 -53834 -47710 -43235 -43836 -46961 -47998
14973d7998J602J014p24N41L930M633J594j074j189j562l811m494j171K442K166
14958d4101J27N30K142J104j510j594L26L33j100J00L330L386l46k445r38n28
14942d1184l370m202O62N929M763j053m408l037n63M44P82Q86l10k532l544j943
14926e2680J324L994L948P40l292m879l668k249j934j328J18P81M33J236L241
14911e4215L148L5k140r10M55j035k409k3L581L856J899J743K799J724l84K79
14895d1597K478J430k196k403K031M766J690k910l207R9K098N52k675m512k942
14880d7298J290M141K173k432m143j855o4j186j815R51M188L717L22k317k920
14865d7248k192K50M400P056M686j265n229l848O01L150J046l909p090n671j745
$$ plain form
14973 -47998 -46396 -45382 -46106 -45565 -41635 -37002 -35408 -36482 -37671 -39233 -43044 -47538 -48709 -46267 -44101
14958 -44101 -43974 -43444 -41302 -40198 -41708 -43302 -42976 -42643 -43743 -43643 -40313 -36927 -37273 -39718 -40656 -41184
14942 -41184 -44554 -48756 -48094 -42165 -37402 -38455 -42863 -45900 -46463 -46019 -45237 -44351 -44661 -47193 -50737 -52680
14926 -52680 -51356 -47362 -43414 -42674 -45966 -50845 -54513 -56762 -58696 -60024 -59906 -59125 -58692 -57456 -54215
14911 -54215 -51067 -51032 -53172 -54082 -53627 -54662 -57071 -57094 -53513 -49657 -47758 -46015 -43216 -41492 -41876 -41597
14895 -41597 -39119 -37689 -39885 -42288 -40257 -35491 -33801 -36711 -39918 -39819 -37721 -37169 -39844 -44356 -47298
14880 -47298 -46008 -41867 -39694 -42126 -46269 -48124 -48188 -49374 -51189 -50238 -46050 -42333 -42011 -44328 -47248
14865 -47248 -49440 -49190 -44790 -37734 -33048 -34313 -39542 -43390 -42789 -39639 -38593 -42502 -49592 -55263 -57008
14850e7008N20N75J468L719L450r59m436j636M726O884K502k765l493q43J050
14835d6246J332J990L102K146j523m362k817J431L006j72m157m695k902k440l134
14820e9441j652K295M974M395K755J933P51j511k899k414k070k658j335L157O569
14805d7151M858Q79K70K684K641j666n845o052l470r05R67K164J808R1o58Q91
14789d8494K692K137j08j190k51N98l33j767j434L58J125K88N06L255N233K435
14773c4950l216n447k153J984K653J228M93n03l434n825m036O91L493K481L82
14758d6159J76K060M209M188P78l581m120N7L728K614m75n86J512J701k6o49n78
14741c5151k267l734r98L600L456j296l239K52K882N00k131l85K020M7l625l462
$$ plain form
14850 -57008 -56488 -55913 -54445 -50726 -47276 -48235 -52671 -54307 -49581 -42697 -40195 -42960 -46453 -47296 -46246
14835 -46246 -44914 -42924 -39822 -37676 -39199 -43561 -46378 -44947 -41941 -42113 -46270 -50965 -53867 -56307 -59441
14820 -59441 -61093 -58798 -53824 -49429 -46674 -44741 -43990 -45501 -48400 -50814 -52884 -55542 -56877 -53720 -47151
14805 -47151 -42293 -41414 -41144 -38460 -35819 -37485 -43330 -49382 -52852 -53757 -52790 -50626 -48818 -48727 -49385 -48494
14789 -48494 -45802 -43665 -43773 -44963 -45214 -44616 -44949 -46716 -48150 -47792 -46667 -46379 -45873 -42618 -37385 -34950
14773 -34950 -38166 -43613 -45766 -43782 -41129 -39901 -39408 -39911 -43345 -49170 -53206 -52515 -49022 -46541 -46159
14758 -46159 -45983 -43923 -39714 -35526 -34748 -38329 -42449 -42392 -38664 -36050 -36525 -37111 -35599 -33898 -33924 -34573 -35151
14741 -35151 -37418 -41152 -42150 -38550 -35094 -36390 -39629 -39377 -36495 -35995 -38126 -38511 -36491 -36444 -40069 -43531
14725d3531l16J137O11R37J364q12l560k086K931N390K586j522k790j765n96P24
14709d1298K756M035K348k304o924p493k536M410P351M443K31m71J378J951Q31
14694c1292L48L85j074k810j017M039O769L662j816m121k585p05m05j08J814M086
14678b4830L985R68k217k589n82N69p37k418j919J43J074k86k489l149q80L169
14662c2188N158K130l163m095J201O257M498j893n398l266O06K472K381J206j053
14647b5147l200k990n84J120L73j603k939k813j005J755L352K504N69j138l714
14632c5460p131p159j101N685N646K86j910J284L042m01l567j550J791R91j917
14617d1471j720J196K699K032J231L74j041o57L022N719K235n046q496n485q58
$$ plain form
14725 -43531 -43847 -42710 -42099 -41162 -39798 -40610 -44170 -46256 -43325 -37935 -35349 -36871 -39661 -41426 -42022 -41298
14709 -41298 -38542 -34507 -32159 -34463 -41387 -48880 -51416 -47006 -39655 -35212 -34981 -35452 -34074 -32123 -31292
14694 -31292 -30944 -30559 -31633 -34443 -35460 -31421 -24652 -20990 -22806 -26927 -29512 -30217 -30622 -30730 -28916 -24830
14678 -24830 -20845 -19877 -22094 -24683 -25265 -24696 -25433 -27851 -29770 -29627 -28553 -28839 -31328 -34477 -35357 -32188
14662 -32188 -27030 -24900 -28063 -32158 -30957 -24700 -20202 -22095 -27493 -30759 -30153 -27681 -25300 -24094 -25147
14647 -25147 -28347 -31337 -31921 -30801 -30428 -32031 -34970 -37783 -38788 -37033 -33681 -31177 -30608 -31746 -35460
14632 -35460 -42591 -49750 -50851 -45166 -39520 -39234 -41144 -39860 -36818 -37219 -40786 -42336 -40545 -39554 -41471
14617 -41471 -43191 -41995 -39296 -37264 -36033 -35659 -36700 -37357 -34335 -28616 -26381 -31427 -39923 -45408 -46266
14602d6266Q81N99R53K210L103K758R23j546k497j128P8j105k453l45L873N036
14586c4926J672k086k880k179k321k382m61K506L840K685N82q08j220j329j441
14571d0748q36J091K938K101j543m456l738r24P45R95J633K450J703j84j035p55
14555d0563j202k350k137l30J079J522K249K696P10k712l374l65J743j16k299
14540d5449p2M533N149K10m736m320K79L549K207j934m761l990m22L602N849M857
14524c5449Q38l502m767k722o90q77j368K43K483K244k29k052k200j758o42J896
14508d8552M127L402O64p43o61j886m141l490R44M561L579l18l454m374l016J91
14492e3167K748J855o59Q6L860M437l49l910p79M437L811k192o021l654J697M958
$$ plain form
14602 -46266 -45385 -44786 -43833 -41623 -38520 -35762 -34839 -36385 -38882 -40010 -39932 -41037 -43490 -43835 -39962 -34926
14586 -34926 -33254 -35340 -38220 -40399 -42720 -45102 -45563 -43057 -39217 -36532 -35950 -36758 -37978 -39307 -40748
14571 -40748 -41584 -40493 -37555 -35454 -36997 -41453 -45191 -46115 -45370 -44375 -42742 -40292 -38589 -38773 -39808 -40563
14555 -40563 -41765 -44115 -46252 -46582 -45503 -43981 -41732 -39036 -38326 -41038 -44412 -44777 -43034 -43150 -45449
14540 -45449 -45521 -40988 -35839 -35629 -40365 -44685 -44406 -40857 -38650 -40584 -45345 -49335 -49757 -46155 -40306 -35449
14524 -35449 -34611 -38113 -42880 -45602 -46292 -47169 -48537 -48294 -45811 -43567 -43796 -45848 -48048 -49806 -50448 -48552
14508 -48552 -44425 -41023 -40359 -41102 -41763 -43649 -47790 -51280 -50336 -45775 -42196 -42514 -45968 -50342 -53358 -53167
14492 -53167 -50419 -48564 -49223 -49137 -45277 -40840 -41189 -45099 -45878 -41441 -37630 -39822 -45843 -49497 -47800 -42842
14476d2842L839m70l689j745L306M035k031p304m476K501M470O25j904L4K266
14461d3385J473o50j874j816K09L828M769o2n472l668L125M520k275p895n131
14446e4304J060K829Q92M47J745J796J214K571M445L159r24l659k826p9J825J160
14430c8649j848m330l160K52P83k844n245k032L772O546N512L311Q06j972k846
14415d1944n86J408n69m491n600l338m93K320N840P664M679p54k941j143j68k331
14399d2447m271k805Q09L682M453K648j257m278l121J146L923L058P25q05j584
14384d0124k045k302l491n926o360j724M594N700R24l207k850j386j952j955J337
14369f0767N299O334N108L334q1n136p376l773J465K489K80j6K234L202J817R22
$$ plain form
14476 -42842 -39003 -39473 -43162 -44907 -41601 -37566 -39597 -46901 -51377 -48876 -44406 -43781 -45685 -45651 -43385
14461 -43385 -41912 -42562 -44436 -46252 -46043 -42215 -37446 -37508 -42980 -46648 -43523 -39003 -41278 -49173 -54304
14446 -54304 -53244 -50415 -49523 -49076 -47331 -45535 -44321 -41750 -37305 -34146 -35070 -38729 -41555 -41634 -39809 -38649
14430 -38649 -40497 -44827 -47987 -47735 -46952 -49796 -55041 -57073 -53301 -46755 -41243 -37932 -37126 -39098 -41944
14415 -41944 -42530 -41122 -41691 -46182 -51782 -55120 -55613 -53293 -47453 -39789 -35110 -35864 -38805 -39948 -40116 -42447
14399 -42447 -46718 -49523 -48714 -45032 -40579 -37931 -39188 -43466 -46587 -45441 -41518 -38460 -37735 -38540 -40124
14384 -40124 -42169 -44471 -47962 -53888 -60248 -61972 -57378 -51678 -50754 -53961 -56811 -58197 -60149 -62104 -60767
14369 -60767 -55468 -49134 -44026 -40692 -40773 -45909 -53285 -57058 -55593 -53104 -52824 -52840 -50606 -47404 -45587 -44665
14353d4665J553J483k38j747j825j195l34P46J030R4K6K158L438N36l903m454
14337d7297j255Q13P05K060N042M861N10k443j011K56k131l970j130K081l45n417
14321d8671n480o06J848o77k622j56L156K999O22o19k78O47K245L796K861p14
14305d1649k993j247J724J792n19j735j061m21l03M71J492J059l04k04J308J169
14289d1421j781m242k713J624M313K952n88k933k820j589p21P9J669K983J759
14274d3429j671l450j003K961L805J185j083p85N29J146J306Q68j418m520m586
14259e0145l32L786K985j362l941k671l1J848L371M492L250r29m957n244k040
14244e1920J024J395L47R01L558N155K797j803l863j718J031P12j593k722k492
$$ plain form
14353 -44665 -43112 -41629 -41867 -43614 -45439 -46634 -46968 -46222 -45192 -45098 -45072 -42914 -39476 -38940 -42843 -47297
14337 -47297 -48552 -47739 -47034 -44974 -39932 -35071 -34561 -37004 -38015 -37759 -39890 -43860 -44990 -42909 -43254 -48671
14321 -48671 -54151 -54757 -52909 -53586 -56208 -56364 -53208 -50209 -49587 -50206 -50484 -49837 -47592 -43796 -40935 -41649
14305 -41649 -44642 -45889 -44165 -42373 -42892 -44627 -45688 -46109 -46412 -45941 -44449 -43390 -43694 -43898 -42590 -41421
14289 -41421 -43202 -47444 -50157 -48533 -44220 -41268 -41856 -44789 -47609 -49198 -49919 -49840 -48171 -45188 -43429
14274 -43429 -45100 -48550 -49553 -46592 -42787 -41602 -42685 -43470 -42941 -41795 -40489 -39621 -41039 -45559 -50145
14259 -50145 -50477 -46691 -43706 -45068 -49009 -51680 -51711 -49863 -46492 -42000 -38750 -39679 -44636 -49880 -51920
14244 -51920 -50896 -49501 -49154 -48253 -44695 -39540 -36743 -38546 -42409 -44127 -43096 -42384 -43977 -46699 -49191
14229d9191k616k200J103N533N546n24o859o829r66M508N449L284J382Q51O56
14214d0873J38r6M74J143Q72j38p77r36j616k699k474m89J051M81o18l05K09r33
14196d7586k061l93K541K657J63n09J874L357J563q77j763k763m527l767P72M312
14180d7007K925P0O93K636O34l903m558m35K504J144n83R64L509L288N88j898
14164c9429k780j793Q83L117J795k623n343l208J117L027J645n29j458q05R54
14149d5430K451J939l23j414P77M417N625K739k126n064l687L84K489P5l623l642
14133d4413l53J304k52j027J320L155R48k766l672k398k063j995O15M280M292
14118d3025K76k554q37K488K903K41k127j877K92K086K051R90J009K410K678Q6
$$ plain form
14229 -49191 -51807 -54007 -52904 -47371 -41825 -42349 -49208 -56037 -57003 -52495 -47046 -43762 -42380 -41529 -40873
14214 -40873 -40735 -40831 -40357 -39214 -38342 -38480 -39257 -40193 -41809 -44508 -46982 -47471 -46420 -45939 -46557 -46862 -46653 -47586
14196 -47586 -49647 -50040 -47499 -44842 -44679 -45188 -43314 -39957 -38394 -39271 -41034 -43797 -48324 -52091 -51319 -47007
14180 -47007 -44082 -44012 -43319 -40683 -40049 -43952 -48510 -48945 -46441 -45297 -45880 -44916 -41407 -38119 -37531 -39429
14164 -39429 -42209 -44002 -43119 -40002 -38207 -40830 -46173 -49381 -48264 -45237 -43592 -44121 -45579 -46384 -45430
14149 -45430 -42979 -41040 -41363 -42777 -42000 -37583 -31958 -29219 -31345 -36409 -40096 -39712 -37223 -37148 -40771 -44413
14133 -44413 -44766 -43462 -43714 -44741 -43421 -40266 -39318 -42084 -45756 -48154 -50217 -52212 -51597 -47317 -43025
14118 -43025 -42749 -45303 -46140 -43652 -40749 -40508 -42635 -44512 -44220 -42134 -40083 -39093 -38084 -35674 -32996 -32910
14102c2910l045l118l15K022K352J962J369m98l004l512j618j79n53k37K456M633
14086c4195K899j207l387k658j606j457p66Q19J182m57j356Q31L886L509n98l910
14070c8471k898N10J852M1j874j404M44J614K015K381J906m34l006k807J83K389
14054c7559J323j283k303j526j245k491l532k326Q02L454L636J655m09j001n11
14039d3316k04l27k43N2j1OJ326L406L489K23l619m119j176J752K675K942L348
14022c3796J622l564q311p229j074L471K707N21J649M200L300k65r04K464L859
14007c1350q36p265q426l823J105K636J781O11n23j563j511J29K048K365R02k02
13991d3922J113L342K001l976q235m000N337Q866K963l549k797R19k15m102l219
$$ plain form
14102 -32910 -35955 -39073 -39388 -37366 -35014 -33052 -31683 -32181 -35185 -38697 -40315 -40494 -41047 -41284 -38828 -34195
14086 -34195 -31296 -32503 -35890 -38548 -40154 -41611 -42377 -41558 -40376 -40833 -42189 -41358 -37472 -33963 -34561 -38471
14070 -38471 -41369 -40859 -39007 -38966 -40840 -42244 -41800 -40186 -38171 -35790 -33884 -34318 -37324 -40131 -39948 -37559
14054 -37559 -36236 -37519 -39822 -41348 -42593 -45084 -48616 -50942 -50140 -46686 -43050 -41395 -41804 -42805 -43316
14039 -43316 -43520 -43847 -44090 -44038 -44049 -44043 -42717 -39311 -35822 -35599 -39218 -43337 -44513 -42761 -40086 -37144 -33796
14022 -33796 -32174 -35738 -44049 -51278 -52352 -48881 -46174 -45653 -44004 -39804 -36504 -36769 -37673 -35209 -31350
14007 -31350 -32186 -39451 -47877 -51700 -50595 -47959 -46178 -45567 -46090 -47653 -49164 -49035 -46987 -44622 -43720 -43922
13991 -43922 -42809 -39467 -37466 -41442 -49677 -53677 -48340 -39474 -36511 -40060 -42857 -41938 -42153 -46255 -49474
13976d9474J657K832o43j545K495M823J321l166l619j891p26J380M616M583P9
13961c7278k708K06L410J173k603j358K667K692r02k228m14M93J58J638L710K324
13945b9020j050j285N94j176n627n199P70L122k470p751m673K452M820K454J458
13930d2581K770K184q15k260j073l85j174m47K937N365L514p67k837j084J352
13915c5301N54l180n282k654J756K625j03j203J507L543J006k914k894J97J022
13900d1321j819m169k953J38K253L011L200K749J576N16k4r87k960m496l594o99
13884d9579R20j251n291o134j439N065P776N709K536R51K27o33r70n97o12q57
13868d4179L55K722L490J873K70l71k046m507l738R96L810P61l091j241L532L449
$$ plain form
13976 -49474 -47817 -44985 -45628 -47173 -44678 -39855 -38534 -41700 -45319 -47210 -47936 -46556 -41940 -37357 -37278
13961 -37278 -39986 -39780 -36370 -35197 -37800 -39158 -36491 -33799 -34701 -36929 -37343 -36850 -36692 -35054 -31344 -29020
13945 -29020 -30070 -31355 -30761 -31937 -37564 -42763 -41993 -38871 -41341 -49092 -53765 -51313 -46493 -44039 -42581
13930 -42581 -39811 -37627 -38442 -40702 -41775 -42160 -43334 -43781 -40844 -35479 -31965 -32732 -35569 -36653 -35301
13915 -35301 -34747 -37927 -43209 -45863 -44107 -41482 -41585 -42788 -41281 -37738 -36732 -39646 -42540 -42343 -41321
13900 -41321 -43140 -47309 -50262 -50124 -47871 -44860 -41660 -38911 -37335 -36819 -36843 -37830 -40790 -45286 -48880 -49579
13884 -49579 -48659 -49910 -55201 -61335 -62774 -57709 -49933 -44224 -41688 -40737 -40510 -41143 -42113 -42710 -43322 -44179
13868 -44179 -43824 -41102 -37612 -35739 -35469 -35840 -37886 -42393 -46131 -45135 -41325 -40564 -43655 -44896 -41364 -37915
13852c7915j799m854k246J704L158L618M573L869L65k871l126j937j761k250k045
13837d3517j254q1K084M467M549J606j939l697l367j229K002L575J027l096l400
13822d2270L57K385k07l098k145L53O59k0J056K424J322o67j11K287L111J800
13806c2764L57q81k703l885l035k034l249m761l008J104L542L427L056K773J165
13791d0896m21O62K737J725j247q20L154M342L65k854r33J719j80l582k612J073
13775c7768J171k349l250K38K320q51m861l861P88K961N34k529k264N23K431K087
13759d4680R14K53k85j101q70J701M983N523K479j078k265j755j575j562l98J096
13743c8620O86j572k940j661R76K608K159k7k622l592j827J075K394J870J666
$$ plain form
13852 -37915 -39714 -44568 -46814 -45110 -41952 -38334 -33761 -29892 -29527 -32398 -35524 -37461 -39222 -41472 -43517
13837 -43517 -44771 -44852 -42768 -38301 -33752 -32146 -34085 -37782 -41149 -42378 -40376 -36801 -35774 -38870 -42270
13822 -42270 -41913 -39528 -39735 -42833 -44978 -44625 -43966 -43986 -42930 -40506 -39184 -39851 -39962 -37675 -34564 -32764
13806 -32764 -32407 -33288 -35991 -39876 -42911 -44945 -48194 -52955 -55963 -54859 -51317 -47890 -44834 -42061 -40896
13791 -40896 -41317 -40655 -37918 -36193 -37440 -38260 -35106 -30764 -30399 -33253 -34186 -32467 -32647 -36229 -38841 -37768
13775 -37768 -36597 -38946 -42196 -41958 -39638 -40489 -45350 -49211 -48423 -45462 -44928 -47457 -49721 -49198 -46767 -44680
13759 -44680 -43766 -43513 -43798 -44899 -45769 -44068 -39085 -33562 -31083 -32161 -34426 -36181 -37756 -39318 -39716 -38620
13743 -38620 -37934 -39506 -42446 -44107 -43131 -40523 -38364 -38391 -41013 -44605 -46432 -45357 -42963 -41093 -39427
13728c9427K380J835q68k808j214J993K507m54l449l702j974l09O60J300J682
13713d1848J709J486J013M73O96K053K985J488j737l715l172j878j244k61J803
13698d0149L154K194M07O4O75M79r7M22J079j85k229j576J804L466P25l155l309
13681c6231K84L148K125j175k764r52J882K266N8j498n20Q87L74q22o80m69j896
13664c5983k323J440N880M287k247n078j165K280L2k577M18M483J955m718o659
13649c9975k520Q17K18m83O25N32j292q34K536L652K34k872j778M82J85o26J180
13632c9919L532K757k17k027k283k298j351J390L670L185J569J392J476n54l313
13617c2991l686j989o03P13L310M978K454j966k171K609N731K265m182o539l165
$$ plain form
13728 -39427 -37047 -35212 -36080 -38888 -40102 -38109 -35602 -36056 -39505 -43207 -45181 -45490 -44830 -43530 -41848
13713 -41848 -40139 -38653 -37640 -37167 -36471 -34418 -31433 -29945 -31682 -35397 -38569 -40447 -41691 -41952 -40149
13698 -40149 -36995 -34801 -34394 -34330 -33655 -33176 -33273 -32851 -31772 -31957 -34186 -35762 -33958 -30492 -29767 -32922 -36231
13681 -36231 -35947 -32799 -30674 -31849 -34613 -35565 -33683 -31417 -31359 -32857 -33377 -32490 -32116 -32938 -33618 -34087 -35983
13664 -35983 -38306 -36866 -30986 -26699 -28946 -34024 -35189 -32909 -32877 -35454 -35036 -30553 -28598 -33316 -39975
13649 -39975 -42495 -41678 -41460 -41943 -41318 -40786 -42078 -42912 -40376 -36724 -36490 -39362 -41140 -40658 -40473 -41099 -39919
13632 -39919 -36387 -33630 -33847 -35874 -38157 -40455 -41806 -40416 -36746 -33561 -31992 -30600 -29124 -29678 -32991
13617 -32991 -36677 -38666 -39269 -38556 -35246 -30268 -27814 -29780 -31951 -29342 -23611 -21346 -25528 -32067 -35232
13602c5232J329K582J044pP35J038j235m106l440R01M007K707J26M75K336J494
13586b5246j648k719p32N93o41j624j48J599R54r65j637j390k310m252m599j753
13570d6518K687N425M588J474p02j01K002L077K112j8j799j806K11K072R80k100
13554b8416k730K21J749j712n588l573J992L184j240m272j930J576K189K107L769
13539c2674M260Q36k849j782K556M637K827l6k160m001n017l744r81N66p5j266
13523c8903j219O37L787O293N666K077p83k35J744J662n41k388k911k836k238
13508c0188j106r13k571l922k338J248L772M313L937K694K62j534p24R74J62k791
13492b8725m091k331j02M60K31M55P03K61p90k155k832q09L781O338K798l510
$$ plain form
13602 -35232 -33903 -31321 -30277 -30284 -29549 -28511 -29746 -33852 -37292 -36391 -32384 -29677 -29551 -29076 -26740 -25246
13586 -25246 -26894 -29613 -30345 -29752 -30393 -32017 -32165 -30566 -29612 -30577 -32214 -33604 -35914 -40166 -44765 -46518
13570 -46518 -43831 -38406 -33818 -32344 -33046 -33147 -31145 -28068 -25956 -25974 -27773 -29579 -29368 -27296 -26316 -28416
13554 -28416 -31146 -30925 -29176 -30888 -36476 -40049 -38057 -34873 -36113 -40385 -42315 -40739 -38550 -36443 -32674
13539 -32674 -28414 -27578 -30427 -32209 -29653 -25016 -22189 -22225 -24385 -28386 -33403 -37147 -38128 -37562 -37637 -38903
13523 -38903 -40122 -39485 -35698 -29405 -23739 -21662 -22445 -22680 -20936 -19274 -19815 -22203 -25114 -27950 -30188
13508 -30188 -31294 -32207 -34778 -38700 -41038 -39790 -36018 -31705 -27768 -25074 -24812 -26346 -27070 -26096 -25934 -28725
13492 -28725 -32816 -35147 -35249 -34789 -34558 -34103 -33400 -33139 -33929 -36084 -38916 -39725 -35944 -29606 -26808 -30318
13476c0318m929M9M539K998j717l669j790R11K716L795L598J477j006j432J08
13461b4670J093j02k432l520k145K01M76k076m013j925K097K870O8q90K676O168
13445b6124M761O41j135n92j370l407k990K28J738r61m427m294j037J671K199
13430c5099K003K327K186J33k948l978j207K826L447l54m068l242O92K634R84
13415c3664p03N40K834K561n36l492m165l044j486n0J247K385L357L838K765m16
13399b8029l738l810j45L179K425m62o61J786J453l638p255l126N349Q953M997
13384b2722l5n84J024K2l248m860l318m86J783K934K915K493L094M441L953M50
13368a2144l376m605m068l933l302q4L950M406Q02k070p26K154J554k995o495
$$ plain form
13476 -30318 -35247 -35198 -30659 -27661 -29378 -33047 -34837 -33926 -31210 -27415 -23817 -22340 -23346 -24778 -24670
13461 -24670 -23577 -23679 -26111 -29631 -31776 -31575 -31099 -33175 -37188 -39113 -37016 -34146 -34078 -34968 -32292 -26124
13445 -26124 -21363 -20722 -21857 -22449 -23819 -27226 -30216 -29988 -28250 -29211 -33638 -37932 -38969 -37298 -35099
13430 -35099 -33096 -30769 -28583 -28450 -31398 -35376 -36583 -33757 -30310 -30664 -34732 -37974 -37282 -34648 -33664
13415 -33664 -34367 -33827 -30993 -28432 -28968 -32460 -36625 -39669 -41155 -41205 -39958 -37573 -34216 -30378 -27613 -28029
13399 -28029 -31767 -35577 -35722 -32543 -30118 -30580 -31241 -29455 -28002 -31640 -38895 -42021 -36672 -27719 -22722
13384 -22722 -22757 -23341 -22317 -22295 -25543 -30403 -33721 -34207 -32424 -29490 -26575 -24082 -20988 -16547 -12594 -12144
13368 -12144 -15520 -20125 -24193 -28126 -31428 -31512 -27562 -23156 -22354 -24424 -25150 -22996 -21442 -24437 -30932
13353c0932m359K000O185L905j528k766J988N910K538m748o695q39M891K990l537
13338b4997n632m27N384M770p56l909j372K637K826m08k758k332r39j65J78j73
13322b8073j936l455j939J328J338k878n349j530M496N727J999j228j560j305
13308c4365j474k13K232K419o74l167j572K339M043J872j306j421K109M882K386
13293b1910l200m423J059N884L105l330m625m70J710o32k327o73N73m20J77L595
13277b5907M437l50n379n083j988r89j121O17K152K30k408j084K341K384n83j120
13261c3851J800L321J050j568j381L65J541K197K614K085J005R48J687J142r62
13246a8007k328j835j247k116l266k462P15M144M590O91m572o046k604J079J086
$$ plain form
13353 -30932 -35291 -33291 -27106 -23201 -24729 -27495 -25507 -19597 -17059 -21807 -28502 -29341 -24450 -21460 -24997
13338 -24997 -30629 -31056 -25672 -20902 -21658 -25567 -26939 -24302 -21476 -21884 -24642 -26974 -27913 -28078 -27900 -28073
13322 -28073 -30009 -33464 -35403 -34075 -32737 -35615 -40964 -42494 -37998 -32271 -30272 -31500 -33060 -34365
13308 -34365 -35839 -36052 -33820 -31401 -32075 -35242 -36814 -34475 -30432 -28560 -29866 -31287 -29178 -24296 -21910
13293 -21910 -25110 -29533 -28474 -22590 -19485 -22815 -27440 -27910 -26200 -26832 -29159 -29832 -29259 -29679 -29502 -25907
13277 -25907 -21470 -21820 -27199 -32282 -34270 -35259 -36380 -35763 -33611 -33381 -35789 -36873 -34532 -32148 -32731 -33851
13261 -33851 -32051 -28730 -27680 -29248 -30629 -30264 -28723 -26526 -23912 -21827 -20822 -19874 -18187 -17045 -18007
13246 -18007 -20335 -22170 -23417 -25533 -28799 -31261 -30546 -26402 -21812 -21121 -25693 -31739 -34343 -33264 -32178
13231c2178l65N48K471J544j331j770M70J198p54j636M10K036K48l018m115k134
13215c8376J446M506M739J537j713q11L202N037K751k20j483k653l982j949L953
13200b4016P272K698n232p217j339M906M529j072m876k487L326N688J378m925
13186b1367o043j652J327j320n200m127J020M428L766J736N77l21j314j003J106
13171b8387L229L626K528J167K78n3j16m98j488k611l027k076N69M163O198M251
13155a2247o06l935k705J330M083L494M87k830m546l796j587O9L91O6o75k171
13139b5178l287k019J069K813J902M91K94K90j79K97J761J512j149k618o08J576
13123b3033K36k598k710l21J520K516L826L564l65m430l034K310L832j396p157
$$ plain form
13231 -32178 -32543 -31995 -29524 -27980 -29311 -31081 -30611 -29413 -30167 -31803 -31393 -29357 -29109 -32127 -36242 -38376
13215 -38376 -36930 -32424 -27685 -26148 -27861 -28672 -25470 -20433 -17682 -17902 -19385 -22038 -26020 -27969 -24016
13200 -24016 -16744 -14046 -19278 -26495 -27834 -22928 -18399 -19471 -24347 -26834 -23508 -17820 -16442 -21367
13186 -21367 -27410 -29062 -27735 -29055 -34255 -38382 -37362 -32934 -29168 -27432 -26855 -27176 -28490 -29493 -28387
13171 -28387 -25158 -21532 -19004 -17837 -17559 -17612 -17728 -18226 -19714 -22325 -25352 -27428 -26859 -22696 -16498 -12247
13155 -12247 -12853 -16788 -19493 -18163 -14080 -10586 -10099 -12929 -17475 -21271 -22858 -22789 -22398 -22332 -23007 -25178
13139 -25178 -28465 -30484 -29415 -26602 -24700 -24209 -23915 -23625 -23804 -23507 -21746 -20234 -21383 -24001 -24609 -23033
13123 -23033 -22797 -25395 -28105 -28426 -26906 -24390 -20564 -17000 -17365 -21795 -24829 -22519 -18687 -20083 -27240
13108b7240o987k315J134J177J74N55K315L963M224L133J837P80j166m427o745
13093b9588n656k075R11K100K556K945L076L205L132J241k631n029l134M61J306
13078b7180k30m77R29J498J681L708N168J187o195q495k996K921K998N27Q92K356
13062b1708N57k827k927j64R16l87l19K371M283K645j194m172m530k299P67J945
13046b7043L22j667j353N35J378O81nj97q72k000k088l73K105L676L259R41j714
13029b4415k573j050J332K839K932J669m50j734o87J267R87j624l062j641j58
13014b6368j086k365q58K481M021K498j14j701j776j066p57j246j090J070L536
12999b4821L339J122M48J702J432j036j893l3J59l210m920r77L968L667m0j260
$$ plain form
13108 -27240 -34227 -36542 -35408 -34231 -34057 -33502 -31187 -27224 -23000 -19867 -18030 -17250 -18416 -22843 -29588
13093 -29588 -35244 -37319 -36408 -34308 -31752 -28807 -25731 -22526 -19394 -18153 -20784 -25813 -28947 -28486 -27180
13078 -27180 -27410 -27887 -26958 -25460 -23779 -20071 -14903 -13716 -19911 -28406 -31402 -28481 -25483 -24956 -24064 -21708
13062 -21708 -21151 -23978 -26905 -27069 -26153 -26540 -26859 -24488 -20205 -17560 -18754 -22926 -27456 -29755 -28988 -27043
13046 -27043 -26721 -28388 -29741 -29206 -27828 -27147 -27152 -27349 -28221 -30221 -32309 -32682 -30577 -26901 -23642 -22701 -24415
13029 -24415 -26988 -28038 -26706 -23867 -20935 -19266 -19716 -21450 -22137 -20870 -19883 -21507 -24569 -26210 -26368
13014 -26368 -27454 -29819 -30677 -28196 -24175 -21677 -21791 -23492 -25268 -26334 -27091 -28337 -29427 -28357 -24821
12999 -24821 -21482 -20360 -19912 -18210 -16778 -17814 -19707 -19740 -19581 -22791 -27711 -28688 -24720 -21053 -21093 -22353
12983b2353K28N99K8J410L300J955j156j437L36n70l568l126J298L831K013K27
12967a6985J229J741m40j806M50K969J416k908n411m116m30L251M603K725j25
12952a3837o32J054J907R68n3p70k185l032j339N48j362m779l141L196N790Q69
12936a6798m644m050k91R40O10K102L272L67l784l193J621M290K072j199j561
12921b0246N45K451K400K74k327l117j836o56n68J99K398L504J804l40l34N26
12905a5323Mq09J47J783J841Q17L88p5j796l185j831J351L113K113o3j044N99
12888a1970L980N421K156k829l659k14J465r73k373N93L207Q56k856k378P01J584
12872g289O26Q77J358j30j231P99K841J103j213O46L684K056k005j801J800K161
$$ plain form
12983 -22353 -22125 -21526 -21498 -20088 -16788 -14833 -15989 -17426 -17090 -17660 -21228 -24354 -23056 -19225 -17212 -16985
12967 -16985 -15756 -14015 -14455 -16261 -15811 -12842 -11426 -14334 -19745 -23861 -24291 -21040 -16437 -13712 -13837
12952 -13837 -14469 -13415 -11508 -10540 -10593 -11363 -13548 -16580 -17919 -17371 -18733 -23512 -26653 -23457 -17667 -16798
12936 -16798 -21442 -25492 -25783 -24843 -24233 -22131 -18859 -18492 -22276 -25469 -23848 -19558 -17486 -18685 -20246
12921 -20246 -19701 -17250 -14850 -14576 -16903 -20020 -21856 -22512 -23080 -22881 -20483 -16979 -15175 -15515 -15849 -15323
12905 -15323 -15319 -16128 -15981 -14198 -12357 -11540 -11152 -11227 -13023 -16208 -18039 -16688 -13575 -11462 -11525 -12569 -11970
12888 -11970 -7990 -2569 -413 -3242 -6901 -7115 -5650 -6623 -8996 -8403 -5196 -4340 -7196 -9574 -8873 -7289
12872 -7289 -6663 -5786 -4428 -4558 -5789 -4990 -2149 -1046 -2259 -1613 2071 4127 2122 321 2121 4282
12856D282r03j273J563J551k228l460K1K635J276j44Q78J300k38n05R86O4l549
12839B256m329j034L4l896o388k505K886L615J707J889K954J583m42J99J660K45
12823D34k827l609j732K68J437K099J560m48k351k994k605n90L221M786k91p961
12807a1603q723j857K312j653n792k329L772M202J101J431L926K389k267l694
12793a8785j167N06J21N15J650J384J262L673N293J655l726l666O96J536k498
12778a1551m337p30K736J305k110k876j142P51K198K853J406j737l753l061j136
12763b1184N7J36k34R8K085M638N126L359K108K017M00k372j486L441N179M47
12747C815l072Q13N192J357n461m466K087L314q51n45M843N206j083l229K563
$$ plain form
12856 4282 3379 2106 3669 5220 2992 -468 -447 2188 3464 3320 4198 5498 5260 4755 5741 5805 2256
12839 2256 -2073 -3107 -3073 -6969 -13357 -15862 -12976 -9361 -7654 -5765 -2811 -1228 -1670 -1471 189 434
12823 434 -2393 -6002 -7734 -7466 -6029 -3930 -2370 -2818 -5169 -8163 -10768 -11358 -8137 -3351 -3642 -11603
12807 -11603 -20326 -22183 -19871 -21524 -27316 -29645 -25873 -21671 -20570 -19139 -15213 -12824 -15091 -18785
12793 -18785 -19952 -19446 -19325 -18810 -17160 -15776 -14514 -10841 -5548 -3893 -7619 -11285 -10589 -9053 -11551
12778 -11551 -15888 -16618 -13882 -12577 -14687 -17563 -18705 -17954 -15756 -12903 -11497 -13234 -16987 -20048 -21184
12763 -21184 -21127 -20991 -21225 -21127 -19042 -14404 -9278 -5919 -3811 -1794 -1394 -3766 -5252 -1811 3368 3815
12747 3815 743 1556 6748 8105 2644 -1822 265 3579 2728 2183 7026 12232 11149 7920 10483
12732A0483N898P72l681L27N416K220m478m450J284L868J238j231j093p97j459
12717A4317j798j672j615j053m41j709l686k014L298N892K376k422l386k010j048
12702C029Q97M395N586K924J012K321K117k472n881l466M5p33k017J321M906K062
12686A6046l674l972L01J306k191l882j126K246L576L687K448n88k310L29M504
12671A6700N670M812M852L618j549n846l104K894L099k489n346k468K11j076k865
12656A7113j885N32K735M500M108K82l258k076J291J227j072m9L356K835j814
12641B7825m131k205q72j966j969l97r70l070j573L089M275M85k002o3K140K195
12625B0791L005M824L481n12q59L319N005J397j598o07k0j811j162K673K545l403
$$ plain form
12732 10483 16381 17153 13472 13799 19215 21435 16957 12507 13791 17659 18897 17666 16573 15776 14317
12717 14317 12519 10847 9232 8179 7738 6029 2343 329 3627 9519 11895 9473 6087 4077 3029
12702 3029 3926 8321 13907 16831 17843 20164 22281 19809 13928 10462 10507 9774 7757 9078 13984 16046
12686 16046 12372 8400 8701 10007 7816 3934 2808 5054 8630 12317 14765 14177 11867 12196 16700
12671 16700 22370 27182 32034 35652 34103 28257 25153 28047 31146 28657 23311 20843 21054 19978 17113
12656 17113 15228 15760 18495 22995 27103 27385 24127 22051 23342 24569 23497 23448 26804 29639 27825
12641 27825 23694 21489 20617 18651 16682 16285 15315 12245 10672 13761 18036 18521 16519 16456 18596 20791
12625 20791 23796 28620 32101 31589 30730 34049 39054 40451 38853 38246 38226 36415 35253 37926 40471 37068
12609C7068o181j060L090j317o946l583N068Q295N141K564K239O62j388k14K507
12594D5945K244J40N32K424J632r45j199K01n13k570k262m04q16k665j505K762
12578D3001N361L696k30l630m819k794J087L127K418K593N131N667J532k359j023
12563E8758K261J697j523k442r35QO67K243K029j760m226m39N601O269J397l164
12547F6441m585l507L90N743O765J182l734j379L304K599k76K241O936M633l049
12532H3704n676j265J929M77p39l42k578o297m775J389L614j8j570K336M953J982
12516G7124j615j581o35p76N67K876J181l858m768J5K760j22k202N33K463m75
12500G1487l039p99J826P07j56K729M617J259k625j485J489P29k163k548p76O36
$$ plain form
12609 37068 30887 29827 32917 31600 24654 21071 26139 34434 39575 42139 44378 45040 43652 43438 45945
12594 45945 48189 48329 48861 51285 52917 51972 50773 50974 50461 47891 45629 45225 44409 41744 40239 43001
12578 43001 48362 52058 51828 48198 43379 40585 41672 44799 47217 49810 54941 60608 62140 59781 58758
12563 58758 61019 62716 61193 58751 57816 57824 58491 60734 62763 61003 56777 56338 61939 68208 69605 66441
12547 66441 61856 58349 58739 64482 71247 72429 68695 67316 70620 73219 72943 75184 82120 86753 83704
12532 83704 78028 76763 78692 79169 78430 78088 75510 69213 64438 65827 69441 69423 67853 70189 75142 77124
12516 77124 75509 73928 73293 72517 73084 75960 77141 73283 68515 68530 71290 71168 68966 69499 71962 71487
12500 71487 68448 67649 69475 70182 70026 72755 77372 78631 76006 74521 76010 76739 74576 72028 71252 71888
12484G1888K326M555M062J89j626J937O224O196L803K567J235j733l526k061P7
12469I6113J096K872M822K704k551l676P50K756j088l045J736N624J650m071k969
12454A02723K021L400J914K146K702O86q56P82J363j931l615l03J171m014q010
12439A00179l158L986L869q2L9J347k020m506J510R378P686q5k100J303Q94k633
12423A15607r69M339M590J253K976P748O007l91o07M956N408j35j499K827L694
12408A55804j01P7M741N363K677N982J2488Q878l104n337O561J4655Q525J102
12394B18311L815P546K127m580k556J820q93n327k433L513L929J348J893K412
12380B30925j304l149K931R916Q358K146Q10L460L028P4J55K568K615L74j898
$$ plain form
12484 71888 74214 78769 82831 83020 81394 83331 89555 95751 99554 102121 103356 101623 98097 96036 96113
12469 96113 97209 100081 104903 107607 105056 101380 102130 104886 103798 100753 102489 108113 109763 105692 102723
12454 102723 104744 108144 110058 112204 114906 115592 114736 115518 116881 114950 111335 111032 112203 108189 100179
12439 100179 97021 101007 104876 104794 104833 106180 104160 99654 101164 110542 118228 118143 116043 117346 118240 115607
12423 115607 114638 118977 123567 124820 127796 135544 141551 141160 140553 145509 150917 150782 149283 152110 155804
12408 155804 155703 155780 160521 165884 168561 174543 187031 195909 192805 187468 194029 208684 217209 218311
12394 218311 222126 229672 231799 227219 224663 226483 225590 220263 217830 221343 225272 226620 228513 230925
12380 230925 229621 226472 229403 239319 247677 249823 250633 254093 257121 257195 257350 259918 262533 262907 261009
12365B61009n717j1513j3876r639m275l073k980j22K690K841L854P720J0270J0287
12351B47476J2845J7702J6373P458J279J899k73r080j3007o430k466r986j5625
12338B48165o298O930P718K288O066J5051J4411N966L191O031M126p95R96N557
12324C19403Q47r332r589P79P606O762Q051J4697J9303K0481K4294K9242K7965
12311D60509K2913K2323K2872J5368M593K777O173M03j2804j7714j2549j0825
12299E04039j4200r437M947J4286J4266J6959K5272K6336J6903J0770J3044J1150
12287F34335J57o761l129j328r024j5525j3019j0117j2559j1518l218M68o212
12274E42550j0555l779L884L429K820R076J3949J1291R800J4718J6039Q815N391
$$ plain form
12365 261009 255292 243779 229903 220264 215989 212916 209936 209814 212504 215345 219199 226919 237189 247476
12351 247476 260321 278023 294396 301854 303133 305032 304759 295679 282672 276242 273776 263790 248165
12338 248165 241867 248797 256515 258803 264869 279920 294331 300297 303488 309519 313645 312850 313846 319403
12324 319403 320250 310918 301329 302108 309714 316476 324527 339224 358527 379008 403302 432544 460509
12311 460509 483422 505745 528617 543985 548578 551355 557528 557931 545127 527413 514864 504039
12299 504039 489839 480402 485349 499635 513901 530860 556132 582468 599371 610141 623185 634335
12287 634335 634492 627731 624602 623274 614250 598725 585706 575589 563030 551512 548294 548762 542550
12274 542550 531995 528216 532100 535529 538349 547425 561374 572665 582465 597183 613222 622037 627428
12261F27428J2729J7775J1108M738R536J5479J2313R264J4695J6754N773l801
12249G53791K973J4337J2516M454O596J4471J3782Q224J0034J4864J2189R582
12237H77813K0410L7110M2462L8655M0114M6272M6448M3120M5183M6434L6220
12226A320241K3211K2878K9366K5980J5386J1978J2196J928j2749j2704J16N693
12214A443520P53J164J0715J6655J6222J9371K4606J9934Q677O715J3175J1701
12202A593208K040J784J3921K1099J6414J2696J6509J9057J7654K0887K7987K7773
12190A791029K1787K3858L3777L6553L0169K8173L2648L1483K4541K4811L1424
12179B110253L0083K2458K5179L7219L9649L1070L0703M1875M6072L8773L7015
$$ plain form
12261 627428 640157 657932 669040 673778 683314 698793 711106 720370 735065 751819 757592 753791
12249 753791 756764 771101 783617 788071 794667 809138 822920 831144 841178 856042 868231 877813
12237 877813 898223 935333 977795 1016450 1056564 1102836 1149284 1192404 1237587 1284021 1320241
12226 1320241 1343452 1366330 1395696 1421676 1437062 1449040 1461236 1463164 1450415 1437711 1437827 1443520
12214 1443520 1444273 1445437 1456152 1472807 1489029 1508400 1533006 1552940 1561617 1568332 1581507 1593208
12202 1593208 1595248 1597032 1610953 1632052 1648466 1661162 1677671 1696728 1714382 1735269 1763256 1791029
12190 1791029 1812816 1836674 1870451 1907004 1937173 1965346 1997994 2029477 2054018 2078829 2110253
12179 2110253 2140336 2162794 2187973 2225192 2264841 2295911 2326614 2368489 2414561 2453334 2490349
12168B490349M4849M6087L8613M0204N2279N4426M3729M1847N3396N6594M6230
12157C008603M5005N9107O4582N3212M9243O3088P1398O2570N8675P0946P7113
12146C683542O6031O1112P4970Q4966P9288Q1646J02593J13433R8924Q8316J01261
12135D636082J11528R9929R3186J10840J24059J10592J00549J20476J41743J35103
12125E784087J26980J46849J67455J56760J42541J62204J92667J95920J91699
12116G267162K16259K49623K55030K51808K76148L07767L10827L09102L41700
12107I785426L82797L88618L85578M23199M76983M92576M90979N29718N92332
12098A3948206O22019O35337O92058P78942Q38604Q88670R91505J128562J231874
$$ plain form
12168 2490349 2535198 2581285 2619898 2660102 2712381 2766807 2810536 2852383 2905779 2962373 3008603
12157 3008603 3053608 3112715 3177297 3230509 3279752 3342840 3414238 3476808 3535483 3606429 3683542
12146 3683542 3749573 3810685 3885655 3970621 4049909 4131555 4234148 4347581 4446505 4534821 4636082
12135 4636082 4747610 4847539 4940725 5051565 5175624 5286216 5386765 5507241 5648984 5784087
12125 5784087 5911067 6057916 6225371 6382131 6524672 6686876 6879543 7075463 7267162
12116 7267162 7483421 7733044 7988074 8239882 8516030 8823797 9134624 9443726 9785426
12107 9785426 10168223 10556841 10942419 11365618 11842601 12335177 12826156 13355874 13948206
12098 13948206 14570225 15205562 15897620 16676562 17515166 18403836 19395341 20523903 21755777
12089B1755777J319105J463572J650942J809553J964581K206848K523567K827113
12081C7521058L140016L569076M103093M638193N207345N965656O935515Q007338
12073G9087290R216636J0750053J2632068J4699024J6937629J9511534K2386912
12066A85221146K5348813K8464399L1866273L4641189L4515946K9415502J9232395
12059C88705663N676523r134629k3144056l3879171l9031550l8256392l3750224
12052B17186164k8415020k3749313j9783304j6348541j3590295j1499126r762877
12045I4037688q220589p002064o141355n434479m758869m208141l825070l479618
12037E0967503l098509k773497k555081k350195k106271j904845j790891j682434
$$ plain form
12089 21755777 23074882 24538454 26189396 27998949 29963530 32170378 34693945 37521058
12081 37521058 40661074 44230150 48333243 52971436 58178781 64144437 71079952 79087290
12073 79087290 88303926 99053979 111686047 126385071 143322700 162834234 185221146
12066 185221146 210569959 239034358 270900631 305541820 340057766 369473268 388705663
12059 388705663 394382186 385247557 362103501 328224330 289192780 250936388 217186164
12052 217186164 188771144 165021831 145238527 128889986 115299691 103800565 94037688
12045 94037688 85817099 78815035 72673680 67239201 62480332 58272191 54447121 50967503
12037 50967503 47868994 45095497 42540416 40190221 38083950 36179105 34388214 32705780
12029C2705780j529419j403681j351763j303744j207159j118255j082241j045897
12021B2663621r66598q94719q71193q47906p84885p28848p20638p15774o71112
12012A5461948o25719o21725o23447n88569n47236n37994n32132m92968m48487
12003A0443671m35379m28581l94576l59766l57772l60267l28717k87675k78351
11994G212587k82360k59815k24799k15278k21404k09393j87640j85728j93053
11985E233117j79174j53125j45227j50061j41551j25067j22608j25554j12667
11976C978083r6151j00232j12645j06175q9852q9898r8247q9730p3086p4381q5314
11965B962372p8835o2249o3531p6898p3594n7021n5294o6386o2530m4726m1571
$$ plain form
12029 32705780 31176361 29772680 28420917 27117173 25910014 24791759 23709518 22663621
12021 22663621 21697023 20802304 19931111 19083205 18298320 17569472 16848834 16133060 15461948
12012 15461948 14836229 14214504 13591057 13002488 12455252 11917258 11385126 10892158 10443671
12003 10443671 10008292 9579711 9185135 8825369 8467597 8107330 7778613 7490938 7212587
11994 7212587 6930227 6670412 6445613 6230335 6008931 5799538 5611898 5426170 5233117
11985 5233117 5053943 4900818 4755591 4605530 4463979 4338912 4216304 4090750 3978083
11976 3978083 3881932 3781700 3669055 3562880 3473028 3383130 3284883 3195153 3122067 3047686 2962372
11965 2962372 2883537 2821288 2757757 2680859 2607265 2550244 2494950 2428564 2366034 2321308 2279737
11954B279737n5075n7279m2212l3936l9731m0286l0666k8383l5873l5604k6840
11943A853852k7971l8628l8659k8094k8483m0805m2467l0870k8718l9427l9176
11932A470554k2622j5113k7065l5806k7537j9974k6816l4266l0285k5743k9486
11921A175841l1338k5492k3365k9107k9544k1305k0067l0432l5108k6654k0657
11910H82772k4465k3406j2524j0531k5289l6319l0510k4910l3492m0830l1860
11899E88636j9965k0597k2604j1717Q89J74l894L915J4760J3362P879J4758K8163
11886E93759L1024K4314K0337J8200R894M69p37M34o375j5386j5186j0015j0579
11873F40153j3740j1216q259j3283j8907j3873m370l191p088n390j576n110j0690
$$ plain form
11954 2279737 2224662 2167383 2125171 2091235 2051504 2011218 1980552 1952169 1916296 1880692 1853852
11943 1853852 1825881 1787253 1748594 1720500 1692017 1651212 1608745 1577875 1549157 1509730 1470554
11932 1470554 1447932 1432819 1405754 1369948 1342411 1322437 1295621 1261355 1231070 1205327 1175841
11921 1175841 1144503 1119011 1095646 1066539 1036995 1015690 995623 965191 930083 903429 882772
11910 882772 858307 834901 822377 811846 786557 750238 719728 694818 661326 620496 588636
11899 588636 568671 548074 525470 513753 514642 514816 510922 514837 529597 542959 550838 565596 593759
11886 593759 624783 649097 669434 687634 697528 697997 697260 697694 691319 675933 660747 650732 640153
11873 640153 626413 615197 606938 593655 574748 560875 556505 553314 546226 540836 539260 534150 523460
11860E23460p298J12o78o280m867J143J065k550n0M414K65p724p586l988j0269
11845D79169k1968k2924j4354j2776k0708k4282j9959j9179k4769k6070k0413
11834B51767j7448j8842j4706l787L011K920N580J3284J6305J1794Q506Q703L951
11821B71038o805j3540j3896j7201k5098k6761j8873j1936j0688o399M525J2349
11809A36715J2222J3373K1498K7947K5456J9979J7970J5542Q657J542k543o737
11797B91621j0870r208l321l143r672j1283l423L474K495Q04L922N378J026j704
11783B56096J444K279m409j0448r484q405j3016j6366j2371p443p283n684J868
11770A66778P173M287J863P394J2484Q076J487K841O338J354q046j1149r304j0495
$$ plain form
11860 523460 516162 516274 515596 509316 504449 505592 506657 504107 504057 508471 508736 501012 493426 489438 479169
11845 479169 457201 434277 419923 407147 386439 362157 342198 323019 298250 272180 251767
11834 251767 234319 215477 200771 196984 199995 202915 208495 221779 238084 249878 258384 267087 271038
11821 271038 264233 250693 236797 219596 194498 167737 148864 136928 126240 119841 124366 136715
11809 136715 148937 162310 183808 211755 237211 257190 275160 290702 299359 300901 298358 291621
11797 291621 280751 271543 268222 265079 255407 244124 240701 244175 246670 247474 251396 256774 257800 256096
11783 256096 257540 259819 255410 244962 235478 227073 214057 197691 185320 177877 170594 164910 166778
11770 166778 173951 178238 180101 187495 199979 208055 209542 212383 218721 220075 212029 200880 191576 181081
11756A81081j3218j1512q786j1208j4108r901k951j833l459K10O030N398J86j832
11742A14097j640m280n791l39N613K416m887m485J432J176n256p497m489m742
11728H1328q391o755K95L450Q75N7K340J244l121l262J271L387K697N394R831
11713I0640P884J066p60K618J703l867m078J692K226m337n524L403J0202O011
11699A08879j531l574l036l756j516M872P182J947j841J580M118j163o773l662
11685A01726L416M827J179j218j841k902k290J119K182k153o306n421l440m566
11671H4312n308k675j162l391l161L169P783L731k943l717j411k508m218j179
11657F7322K527N16l448k594k85l046o469k155N811O020j324m940q12L570L441
$$ plain form
11756 181081 167863 156351 147565 136357 122249 112348 109397 107564 104105 104315 110345 115743 115929 114097
11742 114097 112457 108177 102386 102047 107660 110076 105189 100704 102136 103312 98056 90559 86070 81328
11728 81328 72937 66182 66477 69927 70802 70859 73199 74443 71322 68060 69331 72718 75415 80809 90640
11713 90640 98524 99590 98830 101448 103151 99284 95206 96898 99124 94787 89263 92666 102868 108879
11699 108879 107348 103774 100738 96982 95466 100338 107520 109467 107626 109206 113324 112161 105388 101726
11685 101726 105142 109969 111148 109930 108089 105187 102897 104016 106198 104045 97739 92318 88878 84312
11671 84312 79004 76329 75167 71776 68615 71784 79567 83298 80355 76638 75227 72719 68501 67322
11657 67322 69849 70365 66917 64323 64038 60992 54523 52368 58179 64199 62875 57935 57123 60693 64134
11642F4134K538L393L259J563J589K934J146l647n819l278j32N20k87j587l297
11627F3029l172M69L847K194k064k665K98J152j474l323k639k065k501k090j132
11612D7864j496j852J51K284R71j664j167Q63l82l635l531m70L33j555k034j216
11596C3464k612m530k150K316J933k461k972J346K726j058k479K037N460K441
11582C3461j791r32K483K983Q87q64k442m209l724n84J050o08r54L302P488N364
11566D0910j643o612n938k075N40k86k855l204q6K665J693k56Q97K992J574j121
11550B7195L87M238L896L61O65M142K512m614p306k119J801j259m207q96K796
11535B7592M37l248j838R61q35l953k538P78O76l47K389N410K902j990k113J476
$$ plain form
11642 64134 66672 70065 73324 74887 76476 79410 80556 76909 71090 67812 67680 68200 67913 66326 63029
11627 63029 59857 60326 64173 66367 64303 61638 61936 63088 61614 58291 55652 53587 51086 48996 47864
11612 47864 46368 44516 44667 46951 47922 46258 45091 45954 45572 41937 38406 37936 38269 36714 34680 33464
11596 33464 30852 26322 24172 26488 28421 25960 22988 24334 27060 26002 23523 25560 31020 33461
11582 33461 31670 30738 33221 36204 37091 36227 33785 29576 25852 25268 26318 25710 24756 28058 35546 40910
11566 40910 39267 32655 26717 24642 25182 24896 22041 18837 18751 21416 23109 22853 23750 26742 28316 27195
11550 27195 27582 31820 35716 36077 36742 40884 43396 38782 31476 29357 31158 29899 25692 24796 27592
11535 27592 28029 24781 22943 23904 23069 19116 16578 17356 18032 17685 20074 25484 28386 26396 24283 25759
11519B5759K268j56j047o4o05j924o43J885J608r28k322k497k638q95K989L669
11503B4459j529n815k999J707R20j307K663Q260N191l672n394J912O513K762j510
11488C2161l74J500J33n56J511J020m218p284l389J756J540j480j878o64j327
11473A8451k424j035J059Q44k23M04R81j125l752k944L73J527j117m057l157J592
11457E397N769M867k44l599j749J479J109j336j533m02j398k428Q65N378L903
11442A6078k068l507J013K647k264n481r09N171M872Q73p9J460J010o20K97K673
11426B1166K428n29k871l112j992k79N87r88l131j737K521L989J151p85O46R20
11410A7984k269l994j603m98l764m982K67M302q29q704p629Q15M925J592r07J876
$$ plain form
11519 25759 28027 27871 26824 26760 26155 24231 23588 25473 27081 26153 23831 21334 18696 17801 20790 24459
11503 24459 22930 17115 14116 15823 16743 15436 18099 26359 31550 27878 22484 24396 30909 33671 32161
11488 32161 31787 33287 33420 32864 34375 35395 31177 23893 20504 22260 23800 22320 20442 19778 18451
11473 18451 16027 14992 16051 16895 16672 17076 18057 16932 13180 10236 10609 12136 11019 6962 3805 5397
11457 5397 11166 16033 15789 12190 10441 11920 13029 11693 10160 9758 8360 5932 6797 12175 16078
11442 16078 14010 10503 11516 14163 11899 6418 5509 10680 15552 16425 16346 17806 18816 18196 18493 21166
11426 21166 23594 23065 20194 17082 15090 14811 15398 14410 11279 9542 12063 16052 17203 16418 17064 17984
11410 17984 15715 11721 10118 9620 5856 874 1141 5443 4614 -4090 -11719 -10904 -5979 -4387 -5294 -3418
11394c418M543K556j078k410k037j581q04n9n39j303l84J363J751J376J764J398
11378A138j245l125q80K634K422k70l94K158L284K206J081q76n102p438k871M592
11362b686O011J229q92L267P040M827m3j969n65J524K541J213k372m450j374L943
11346A7244N222K068n43j259l003m977k961J608J993k730n714l483k82P56J574
11331E513K048j306o310n011L229Q594N764J775K985M596Q96l633k716K93p75
11316A5942l384j770J567K04m247m694n64K140J180M4M94P21L63P96J003r92l441
11299E362k904J3J810J530N44j155l841n262l569r20J06R92L743N978M529R89
11283G945j144j785k031n84K352K062l467p800m753J326K121j379j370L393O265
$$ plain form
11394 -3418 1125 3681 2603 193 -1844 -3425 -4229 -4288 -4827 -6130 -6514 -5151 -3400 -2024 -260 1138
11378 1138 -107 -3232 -4112 -1478 944 674 280 2438 5722 7928 9009 8133 3031 -4407 -7278 -2686
11362 -2686 3325 4554 3662 6929 13969 18796 18753 16784 16219 17743 20284 21497 19125 14675 13301 17244
11346 17244 22466 24534 23991 22732 19729 14752 11791 13399 15392 12662 6948 3465 3183 3939 5513
11331 5513 7561 6255 -55 -5066 -1837 6757 12521 14296 17281 21877 22773 19140 16424 16717 15942
11316 15942 12558 10788 12355 12559 8312 3618 3054 5194 6374 6418 6912 7633 7996 8792 9795 8803 5362
11299 5362 2458 2471 4281 5811 6355 5200 1359 -3903 -7472 -8392 -8286 -7294 -3551 2427 6956 7945
11283 7945 6801 5016 2985 2401 4753 6815 3348 -4452 -9205 -7879 -5758 -7137 -8507 -5114 1151
11268A151M034M50j643l444m804l305K78K130J638J554K062P57j803k596j519
11253e060o46M84K667K733j414m386n89M913K959m412o758k217Q35n46r6L673
11237g860L567j903l785J581M907l09o234m119J264J011k841k748O20J242o63
11222a6270l86J780K279K169M279N711K119l215l439R49L515K343P61m70l094
11207i69m844j740L446L689j025l187N01M775M825K248k09k840n056l542J953
11192a975N949M171o65l287k818j937j790j321l77j99r48r22J022L196K561r88
11176c28l311r73L385M154J144m5K772M469J310k201o17L044K140k494l981o98
11160G770J689j24k383j173J546J547j537l969k099L803Q691P079J21m262j333
$$ plain form
11268 1151 5185 5635 3992 548 -4256 -7561 -7283 -5153 -3515 -1961 101 858 -945 -3541 -5060
11253 -5060 -5706 -5222 -2555 178 -1236 -5622 -6211 -1298 1661 -2751 -9509 -11726 -10891 -11437 -11533 -7860
11237 -7860 -4293 -6196 -9981 -8400 -3493 -3802 -10036 -14155 -12891 -11880 -14721 -17469 -16849 -15607 -16270
11222 -16270 -16656 -14876 -12597 -10428 -6149 -438 1681 -1534 -4973 -4024 -509 1834 2595 2125 -969
11207 -969 -5813 -7553 -4107 -418 -1443 -4630 -4129 646 5471 7719 7510 4670 -386 -3928 -1975
11192 -1975 3974 8145 7480 4193 1375 -562 -2352 -3673 -4050 -4249 -5197 -6119 -5097 -1901 660 -328
11176 -328 -3639 -4612 -1227 2927 4071 4026 6798 11267 12577 10376 9759 12803 14943 12449 8468 7770
11160 7770 9459 9335 6952 5779 7325 8872 7335 3366 1267 5070 13761 20840 20961 16699 15366
11145A5366L832M045N75k42K175K954J130L46P03j405m735l386K535N269J515
11130C0677k155l24K596L77m719o043k556J347K771J891p64m043n306l540j395
11115H814j307k212k387k171j526J051M299L545j994o047l889M97J076j061j430
11100d742r20l100n573k674L969O220J913j461J673O560N654m78m938m353j903
11085d153j260j738o10K202L746J968j534l684l936m240m981l698P60N186N693
11070a0279K958J075J823K817J411j872m405m437k333K82K090K926L051K122j26
11055b897k400k755j197M28J287K029K063m65m674o069k165L326M633Q10l780
11040a1826m709j417K958M275J207k661k433J709M404K552o46j078L87N05q15
$$ plain form
11145 15366 19198 23243 23818 23576 25751 28705 29835 30181 30884 29479 24744 21358 23893 29162 30677
11130 30677 28522 28198 30794 31171 26452 20409 17853 19200 21971 23862 23098 19055 13749 10209 8814
11115 8814 7507 5295 2908 737 -789 262 4561 8106 6112 65 -3824 -3327 -2251 -3312 -4742
11100 -4742 -5662 -8762 -14335 -17009 -13040 -6820 -4907 -6368 -4695 1865 7519 7041 2103 -2250 -4153
11085 -4153 -5413 -7151 -7761 -5559 -1813 155 -1379 -5063 -8999 -13239 -18220 -21918 -21158 -15972 -10279
11070 -10279 -7321 -6246 -4423 -1606 -195 -2067 -6472 -10909 -13242 -12960 -10870 -7944 -4893 -2771 -2897
11055 -2897 -5297 -8052 -9249 -8821 -7534 -5505 -3442 -3907 -8581 -14650 -16815 -13489 -8856 -8046 -11826
11040 -11826 -16535 -17952 -14994 -10719 -9512 -12173 -14606 -12897 -8493 -5941 -6587 -7665 -7278 -6773 -7588
11025g588j178k2R71N31j291l377l414j5L913L656j39j630Q67J929j145k698J254
11008i376M426j61p646q139k066J803J208K020N624O159J844j517j007r05l151
10993a0884k956J699M746J524l723n143l573k263o49K029K711o0j983J3J780q81
10977a7613m122k134K844M154J323n48P9N5j437j739m79l29j639j669K88J802
10961b1164J809J942K712K318O2k149k352l55K688M514K855j269l270r02J829
10946a0732M40k876k783O67K869K700L174M235J927l747o660l214K164L499R63
10931g374j447k274k691k723j313J042K770L621M366M867M307K727Q11j116k693
10916B880k942j422P81K231K617K211P70j729l833l648j309P13M39r85o11K190
$$ plain form
11025 -7588 -8766 -8788 -7817 -7286 -8577 -11954 -15368 -15383 -11470 -7814 -7953 -9583 -8716 -6787 -7932 -10630 -9376
11008 -9376 -4950 -5111 -12757 -20896 -22962 -21159 -19951 -17931 -12307 -6148 -4304 -5821 -6828 -7733 -10884
10993 -10884 -13840 -12141 -7395 -5871 -9594 -14737 -18310 -20573 -21222 -19193 -16482 -16542 -18525 -18512 -16732 -17613
10977 -17613 -21735 -23869 -21025 -16871 -15548 -16096 -16017 -15962 -17399 -19138 -19617 -19946 -21585 -23254 -22966 -21164
10961 -21164 -19355 -17413 -14701 -12383 -12321 -14470 -16822 -17177 -14489 -9975 -7120 -8389 -11659 -12561 -10732
10946 -10732 -10292 -13168 -15951 -15284 -12415 -9715 -6541 -2306 -379 -4126 -10786 -14000 -11836 -8337 -7374
10931 -7374 -8821 -11095 -13786 -16509 -17822 -16780 -14010 -10389 -6023 -1156 3151 5878 6689 5573 2880
10916 2880 -62 -1484 -703 1528 4145 6356 7126 5397 1564 -2084 -3393 -2680 -2241 -3226 -3837 -1647
10900a647M265K650j040k426m46J365M02j307r00O11M12j302j880n83P35Q02K25
10883f4j20J55J237K282J345j743l808k229J059K351J591J404J900O56k240l341
10867D35q40K828M363L107O63r24o44L4j751n606o484j481M316L874j361l248
10851b719J069N618N200J984O4p35k014k441l16K575L103P44k619m612l153J552
10835C300N077L024j992k674K189N350K196k352k342om43k232o38L102L471K37
10819A5267r54K143M740K353k908n493l209P89J751j330m146k088L260N703L235
10804A9113Q46K343M378K528j125j722N40J784Q73q49l451o409n680P84P224O993
10788B8170L011L138O743N570j690n987k092L234K146k871m493j660J213K052
$$ plain form
10900 -1647 2618 5268 4228 1802 1356 2721 3123 1816 916 1527 1939 637 -1243 -1826 -1091 -289 -64
10883 -64 -184 -29 1208 3490 4835 3092 -716 -2945 -1886 465 2056 3460 5360 6016 3776 435
10867 435 -405 2423 6786 9893 10556 9632 8988 9022 7271 1665 -4819 -6300 -1984 1890 529 -2719
10851 -2719 -1650 3968 9168 11152 11216 10481 8467 6026 5710 8285 11388 12132 9513 4901 1748 3300
10835 3300 8377 11401 9409 6735 8924 14274 16470 14118 11776 11770 11327 9095 8457 11559 15030 15267
10819 15267 14313 16456 21196 23549 20641 15148 11939 12728 14479 13149 9003 6915 10175 15878 19113
10804 19113 19959 22302 26680 29208 28083 26361 26901 28685 29558 28709 25258 18849 13169 13953 21177 28170
10788 28170 31181 34319 41062 46632 44942 38955 36863 40097 42243 39372 34879 33219 34432 36484
10774C6484K076J520j95j462q3K987M698L821J421j210k965k774r80O35J606L362
10758D8941N744N897K775k05K18K427K881J560J115K168K752J580q43l414m479
10743F9117j988L692Q138P089J837k171j903N99K149K294K303K420J886J030J449
10728I7941L455M557K294j643k573Q61M288L732J324J351L034K370j55J25L797
10713A24758N713L113m98j982l030m803m010J018N460M682J630J733L986L647
10699A41417J137J160M061N132K836J281L130N558N418L972L995N353N821M371
10685A94642K015Q33K592O591Q912O201L93k773m56M397P428P680P029O887P020
10670B59391O799O403O658P806Q733Q424Q135J0217J4186J6334J4639J1700J0878
$$ plain form
10774 36484 38560 40080 39885 38423 38340 41327 46025 49846 51267 50057 47092 44318 43338 43973 45579 48941
10758 48941 54685 60582 63357 63152 63370 65797 68678 70238 71353 73521 76273 77853 77010 73596 69117
10743 69117 67129 70821 78959 86048 87885 85714 83811 84410 86559 88853 91156 93576 95462 96492 97941
10728 97941 101396 105953 108247 106604 104031 104892 109180 112912 114236 115587 118621 120991 120836 120961 124758
10713 124758 130471 133584 133086 131104 128074 123271 119261 120279 125739 130421 132051 133784 137770 141417
10699 141417 142554 143714 147775 152907 155743 157024 160154 165712 171130 175102 179097 184450 190271 194642
10685 194642 196657 197490 200082 206673 215585 221786 222179 219406 218950 223347 230775 238455 245484 252371 259391
10670 259391 266190 272593 279251 287057 295790 304214 312349 322566 336752 353086 367725 379425 390303
10657C90303J2002J3163J4168J5460J6103J6034J7878K3051K8406L0636L1520
10646F08724L4531L8743M1265M3522M9260N7826O5671P3356Q4290R7016J06174
10635A300378J11809J20281J33982J46982J53094J51734J43415J26853J04813
10626B493341Q6466P8713P9859Q6073R8823J20491J47271J72721J95023K14309
10616C773090K24951K17191J86859J39512Q5877L7056K866j0439k684K1583N6742
10605D732604R7322J37424J71129J92327J93199J66039J09724L2877n0783j27702
10595E654160j84537k09563k00371j67804j27106q6336m6901j2354R417J2047
10585D640652n928m2572r2618j46261j92167k22395k32906k22444j95390j62935
$$ plain form
10657 390303 402305 415468 429636 445096 461199 477233 495111 518162 546568 577204 608724
10646 608724 643255 681998 723263 766785 816045 873871 939542 1012898 1097188 1194204 1300378
10635 1300378 1412187 1532468 1666450 1813432 1966526 2118260 2261675 2388528 2493341
10626 2493341 2579807 2658520 2738379 2824452 2923275 3043766 3191037 3363758 3558781 3773090
10616 3773090 3998041 4215232 4402091 4541603 4627480 4664536 4667402 4656963 4654279 4675862 4732604
10605 4732604 4829926 4967350 5138479 5330806 5524005 5690044 5799768 5832645 5781862 5654160
10595 5654160 5469623 5260060 5059689 4891885 4764779 4678443 4631542 4619188 4628605 4640652
10585 4640652 4634724 4592152 4499534 4353273 4161106 3938711 3705805 3483361 3287971 3125036
10575C125036j35140j12563r1004p2915o6949p6020r3066j10365j26497j41572
10565B098945j51895j53622j47539j36616j22236j05845r1031q0484p3151o6874
10555I69652o1348n6430n0637m4131m0169m0216m0200l5500k7882k3446k4322
10544E25371k6240k4790k0888j8603j9541k1247k0923j9200j8849k0062j9290
10533B95738j4346q630p250r957j1750j0421r203j0663j2274j0803p818p198r136
10520A66289j0098q012m527k251k083l492n630p542q208p025m368j720r05k339
10506I8089m285m675l419j980j412k052m122o641o854l484L18M73k070k681l44
10491E4861P91j858n345n966m276k971k739k599k002o57J482K869J674p13j071
$$ plain form
10575 3125036 2989896 2877333 2786329 2713414 2646465 2570445 2477379 2367014 2240517 2098945
10565 2098945 1947050 1793428 1645889 1509273 1387037 1281192 1190161 1109677 1036526 969652
10555 969652 908304 851874 801237 757106 716937 676721 636521 601021 573139 549693 525371
10544 525371 499131 474341 453453 434850 415309 394062 373139 353939 335090 315028 295738
10533 295738 281392 272762 265512 255555 243805 233384 224181 213518 201244 190441 182623 175425 166289
10520 166289 156191 148179 143652 141401 139318 135826 130196 122654 114446 107421 103053 101333 100428 98089
10506 98089 93804 89129 85710 83730 82318 80266 76144 69503 62649 59165 59483 59956 57886 55205 54861
10491 54861 55652 53794 48449 42483 38207 35236 32497 29898 27896 27239 28721 31590 33264 32551 31480
10476C1480j0j566n532n939o05L676P49m969m748J448N482L085j487l043j621
10461A6400J34J108J496J418R47j15k135l949l198m52p7l710o338l590O45J15
10445a301l216k369K402L633p14l867j888J68k042m348j853J990J108k931l617
10430a8845J98L513L408K105J988K529K458J320j223m472n569k498K242M153K538
10415f155N49o8o55j876k201j211r42k223k560R4L622M303J855n47p65K40Q54
10398g686J108J475J161p35l208m236l455k225j067Q23L080L450J018j903k771
10383a5171j951r05O15K933M039K309N5L34J473m60m318m722q11J946N57r38Q90
10366a4125K570J69k803n79M630M949j307o967o362k312k16k18P89K528J563k601
$$ plain form
10476 31480 31470 29904 24372 18433 17828 21504 22253 17284 12536 13984 19466 22551 21064 18021 16400
10461 16400 16534 17642 19138 20556 21503 21388 19253 15304 12106 11654 11577 7867 1529 -2061 -1416 -1301
10445 -1301 -4517 -6886 -4484 -851 -1565 -5432 -7320 -7152 -9194 -13542 -15395 -13405 -12297 -15228 -18845
10430 -18845 -18647 -15134 -11726 -9621 -7633 -5104 -2646 -1326 -2549 -7021 -12590 -15088 -12846 -8693 -6155
10415 -6155 -5606 -5674 -6329 -8205 -10406 -11617 -12559 -14782 -17342 -17248 -13626 -9323 -7468 -8015 -8780 -8540 -7686
10398 -7686 -6578 -5103 -3942 -4677 -7885 -12121 -15576 -17801 -18868 -18045 -14965 -11515 -10497 -12400 -15171
10383 -15171 -17122 -18027 -17412 -14479 -10440 -8131 -8076 -7742 -6269 -6729 -11047 -15769 -16580 -14634 -14077 -15015 -14125
10366 -14125 -11555 -11386 -14189 -14768 -10138 -5189 -6496 -13463 -19825 -22137 -22353 -22571 -21782 -19254 -17691 -20292
10350b0292n874n136k493j771k749j925J409L613K456Q64K079M101L086J58l72
10335b2846J507J649m73n17K760M692K604L03R74J517j243m255l854k615l989
10320b3786m680k58N187M001k303m696q05K082m30l452k197N05O07l5J666L580
10304b5014K230o66j109M56M10j693k703j116R90J285p8j116q7K652M342K706
10288a8511o99k193j160n36j506j524R37L475L647K199K20k938o191n504nM586
10272b5703L278p29j091J940K912N22r46N64J888N99j355j941k379l821m311j779
10256c2352K360M991M852K616p17l645m043j273K372L797K250o01k835l547k658
10241b8433p31J166K102J777L40j777l593l750j632J613L695L175J013l20M04
$$ plain form
10350 -20292 -26166 -31302 -33795 -35566 -38315 -40240 -38831 -35218 -32762 -31898 -29819 -25718 -22632 -22474 -22846
10335 -22846 -21339 -19690 -20163 -20680 -17920 -13228 -10624 -10321 -9347 -7830 -9073 -13328 -17182 -19797 -23786
10320 -23786 -28466 -28724 -23537 -19536 -21839 -26535 -27340 -25258 -25688 -29140 -31337 -30832 -30225 -30260 -28594 -25014
10304 -25014 -22784 -23450 -24559 -24103 -23693 -25386 -28089 -29205 -28215 -26930 -27008 -28124 -28211 -25559 -21217 -18511
10288 -18511 -19210 -21403 -22563 -23099 -24605 -26129 -25192 -21717 -18070 -15871 -15651 -18589 -24780 -30284 -30289 -25703
10272 -25703 -22425 -23154 -24245 -22305 -19393 -18871 -19817 -19253 -17365 -16766 -18121 -20062 -22441 -26262 -30573 -32352
10256 -32352 -29992 -25001 -20149 -17533 -18250 -21895 -25938 -27211 -24839 -21042 -18792 -19393 -22228 -25775 -28433
10241 -28433 -29164 -27998 -25896 -24119 -23779 -25556 -29149 -32899 -34531 -32918 -29223 -26048 -25035 -25355 -24951
10226b4951J791J842O65j10j52q11k502l596k552K52L146M167J810k830n038j196
10210c0065N059N885p2m969k797K137K636p7N73M707N367k13o095o463k940k80
10194b7607M14Q10J332J402J342J216j99k964m407k330J591L693K596P6j277j37
10178b4449K689M495L079l49k199j095N06J96j140j458q49n64l13J064L016L617
10162a3754K454J323J466J422j131n475p288l505K845N297K154j037O38M374M231
10147e986K75k108q91M64j78n25P95J235p19k240q61J425J757O74j97j226k486
10130a0792j870J079K853J161q51L89K846K604O49N04J333n58m253m501J6M144
10114e247L492n6j858l50K309L272J315k428n375n910m430j690J917M428K923
$$ plain form
10226 -24951 -23160 -21318 -20653 -20763 -20915 -21726 -24228 -27824 -30376 -30124 -26978 -22811 -21001 -23831 -28869 -30065
10210 -30065 -25006 -19121 -19193 -24162 -26959 -24822 -22186 -22263 -21690 -16983 -11616 -11829 -17924 -24387 -27327 -27607
10194 -27607 -27193 -26383 -25051 -23649 -22307 -21091 -21290 -24254 -28661 -30991 -29400 -25707 -23111 -23035 -24312 -24449
10178 -24449 -21760 -17265 -14186 -14535 -16734 -17829 -17323 -17127 -18267 -19725 -20574 -21138 -21451 -20387 -17371 -13754
10162 -13754 -11300 -9977 -8511 -7089 -8220 -13695 -20983 -24488 -21643 -16346 -14192 -15229 -14591 -10217 -5986
10147 -5986 -5711 -7819 -8710 -8246 -8424 -8949 -8154 -6919 -7638 -9878 -10739 -9314 -7557 -6883 -7080 -8306 -10792
10130 -10792 -12662 -11583 -8730 -7569 -8420 -8031 -5185 -2581 -1932 -1428 -95 -653 -4906 -9407 -9391 -5247
10114 -5247 -1755 -1811 -3669 -4019 -1710 1562 2877 449 -4926 -10836 -15266 -16956 -15039 -10611 -7688
10099g688j391k449K408P099M982q61k265J312K720o81l169o78L114L654J870
10084G977L31j147k476j291K260L608N84k634k171j19O87K234O179Q139L977j941
10068B4197k255K053L484r1l179k368p36j110j703p54K47P07K933O890P731K694
10052C8740l417m184m02J756j75k526k000j71j15j760k795k364j728j814k166
10037A4879k361k814l370k526L32K883K173j109l054j822pl47j669j494m97j095
10021a898k874l003j073P5r62j808p1K918L813J304k817n594n276k686n67n00
10005b1019p77Q65K957J811k287m058l04N098O177K569j003j456l3J053J186L68
9989h853j188j916j94K374J958j762l894r01L642L590q09l018J88L741J629m031
$$ plain form
10099 -7688 -9079 -11528 -9120 -2021 2961 2100 -165 1147 3867 3186 17 -661 2453 6107 7977
10084 7977 8308 7161 4685 3394 5654 9262 9846 7212 5041 4922 5609 7843 14022 22161 26138 24197
10068 24197 21942 23995 27479 27388 24209 21841 21105 19995 18292 17538 17785 18492 21425 28315 36046 38740
10052 38740 35323 31139 30737 32493 32318 29792 27792 27621 27506 25746 22951 20587 18859 17045 14879
10037 14879 12518 9704 6334 3808 4140 7023 9196 8087 5033 3211 3204 2857 1188 -306 -803 -1898
10021 -1898 -4772 -7775 -8848 -8773 -9735 -11543 -11614 -8696 -4883 -3579 -6396 -11990 -17266 -19952 -20519 -21019
10005 -21019 -21796 -20931 -17974 -16163 -18450 -22508 -22812 -17714 -11537 -8968 -9971 -11427 -11460 -10407 -9221 -8853
9989 -8853 -10041 -11957 -12151 -9777 -7819 -9581 -13475 -14376 -10734 -7144 -7953 -10971 -10783 -7042 -5413 -9444
9973i444n559l62N443N214O3l650k954r06r82k201j470J358L282K563R13M75O46
9956g571k09j186J73L275M076P91k758k239Q78J704n67j947m38J069K17q09O35
9939d906L023L382K078J352J154J53p81J09J689J499L68J189L283K556j772m965
9923I411l255R04K449J61k799l184p18K015J842j475l799r99M872O962K325m129
9907A0583o329m298j945o91O64J816J091p74j040O05J424J24r97L53K940L683
9891G209J503j738l438k615n52N48j82j543k120k140k594l198k646n54K120M363
9875g577N517M824K250m17j045mJ81j492k965k229k93L30q59k097k134j609j477
9858a1096j538j256q52n01O93L254N182L417j615n125l462J039L197J952Q94K044
$$ plain form
9973 -9444 -15003 -15365 -9922 -4708 -4645 -8295 -11249 -12155 -13137 -15338 -16808 -15450 -12168 -9605 -8692 -8217 -7571
9956 -7571 -7780 -8966 -8793 -5518 -1442 -651 -3409 -5648 -4770 -3066 -3633 -5580 -6018 -4949 -4732 -5541 -4906
9939 -4906 -1883 1499 3577 4929 6083 6236 5455 5564 7253 8752 9120 10309 13592 16148 14376 9411
9923 9411 6156 7060 9509 9670 6871 3687 2969 4984 6826 5351 1552 553 5425 12387 14712 10583
9907 10583 4254 -44 -1989 -2680 -2016 -200 891 117 -923 -318 1106 1230 233 586 3526 7209
9891 7209 8712 6974 3536 921 369 917 735 -808 -2928 -5068 -7662 -10860 -13506 -14060 -11940 -7577
9875 -7577 -2060 2764 5014 4597 3552 3548 3729 2237 -728 -2957 -3250 -2920 -3779 -5876 -8010 -9619 -11096
9858 -11096 -12634 -13890 -14742 -15243 -14550 -11296 -6114 -2697 -4312 -9437 -12899 -11860 -8663 -6711 -5817 -3773
9842c773K950J282j162j510k01N53P90K005L516K969M41j152k23J341J085q18
9826H093k266j931m08P14M88m07n00N31J476J487J036L70j053k491j620J601L334
9809H454J150j468p4L217K540k059m112q37K601J742k09J350M074K594k173m169
9793A2621j561J254J361J101K450K864o2l644l631l35K389K823K462K233J362
9778B3687J41L19J802K026R3j276P2K120J875q0j263j661k620k855k93K687J412
9761B6186k948l492J823N775K334l934m771m06K326J356R04K329J546k899o237
9746A9892m763j057R58J220R46m01k351k073O92J548j770m680k488J868K182j445
9730H278l283r02K214K696J000j179k967l301j611j9j351m355m413j7M605M786
$$ plain form
9842 -3773 -823 459 -703 -2213 -2414 -1861 -1071 934 4450 7419 7860 6708 6485 7826 8911 8093
9826 8093 5827 3896 3488 4202 4690 4283 3783 4314 5790 7277 8313 8683 7630 5139 3519 5120 8454
9809 8454 9604 8136 8062 11279 13819 11760 7648 6811 9412 11154 10945 12295 16369 18963 16790 12621
9793 12621 11060 12314 13675 14776 17226 20090 20028 16384 12753 12418 14807 17630 20092 22325 23687
9778 23687 23828 24147 25949 27975 28068 26792 26864 28984 30859 30779 29516 27855 25235 22380 22087 24774 26186
9761 26186 23238 19746 21569 27344 29678 25744 20973 20567 22893 24249 25153 27482 29028 26129 19892
9746 19892 15129 14072 15030 16250 17196 16795 14444 12371 13063 14611 12841 8161 5673 7541 9723 8278
9730 8278 4995 4093 6307 9003 10003 8824 5857 2556 945 926 -425 -4780 -9193 -9210 -4605 181
9714A81R26k847l667k099l03O39J363K450K783J168p86k24J953J303l024n658
9698e842k952P83J07k415p74L422K988k166l550K493Q301O029j459o051n449l049
9682i584q52J470K846J756j27K20K535M087M017L453K686J735K224M699N637J742
9666B8544l746m376j65J866j739n620m317j133k897q724j0682n634j58q34m499
9651b4114l280L138O594K509l189k713K375M180M27k851r97K797L013n78m033
9636a6722m976m045k520j305j007q99Q75M268O243M513P21j936k367j177J069
9621a9265K958K071j481l731k074N39J12k075k045p9J02j754j903O60K172K22
9605b5571k465k326K92K556K754J054j061j344Q36K519N33l133l235Q25L612J789
$$ plain form
9714 181 1107 -1740 -5407 -7506 -7809 -7170 -5807 -3357 -574 594 -192 -416 1537 2840 -184 -5842
9698 -5842 -8794 -8011 -7904 -10319 -11093 -7671 -4683 -6849 -10399 -7906 395 6424 4965 -1086 -6535 -9584
9682 -9584 -10436 -8966 -6120 -4364 -4491 -4271 -1736 2351 6368 9821 12507 14242 16466 21165 26802 28544
9666 28544 24798 20422 20257 22123 20384 14764 10447 9314 6417 -2307 -12989 -18623 -18781 -19615 -24114
9651 -24114 -27394 -24256 -17662 -15153 -18342 -21055 -18680 -14500 -14073 -16924 -17921 -15124 -12111 -12689 -16722
9636 -16722 -21698 -25743 -28263 -29568 -30575 -31474 -30599 -26331 -20088 -15575 -14854 -16790 -19157 -20334 -19265
9621 -19265 -16307 -14236 -15717 -19448 -21522 -20983 -20871 -22946 -24991 -25070 -24968 -26722 -28625 -27965 -25793 -25571
9605 -25571 -28036 -30362 -30070 -27514 -24760 -23706 -24767 -26111 -25275 -22756 -22223 -25356 -28591 -27766 -24154 -22365
9589b2365j049m97J815J419j890m210l122K63L447M085J009l535m543k04M598
9574b4779M163k63k508k81K452J941n92j764n76J317J790j6k742l591j716q3j533
9557b8781m085l494J25K562K440K783M376L235k174o248l687K156M003J107j092
9542b6774l07M18k10N72L083L039q84l262j57L835K302k993n079k391J73j67r83
9525b9785l19N10R94K686M857M036j11l290l110k161k313j347J467K093j445m120
9509c1358j424K651J762k184k080K727N646L316m07j620j134p64m51m29j393j611
9493b8753J203M668L891m14k026J056L423J087k602l156j485o01n25j81j30l05
9477b4850Q19K209M21l568l608J974O298M097m54j673j408l221l841P88N901M155
$$ plain form
9589 -22365 -23414 -23911 -22096 -20677 -22567 -26777 -29899 -29636 -26189 -22104 -21095 -24630 -29173 -29377 -24779
9574 -24779 -20616 -20879 -23387 -23668 -21216 -19275 -19867 -21631 -22207 -20890 -19100 -19116 -21858 -25449 -27165 -27248 -28781
9557 -28781 -32866 -36360 -36235 -33673 -31233 -28450 -24074 -20839 -23013 -29261 -32948 -30792 -26789 -25682 -26774
9542 -26774 -27081 -26663 -26873 -26301 -23218 -20179 -21063 -24325 -24482 -20647 -18345 -21338 -26417 -28808 -28635 -28802 -29785
9525 -29785 -30104 -29594 -28600 -25914 -21057 -17021 -17132 -20422 -23532 -25693 -28006 -29353 -27886 -25793 -27238 -31358
9509 -31358 -32782 -30131 -28369 -30553 -32633 -29906 -24260 -20944 -21351 -22971 -24105 -24869 -25320 -25749 -27142 -28753
9493 -28753 -27550 -22882 -18991 -19405 -21431 -20375 -16952 -15865 -18467 -21623 -23108 -23709 -24234 -24415 -24545 -24850
9477 -24850 -24031 -21822 -21401 -24969 -28577 -26603 -20305 -16208 -16662 -18335 -19743 -22964 -26805 -26017 -20116 -15961
9461a5961j925l756o74K64k510k863J225L903J918l42N28J495m8j319q5Q70o21
9444a9901j852n79P69J01j75J924L675K420K78M2L70q96k302j545O51K699M611
9427i710N347K145l924o502k396K973L400Q16P22K724K286p94k471j569m73M36
9411f990L028O237O204K193k021l209j643Q81K519J320k779o293n792k469o8M61
9395h421P22Q40p4o29J150L680L778J880P43k2k690n349l360K456N300K052k136
9378h0j635J929L055J16l735n375m499k639j183l03M63M78j640m731m816p80K573
9361b2802J196j462J45M069L754q52l117q08R33q39k542j806j517k834k042J634
9345b8890K890o9p71M530Q726M497l426n408j162K277K651K857K315j836o368
$$ plain form
9461 -15961 -17886 -21642 -22316 -22052 -24562 -27425 -26200 -22297 -20379 -20721 -20193 -18698 -18746 -20065 -20150 -19280 -19901
9444 -19901 -21753 -22332 -21563 -21462 -21637 -19713 -16038 -13618 -13340 -13298 -12928 -13824 -16126 -17671 -17020 -14321 -9710
9427 -9710 -4363 -2218 -6142 -12644 -15040 -12067 -8667 -7851 -7129 -4405 -2119 -2913 -5384 -6953 -7426 -6990
9411 -6990 -3962 2275 8479 10672 8651 5442 3799 4680 7199 8519 5740 -553 -6345 -8814 -8882 -8421
9395 -8421 -7699 -6859 -6933 -7562 -6412 -2732 1046 2926 3669 3647 957 -4392 -7752 -5296 4 2056 -80
9378 -80 -1715 214 3269 3385 -350 -5725 -10224 -12863 -14046 -14349 -13886 -13408 -15048 -19779 -24595 -25375 -22802
9361 -22802 -21606 -23068 -22923 -18854 -15100 -15952 -19069 -19877 -18944 -19783 -22325 -24131 -25648 -28482 -30524 -28890
9345 -28890 -26000 -26069 -26840 -22310 -13584 -9087 -12513 -17921 -19083 -16806 -14155 -11298 -8983 -10819 -17187
9330a7187m897J015L191q6j682K067N789M651J243o54j868l376k683R61L364J798
9314h354m74p5J064L61m13O10Q94j577l338r76K256J373k116l247k063k139k924
9297b1138r44K413K167j057j003L515N559R11m876m845n62J721P63K46J457K008
9281a3665J063N82J064N64j152j413P81K206k41m579n661j382M688P162M402L0
9265e551j202J279L496K182j038k245o79Q42N85k3M95J176N99q57k074k590j694
9248g299J532N529O235K300j994k228j65m37k538j417L845P574N669J508M38K031
9232B0583J871j013k918j321J647K487Q85l44J046M146O140N574L620J857K77
9217D4537j323j651J0J500P44j00K281N653M081k550o804m046J068K176J50l78
$$ plain form
9330 -17187 -22084 -21069 -17878 -17964 -19646 -17579 -11790 -7139 -5896 -6550 -8418 -11794 -14477 -13516 -10152 -8354
9314 -8354 -8828 -8903 -7839 -7478 -7891 -7281 -6387 -7964 -11302 -12278 -10022 -8649 -10765 -14012 -16075 -18214 -21138
9297 -21138 -22082 -19669 -17502 -18559 -19562 -16047 -10488 -9577 -14453 -19298 -19860 -18139 -17376 -17130 -15673 -13665
9281 -13665 -12602 -12020 -10956 -10392 -11544 -12957 -12176 -9970 -10211 -14790 -20451 -21833 -17145 -9983 -5581 -5551
9265 -5551 -6753 -5474 -1978 204 -834 -3079 -3758 -2916 -2331 -2354 -1859 -683 -84 -941 -3015 -5605 -7299
9248 -7299 -5767 -238 5997 8297 6303 4075 3910 3473 935 -482 3363 10937 16606 18114 18552 20583
9232 20583 22454 21441 18523 17202 18849 21336 22221 21877 22923 27069 33209 38783 42403 44260 44537
9217 44537 43214 41563 41573 43073 43817 43717 45998 51651 55732 53182 46378 42332 43400 45576 45726 45348
9201D5348J067J983K529L838L577n28m749l609J337L580J559l70l34q86k252j265
9185E0825J530J224k842n044k952j547m226o605m329o58k88j010J562N191M363
9170C5194j34k218kK217J354r10k522m043o019p114o238m053j695J95J171J335
9154F518J525J848J243k21n54Q89J632p8k101j700K84J438J440Q91p45k758k121
9137G430J393K649j438n670l908Q66J196k565l267O84L117J205k19K065M246K966
9121A0750J005J142P47k581n449m059p70m1j454j920j577k287k743m34L043L581
9105c047P17j924j888k18J031Q25o97j916o55K515L577J21m650n800k901M75K052
9088a2383K395K197J333L46J86N02J00j141k204k088k17K805M153J055m431o188
$$ plain form
9201 45348 46415 48398 50927 54765 58342 57814 53065 49456 50793 54373 55932 55562 55228 54342 52090 50825
9185 50825 52355 53579 50737 45693 42741 41194 36968 30363 26034 25376 25088 24078 25640 30831 35194
9170 35194 35060 32842 32840 35057 36411 35501 32979 28936 22917 15803 9565 5512 3817 4012 5183 6518
9154 6518 8043 9891 11134 10913 10359 11248 12880 12802 10701 9001 9285 10723 12163 13054 12309 9551 7430
9137 7430 8823 11472 10034 4364 456 1322 2518 -47 -3314 -2630 487 1692 1473 3538 7784 10750
9121 10750 11755 12897 13644 11063 5614 1555 785 744 -710 -2630 -4207 -6494 -9237 -9671 -6628 -3047
9105 -3047 -2330 -4254 -6142 -6360 -5329 -4504 -5201 -7117 -7772 -5257 -1680 -1559 -6209 -12009 -14910 -14435 -12383
9088 -12383 -9988 -7791 -6458 -6112 -5926 -5424 -5324 -6465 -8669 -10757 -10974 -8169 -4016 -2961 -7392 -13580
9072a3580j831L406L713M29j113K66J352O78P7O72J425J431O06j158k851k055
9056h533J190K782M52j724M52L899L305O54J669M621K158n392q670l834J287J46
9040e538k410L98N293M802k2j757J216L134O58l032m364l505j659N36J057k095
9024g288o344n855O93P385Q147L603j150k994k540j361j26Q79J320J187Q69O46
9008b929L67l00j129j102L16J567J72l642o032l942P97L779L571K642K879K810
8992a76K63l837n819l152K377N789L839j011k936K66M291M014Q3k743k436j336
8976b524j214p04J184K397R86j429j886l84N55o5o75k43r0j462k821j387K700
8959g062N350K932k796n900l158J692K493j325m001j287L728M940J590j055N69
$$ plain form
9072 -13580 -15411 -12005 -8292 -7863 -8976 -8710 -7358 -6680 -6603 -5931 -4506 -3075 -2469 -3627 -6478 -8533
9056 -8533 -7343 -4561 -4109 -5833 -5381 -1482 1823 2477 4146 8767 10925 5533 -3137 -6971 -5684 -5538
9040 -5538 -7948 -7550 -2257 2545 2523 766 1982 5116 5774 2742 -1622 -5127 -6786 -6250 -5193 -7288
9024 -7288 -13632 -19487 -18794 -11409 -3262 341 -809 -3803 -6343 -7704 -7830 -6951 -5631 -4444 -3575 -2929
9008 -2929 -2562 -2862 -3991 -5093 -4777 -3210 -3038 -6680 -12712 -16654 -15857 -12078 -8507 -5865 -2986 -176
8992 -176 87 -3750 -9569 -12721 -10344 -4555 -716 -1727 -4663 -4397 -106 3908 3991 1248 -1188 -2524
8976 -2524 -3738 -4442 -3258 -861 125 -1304 -3190 -3574 -3019 -3084 -3759 -4002 -4092 -5554 -8375 -9762 -7062
8959 -7062 -1712 1220 -1576 -7476 -10634 -8942 -6449 -7774 -11775 -13062 -9334 -4394 -2804 -3859 -3290
8944c290L416K606j314l112m23K753J366m124q427p565k360L503O860O569L560
8929A8R1k240l929o002p375n675j000L308M656M012L424K695O65j645j817L16
8913a0498K242K207J116M10p1j041j972j849j098j151k060k047k44J389M64k031
8897a6234k524J23K711K243K80K98K303L202J841K50l28j141k839l702k300N37
8881a5280L326M954L661j395o558o003J11M160J069m344m404N16L594J753j604
8866a6444l026k573r31J856M123L471P05q78n22l95p19Q03L811M266O70k955k700
8849a1438N8J784J979K332K838J807j143m116m616j626L070N710M302J115m69
8834A587n55j300k205j180L90r64m042l730J87J437k683o198l657J344K367R5
$$ plain form
8944 -3290 126 2732 1418 -1694 -2117 636 2002 -2122 -10549 -18114 -20474 -16971 -10111 -3542 18
8929 18 109 -2131 -6060 -12062 -19437 -25112 -26112 -22804 -18148 -14136 -10712 -8017 -7352 -8997 -10814 -10498
8913 -10498 -8256 -6049 -4933 -4523 -4594 -5635 -7607 -9456 -10554 -11705 -13765 -15812 -16056 -14667 -14203 -16234
8897 -16234 -18758 -18635 -15924 -13681 -13401 -13103 -10800 -7598 -5757 -5507 -5835 -6976 -9815 -13517 -15817 -15280
8881 -15280 -11954 -7000 -3339 -4734 -11292 -17295 -17184 -13024 -11955 -16299 -20703 -20187 -16593 -14840 -16444
8866 -16444 -19470 -22043 -22974 -21118 -16995 -13524 -12819 -13697 -14219 -14614 -15333 -14530 -10719 -6453 -5783 -8738 -11438
8849 -11438 -11380 -9596 -7617 -5285 -2447 -640 -1783 -5899 -10515 -12141 -9071 -3361 941 2056 1587
8834 1587 1032 -268 -2473 -3653 -3263 -4227 -8269 -11999 -11812 -10375 -13058 -19256 -22913 -21569 -19202 -19107
8818a9107l34J487J603n21j014J890N471O597M406k85m753n049p82K680J103j897
8802h505l12M395N522K059k45J050J653p44j827J486M700K268l803o907m661l77
8786d248K447L088K242R25K95L00n31k475l358j926l90j015j842N90N061O176
8770E339J841l258l766q07K21j977k553J706O323M750j817n431k461J793J679
8755A582j047j783p34m57M30M348P717M540l281o863k852K172K180k92l97Q37
8739F100k41k749k939o33Q53L0j296j130P35L066L822J815j026j295R13J653p08
8722F970k579q41K148K528P14m31n45j056j588q19O37J399J734K075J308o46j240
8705I768L88O30l047o741n258k02K562J704Q93J574J335m83j300j99O43L78Q49
$$ plain form
8818 -19107 -19441 -17954 -16351 -16872 -17886 -15996 -10525 -3928 478 193 -4560 -9609 -10391 -7711 -6608 -8505
8802 -8505 -8817 -4422 1100 3159 2914 3964 5617 4873 3046 4532 9232 11500 7697 790 -3871 -4248
8786 -4248 -1801 1287 3529 4454 4749 5049 4518 2043 -1315 -3241 -3631 -4646 -6488 -5898 -837 5339
8770 5339 7180 3922 156 -651 -430 -2407 -4960 -3254 3069 7819 6002 571 -1890 -97 1582
8755 1582 535 -1248 -1982 -2439 -2009 2339 10056 14596 11315 4452 1600 3772 5952 5660 5263 6100
8739 6100 5859 3110 171 -462 391 421 -875 -2005 -1270 1796 5618 7433 6407 5112 6025 7678 6970
8722 6970 4391 3550 5698 8226 8940 8509 7964 6908 5320 4501 5138 6537 8271 10346 11654 11008 9768
8705 9768 10156 10786 7739 998 -4260 -4462 -1900 -196 697 2271 3606 3123 1823 1624 2267 2645 3494
8688C494K529L186J695l24j429j648p76J140J853n47l405k385J513K894M32j273
8672F949M41K166N48k368k907r07J576L305L355J037j700j313J998L787J999j24
8656A7842J88J162Q54P48J695J112j746k501J556N676M381L59J70L680M765J400
8640D1341j853j719k58N8l1L06j65j437o48L469P109N503n74m902k748L572O972
8623E3995L489l098n710k190L204O162O610N831L452j51k081r47K65j219l185
8608F4427k051J352L832N112O294N554J052l536k743J998L803O28k316j405O61
8593H2662R89J208K961M100L123K854N599Q200O345J175k476k577q30J277L552
8578A18162N027M378K608K688N786R300R310M782o36j712K359N998L704k269m283
$$ plain form
8688 3494 6023 9209 10904 10580 9151 7503 6727 7867 9720 9173 5768 3383 4896 7790 8222 6949
8672 6949 7390 9556 10104 7736 4829 3922 5498 8803 12158 13195 11495 10182 12180 15967 17966 17842
8656 17842 18030 19192 20046 20794 22489 23601 21855 19354 20910 26586 30967 31326 31496 35176 39941 41341
8640 41341 39488 37769 37511 37569 37538 37844 37679 36242 35594 39063 46172 51675 51101 46199 43451 47023 53995
8623 53995 57484 54386 48676 46486 49690 55852 62462 68293 71745 71594 69513 68566 68831 67612 64427
8608 64427 62376 63728 67560 72672 78966 84520 85572 82036 79293 81291 85094 85722 83406 82001 82662
8593 82662 83651 84859 87820 91920 95043 97897 103496 111696 118041 119216 116740 114163 113333 114610 118162
8578 118162 123189 127567 130175 132863 138649 147949 157259 162041 161405 159693 162052 168050 171754 169485 165202
8563A65202L85N968O424K731q37l425o300p936n797j847j338n677j0430j1158
8549A25965q283n174m015m735o207p148o757n230l304j420n4k52k361m386l514
8534F3125r5J410k699r736j1987n299M787Q214K027o257q404n096k448k203j099
8519B4240J335J249k033l396J98M358L669o39l525l370k231j527j491k698m510
8504I629m140p87J834Q17r74K52K390J064k361k793n3J301K92N81K577J860k516
8487H973m983k001K252K769J180J594L045J570k432m208j591K075K393j065m620
8472D951m362l87K789J431k216k658Q50L110J045j730j267K00j302l999k945J628
8456d862M251K401n64j339p92o14lJ872L233K264K80l97k22j436l943m881k537
$$ plain form
8563 165202 165587 171555 177979 180710 179873 176448 170148 162212 156415 154568 153230 147553 137123 125965
8549 125965 117682 112508 108493 103758 97551 90403 83646 78416 75112 73692 73638 73386 71025 66639 63125
8534 63125 63030 64440 61741 52005 40018 34719 39506 47720 49747 43490 35086 29990 27542 25339 24240
8519 24240 25575 26824 24791 21395 21593 25951 29620 28981 25456 22086 19855 18328 16837 14139 9629
8504 9629 5489 4702 6536 7353 6379 6631 9021 10085 7724 4931 4878 6179 6471 7052 9629 11489 8973
8487 8973 3990 1989 4241 7010 8190 9784 12829 14399 11967 7759 6168 8243 10636 9571 4951
8472 4951 589 202 2991 4422 2206 -452 398 3508 4553 2823 1556 1756 454 -3545 -6490 -4862
8456 -4862 -611 1790 1226 -113 -905 -1519 -1522 350 3583 5847 6127 5730 5508 4072 129 -4752 -7289
8439g289J337L775L701J913p44l705n697n169k173J182K771K230N01j262j812
8424a0441k75K275K959M20l022m195l046j752r54K95J454P06j508k320o29J351
8408a8682J740J394J476J336L47m67k22M33Q71J210P49j489l767k734J047K721
8392a4037N15j006J676M888L724J26q00L78q98m270m481m93K320P01j859j550
8376a5066k1m30j767r92J833L938L864K373M57j329k354k312j838j856k666l703
8360b1869l507p91L153M507J786q43J279N795N731m55o330o419k844o37p79j000
8344b3223m7J826L986M560J564k979l798O1K740J37l729l617j729k967n224k442
8328c4881M324P331L890k20n86J31r08j247J317L460J695j388j404O83Q34j157
$$ plain form
8439 -7289 -5952 -2177 1524 3437 2693 -1012 -6709 -11878 -14051 -12869 -10098 -7868 -7367 -8629 -10441
8424 -10441 -10716 -8441 -5482 -5062 -8084 -12279 -15325 -17077 -18031 -17736 -16282 -15576 -17084 -19404 -20033 -18682
8408 -18682 -16942 -15548 -14072 -12736 -12389 -12856 -13078 -12645 -11774 -10564 -9815 -11304 -15071 -17805 -16758 -14037
8392 -14037 -13522 -14528 -12852 -7964 -4240 -4114 -4914 -4536 -5434 -9704 -14185 -14678 -12358 -11657 -13516 -15066
8376 -15066 -15087 -15517 -17284 -18276 -16443 -12505 -8641 -6268 -5811 -7140 -9494 -11806 -13644 -15500 -18166 -21869
8360 -21869 -25376 -26167 -23014 -18507 -16721 -17564 -16285 -10490 -4759 -5214 -11544 -17963 -20807 -21444 -22223 -23223
8344 -23223 -23270 -21444 -17458 -12898 -11334 -14313 -18111 -18050 -15310 -15173 -18902 -22519 -24248 -27215 -32439 -34881
8328 -34881 -30557 -23226 -19336 -19556 -20142 -20011 -20919 -22166 -20849 -17389 -15694 -17082 -18486 -17803 -16969 -18126
8312a8126k074j035OL54P03J54k429m717l266O24K161L90p71N16J503R58J814
8295b3235M623M233j967p397m597K980N208K9m152j700K702K903N34L82J972J825
8279a5657M44O35J162j355n171m697M75L997J888k229l455k291j686j435L38K598
8263b6439K515Mk135k134q29L42Q11O18J48j02k07m57r6J912M276M082J212p64
8245a7243J31J161l68k353j416J247J783j83j721j740j549j000J131L078J484
8230a7558k359k785J885N863L675k324n500l419N64K493J576n15j616p08J064
8215a9664J434r4j483r89O07J536J278K62j175k425k607j843j084j21K204M975
8199a9189N130J992p94j80J860J651n58j692j218j468k954l068l93K643K925N86
$$ plain form
8312 -18126 -20200 -21235 -21229 -20875 -20172 -20018 -22447 -27164 -30430 -29806 -27645 -27255 -28026 -27510 -26007 -25049 -23235
8295 -23235 -18612 -14379 -16346 -23743 -28340 -25360 -20152 -20123 -24275 -25975 -23273 -20370 -19836 -19454 -17482 -15657
8279 -15657 -15213 -14578 -13416 -14771 -19942 -24639 -24164 -20167 -18279 -20508 -23963 -26254 -27940 -29375 -29037 -26439
8263 -26439 -23924 -23920 -26055 -28189 -29018 -28676 -27865 -27247 -27099 -27201 -27408 -27865 -27961 -26049 -21773 -17691 -16479 -17243
8245 -17243 -17112 -15951 -16319 -18672 -20088 -18841 -17058 -17241 -18962 -20702 -22251 -23251 -22120 -19042 -17558
8230 -17558 -19917 -22702 -20817 -14954 -11279 -13603 -19103 -22522 -21958 -19465 -17889 -18404 -20020 -20728 -19664
8215 -19664 -18230 -18324 -19807 -20796 -20189 -18653 -17375 -17113 -18288 -20713 -23320 -25163 -26247 -26368 -24164 -19189
8199 -19189 -14059 -12067 -12861 -13041 -11181 -9530 -10088 -11780 -12998 -14466 -17420 -20488 -20881 -18238 -15313 -14727
8183a4727j676k206j944k463l353k441Q52L482K229j131j294K868N694K571k982
8168a6521m341j449K9j635j725K416O198M482q08l926l361k215k118j400P13K287
$$ plain form
8183 -14727 -16403 -18609 -20553 -23016 -26369 -28810 -27958 -24476 -22247 -23378 -24672 -21804 -16110 -13539 -16521
8168 -16521 -20862 -22311 -22282 -23917 -25642 -23226 -17028 -12546 -13354 -17280 -20641 -22856 -24974 -26374 -25661 -23374
$$ [...]
##END NTUPLES=NMR SPECTRUM
##END=
