##TITLE=H1
##JCAMPDX= 6.0         $$ Bruker NMR JCAMP-DX V2.0
##DATA TYPE= NMR FID
##DATA CLASS= NTUPLES
##ORIGIN= UXNMR, Bruker Analytische Messtechnik GmbH
##OWNER= root
$$ XWIN-NMR		Version 3.5
$$ Mon Jan  4 09:52:09 2016 Russian Standard Time (UT+4h)  servis@DPX200
##.OBSERVE FREQUENCY= 200.131235884673
##.OBSERVE NUCLEUS= ^1H
##.DELAY= (6, 6)
##.ACQUISITION MODE= SIMULTANEOUS
##.ACQUISITION SCHEME= undefined
##.AVERAGES= 32
##.DIGITISER RES= 18
##SPECTROMETER/DATA SYSTEM= spect
##.PULSE SEQUENCE= zg
##.SOLVENT NAME= DMSO
##.SHIFT REFERENCE= (INTERNAL, DMSO, 0, 16.5164)
##AUDIT TRAIL= $$ (NUMBER, WHEN, WHO, WHERE, WHAT)
$$ ##TITLE= Audit trail, XWIN-NMR		Version 3.5
$$ ##JCAMPDX= 5.01
$$ ##ORIGIN= Bruker BioSpin GmbH
$$ ##OWNER= servis
$$ F:/spectra/data/servis-vadim/nmr/H1/1/audita.txt
$$ ##AUDIT TRAIL=  $$ (NUMBER, WHEN, WHO, WHERE, WHAT)
(   1,<2016-01-04 09:51:07.53 +0400>,<servis>,<DPX200>,
      <created by zg, POWCHK disabled, PULCHK disabled
       configuration hash MD5:
       00 E9 B6 7A A2 85 ED C7 34 08 36 98 17 FE 4E 26
       data hash MD5: 16K
       F9 49 4F 9B 67 CA 1B 6D 74 3D F2 71 39 01 98 6E>)
$$ ##END=
$$ 
$$ hash MD5
$$ 79 EA BE 57 73 E6 55 9D C8 E2 55 26 84 91 FE 84
##$RELAX= 
##$RELAX= 
##$RELAX= 
##$RELAX= 
##$RELAX= 
##$RELAX= 
$$ Bruker specific parameters
$$ --------------------------
##$DU= <F:/spectra>
##$EXPNO= 1
##$NAME= <H1>
##$PROCNO= 1
##$TYPE= <nmr>
##$USER= <servis-vadim>
##$AMP= (0..31)
100 100 100 100 100 100 100 100 100 100 100 100 100 100 100 100 100 100 
100 100 100 100 100 100 100 100 100 100 100 100 100 100 
##$AQSEQ= 0
##$AQ_mod= 1
##$AUNM= <au_zg>
##$AUTOPOS= <>
##$BF1= 200.13
##$BF2= 200.13
##$BF3= 200.13
##$BF4= 200.13
##$BF5= 500.13
##$BF6= 500.13
##$BF7= 500.13
##$BF8= 500.13
##$BYTORDA= 1
##$CFDGTYP= 0
##$CFRGTYP= 5
##$CHEMSTR= <none>
##$CNST= (0..31)
1 1 145 1 1 1 1 1 1 1 1 1 1 1 1 1 1 1 1 1 1 1 1 1 1 1 1 1 1 1 1 1 
##$CPDPRG= <>
##$CPDPRG1= <>
##$CPDPRG2= <>
##$CPDPRG3= <>
##$CPDPRG4= <mlev>
##$CPDPRG5= <mlev>
##$CPDPRG6= <mlev>
##$CPDPRG7= <mlev>
##$CPDPRG8= <mlev>
##$CPDPRGB= <>
##$CPDPRGT= <>
##$D= (0..31)
0 1 0 0 0 0 0 0 0 0.06 0 0 0 0 0 0 0.0002 0 0 0 0 0 0 0 0 0 0 0 0 0 0 
0 
##$DATE= 1451886666
##$DBL= (0..7)
120 120 120 120 120 120 120 120 
##$DBP= (0..7)
150 150 150 150 150 150 150 150 
##$DBP07= 0
##$DBPNAM0= <>
##$DBPNAM1= <>
##$DBPNAM2= <>
##$DBPNAM3= <>
##$DBPNAM4= <>
##$DBPNAM5= <>
##$DBPNAM6= <>
##$DBPNAM7= <>
##$DBPOAL= (0..7)
0.5 0.5 0.5 0.5 0.5 0.5 0.5 0.5 
##$DBPOFFS= (0..7)
0 0 0 0 0 0 0 0 
##$DE= 6
##$DECBNUC= <off>
##$DECIM= 32
##$DECNUC= <off>
##$DECSTAT= 4
##$DIGMOD= 1
##$DIGTYP= 9
##$DL= (0..7)
0 120 120 120 120 120 120 120 
##$DP= (0..7)
150 150 150 150 150 150 150 150 
##$DP07= 0
##$DPNAME0= <>
##$DPNAME1= <>
##$DPNAME2= <>
##$DPNAME3= <>
##$DPNAME4= <>
##$DPNAME5= <>
##$DPNAME6= <>
##$DPNAME7= <>
##$DPOAL= (0..7)
0.5 0.5 0.5 0.5 0.5 0.5 0.5 0.5 
##$DPOFFS= (0..7)
0 0 0 0 0 0 0 0 
##$DQDMODE= 0
##$DR= 18
##$DS= 0
##$DSLIST= <SSSSSSSSSSSSSSS>
##$DSPFIRM= 0
$$ [...]
##$SUBNAM0= <"">
##$SUBNAM1= <"">
##$SUBNAM2= <"">
##$SUBNAM3= <"">
##$SUBNAM4= <"">
##$SUBNAM5= <"">
##$SUBNAM6= <"">
##$SUBNAM7= <"">
##$SUBNAM8= <"">
##$SUBNAM9= <"">
##$SW= 20.6817932712277
##$SWIBOX= (0..15)
0 0 3 0 0 0 0 0 0 0 0 0 0 0 0 0 
##$SW_h= 4139.07284768212
##$TD= 16384
##$TD0= 1
##$TE= 0
##$TE2= 300
##$TE3= 300
##$TEG= 300
##$TL= (0..7)
0 120 120 120 120 120 120 120 
##$TP= (0..7)
150 150 150 150 150 150 150 150 
##$TP07= 0
##$TPNAME0= <>
##$TPNAME1= <>
##$TPNAME2= <>
##$TPNAME3= <>
##$TPNAME4= <>
##$TPNAME5= <>
##$TPNAME6= <>
##$TPNAME7= <>
##$TPOAL= (0..7)
0.5 0.5 0.5 0.5 0.5 0.5 0.5 0.5 
##$TPOFFS= (0..7)
0 0 0 0 0 0 0 0 
##$TUNHIN= 0
##$TUNHOUT= 0
##$TUNXOUT= 0
##$USERA1= <user>
##$USERA2= <user>
##$USERA3= <user>
##$USERA4= <user>
##$USERA5= <user>
##$V9= 5
##$VALIST= <valist>
##$VCLIST= <CCCCCCCCCCCCCCC>
##$VD= 0
##$VDLIST= <DDDDDDDDDDDDDDD>
##$VPLIST= <PPPPPPPPPPPPPPP>
##$VTLIST= <TTTTTTTTTTTTTTT>
##$WBST= 1024
##$WBSW= 4
##$XGAIN= (0..3)
0 0 0 0 
##$XL= 0
##$YL= 0
##$YMAX_a= 967344
##$YMIN_a= -1146076
##$ZGOPTNS= <>
##$ZL1= 120
##$ZL2= 120
##$ZL3= 120
##$ZL4= 120
##$ABSF1= 10
##$ABSF2= 0
##$ABSG= 5
##$ABSL= 3
##$ALPHA= 0
##$AQORDER= 0
##$ASSFAC= 0
##$ASSFACI= 0
##$ASSFACX= 0
##$ASSWID= 0
##$AUNMP= <proc_1d>
##$AZFE= 0.1
##$AZFW= 0.1
##$BCFW= 1
##$BC_mod= 2
##$BYTORDP= 0
##$COROFFS= 0
##$CY= 12.5
##$DATMOD= 1
##$DC= 2
##$DFILT= <>
##$DTYPP= 0
##$F1P= 11.0000006437302
##$F2P= -0.999999642372123
##$FCOR= 0.5
##$FTSIZE= 0
##$FT_mod= 4
##$GAMMA= 1
##$GB= 0
##$INTBC= 1
##$INTSCL= 1
##$ISEN= 128
##$LB= 0.3
##$LEV0= 0
##$LPBIN= 0
##$MAXI= 10000
##$MC2= 0
##$MEAN= 0
##$ME_mod= 0
##$MI= 0
##$NCOEF= 0
##$NC_proc= 0
##$NLEV= 6
##$NOISF1= 0
##$NOISF2= 0
##$NSP= 1
##$NTH_PI= 0
##$NZP= 0
##$OFFSET= 16.51637
##$PC= 1
##$PHC0= -107.5595
##$PHC1= 3.843713
##$PH_mod= 0
##$PKNL= yes
##$PPARMOD= 0
##$PSCAL= 4
##$PSIGN= 0
##$REVERSE= no
##$SF= 200.13
##$SI= 32768
##$SIGF1= 0
##$SIGF2= 0
##$SINO= 400
##$SIOLD= 32768
##$SREGLST= <1H.CDCl3>
##$SSB= 0
##$STSI= 0
##$STSR= 0
##$SW_p= 4139.07284768211
##$SYMM= 0
##$S_DEV= 0
##$TDeff= 0
##$TDoff= 0
##$TI= <>
##$TILT= no
##$TM1= 0
##$TM2= 0
##$TOPLEV= 0
##$USERP1= <user>
##$USERP2= <user>
##$USERP3= <user>
##$USERP4= <user>
##$USERP5= <user>
##$WDW= 1
##$XDIM= 8192
##$YMAX_p= 0
##$YMIN_p= 0
$$ End of Bruker specific parameters
$$ ---------------------------------
##NTUPLES= NMR FID
##VAR_NAME=  TIME,          FID/REAL,        FID/IMAG
##SYMBOL=    X,             R,               I
##VAR_TYPE=  INDEPENDENT,   DEPENDENT,       DEPENDENT
##VAR_FORM=  AFFN,          ASDF,            ASDF
##VAR_DIM=   8192,          8192,            8192
##UNITS=     SECONDS,       ARBITRARY UNITS, ARBITRARY UNITS
##FACTOR=    0.0002416,     1,               1
##FIRST=     0,             0,               0
##LAST=      1.9789456,     0,               0
##MIN=       0,             -1146076,        0
##MAX=       1.9789456,     967344,          0
$$ Real data points
##PAGE= N=1
##DATA TABLE= (X++(R..R)), XYDATA
$$ [...]
3049b1767N717J6755J6227O095p567j5420j3860k167J1005J6619J1438o53j3069
3062I353j7537j0774K858J3296J4806O390o565j6591j5002m377Q391J6292J3772
3075A4312J812j0764j5890j0147J532J3777J7034Q804l452j4038j5145o230P031
3088a1364J5772J3525L272r087j6332j2428n48J1615J6017J0317j537j3565j5900
3101a0243p551M526J4028J4733N026q595j5966j3817l431Q991J5635J1000o69
3114A3667j1658j6013r424L186J3871J5512P678m559j3798j3407l018Q954J5971
3127F962J3693K828r747j5227j0628R36J1612J4757P621m614j4801j5758p285
3140a9651M887J3881J2666K832q585j5443j2021r04J0967J5712J0497j098j1692
$$ y = [-21767, -16050, 705, 16932, 23027, 15460, 40, -13820, -15987, -4982, 11637, 23075, 22422, 9353, -8184, -18958, -16100, -2804, 12002, 18392, 11827, -4764, -19766, -24143, -15752, 540, 14312, 16124, 5360, -10530, -20677, -19145, -5368, 11666, 20470, 17018, 2980, -12165, -18395, -11364, 4408, 17933, 21205, 12118, -4214, -16642, -17190, -5575, 10442, 20759, 19222, 5657, -10243, -17794, -13268, 760, 15493, 20519, 11924, -4042, -17859, -21290, -12299, 3336, 14336, 13667, 2009, -14004, -23428, -20242, -6371, 9141, 16819, 12260, -1538, -14945, -17963, -9009, 6962, 20655, 23483, 13736, -1491, -12119, -11183, 429, 15186, 22807, 18193, 3392, -12366, -19651, -14764, -883, 11783, 14615, 6030, -9413, -21434, -22338, -11371, 4341, 14838, 13740, 2048]
3153B048j4266p164M979J3986J4699O344o556j4470j2771k508Q548J4861J1051
3166A8781r0j1226j5186r492K046J2607J4582P031m931j3088j3839m741P369J4370
3180D193J1996J934r481j5136j0776N66J0757J4099Q716l473j3410j3792o173
3193a9980M726J3675J3240L466p901j3659j1268j105J0083J5638R960l97j0573
3206E905j3813p333M385J3376J3380N634n714j4020j2752k978P498J3515J0668
3219A7751J59j1031j5020r420J177J0908J3030O639n402j2929j3098n138O682
3232a5692J4022J2330K566p658j3304r285J158J1346J4429Q942j551j1650j2937
3245g284n937N033J2419J2537L404p289j3739j1615k262Q624J3194R312j558j1068
$$ y = [2048, -12218, -19382, -14403, -417, 14282, 20626, 14070, -400, -13171, -15679, -7131, 7730, 18781, 18691, 7465, -7721, -17213, -15167, -2560, 12022, 19053, 14122, 1034, -12805, -17546, -10177, 4193, 16189, 18123, 8642, -6494, -17270, -16704, -5947, 8152, 16868, 13395, -15, -13807, -19980, -15254, -1579, 11661, 15127, 7226, -6433, -17701, -18806, -8723, 6915, 16875, 16478, 5905, -7908, -15241, -10856, 2520, 15900, 21534, 15820, 1800, -10952, -13930, -6432, 7083, 17751, 17910, 6879, -8141, -17561, -16384, -5476, 7554, 14193, 8791, -4138, -17236, -22374, -15692, -1670, 10660, 13226, 5568, -7736, -17021, -15863, -4517, 9912, 18854, 17303, 5653, -7284, -13221, -8188, 4231, 16768, 20172, 12883, -856, -12471, -14733, -6109, 7085, 16397, 14839, 3771]
3259C771j3885p696K776J1980J3089M882n398j3107j2444l030P493J2899J0690
3272A2020R90r129j3813q284J982J1085J3746P818l562j1433j1829l802O374J3662
3286E825J1845K784p684j2718r784n33R595J2687P151l031j1911j4213p215L222
3300a3980J0572J0908L010p155j3490j0614j529Q321J3783J0304N43q730j1308
3313i365n996M140J2727J3489O549m648j1372j1224l704O406J2533Q611J51r426
3327H871j4123r688K26R121J1318O326l646j1604j1817m346N301J2382J1461K973
3341A2755o990j1617q977j78R255J3457P973j660r716j1859o279M134J1577J1023
3355A2898L891n836j1911j0511k224P574J2105Q745j14r384j2199p183J830J0025
$$ y = [3771, -10114, -17810, -15034, -3054, 10035, 14917, 9519, -3588, -16032, -19062, -11569, 1330, 12020, 13010, 3881, -9932, -18216, -16234, -5149, 8597, 16415, 12853, 1420, -10409, -14211, -7837, 5825, 17670, 20454, 12770, 52, -9732, -10265, -670, 12017, 19168, 16137, 4226, -9987, -17202, -13980, -3408, 7500, 10510, 3355, -10135, -20749, -22278, -13957, -174, 10130, 10673, 1943, -9365, -15361, -11221, 1506, 14995, 21544, 16896, 5524, -5700, -9404, -2998, 9535, 18146, 18297, 8871, -5252, -14940, -14714, -5593, 5725, 12051, 8405, -3199, -15016, -19362, -14061, -1679, 9782, 12755, 5765, -5852, -14829, -15007, -5752, 7705, 15678, 14018, 4302, -7557, -13836, -9702, 1875, 12898, 16789, 10953, -958, -11469, -13693, -6119, 5986, 14731, 14617, 5233, -6966, -14149, -12319, -2294]
3369b294J1825M951m753j1831j1171m006N960J1941R942Q46p424j1933p945J419
3383a4473J0248J2484O901j985r984j0940m157N446J1183J0314K655o621j2434
3396a363r638j501P585J1195O888k437j0197j2005o180K520J0612J1440M056m676
3410F299j0555r372j406Q017J2458R307O96q055j1413o718K035R560J0852N130
3424A6835m249j1345j0598l783M902J0599R412P43p626j1735q117L3Q553J1341
3438D965O572k640r552j0607m749N153J0986J0012L481n324j1099q482l77P661
3452d000J1266P652q39q792j1271n738K656R846J0360L899n240j0788r637k681
3466a3307O092J1008P920N9q308j1142p355J557Q892J0326N366l236r851r701
$$ y = [-2294, 9531, 14482, 9729, -2102, -13273, -17279, -11319, 622, 10564, 11410, 3986, -7947, -15892, -14473, -4225, 8259, 15160, 13175, 3191, -7749, -11906, -6460, 4723, 15037, 17692, 11071, -1363, -11001, -12502, -4917, 6278, 13166, 10729, 532, -11473, -17653, -15133, -4521, 6919, 10975, 6299, -4256, -13628, -15034, -7017, 5441, 14748, 15444, 7389, -4024, -10742, -8707, 853, 11705, 16835, 12586, 1241, -9357, -13140, -8238, 2361, 11773, 12516, 4890, -6845, -14962, -14929, -6376, 4965, 11537, 8897, -655, -11262, -16011, -10858, 128, 10140, 13621, 8297, -2802, -11284, -11661, -4000, 7266, 14918, 14079, 5287, -5984, -11722, -9066, 780, 11140, 15039, 9799, -989, -10626, -13307, -7215, 3793, 11713, 11772, 3464, -7678, -15033, -13476, -4584, 5742, 11108, 7872, -1979, -11680]
3480a1680l064N541J0550R812K313o640j0194p033K39Q310J0864O457k267r170
3494D038j0482n268L739R732R050K220n497j1055q868j279O957J0146P071n48
3508I956q649j0148n539K497R326J0155M398m040r558q931j850N855J0984Q118
3522A2574O24p105r897o828J152Q349R914M819l182r472j0226l597M329R723Q158
3537I335J939o300j0325p445K49P283J0322O802j693q595r281m215L321R663R519
3552A0579K879n050r549q417j528O504R603O548n63q002j0444n478J809Q661R154
3567F706M316l813r381q293k019N313J0117Q040Q69o499r353o459J205P911R910
3582H570M620k519q658r087m437M387R137P800J546n630j0186p507K0O562R660
$$ y = [-11680, -14744, -9203, 1347, 11159, 13472, 6832, -3362, -10395, -10156, -1846, 9018, 15475, 13208, 4038, -6444, -11712, -7973, 1759, 10809, 13029, 7532, -3523, -12391, -13670, -6713, 3433, 10504, 9956, 1307, -8841, -14380, -11883, -2557, 7598, 11996, 7956, -1602, -10533, -12383, -6528, 4456, 12574, 13198, 6093, -3804, -10632, -9480, -1131, 8783, 13602, 10420, 948, -9278, -12875, -8546, 1177, 9335, 11274, 4974, -5351, -12796, -12547, -5264, 5058, 11860, 10167, 1572, -7709, -11924, -8603, 1060, 10579, 13458, 8408, -1141, -9558, -11086, -4582, 5021, 11569, 11006, 3004, -7440, -12918, -11109, -2448, 6706, 11022, 7209, -2172, -10465, -12484, -7171, 2946, 10986, 11855, 5356, -3997, -10456, -9251, -1340, 8570, 13190, 10671, 2013, -7074, -11511, -7124, 2013, 9813, 11359, 5729, -4457, -11964, -11944, -5382, 4278]
3597D278N937j483p952r113m090L009Q455R391K897m594r206p608j423O014R677
3612D189O776k49o569r105n545J737Q654Q838M396l314q668q600k296M842Q565
3627C651P303P21o649r728o568J73O697Q976M530k663q200q600l543L694R095
3642a111Q242K148m471q332o657j02P372R484N999o62o966q736m080K681P576
3657B385Q121K971m366r870p461k276M721Q516O209n63o729q925n602J436P821
3672c612Q694L958k629p872q003k228M904Q974O941J473n387q816n844R21O560
3687a966Q656N016j880p557q215l477L097Q018P675J729m924q363o757r40N743
3702d145Q659N326j084o774q484m948K471P491P351L229l163q592o988j670N275
$$ y = [4278, 10215, 8732, 780, -8333, -12423, -9414, -959, 8432, 11329, 6735, -2471, -10079, -11502, -5488, 4189, 10965, 10716, 4147, -4958, -10503, -8766, -112, 8726, 13122, 9808, 1140, -7460, -9756, -4914, 3651, 10954, 11675, 5026, -4702, -11270, -11097, -4400, 4576, 9106, 6443, -1757, -10357, -13900, -10206, -1111, 7131, 9279, 4808, -3524, -10181, -10283, -2911, 6573, 12572, 11910, 4944, -3792, -7872, -5191, 2385, 10506, 13477, 9111, -759, -8220, -10496, -5775, 2741, 8950, 8387, 1658, -7267, -12869, -11433, -3612, 5082, 9040, 6411, -1461, -9464, -11692, -6788, 2186, 9127, 10600, 5213, -3603, -9447, -8526, -1966, 6690, 11706, 9826, 2269, -5946, -9423, -6326, 1692, 9367, 11096, 6172, -2191, -8948, -9888, -4145, 4514, 9840, 8756, 1982, -6502, -11450, -8979, -1488, 5863, 9092, 5929, -2663, -9651, -11321, -6046]
3717f046Q433O512O81o171p981n010J491O875Q379L935k692p362p604k817L828
3732e549Q159O742Q62n062q364o172Q3O089P831M865j595p017p848l164K941P167
3748c2P607J966m027q316o008r45N110Q223N701q93o506p518m469J975P450P267
3764F585K915k781p442p257j202M568P690O095N74n558p914m722R02O425P567
3779F445L978k513p444o974k708L166P409O306J252m875p646o064L44N308P705
3794C689M716j166o472p611l447K881P101O987K399l590p564n790q72M884Q098
3809D243N593n22n449p345m279J684O578P214K634l125p240o655k464M410O874
3824B151N235N65n168p770n204R14N749P111M064j956o397o736k033K879P243
$$ y = [-6046, 2387, 8899, 9580, 3409, -4572, -9582, -8091, -1216, 7163, 11098, 8406, 1044, -6560, -9377, -5549, 2610, 9352, 10214, 5152, -3212, -9384, -9301, -3212, 4619, 9484, 7889, 872, -6976, -10140, -7199, -32, 7575, 9541, 5514, -2802, -8810, -9755, -4645, 3578, 9279, 8386, 1880, -5638, -10107, -8132, -682, 6585, 9500, 6719, -723, -7980, -9182, -4614, 3076, 9171, 9745, 4187, -3727, -8449, -7547, -1122, 6445, 10423, 7910, 466, -6508, -9216, -6050, 1359, 7665, 8917, 4042, -3604, -9668, -9324, -4016, 3689, 8405, 7239, 767, -6844, -10291, -7410, -309, 6678, 9077, 5487, -2077, -7867, -8739, -3855, 4243, 9836, 9314, 3865, -3480, -7759, -6075, 503, 7717, 10351, 7226, -14, -6669, -9133, -4723, 2151, 7386, 7951, 2783, -4987, -10191, -9277, -3528, 3583, 7647, 5691, -706, -7442, -9475, -6596, 647]
3839F47O692J741m296o653n154k16N684P098M802j424n760p096l788K162O628
3854A067N882J993l617p107o084j279M291O742N140k35n464o831l853J211O073
3869b071P017L130k795n972o215j838L842P264N489P75m132p069m797O72N698
3884a002O542L556j613o348o574k793K878O318N688J503l867p228n210k46M669
3899c727O786M322r02n787o482l207K008O025O624K215k734o227n526j033M473
3914c172O743M768K12m921o831l842J310N074O333K846k436o640o083j944L111
3929e472O300N390M03m355o180m704M62N207O719L270r61n454n945k531L014O332
3945A495N354J785l303o351m680o72M322O354M046j028n302o365l408J406N426
$$ y = [647, 7339, 9080, 4784, -1869, -7023, -7239, -1555, 5543, 10345, 8921, 3161, -3935, -7723, -5561, 1067, 6949, 8942, 5325, -1782, -7866, -9145, -4854, 1888, 7028, 6793, 1329, -5502, -9355, -8144, -2071, 4946, 8076, 5281, -691, -6906, -8744, -4902, 2362, 7851, 8626, 4494, -2575, -7372, -6700, -1002, 5540, 9096, 7483, 1135, -5439, -8232, -5354, 964, 6652, 8155, 4288, -2940, -8150, -8396, -3727, 3059, 7381, 6479, 692, -5790, -8997, -6989, -964, 5660, 7875, 5141, -1086, -6612, -7645, -3172, 3571, 8339, 8551, 3630, -3201, -7043, -5733, -659, 5674, 8520, 6084, -556, -6639, -8583, -5472, 828, 6218, 6621, 2266, -3914, -8618, -8156, -2949, 3770, 7040, 6079, 625, -5320, -7851, -4837, 1495, 6849, 8634, 5331, -1020, -5700, -6372, -2050, 4304, 8350, 7322, 2020, -4345, -7753, -6347, -921]
3960i21N619K254l066o031n069j410L719O453M743k5m194n918l750J199N671N860
3976E134K801j712n905n539j371K908N577N119R89m118o082m118j42M445O064
3991D050L542j647n237o068k609K422N619N015J511l275n634n142j16M032O086
4006B549M163p18m391n595k975J520N415N347K765k567n657m938j250L269N830
4021B767M641k19m003n985l935O41M740N492K240j612n425n317j983K928N172
4036A42M708J298l465n724l532QM358N655L586r85m608n375k464K043N271N130
4052F046J233k693n290m722r96L778N466L529m29m145n801l141J726M594M876
4067D031K518k389n441m438p70K508N698M278M06l689n415l630N19M352N455K623
$$ y = [-921, 4698, 6952, 3886, -2145, -7214, -8624, -4905, 1548, 6291, 6266, 2072, -3846, -7596, -6397, -726, 5134, 7935, 6223, 318, -5221, -6592, -3684, 1893, 7012, 8001, 3883, -2199, -6317, -6459, -2014, 4050, 7592, 5945, 708, -5360, -7969, -5547, 72, 5087, 6598, 3323, -2311, -7453, -7569, -3537, 2549, 6712, 5994, 1603, -3992, -6967, -5447, -32, 5315, 8080, 5513, -144, -5082, -6332, -3063, 2767, 7408, 7189, 3186, -2799, -6734, -6093, -1353, 4139, 6379, 4767, -658, -5975, -7958, -5030, 142, 4850, 6148, 2683, -3041, -6573, -6565, -2207, 3448, 7034, 6049, 1441, -3934, -6398, -4355, 916, 6046, 7279, 4586, -704, -5426, -6422, -2644, 2822, 6351, 5922, 1777, -4024, -7165, -5439, -845, 4031, 6549, 4160, -1281, -5719, -6489, -3981, 1717, 5995, 6401, 2712, -2703, -6333, -5814, -1462, 3993, 6616]
4083F616j412m675n249j844K531N276M171R84l292n412m128K35L885N099L343
4098F128r61m248n103k362J829M914M887J490k677m858m306n98L395N192L617
4113F339l70l979m910l358J108M491M655K093k177m772n024r75K893M855M300
4128E169K43l447m829l337M06M260N180K595j194m498m293k102K223N044M141
4143E561J099k811n287l569m39L649M832K946l86m312n214k248J666M394M467
4158D348J449k701m576l908q44K979M716L638k87l423m749k881J082M231M715
4173C789K230j722m190m366j283K766M860L792L30k902m832l127M57L307M621
4188C730K449j334m253m601k263J846M015M115J087k922m683l381j81L190N068
$$ y = [6616, 5204, 529, -4720, -6564, -4033, 1243, 5414, 6398, 3106, -2306, -6434, -6199, -2314, 2785, 6128, 5167, 919, -4184, -6546, -4717, 197, 5084, 6574, 3897, -961, -5267, -5865, -2470, 2722, 6339, 5969, 1990, -2920, -6278, -5170, -679, 3976, 6069, 3892, -880, -5904, -6879, -3986, 869, 5169, 5412, 1965, -2864, -6201, -5795, -1535, 3645, 6240, 5046, 548, -3745, -5847, -3624, 1420, 5561, 6660, 3849, -1438, -5007, -5446, -1797, 3035, 5981, 5595, 1283, -3931, -6179, -4513, -119, 4348, 5797, 3096, -1480, -5388, -6232, -3253, 1463, 5101, 4814, 1391, -3358, -6239, -5157, -926, 3789, 6019, 4297, 107, -4259, -5542, -2776, 2084, 5876, 6206, 3304, -1528, -4655, -4198, -891, 3730, 6179, 4845, 592, -4009, -6272, -4426, -411, 3704, 4791, 1869, -2814, -6195, -6376, -3186, 1882]
4203A882K837l43l601m001k203J648M194M127K059k209m197l935m83K410M389
4218B574L306l95l526m667k677N69L614M247J740j533m100l980j318K435M266
4233E55L515O42k495m298l137K78L553M421K609r97l654m436j762J878M024L617
4249D313J385k621m459l047k99K708M393K852m74l098m330k321Q37M260L436J630
4265E165j798m209l812r91K747M114K780M56l092m433k327Q95L377L943K274j326
4281C763l686l574j405K165M154L339O26k717l804l129J25L013L997J978p02l197
4297I46m254j779J685L543L418R56k081m178k956j41K539L994K767j55l274l532
4313b502k153Q41L828L687J375j538l887l263r18K164L860K833J76k702m045k485
$$ y = [1882, 4719, 4376, 775, -3226, -5429, -3781, 413, 4540, 6599, 4390, 193, -3742, -4225, -1815, 2574, 5880, 5485, 1959, -2708, -5385, -4816, -1202, 3045, 4785, 3252, -848, -4828, -6146, -3711, 555, 4070, 4712, 2217, -2081, -5218, -4940, -1387, 3034, 5643, 4646, 992, -3444, -5206, -3328, 696, 4313, 5698, 3077, -1382, -4429, -4728, -2020, 2373, 5225, 4751, 1653, -2677, -4998, -4161, 99, 3535, 5165, 3367, -842, -4654, -5645, -2898, 1216, 3996, 4452, 1360, -3073, -5400, -4505, -1128, 2815, 5089, 3763, 77, -3497, -4902, -2737, 1417, 4756, 5382, 2665, -1139, -4268, -4143, -1130, 2867, 4845, 4143, 946, -3308, -5087, -3402, 141, 3559, 4515, 2434, -1744, -4700, -4841, -2302, 1692, 4459, 4304, 1030, -2502, -4655, -3814, 14, 3701, 5076, 3538, -349, -3612, -4530, -2366, 1494, 4327, 4503, 1801, -2244, -4729]
4329d729M17L137L629K093j145l585l442j165J702L703L423M37k164l602k733
4344d024l4K795L943K084p36k818l847k030J314L788K887R59j794l966l005k88
4360d772K456L600K539l8k736l321k133O50L452L463J569j487l375l138r48J828
4376b391L798K754o7k422l515k310J99L189L248J612r88l038l206j139J393L375
4392D92L112N57k006l312k642n0K391L559K216q79k759l271j673J167L322K728
4408B952R42j588l356k802q5J846L454K442K05k548l389j801O43L125L177J705
4424D922j698l524k811j000J684L332K235K48k257l123k220J84K795L096K030
4439C893q97k780k861j269J510L369K510Q86k082l326k091k31K218L091J948n85
$$ y = [-4729, -4312, -1175, 2454, 4547, 3402, -183, -3625, -4790, -3088, 615, 4038, 4475, 2311, -1291, -4024, -4058, -1263, 2680, 4764, 4028, 1210, -2637, -4667, -3353, 435, 3322, 4281, 2487, -1479, -4484, -4772, -2316, 1284, 3823, 3785, 1049, -2272, -4405, -3755, -303, 3160, 4729, 3242, -133, -3271, -4219, -2391, 1407, 4161, 4094, 1672, -1843, -4153, -3954, -765, 2483, 4095, 3107, 69, -3137, -4276, -2883, 492, 3604, 4161, 2155, -1157, -3799, -3849, -1458, 2101, 4317, 3438, 679, -2592, -4265, -3098, 224, 2952, 3894, 2306, -1050, -3852, -3937, -2091, 1363, 3805, 4010, 1462, -1927, -3728, -3085, 40, 3217, 4922, 3224, -300, -3111, -4111, -2427, 905, 3140, 3388, 1131, -1992, -4212, -4028, -1233, 1863, 3893, 2996, 216, -2645, -3914, -2404, 965, 3475, 4361, 2279, -1047, -3138, -3369, -1151, 1940, 3888, 3303]
4455C303k709l346j213Q20K699K834J237j540l106k548m79K163L337K072J25k342
4471A307l147j801P81K367L328J089j232l002k781o16J282K722K812L95k383l050
4487a929j772J33K445L482J435q95k572k510j068R59L120K330N44j517k970k232
4503c017m73J977K690K013m45k273l050j526J006K433L127J050j194k787k309
4518b778n10J831K943K198j22j935l125j599L06K221K849R87q54k924k584o54
4534c750J625K483K425M96j930k854j795M13K137K636J515n08k147k863j010R67
4550b160K355K564P44j525k731k407M4J822K589J897n18j930k786j516R99K384
4566a75K350R77j020k766k083l69J312K860K015J55k105k637j451K38K191K467
$$ y = [3303, 594, -2752, -3965, -3145, -446, 2388, 3625, 2085, -1021, -3569, -4048, -1885, 1452, 3524, 3649, 1307, -1840, -3641, -2860, -493, 2835, 3924, 2692, -310, -3091, -3707, -2425, 297, 3109, 3504, 1121, -1929, -3701, -3568, -1123, 2359, 3794, 2899, 327, -2183, -3251, -2292, 828, 3158, 3702, 2185, -785, -3017, -3490, -1513, 1177, 3190, 2745, 472, -2578, -4104, -3098, -665, 2462, 3512, 2318, -469, -2778, -3288, -1457, 1486, 3684, 3562, 1627, -1498, -3097, -2791, -570, 2279, 3266, 2412, -512, -3096, -3750, -2125, 358, 2783, 3279, 1349, -1505, -3300, -2887, -750, 1886, 3401, 2893, 746, -2117, -3127, -2160, 195, 2759, 3503, 1978, -753, -3160, -3116, -1294, 1295, 3192, 2674, 744, -2042, -3558, -2559, -175, 2175, 3152, 2132, -634, -2717, -3086, -1774, 1086, 3101, 3256, 1151, -1486, -2937, -2699, -508, 1959]
4582A959J352r74k469k325p56J365K283J952N62j693k365j720k08K136K454J504
4598C057l28k439k109j009O41K460K372N14j383k328k091k87J578K705J375J02
4614B830k049k674j258N86K093K293J092j366k012k168l54J394K400K058j53j328
4630A384k491j329L73K064K100J440r82k304k175q28Q97K099J735O15j454k507
4646a363j616N7J420K591J417l03j949k162q42J091J908K423N18j363k230j588
4662a991k76J324K088J564l64j783k278j382N48J959K271N13o33k058j838m35
4678b771J465K056J953K70j502k289j284O7J822J981J104q65j776k374p91Q54
4694b080K032J880K35j518j818j604K45J430K209J539j46j490j875j048Q85J855
$$ y = [1959, 3311, 2337, -132, -2457, -3213, -1848, 435, 2387, 2949, 1256, -1109, -2829, -3037, -901, 1553, 3057, 2729, 290, -1819, -2828, -2187, 273, 2645, 3159, 1776, -552, -2643, -2930, -1352, 1353, 2728, 2830, 781, -1893, -3151, -2565, -472, 1821, 2913, 1547, -465, -2633, -2987, -1593, 807, 2865, 2712, 1384, -1107, -2436, -2063, 1, 2101, 3541, 2559, 255, -1920, -2748, -1851, 248, 1983, 2598, 1144, -1363, -2979, -2922, -1502, 1089, 2506, 2203, 254, -1908, -2750, -1659, 249, 2672, 3190, 1827, -403, -1991, -2267, -943, 1145, 2709, 2345, 562, -1716, -3098, -2550, -591, 1680, 2193, 1560, -498, -2336, -2771, -1306, 750, 2703, 2973, 1471, -818, -2102, -2035, -213, 1768, 2872, 2007, 231, -2143, -2934, -2080, -48, 1832, 2067, 549, -1269, -2873, -2628, -1198, 1011, 2550, 2404, 914, -961, -2009, -1124, 731]
4710G31J859P96j417j971j975l54J077J887J425n31j627j994r88M13J982J841
4726A154R86o36j644j597m55J198K159J667Q6j319k063j536J13J686J747R02o39
4743A809j920j889o19P11J832J508Q61j257k032j280K7J663J964J311m71j420
4759G98j742j175L88J833J713L13r26j836j630k76Q85J965J420k21j376j616q57
4776b340J43J702K276Q80p26j481j651n20R99J800J358J9j380j755j482N1J428
4793f79J631M44l57j324k014m37J041J653J412N93j080j535j036p3J464J568J386
4810B657p86j083j634q06J89J725J417l0n15j565j549m97J204J604J413k28j052
4827D64j642r21N07J346J568P62m06j706j250m66Q00J576J265K1j473j254j223
$$ y = [731, 2590, 3386, 1969, -2, -1977, -2331, -1254, 633, 2058, 1527, -100, -2094, -3082, -2669, -687, 1154, 2140, 1504, -140, -1737, -2192, -994, 1165, 2832, 2918, 1599, -464, -2000, -1887, -201, 1546, 2448, 1809, -111, -2000, -2619, -1908, -76, 1432, 2293, 1036, -996, -2276, -2249, -586, 1378, 2689, 2218, 798, -944, -2119, -1731, 102, 1815, 2128, 1202, -634, -2264, -2540, -1655, 310, 1730, 1509, 133, -1483, -2340, -2197, -495, 1781, 2661, 1935, 454, -1197, -1717, -718, 1082, 2440, 2459, 1079, -676, -2158, -2107, -679, 952, 1396, 1039, -285, -2299, -2736, -1695, -42, 1370, 1963, 883, -652, -1688, -1761, -297, 1271, 2657, 1871, 788, -846, -1652, -1463, 262, 1679, 1649, 1134, -431, -1980, -2477, -1273, 331, 1744, 1516, 464, -1178, -2099, -1592, -246, 1322, 2084, 1678, -28, -1278, -1744, -944, 632, 1897, 1918, 445, -809, -2032]
4844b032j52J444J422Q83l09j247j552o22J015J487J398M18q01j664j121L6R70
4861d27J726O18m7j392j668p44J56J712J280K76p06j232j323k63J056J201J107
4878A330K55j106j332q00J78J442J148P45l11j292j495m56Q69J360J046K77j202
4895F56j740n57K02N86J619P40l06j254j340k85P22J180J267K72p65j340r24j73
4913a440Q60J564M21L16j108j628n08L56J033J290L91q49j108j054l13O96J269
4930A88J024J29r65j466n87L79J137J222O57l96j379q45m86Q37J430O83K20q56
4948I26j346q55Q2J008R86O32k43j430j104l98M06R97J456P8m07r71j231k94J166
4967e42J383L23P6o85j373o56L60J182J071K62l26j341j109J44N56J257N63J92
$$ y = [-2032, -2184, -740, 682, 1565, 1256, 9, -1543, -2165, -1150, 337, 1735, 2153, 1352, -312, -1433, -1397, -427, 1299, 1917, 1870, 478, -1190, -1934, -1778, -66, 1214, 1490, 784, -448, -1771, -2034, -978, 223, 1330, 1585, 479, -853, -1653, -1475, -33, 1115, 1860, 1549, 257, -1238, -1694, -825, 535, 1581, 1858, 656, -1084, -1641, -1439, -853, 766, 1506, 1200, -54, -1394, -1679, -957, 223, 1490, 1762, 997, -343, -1267, -1440, -580, 984, 1405, 1721, 613, -1015, -1523, -1167, -134, 1156, 1547, 698, -410, -1464, -1777, -1081, 188, 1212, 1341, 376, -1090, -1677, -1298, -161, 1061, 1718, 1322, -57, -902, -1388, -551, 879, 1562, 1782, 926, -420, -1275, -1193, -185, 801, 1433, 1190, -240, -1344, -1742, -1336, -339, 1117, 1195, 788, -183, -1414, -1708, -542, 841, 1164, 1240, 555, -818, -1474, -1114, 68, 1139, 1401, 1075, -266, -1375, -1231, -675, 582, 1145, 1337]
4985A337p85j109n06J55R52J069N16m11j200q13m21M60J155P06l0o35j282p89
5003a631J35P85J253L97j31q21j156l62M92J163J103K30n42r71q01O4Q33J139
5021A179M52n6r35j074n47L5J124M61M46n04j012p67o22J289M00P04J49o39r90
5040i07m14K86J040J042L69m76p20q00j94J98J099Q93j68m06j232m86j33M69J228
5059F88L06O5r72j107m25O20Q22P71K54m16j130p05K2N77J024N59k51n62q30l92
5079a082L46O94Q04M40n48n67o82m73P31J063N27j85n51q22o12R5M59J073L67
5098A077l66p14p59k02K73Q96M88k6n12p03p17O6Q29P64O56l74n81q53j67L95
5118e30N55Q96J68m03p77n21k92N90Q63O47j98o26q47l87L29M45R58K4l88r34
$$ y = [1337, 552, -557, -1063, -908, 44, 1113, 1629, 1218, 18, -795, -1216, -756, 399, 1105, 1075, 440, -842, -1631, -1496, -711, 542, 939, 808, -13, -1169, -1531, -1039, 124, 1227, 1457, 915, -56, -857, -793, 40, 1179, 1631, 1575, 640, -434, -981, -946, 178, 639, 1085, 581, -431, -1198, -1820, -531, -131, 573, 722, 83, -907, -1321, -1035, 5, 1047, 1416, 940, 220, -580, -774, -576, 523, 1416, 1248, 842, -390, -876, -1009, -540, 688, 994, 1059, 87, -1020, -1445, -825, -3, 768, 1022, 606, -524, -1229, -1207, -630, 394, 953, 702, 140, -690, -1082, -736, -42, 762, 1202, 654, 87, -595, -1068, -337, 726, 1253, 1068, 517, -305, -917, -822, -363, 710, 1077, 711, -3, -762, -964, -691, 205, 693, 667, 155, -548, -1265, -1199, -370, 394, 1050, 676, 95, -758, -925, -530, 25, 921, 1089, 686, -91, -612, -904, -314, 549, 1196, 998, 372, -475, -862, -533, -88, 870, 894, 506, -428]
5138d28n22J11L40O50N38q1n50p11j95J9O60P58M95k37o97n92k91M39M71P39J17
5159A033m23q40m58K6M02R08j7j56r63l44l24K16Q54L84M63o04o37l69L45M22
5179h2N10O47j71n65n85l96R7P19K27O46o10n48n32r7L64N38L39k7k92o61n44
5200a023M54O05M54L45l3p89o82M8M39O59M86n1o15o99j67k26O25M66O4pn56l48
5222e51l01K21P27N37kl63k78j95j09J32Q88m1Q7n13n56j75R7N25K62O5j49o70
5244c62n96J2L50Q76J28J06l00m89j79J59M61N61K74o39m14l48k20L8P32L12J48
5265F10o46n28m17K95N33M74k25J28j27o52K9J27Q80L06N5m55j20k59k48N17M46
5286G23r8k18m04m36n98N13L09M67K3j58q27k12L22L43L42L94J6l93l63Q3j75
$$ y = [-428, -950, -839, -499, 151, 689, 608, 58, -653, -848, -829, -169, 589, 1084, 847, 150, -442, -733, -294, 177, 916, 1033, 610, -230, -688, -662, -260, 648, 631, 475, -488, -832, -1156, -940, -86, 298, 761, 157, -480, -849, -504, -82, 428, 1075, 904, 339, -246, -642, -545, 174, 401, 1047, 437, -111, -643, -740, -376, 162, 501, 474, 182, -479, -1023, -569, 36, 490, 835, 802, 13, -669, -621, -182, 477, 963, 912, 297, -402, -569, -795, -170, 296, 360, 353, -203, -551, -852, -631, 96, 633, 631, 268, -10, -205, -314, -182, 706, 665, 752, 239, -317, -492, -395, 130, 392, 457, 308, -362, -958, -946, -596, 280, 408, 514, 214, -275, -454, -295, 166, 727, 1001, 362, -52, -400, -620, -582, 150, 462, 610, -36, -564, -981, -686, -153, 321, 96, 224, 97, -555, -526, -399, 481, 787, 842, 387, 267, 8, -240, 277, 723, 625, 407, 3, -433, -1031, -518, -209, 258, 281, 123, -704, -916, -594, -251, 91, 485, 501, 108, -255, -172, -347]
5307c47M67N23p0k89j84l54j73O42K36N0j00l96m03j61J82M45L53p0j49l57k92
5328d47K8K42N08J29L20l65m57l88J81L07K75P9k59j90n33j87L75K83O31j87k62
5349H3l78rJ01R3N82J50j37l36k28J5j53M70O3k2l91k68k40K18J3N00n2n5r7l46
5373d24j92J22L74M83l3j45l06l24M27R8M08K8P5m45j37k07L3K43K75M2k57k01
5395f3j36j74J30N45l4q9m96K5k07K23K79QL97m12p9k35J50J36L34J16j16j80
5417A22m81m1J84K67M17j89j00m11J05j43O1K98L10r1j8l96j22l0K41L62k71K07
5439B81m74P8k49J89L12K4j36m6k84J17k31L08K25R8m4l76L4J14j56L14J18Qk28
5462dj90R5k49L32K89K82m12j60J10l62R2J59L18O3ln19j41j6L52K02N3K97m97
$$ y = [-347, 120, 643, 573, 284, 100, -254, -427, 215, 451, 501, 401, 5, -398, -559, -377, 68, 421, 351, 202, -155, -447, -419, -177, 331, 460, 780, 415, -42, -430, -249, 58, 333, 412, 153, -37, -570, -757, -382, -99, 532, 345, 83, -295, -304, -203, -110, 472, 622, 485, 149, -79, -64, -217, 253, 316, 294, -97, -365, -605, -387, -374, 126, 74, 19, -78, -424, -616, -494, -120, 363, 330, 185, -121, -445, -18, 80, 488, 516, 591, 146, 9, -198, -165, 78, 353, 395, 138, -63, -199, -373, -243, 302, 268, 179, -317, -292, -499, -276, 3, 11, 408, -4, -83, -318, -168, -32, 302, 418, 302, 122, -359, -400, -216, 51, 468, 279, 179, -232, -127, -270, -209, 89, 399, 308, 290, -106, -228, -258, -17, 345, 74, 281, -193, -115, -364, -175, 137, 161, 25, -21, -305, -188, -419, -111, 114, 212, 168, -208, -174, -60, -216, 98, 216, 224, -4, -194, -99, -348, -16, 273, 555, 143, -17, 93, -269, -177, -18, 300, 363, 360, -159, -300, -316, 36, 238, 291, 588, 91]
5485I1l44l7O4M56K8L5j41j61j76j89M54J98N5k97R5m06J44rJ83J52M9l18P8k59
5509b55L8O7K10J41J14k63j76j68N5L57K24k5k95K1j49k00J37K57J93k89O6j17
5531e7k35m4L29K27l5k49j21J52k79Q4M12J70j58k13j9j11J74nJ78J19j10j43
5553F6l49O7j08M28K55k85p5k26j12K45J07K03N9j16k40k65K61m2K15L8J8k06
5575f2k87m9K32J74L87R7k51j02m24K19l7M66j14K05l25k24l22J44L56M32j05
5596D10k69k11l60J78J69J38R6R5m36j77L3k4K98K36Q0%k98l19J65K47J51J84
5618C86R8m46N6k15j29K89K57Q9n8m18l90L1L41L19l8L06m14m9m25K9K20L52K35
5641D26l32l07p6j24J71M46O5R0n7k24k88R0J27K31K06j55l1l80k9mK45K40L43
$$ y = [91, -253, -290, -226, 230, 258, 293, 152, -9, -185, -374, 80, 278, 333, 36, 131, -275, -131, -140, 43, 195, 244, -74, 4, -255, -217, -150, 60, 201, 315, 52, -124, -292, -237, 120, 344, 319, 24, 45, -104, -304, -167, 90, 283, -6, 60, -57, -292, -336, -7, 220, 185, -64, -185, -33, -312, -228, 184, 354, 196, -17, -36, -147, 27, 22, 200, 319, 209, 66, -283, -216, -324, 104, 359, 74, -1, -227, -339, -94, 13, 216, 275, 159, -81, -346, -85, -127, 88, 126, 144, -62, -349, -398, -166, 8, 395, 492, 241, 139, -285, -66, -103, 363, 249, 454, 129, -95, -417, -273, 83, 515, 410, 141, -70, -430, -252, -83, 55, 151, 246, -190, -367, -334, -358, -60, 176, 256, 256, -42, -361, -196, 51, 202, 386, 484, 38, 94, -121, -250, 39, 296, 385, 327, -91, -481, -450, -109, 210, 172, 478, 64, 15, -410, -381, -161, 191, 426, 94, -213, -289, -413, -242, 204, 269, 359, 302, 78, -210, -120, 7, 238, 444, 289, 258, -122, -151, -155, 90, 330, 673]
5664F73m11m74o1m36O29L49J27k79J0m00q2J24J98K99K57k55n76j1QO5O53K25
5686F32k38j24l02o09L89K91M29L0j85k78l83j24J13L76L13j4n43k0l53M21J3
5707a66L87J25l9l00l87j91M37J44L00N3k77k38l08p8M46L56J32j20j68k89k99
5728d80J38M43K74K53l58m03k38J07K57M17J79m9m27l31l48L7M44L42J53o1n67
5749b18l77L1L90J34J54K72l56l68j51K13N07L22P8j90k20o93k4K46M65L48j76
5770C87l80j93k91j23M20K39N57k77k96m32j98N48M16J75J04k04l83n24J33K86
5790c6M53L27k12k98n42l07J32J92M18K23m08k46l48O1M8O39K24k8j36j95m56
5811d95M41L96J98K37j77l73n30J2rM96L85k6l54p01N1j85M69M89K20k55l60m17
$$ y = [673, 262, -212, -273, -709, -80, 269, 396, 117, 127, -273, -355, -231, -33, 266, 523, 268, -308, -319, -311, -246, 407, 632, 394, 270, -32, -641, -252, 39, 468, 498, 313, 35, -348, -472, -359, 17, 330, 316, -227, -247, -600, -179, -166, 221, 346, 307, 7, -380, -571, -134, 10, 310, 363, 86, -152, -460, -538, -92, 264, 396, 276, 108, -181, -480, -342, 101, 375, 628, 270, -133, -371, -264, -7, 410, 589, 540, 113, -218, -566, -529, -85, 257, 410, 349, -218, -595, -564, -174, -40, 114, 386, 30, -338, -489, -276, 231, 553, 631, 441, 221, -472, -496, -250, 215, 563, 387, 7, -186, -477, -600, -180, 59, 616, 339, 43, -389, -587, -39, 377, 552, 656, 452, 69, -455, -322, -36, 417, 744, 532, 234, -308, -615, -483, -291, 127, 350, -58, -304, -652, -591, -543, 96, 320, 292, 156, -39, -495, -54, 342, 540, 777, 600, 227, -303, -291, -300, 196, 581, 555, 201, -500, -449, -634, -165, 324, 544, 289, -71, -488]
5833d88k40L79N40M01M6l05l56o28J27L74M77L77j78o61o47K80L56J23P01p9j46
5854D53o76k59L23K52M87j5J37n69m49k31K75J20N26k8o0n18n23k4K22M25L43
5875B11K6m14l11k36M1P28N96J18m3l86o31p3N63L91K22L7l30n07n79K41L30M13
5897D07J74q0n76o64r1K11L87M79J51j65p77l21J69K10Q57J96K11n42o96j16L3
5918e43O84N31L20m98m18n59j41L70M89N30N4m78m44m88K87M43K90K95k95m56
5938b7m86l22L91M81N24j01k94n64o99J49M51O72M67j65m44l22m10L71M35O24
5958G31K47m31m96n58R0N71K88M36p2p21n47k45p5N86Q35l7l08n12o05L03k8O86
5980A38K42J93m46m79j19j69O73L03M72j65o11n86j94L23Q33J06J45l44o33l18
$$ y = [-488, -728, -349, 191, 592, 638, 333, -23, -651, -524, -150, 327, 704, 526, -135, -782, -502, -146, -23, 678, 599, 453, -223, -482, -159, 93, 580, 565, 702, 133, -316, -547, -272, -152, 374, 346, 286, -232, -755, -779, -557, -132, 211, 237, -177, -488, -724, -683, 45, 641, 759, 716, 330, -301, -374, 189, 580, 802, 839, 509, 2, -577, -336, -6, 407, 581, 501, -75, -739, -830, -619, -232, 247, 398, 233, -544, -865, -696, -486, 371, 567, 778, 236, -460, -576, -543, 141, 672, 992, 494, 76, -483, -624, -254, 235, 765, 819, 341, -103, -591, -304, 139, 429, 724, 429, -27, -513, -835, -444, 37, 561, 460, 166, -398, -1097, -948, -497, 175, 642, 477, 33, -289, -699, -328, 107, 731, 978, 547, 51, -507, -417, 154, 442, 878, 806, 85, -462, -707, -782, -196, 639, 602, 294, -218, -823, -520, -548, 138, 380, 573, 127, -352, -471, -640, 33, 336, 808, 643, 32, -554, -748, -425, 408, 514, 659, 315, -318, -636]
6000f36K0L38M13N87J6o41o95O7L29J49O17R8j28o97n78J4N74M44M00m0n21n09
6022c79l86K74O34M16K02k97q42j89k39L15P07L71Pl08p02k83j66J109K25J61
6042F30O0n98p77R8L07L72M80M25p05p90j13J50L04O17L10Q6p79p26m2O8P09O32
6064G18mm10o46n67N3O14O57K90K85p17o57k33J59O67N04R6l33m34n86j73K94
6085d23Q88M50k40m29o28k28J28M35O75K00j56q42n47k46K66Q53J98J36m69m93
6105d72j04pO01K34L86K66r00n68J35j69P45Q22o0m06o43l76k28L82R35N52l79
6126G46m37o28n90M14M69N71J96n01n97n09k52M37O15Q27j57l15q79m32K50Q65
6146I3M74L84m11m55m91m04L23P23P70k7n32o48l43L2L85M07M28j85o42o55k00
$$ y = [-636, -616, -278, 135, 722, 738, 97, -598, -531, -202, -53, 564, 662, 534, -163, -741, -727, -153, 291, 691, 651, 130, -379, -765, -491, 143, 559, 761, 464, -378, -567, -806, -491, 216, 587, 594, 286, -416, -699, -865, 244, 469, 630, 690, 92, -685, -587, -280, 92, 572, 997, 292, -498, -611, -461, -157, 460, 770, 856, 77, -649, -691, -623, 86, 718, 714, 304, -342, -909, -856, -242, 415, 705, 990, 273, -384, -617, -458, 209, 713, 809, 476, 42, -544, -717, -423, 465, 915, 675, 246, -382, -610, -482, -47, 628, 828, 672, -170, -717, -963, -697, 156, 354, 490, 21, -472, -576, -583, 18, 252, 638, 904, 4, -564, -429, -598, 147, 969, 909, 503, -140, -516, -744, -362, 573, 1125, 746, 309, -319, -909, -495, -26, 545, 741, 240, -357, -866, -1118, -681, -66, 761, 604, 289, -590, -1022, -772, 93, 567, 951, 540, 85, -406, -810, -487, 236, 1006, 979, 447, -201, -544, -512, -127, 280, 708, 523, -119, -774, -974]
6167i74J81N68Q12J62n37n65m10l25P98P15L25Q6l93p82k99K38Q15L67J19j45
6187G56o58p84K26p1P91M57j47k86o32n79L12L95M54N42m06n14n98l05L84O89
6207B6O29L10o47m79n91J71N05M81N34k06n71m16j89l7P27N69K13k64j022o04
6227h61J69M08N97M93p7o63m71l23j12O71O99R8k01m92o88k60L65Q57L81J21n74
6248A37p07l62J70P02O02L17j01q68l30l17L07P09O41J96m78p80k66j77N47M78
6268D20L04j1q58n44l49J85P51O09M35o07p27m10mM91P68K51J53o38p05m68K69
6289f85O24P76K78o78o04r4o46L83Q19N16J59n33o80n30K39P22L87M90j33p30
6309H0n99l54M07R33N39K21o22r13m51K11J13O89M38j29o66n52m71K40N52Q61
$$ y = [-974, -793, -225, 587, 749, 212, -353, -763, -1088, -290, 425, 750, 836, 443, -339, -638, -400, 415, 782, 901, 756, 98, -686, -460, -531, 260, 717, 570, 284, -348, -927, -615, -220, 234, 776, 370, -144, -742, -1047, -663, 26, 655, 965, 318, -161, -752, -581, -76, 405, 939, 733, 162, -254, -443, -480, 247, 816, 1029, 765, -257, -861, -692, -284, 313, 806, 729, 66, -405, -728, -840, -169, 530, 628, 427, -65, -753, -1013, -648, 209, 590, 711, 137, -570, -932, -762, -60, 542, 859, 758, -110, -440, -757, -450, 259, 900, 1096, 618, -162, -428, -605, -58, 420, 724, 713, -145, -689, -1038, -853, -102, 507, 942, 335, -392, -802, -806, -315, 453, 704, 857, 219, -486, -954, -685, -61, 715, 993, 315, -289, -383, -1029, -646, 173, 689, 848, 315, -365, -895, -656, 66, 453, 943, 810, 80, -519, -873, -466, 467, 1006, 1227, 605, -308, -759, -548, -435, 254, 692, 563, -103, -655, -1126, -886, -334, 527]
6329E27L39m46n11p36R0L76R18L57P7l28j208j77K89N51Q62M3j94p22n96l80M55
6350d14M87Q64j09p18o05l91L4N48N97K51k73n68l82n15K40P39R17r1l98m70m81
6371g38p4O78P08N30K8p87n62m98M10O35R79K36n23p77o97l09M96O24L89N8p91
6392A5p95o46N47J83P41L12l49m79p57o9N32Q38O02L12o01o82k10r6P20Q89M12
6413A419Qp36n92l69l8R82N89l3n26o85p47k08M11P79M47Lq84p38k82n1R06O98
6435C53K49m69m37q89K45N24N61O85r1l87q02m89M89N80R71L03k62q44o17l84
6455g11M85Q50M49q2m05o13q22p6N13O92M73l02q01n26m05J79R34N55K81m91n30
6476c53p42Q8N28O73P87l9k72q83n43O21N47Q42j05nj050n73j10K26Q84M40r6
$$ y = [527, 866, 420, -91, -827, -737, -361, 557, 914, 991, 663, -545, -722, -433, 118, 980, 1023, 829, 107, -489, -869, -414, 73, 937, 828, 110, -495, -886, -852, -304, 293, 544, 271, -297, -679, -1194, -954, -215, 702, 611, 213, -257, -738, -812, -134, 574, 1104, 1132, 345, -217, -715, -305, 330, 1309, 1545, 1022, 245, -452, -761, -265, 359, 748, 806, 15, -780, -1426, -879, -696, 45, 357, 8, -471, -1228, -1297, -765, 73, 675, 987, 386, -296, -506, -602, 118, 1007, 1419, 1427, 691, 99, -270, -308, 674, 1263, 1230, 704, 19, -728, -936, -525, 254, 701, 704, -180, -918, -1200, -1251, -345, 353, 602, 133, -304, -1193, -948, -424, 137, 822, 731, 344, -458, -947, -458, 122, 1093, 1396, 1134, 290, -327, -711, -226, 624, 1073, 991, 586, -27, -849, -925, -412, 280, 753, 451, -350, -876, -1281, -1102, -168, 387, 668, 177, -353, -1095, -1007, -479, 194, 981, 942, 670, -213, -756, -135, 412, 1254, 1149, 1144, 94, -479, -589, -363, 521, 961, 865]
6497H65r42o34m80J39O53P74M61m56p19l38n11K15R63Q35J19n44p97n11L57N06
6517d5O91M57j5q89o49j49J27O85R11J57o15q21o58k40O81Q18M58m9o41q27n03
6538a116K31Q62M79L26k01j265j66k54N59Q06M87K76q67p14n82M87M86Q00P40
6557A374l08p82r29k01Q8Q48P04N9m73o24p41l5P32Q00M41q9p29p45j77J19Q38
6578A70O27J39l39r17n52j21L81R94O62n4q77p41m04N27K40J038J23m61q14p83
6598a162L3N41R39N99m02j68p89o80M22N53O73N46k09r33n85m32M81N91Q62J30
6618A010n51p51p42oR25P94K70k86l51q94l29L42O88M32M23m44r29m09k55N99
6638d64P24P35o9o54o97n34K63P18Q08M20p80n72n96k47M70R73L97L2n75p14n05
$$ y = [865, -77, -711, -1191, -1052, -399, 375, 836, 380, -339, -677, -1188, -973, -10, 825, 944, 400, -397, -908, -551, -45, 646, 1103, 1088, 199, -450, -599, -472, 213, 1124, 1281, 666, -155, -813, -1053, -372, 446, 904, 855, 214, -613, -1116, -885, -23, 456, 782, 581, -684, -850, -1104, -545, 261, 748, 1024, 157, -557, -1139, -652, -166, 634, 1374, 1066, 284, -645, -846, -758, 90, 794, 853, 380, -244, -985, -1020, -288, 512, 953, 864, 135, -610, -787, -668, 170, 797, 936, 597, -320, -872, -993, -612, 382, 1044, 990, 113, -628, -1032, -505, -265, 773, 896, 435, -379, -1162, -1129, -588, 351, 950, 548, 380, -409, -1089, -667, -114, 559, 1105, 896, -37, -622, -1054, -573, 18, 880, 1010, 459, -292, -1034, -1040, -115, 679, 949, 663, 312, -582, -911, -569, 119, 551, 974, 530, -399, -808, -1063, -464, 260, 995, 926, 272, -425, -959, -696, 22, 830, 1250, 470, -102, -698, -945, -475, 498, 895, 927, 352, -362, -867]
6659h67M9M75P53M49j59q81p33r0K84Q74O05J55o11n95n39p1O30Q19K30J35o92
6680B20n83p78P40N43N80L42m31p49r65O8M69P53K88J44m67r37o29N41N08Q96
6700E53M67p67l09n57m12L74Q70P44J56n30q73m52J6O36O29M48j35n90r68m08
6720a108N75P39P13J98p03o69o79k05O60R74K85J30q71n66l29j39R48O62L37k65
6740F87p35l73m01P26N67P19o9o30o79q70K80P42Q68L00m46q35p66J40j1Q04P35
6761G53l9k55q42o18J40O72O03M21P2p43q93l75N69Q19N61L99n38q83p28m8M65
6782d88J053L56n7o47r03l9j25P69R17K97k87r48p22kL83P15M97J03o34p02p29
6803a193L53N56O45N34l65q46p99J73K80O57J174r0l97r47m80K1M52J139J87R7
$$ y = [-867, -818, -343, 410, 859, 700, -181, -914, -1004, -720, 154, 759, 914, 303, -292, -831, -902, -272, 547, 777, 912, 220, -363, -1141, -401, 142, 722, 1064, 633, -116, -1081, -1013, -544, 209, 497, 641, 174, -763, -1392, -851, -343, 553, 1020, 253, -56, -613, -1025, -651, 219, 963, 1119, 589, -284, -736, -720, -84, 545, 993, 858, 268, -700, -1108, -533, 206, 919, 1117, 414, -255, -934, -1139, -479, 495, 780, 910, 39, -527, -856, -995, -47, 615, 952, 687, -48, -421, -822, -96, 471, 1190, 1121, 491, -188, -1058, -778, -36, 832, 1132, 686, -149, -915, -775, -786, 18, 753, 714, 459, -383, -1001, -861, -189, 414, 835, 907, 164, -729, -1104, -535, 284, 845, 1244, 706, -177, -905, -953, -488, 565, 921, 864, 217, -686, -725, -850, -81, 836, 1133, 846, -102, -824, -826, -443, 272, 769, 872, 238, -464, -1193, -840, -284, 361, 895, 530, -316, -1115, -942, -662, -5, 1169, 1079, 682, -265, -745, -724, -272, 867, 1054, 1151]
6823A151r72n31m88K24O88P69J3l98o70p06r2O42P41N14r3n66q72j15O2N47O95
6844E43L73k11q78p44j49L19J043L07N6n70o72n41J20R66M92O34m13o36m14k83
6864f58M30O98O78J61q14m58o27L7N51P40L91l28n83p85l20j74R21Q29j9k47q46
6885d23o75j33N06Q18O89k65k87q24m37K62J028K32N93j33r52n68k30N62P46O21
6905A130m3p98n49o71M38L48Q17M59l08o23o88k51L80L87O77Q9o61p13p27r5O17
6926g85P26M19J61q40o01l40M31P51J007K99k22p26o22o9L18J201M60r4o85p50
6946C9m82k35O53R18J93o91r05q70k56O59N91N15M1k70p02m05J21N86P90N08m6
6967G52n46n83l00K87J199N78k78l38q44o51K0O40Q12J92Q9p94p40m41K33Q81
$$ y = [1151, 179, -352, -840, -616, 72, 841, 854, 456, -214, -920, -1012, -370, 371, 885, 792, 226, -646, -761, -699, -152, 543, 916, 705, -173, -917, -1066, -747, 296, 603, 659, 89, -583, -1124, -1004, -38, 454, 1088, 675, 39, -375, -658, -228, 470, 1148, 1309, 495, 37, -590, -553, -2, 738, 1129, 801, 218, -567, -887, -1061, -140, 689, 670, 423, -423, -1098, -1231, -725, 93, 782, 517, 230, -594, -1031, -769, 259, 491, 1084, 951, -1, -569, -799, -237, 509, 1130, 1087, 289, -260, -931, -493, -145, 672, 1131, 823, 200, -488, -739, -359, 28, 705, 794, 133, -580, -1307, -1402, -785, -59, 360, 521, -319, -920, -1260, -829, -78, 929, 1228, 1006, 280, -342, -411, -93, 1108, 1568, 1474, 789, 39, -443, -678, -25, 893, 1086, 395, -510, -1380, -1636, -977, -386, 129, 170, -100, -802, -1207, -1086, -500, 290, 798, 752, 206, -377, -677, -390, 809, 1387, 1109, 771, -73, -724, -704, -64, 748, 940, 1029, 235, -505, -946, -713, 168]
6987A68O76J19k82p94p77k21O50P92K97J17p15p53m12R8L74R13L84k79n76m11
7007f32o94P41R68P76K12n23q13p23M01N51O05M56J09r75q22j78J18N25O60M4
7027H06o00j014o36K0M04Q10O08k83m97o18l11J96J210M57N53l47m19o70j12M73
7047C0Q67N35O4o98j176l71K5O47O24L08l50o31p29l85J96J088M21O2k87p82n90
7068a132K58P22P92K56J24p95j065k07O46M88Q29k2l54q27p45J63N65P99L37Q4
7088I16r03n85n16J68R94N94M15o18n62p83j47O93N63O21l6l73j340N4j48Q69
7108a24Q54M70o06n97o41l84J62J190M18K21l95r28n38pP88R34L13k45p64r71
7128h50k79M03Q71L70M25n63p87m76M3L52Q99M94k94m24p77m34L07N27J082j19
$$ y = [168, 844, 963, 681, -113, -890, -1111, -461, 331, 628, 745, 30, -723, -1135, -1037, -663, 250, 634, 355, -221, -632, -1326, -585, 383, 1159, 1371, 848, 35, -688, -287, 264, 869, 1325, 1434, 459, -363, -541, -423, 102, 762, 806, 206, -808, -1444, -1424, -1020, -210, 398, 115, -382, -1000, -1311, -1115, 95, 552, 1105, 758, 339, -331, -443, 30, 897, 1432, 1496, 798, -378, -749, -724, -77, 547, 855, 505, -126, -855, -1240, -1044, 44, 465, 527, 240, -542, -1132, -874, -152, 640, 896, 1020, 225, -840, -1047, -401, 87, 916, 894, 540, -287, -1032, -869, -304, 495, 832, 916, 13, -572, -1088, -920, 74, 668, 1083, 465, -97, -880, -1027, -334, 229, 850, 814, 441, -899, -845, -993, -124, 730, 1200, 594, -3, -644, -1028, -866, 324, 742, 963, 568, -360, -898, -905, -117, 817, 1130, 885, 121, -850, -1129, -726, 145, 515, 940, 377, -410, -886, -843, -491, 408, 902, 608, 184, -593, -1027, -720, -193, 889, 770]
7148G70k4o51q04OL60R08P07m81m53p13n92K80P00L86M53m35l74o55l88J84R95
7169A79M88L0m11p74l28p6N44O51P38p4o41r58m64N88Q64M62K11o15o99o12J2
7190h85O32N38O94j69p01p38k79J42P55N91J16j66o81o74n4O01M53O91j25l66
7210C75o46o69K69O23O02P11k86q45q22m97N71O67P25p0J34j110o40j22O20Q78
7230D68K44O2p04o43m44L83Q45M21L74o47o23m55l3L35R42L71mo17n92m17J53
7251e81N52M50N66m46o39n40m67O15R62L53K85o22o02p40L63K70Q05N33k89o11
7271B17q56j67J58N84P39J38m18j062j96k36N82P98M56l1p24q55j21K99P53N83
7291F41L37l49o77p28j29N55Q44M93j56o09n27p12J60O68P41L53l28p63o06j3
$$ y = [770, 746, 95, -709, -703, -343, 565, 1272, 791, 338, -375, -967, -687, 13, 399, 852, 417, 43, -612, -1000, -816, 179, 667, 697, 286, -488, -816, -892, -348, 303, 1041, 967, 326, -632, -1096, -508, 356, 818, 1029, 414, -285, -897, -885, -253, 285, 979, 810, 109, -629, -908, -766, -11, 580, 696, 530, -151, -825, -879, -278, 175, 866, 741, 375, -271, -940, -671, -48, 554, 1265, 979, 134, -688, -1185, -614, 53, 778, 708, 842, -268, -908, -1030, -410, 468, 712, 774, 70, -573, -1017, -634, 211, 632, 1006, 359, -264, -719, -752, -417, 525, 896, 892, 275, -317, -734, -581, -29, 421, 987, 541, -98, -638, -1105, -490, 472, 825, 1110, 488, -114, -854, -491, -221, 584, 1117, 828, 217, -639, -806, -648, -64, 675, 813, 395, -667, -863, -1099, -517, 281, 737, 706, -18, -873, -994, -695, 58, 641, 978, 629, -48, -776, -905, -350, 494, 987, 831, 222, -305, -1017, -857, -189, 552, 905, 577, -186, -792, -805]
7311h05L44O36P57J48n77j036k18k15P07Q22L62j27o17q13l38Q4O54Q98L42m52
7331E56r61o05j19R18O27O94o3p08p48l33K48P04N03K83m47q70n27k63P22M54
7351F5P11m7o78o60m67MQ58R34K62k42n52o69j77M39O12P53M3n19j000m69j26
7372i25L75P26P68n33p61o11k18L37Q85O31J86l97p16m21P5N31Q50L15m5p27q25
7393e00k79M33L83O06J60m37p14p30j00O01M91N92J34n09o03m60K11N30J049N48
7413A406l69o61n74n90P35O89K52J29o41n67p47j45N53O66O59m57o22q65j42P54
7433e37N00Q38O7k09q42m16K29N96P41K98k11p12m47o09n9M77R08j83k28p07q31
7454a337J2O07O30P15M8n17n57l22K29P43P06L75J24r17q60n5K36O04N53l12l88
$$ y = [-805, -461, 175, 932, 1080, 503, -533, -751, -966, -259, 563, 925, 798, 181, -632, -970, -886, -232, 666, 1008, 556, -405, -1010, -1129, -211, 416, 1110, 1047, 339, -409, -742, -494, 210, 713, 996, 549, -321, -848, -1111, -389, 65, 776, 729, 51, -609, -1076, -1072, -214, 720, 982, 740, 188, -481, -658, -219, 393, 1146, 1189, 670, -330, -799, -925, -550, 176, 944, 411, -350, -961, -1179, -842, 43, 674, 860, 463, -253, -674, -599, -68, 782, 1097, 1052, 325, -500, -779, -346, 37, 643, 803, 366, -348, -1078, -1178, -577, -86, 506, 640, 131, -472, -932, -721, -191, 858, 1406, 1037, 376, -198, -788, -53, 636, 888, 1017, 376, -191, -938, -1083, -530, 136, 795, 338, -284, -1149, -1291, -537, -37, 801, 868, 659, -183, -599, -370, 226, 967, 1265, 1054, 342, -105, -714, -773, -296, 612, 429, 201, -506, -1337, -1325, -718, -88, 627, 675, 158, -399, -721, -492, 251, 957, 1332, 1456, 539, -321, -376, -140, 464, 1017, 705, 317]
7475C17j064o21J3N43N22N53j31m20q70j63M80O62R43J14r4p28n17m3O96N05N36
7496A233j78p82p24l32K24M16Q21P0l22o85p08k44P28P38O31L17o87o01o02K60
7516d27M35O00M32l07p55o21m27L00N58P78k4n63o67m01LP32N08P47j28n38o20
7537c85l08L91O23Q02L08p46n60p81j19Q24L81M61k41o91p93l70K82O07O77K34
7557E96k12n82p28m4O49Q58M94P7n57p46n98J76O20N77J09J4o47q77L3K66M81
7578d1M57K27k53o50n34j65P84Q02N41o6p40o84m03J56N13O01K02k69o87j150
7598a359J79N05P14N16pl80o62m87K84N54J006L40k84n31r50K44K35O10L40J28
7618I95m85p31p05m8L88P86J61K7r28n90o8M08P49N15L23k55p06n94M64M22O97
$$ y = [317, -747, -1368, -1355, -812, -290, 263, 132, -288, -1158, -1321, -841, -179, 764, 878, 784, 56, -461, -504, 192, 697, 1233, 1055, 273, -451, -783, -559, -143, 678, 748, 426, -259, -967, -1211, -483, 255, 886, 1203, 516, -85, -687, -427, 8, 608, 1040, 733, -22, -643, -1070, -770, -212, 566, 542, -21, -688, -1089, -1086, -354, 154, 901, 773, 235, -385, -693, -302, 321, 1123, 1431, 685, 125, -656, -775, 49, 430, 891, 650, -41, -834, -1204, -922, -315, 362, 596, 384, -198, -926, -970, -321, 537, 1031, 1108, 551, -195, -793, -617, 3, 580, 689, 703, 56, -821, -788, -522, -41, 416, 643, 390, -260, -794, -959, -175, 627, 1168, 1102, 362, -322, -725, -569, -56, 545, 747, 478, -209, -1359, -1180, -675, 39, 555, 548, 168, -494, -981, -697, -143, 863, 1203, 919, 388, -562, -318, -83, 527, 867, 995, 510, -221, -926, -974, -586, 200, 361, 388, -540, -1130, -1198, -790, -41, 474, 797, 542, -164, -758, -294, 128, 825]
7639H25K42J52q84m71l88J47O95L75k10L4o35q60j26M52P28L03K88n55p96j44
7659h28K93L88Q14M29k94p13n47k04M47O47K93K94n32p43o00n7M24Q99N84m04
7679E90q10n93j07J96P07N12M67p57l39o88J38L46O99N78l8n15p89m85M06N48
7699F6N92J98l54o16o53k62J26J183M02l5l11p16m00K41M87O51L91j37l79q69
7719c95j03N6R94N12j5p43o75m96L8M14N46L59n9p23m37m30K75R42L73J47K6r68
7741c62l88K35M93M55N84j50k62p32m78L43L88O19K11n03n69o54k58L99P32J96
7761B99P0l88n04n47j17J208M13K84j61o17l83k34K44R00K87J85n49o07m62P3
7781f06N13N89M16oq83o12j16J82M55P36L12n34p74n92L08J27O16M63J36n48p99
$$ y = [825, 1067, 1219, 335, -136, -524, -377, 318, 693, 483, 517, -118, -978, -1104, -652, 76, 379, 667, 112, -684, -828, -535, -147, 667, 1096, 802, 89, -458, -662, -215, 432, 725, 1019, 487, -256, -856, -913, -489, 410, 994, 590, -220, -813, -920, -724, -17, 495, 962, 205, -134, -822, -684, -338, 361, 939, 901, 386, -403, -888, -482, 66, 658, 856, 502, -114, -767, -1029, -903, 280, 682, 647, 336, -380, -780, -539, -52, 599, 990, 853, 474, -395, -498, -442, 552, 1064, 1049, 306, -369, -865, -827, -413, 133, 492, 433, -290, -727, -1157, -882, 60, 433, 580, 606, -362, -750, -515, -22, 433, 1017, 867, 605, -127, -605, -262, 126, 745, 956, 453, -116, -770, -1028, -629, 103, 299, 369, -19, -523, -1070, -1187, 21, 434, 718, 557, -60, -443, -677, -433, 467, 754, 939, 390, -217, -679, -606, -93, 496, 912, 906, 23, -589, -705, -523, -68, 668, 980, 446, -328, -920, -612, -485, 131, 594, 730, 182, -617]
7802f17m24N25L60O49K88l15n98o03k1J37P48M68L18m57r77l14J24N26R36L61
7822A114m99o14l68k69J84Q37K73J41l13o69m90k16N19Q32L12j05p64o20r5l0
7842h40Q26L90J08k64l58o65j74L96P59M57J49n28n96l88L31M26P44K71l51k98
7862C95q02j19K79P29L19M6o45q20k83MN46N90J87r3o88p91J77K68O78N77J76
7883G30l28o63l39j07O56Q96O8p0l82o51n03J7N98O58M08m92p47m42k07L96P18
7904B14O39R4q05n24k37L9O16O93K03k68p51l73j40J07O02L85J28m03p41o85J98
7925a009O33N95L39k95j77n93k53K52O54P22N11o72l81o49q5O55N00J64q6p02
7945A23p00k80L9M31Q36K8n05n70l99J98L75O85N57k9m57n24m00J23M73P68K70
$$ y = [-617, -1041, -516, -156, 493, 781, 466, -132, -735, -756, -619, 129, 597, 915, 458, -519, -833, -709, -183, 753, 1114, 615, 1, -367, -636, -452, 385, 658, 799, 486, -183, -673, -889, -370, 462, 774, 669, -95, -715, -810, -840, -14, 376, 484, 220, -138, -803, -977, -581, 178, 635, 784, 256, -340, -728, -397, 29, 773, 1044, 693, 395, -407, -526, -247, 482, 801, 847, 202, -618, -901, -897, -351, 239, 426, 333, -355, -1146, -969, -701, -23, 554, 730, 402, -261, -600, -707, -51, 845, 913, 843, 461, -190, -693, -676, -78, 580, 988, 496, -251, -693, -900, -504, 214, 853, 947, 142, -382, -619, -580, 36, 729, 932, 664, -87, -460, -600, -493, 109, 494, 622, 219, -522, -1207, -1009, -376, 219, 558, 263, 86, -507, -760, -508, 146, 868, 1379, 707, 326, -323, -408, 247, 747, 911, 825, 123, -577, -857, -818, -387, 449, 477, -28, -598, -997, -799, -424, 261, 818, 789, 332, -192, -592, -469, 4, 772, 1042]
7966A042l05o60n04m23J86P02N64J21o66n86m65O9P26Q97M3k1m55q51p5M01M64
7987B04O53K16q61m83k91j62J69P79K08k15n28o20k12r4P47R29J28j78n29k10
8007c50k10P07P42L13J11o26m05m50r2M48N63J27m26p85o39j18J73K87Q36J88
8027C94n29l28m84r2N06Q14O15k67m31l72k61p4R88L20J93l54n98n61j23J60L27
8048a57O27P4o12p68k62K4Q47O23N79k59n82k18m18M25O46N32J46q28o46n21k01
8069i49N72N32l4N5o60o51j23L45N52P96K83l26p15j68J42N03K62Q58p7m51p17
8090B9m66M41K34N71n5k36r07n77j51L78N17N17N9m91n80k89M55M89N84M37k65
8111F94m30m44o1K93N71L99j70m16o24o99RO02M74K78k44n87m95k84M74N66N63
$$ y = [1042, 737, 77, -427, -850, -664, 38, 602, 723, 57, -529, -994, -925, -199, 698, 741, 720, 265, -586, -661, -260, 204, 857, 1073, 212, -271, -562, -724, -555, 224, 432, 217, -311, -931, -1143, -1237, -490, 439, 567, 389, -140, -350, -560, 147, 889, 1202, 1313, 687, 282, -168, -260, 188, 751, 878, 452, -333, -972, -1090, -917, -630, 206, 394, -135, -463, -947, -1039, -533, 281, 896, 629, 198, -174, -435, -509, 479, 799, 992, 638, 40, -521, -644, -484, -157, 470, 544, -68, -836, -1098, -1074, -227, 396, 975, 716, 134, -84, -502, -77, 569, 1101, 1247, 419, -227, -748, -949, -377, 155, 121, 176, -484, -1135, -1258, -913, -361, 435, 718, 392, -323, -491, -349, 154, 416, 1274, 1197, 746, 29, -437, 4, 238, 809, 754, 518, -389, -966, -1117, -739, -222, 295, 354, -137, -717, -1006, -551, -62, 522, 959, 694, 264, -180, -241, 52, 623, 1022, 852, 436, -188, -887, -878, -276, 198, 476, 232, -355, -850, -1134, -660, -94, 469]
8132D69K02l58p06k41J35M84Q01J77K15o60p56l56K79L68P11P3n16p38k70l36
8152a023M90L98P10l08j69o95k87K17N84M85N60m24m30q21l3L12O73N29q0k45
8172D43p26n48J36L83P09M36j13q36m30l49K91P46K63K07l19n34m22j99N89
$$ y = [469, 671, 313, -393, -634, -499, -15, 786, 963, 1178, 518, -238, -594, -315, 53, 764, 837, 321, -417, -687, -1023, -533, -135, 575, 267, 98, -597, -884, -667, -83, 402, 962, 538, 108, -713, -746, -434, 239, 768, 688, 443, -283, -831, -695, -312, 397, 833, 720, -116, -546, -895, -604, 142, 405, 612, 293, -241, -663, -862, -273]
8191b73
$$ Imaginary data points
##PAGE= N=2
##DATA TABLE= (X++(I..I)), XYDATA
0@%%%%%%%%%%%jL3o4O4o5R7j29J30j62K25k57K90l54M18m83N79o75P72r00J029
31E47j159J320j511J704j915K157k420K704l021L361l732M146m595N088n626O209
47C257o849P549q320R169j0101J1131j2279J3562j5001J6633j8504K0670k3207
60a2290K6229k9913L4517m0453M8438n9841P7603j09344J83760o85823n78959
71a146076P55949L47158J85958l08238l43935k61941J85765M46797N91414L46496
81G99347J4597l46446l78900k12714J41264L73965M01665R4688k65812m96849
91A24805m06952j17687K36096L56792K01627j30568l75280m13791j88162J38329
101e74791L63452L35788J21535j62251l32817k71024O247K95915M18417K85004
$$ y = [0, 0, 0, 0, 0, 0, 0, 0, 0, 0, 0, 0, -1, 32, -32, 32, -33, 64, -65, 65, -97, 128, -129, 161, -193, 225, -258, 321, -354, 418, -482, 547, -612, 708, -803, 901, -1014, 1143, -1277, 1427, -1594, 1767, -1965, 2181, -2414, 2674, -2952, 3257, -3592, 3957, -4363, 4806, -5295, 5836, -6443, 7119, -7882, 8751, -9753, 10917, -12290, 13939, -15974, 18543, -21910, 26528, -33313, 44290, -65054, 118706, -567117, -1146076, -390127, -42969, 142989, -165249, -509184, -771125, -585360, -138563, 452851, 799347, 813944, 467498, 88598, -124116, 17148, 391113, 792778, 887466, 621654, 124805, -282147, -399834, -163738, 193054, 394681, 264113, -111167, -524958, -713120, -574791, -211339, 124449, 245984, 83733, -249084, -520108, -513861, -217946, 200471, 485475]
111D85475l8575l53145m24794k06916J47647M07102L98367J09920k51897m33399
121a60215l29297k0005L17002M72089L37172N733l07878m25417k67621Q4400M01257
132A07220M66462K36434j56876m76495n04311k15627J80671M18192L56820L7774
142D50264l33449n06099l72932l6461K99998M46903L17876J358k90131l77008
152c99681k07350J27722M18856M62314K30178j18774l63287l47202q1752K42104
162c6872L94102K81600j1599k97874l93606k44901L1962K53068K91330J23909
172C91119j49704l45651l29106j10963J74264L49328K88956K5634k56788l62679
182c25590k16979Q9143L48104L76836J60338j46726l47155l17312p4394K23903
$$ y = [485475, 446900, 93755, -331039, -537955, -390308, 16794, 415161, 525081, 273184, -160215, -489512, -509517, -192515, 279574, 616746, 622479, 314601, -110816, -378437, -294037, 107220, 573682, 810116, 653240, 176745, -327566, -543193, -362522, 55670, 412490, 450264, 116815, -389284, -762216, -798677, -498679, -51776, 266100, 267458, -22673, -399681, -607031, -479309, -60453, 401861, 632039, 513265, 149978, -197224, -278976, -36872, 357230, 638830, 627231, 329357, -64249, -309150, -277188, -24120, 267210, 391119, 241415, -104236, -433342, -544305, -370041, -20713, 268243, 293877, 37089, -325590, -542569, -453426, -105322, 271514, 431852, 285126, -62029, -379341, -453735, -229832]
192b29832L81299L04925M3517k50460l92390k81540J4603L09868M14685K50215
202E64890r1219l81324m23368j94217J56681M03604L81146J08380k27516m13790
212a16733l43549o5118K48681L98445K99893J9804k73715l99947k66890M2788
222d56341L25199M00642K22157j01956l56548l67371j37789J71586L59658L07634
232C66871N3464k23228l43395k48484m367K38880L25305J99030n1022k63399l07627
243b57972j45878J25069L19459L04015R2932j76636l25332k42518J2905K55147
253c8809L22872J79110q8603l04648l22645j41836J13109K88234K76108P2803
263C55695j91696l40575k79739l8850K42352L77164K62087k2887k86602l62084
$$ y = [-229832, 151467, 456392, 499909, 249449, -142941, -424481, -409878, -100010, 314675, 564890, 473671, 92347, -331021, -525238, -368557, 35047, 416193, 524573, 297057, -116733, -460282, -525400, -276719, 121726, 421619, 441423, 167708, -232239, -499129, -456341, -131142, 269500, 491657, 389701, 33153, -334218, -472007, -300421, 59237, 366871, 420335, 197107, -146288, -394772, -399139, -160259, 165046, 364076, 313054, 49655, -257972, -403850, -278781, 40678, 344693, 437625, 260989, -64343, -306861, -293956, -38809, 284063, 463173, 374570, 69922, -252723, -394559, -281450, 6784, 282892, 355695, 163999, -176576, -456315, -495165, -252813, 124351, 386438, 363551, 76949, -285135]
273b85135j94879J15034L55183L65406J52640j43852l44920l21248q9111J93442
283a97440L51754K97020N2571k38542l83517k88288k0580K53696L65125K28463
293D20262o8029l15587l55746j72460J20379L32570L20766J07445j54833l08231
303g3464k66127m8898J99648L13222K31902J1936k19430l10794j90960N6190K60652
314c6123K94802J33594j25923k99156k64086o0236J73048K91319K12594j3077
324C06756k23540k82135j65210N6186K49823K82288J28676j05277k73137k71242
334b96812q3962J72248L16402K51898K5961k22344l31986k16503M5662K69904
344f9532L18611J68585r3482k97084l06523j24471J27858L04154K93599Q8168
$$ y = [-285135, -480014, -364980, -9797, 355609, 508249, 364397, 19477, -301771, -390882, -197440, 154314, 451334, 503905, 265363, -118154, -406442, -427022, -173326, 191799, 420262, 352233, 36646, -319100, -491560, -371181, -38611, 282155, 389600, 234767, -73464, -339591, -388489, -188841, 124381, 356283, 368219, 148789, -162005, -352965, -296775, -36123, 258679, 392273, 266350, -32806, -296892, -357128, -184080, 107239, 319833, 306756, 83216, -198919, -364129, -307943, -58120, 224168, 352844, 247567, -25570, -296812, -380774, -208526, 107876, 359774, 385735, 163391, -168595, -385098, -339436, -69532, 249079, 417664, 324182, 27098, -279425, -403896, -276038, 28116, 321715, 409883]
354D09883j77745l28810k76859n1021K17214L46414K44695j3542k55187l33316
364b18274j96079P1953K85708L07933J41792j06367k86676k80617r3383J45116
374b28894K86490K53845N8463j79603k96084k15904Q54K16844K93892J72105o5181
385B96827k49405k65055j11054J15757K64022K31591M8977j55800k59251j99033
395b82424p032J89446K56459J56395m7092k31206k70034j27658R8364K56191K46834
406B38243P1952j59754k85137k17069r083K04661K92343J92869l0810k25876k69782
417a97443j41220Q5049K70021K87084J25119j11727k77775k69203q1221J63625
427a47691K96966K33049J5236k21632l25316k24221R357K19473K79524J56935
$$ y = [409883, 232138, -96672, -373531, -424552, -207338, 139076, 383771, 370229, 115042, -218274, -414353, -342400, -56692, 251241, 393033, 286666, -10, -280627, -374010, -228894, 57596, 311441, 369904, 190301, -105783, -321687, -320833, -103989, 189903, 362008, 296827, 47422, -217633, -328687, -212930, 51092, 282683, 331660, 175860, -83391, -282424, -289456, -100010, 156449, 312844, 265752, 34546, -235488, -363146, -264782, -8591, 238243, 310195, 150441, -134696, -351765, -360848, -156187, 136156, 329025, 298215, 72339, -197443, -338663, -253614, 16407, 303491, 428610, 316883, 39108, -230095, -311316, -147691, 149275, 382324, 397560, 175928, -149388, -373609, -364252, -144779, 134745, 291680]
437B91680p3064k58151k77380j25862J02473K70867K72163J02732j21955k55932
447g2429k16516k6287J93447K92443K05590n256k02909k65167j51691N7136K16217
458B4578K25399Q6073j15310k49630k26864o4510J28877K34505J85097R400j76105
469F1510k42049j46864M9580K22972K54726J21066q5412k26247k14249n7473J42465
480a19975K48714J87940M470j88346k72234j90378O204J87743K39258J32155p1708
491A63843k39035k50227r4581J28227K81537K66796R0407j30124k46930j90237
501b20324p73K02482K85147J89201k0426k12608k74741j70572L6867K07490K27522
512B49265Q9031j23728k79175k72745j03949J11699K38409K03821L1948j61591
$$ y = [291680, 218616, -39535, -316915, -442777, -340304, -69437, 202726, 305458, 183503, -72429, -288945, -315232, -121785, 170658, 376248, 370992, 168083, -97084, -248775, -191639, 24578, 249977, 336050, 220740, -28890, -255754, -320264, -191387, 43118, 228215, 237615, 61510, -180539, -327403, -277823, -54851, 199875, 320941, 235529, 9282, -204967, -262440, -119975, 128739, 316679, 321149, 132803, -139431, -329809, -323605, -135862, 103396, 235551, 163843, -75192, -325419, -420000, -291773, -10236, 256560, 346967, 216843, -30087, -220324, -221097, -18615, 266532, 455733, 435307, 222699, -52042, -222614, -185747, 21743, 249265, 338296, 214568, -64607, -337352, -441301, -329602, -91193, 112628, 144576, -17015]
522a7015k40355j52802L9096K16872K72726J68098k6788j80516k00533q2720J00767
533a03170K27208K06948N3305j31772k33657j87542j7894J58991K18057J28583
543C19057m9441k05692k33519j11162P4867K00543J93109N5707j27388k29504
553a13423j81512k0988J53369K34312J61378k4189j93859k39277j35408N6779
563c02818K16422K30185R1828j00592k25256k02761l8822J63291K66423K13291
573C11191M2321j45216k30138j51598L3177J99210K45503J38423o4943k32439
583A45491k53014j24736O7201K02965J91401L4596j57951k58540k12033m4836
593d09456J42887K27057J56172j0799j63653k09513j10588P3467K17635K31275
$$ y = [-17015, -257370, -410172, -371076, -154204, 118522, 286620, 259832, 79316, -121217, -203937, -103170, 124038, 330986, 384291, 252519, 18862, -168680, -186574, -27583, 190474, 319057, 269616, 63924, -169595, -280757, -205890, -5347, 187762, 243469, 116081, -113423, -294935, -315923, -162554, 71758, 233136, 208947, 15088, -224189, -359597, -302818, -86396, 143789, 235617, 135025, -90231, -292992, -331814, -168523, 97900, 311191, 353512, 208296, -21842, -173440, -140263, 58947, 304450, 442873, 377930, 145491, -107523, -232259, -165058, 37907, 229308, 263904, 105953, -152587, -364620, -409456, -266569, -39512, 116660, 105861, -57792, -267305, -377893, -304426, -86791, 144484]
603A44484J13209o4785j90038j74678l0663J37367K22516J73377J4633j50968
613A94454k06891j24940L4189J71913J97321Q5211q9384k09045k04350q0640Q9170
624a42992J90055J48594p28j59922k30425j61074J1599J70925K10409J13808n6164
635I4085j93997k02523p0770J10680K27501K13468P3502j05617j99164j47828
645b00663R943J77242K49127J70487j1849j76133k23662j32260M2926J84365J92094
656B81617O2314j18220k40512k28424q3903R6784J94909J56277J1746j48790k16718
667b32920j40745K7285J80837K27731J39861k8820j63146j74062o2221R8357K06244
678G8401J85897M6436j16121j98583j55381j4195J34820J87716J10660m0041j70295
$$ y = [144484, 257693, 192908, 2870, -171808, -202471, -65104, 157412, 330789, 345422, 194454, -12437, -137377, -103188, 68725, 266046, 351257, 261873, 52828, -151522, -232162, -142992, 47063, 195657, 194929, 35007, -195418, -356492, -344893, -173968, 36441, 150249, 94085, -99912, -302435, -373205, -262525, -35024, 178444, 251946, 146329, -52835, -200663, -190720, -13478, 235649, 406136, 394287, 218154, -5508, -137768, -94842, 89523, 281617, 343931, 225711, -14801, -243225, -327128, -230344, -35435, 120842, 132588, -16202, -232920, -373665, -346380, -165543, 62188, 202049, 173229, 10083, -163979, -226200, -127843, 78401, 264298, 310734, 194613, -3970, -159351, -173546, -38726, 148990, 259650, 219609, 49314]
689D9314j96387r6082O5486J78897J74047N7285r8889j90961j53376j2604J36431
700h6839J99923J36298j9494j64114k01475j12680M3724J69848J80450O5655r7026
711A14270k01038j81464m6756J21761K12345J68837K2909j30783j94046j23369
721b37334L8321J82228K15979J20478m7080j82183j94389q1055Q0864J87619J71216
732B54664L7078j27874k16475j74735l3537J21317J87609J23256k6258j60587
742a5542j93709j02916N8477J84530J93382Q8210o3484j65214j49147k6023J18516
753g2920J89298J42755M863j37331j89199j19711K0643J42207J66463P4458p3593
764A47933j75862j68073n5731R1371J78660J45194J8152j17690j76232j17394
$$ y = [49314, -147073, -243155, -177669, 1228, 175275, 232560, 133671, -57290, -210666, -223270, -86839, 113084, 249382, 229888, 65774, -135701, -248381, -204657, -34809, 145641, 211296, 114270, -86768, -268232, -314988, -193227, 19118, 187955, 210864, 80081, -113965, -237334, -199013, -16785, 199194, 319672, 272592, 90409, -103980, -185035, -104171, 83448, 254664, 291742, 163868, -52607, -227342, -260879, -139562, 48047, 171303, 145045, -15542, -209251, -312167, -253690, -69160, 124222, 212432, 148948, -16266, -165413, -191436, -72920, 116378, 259133, 263996, 126665, -62534, -182245, -161602, -19395, 147068, 221526, 147933, -27929, -196002, -251733, -160362, 18298, 163492, 181644, 63954, -112278, -229672]
774b29672K5290J55896J88081J04731m2096j60558j72289o7220Q1303J75795J57886
785B17147L4130j18103j96810j51683j5408J27001J86095J20306k8293j57488
795A6894j85917r8400N4636J76221J83099P5026p5578j73923j59453l5824J15216
806a08003J91178J48265J5331j27742j87085j22428J9278J43014J73507R0959
816B36274n6239j67797j71543o8927P2074J66373J49364L1548j05096j69687j27848
827b11504j769J28983J73280J04463k7292j38788j60347p3394O5076J59681J50702
838A69091M8307q6577j65965j33727j2908J12675J64765J11862j9374j41099j69097
849a22047r0132M3740J50467J59821O0390p8368j64008j45903l4449J05073J76201
$$ y = [-229672, -204382, -48486, 139595, 244326, 202230, 41672, -130617, -197837, -116534, 59261, 217147, 251277, 133174, -63636, -215319, -230727, -103726, 82369, 202675, 174382, 16894, -169023, -267423, -212787, -36566, 146533, 221559, 145981, -27942, -187395, -223219, -108003, 83175, 231440, 246771, 119029, -68056, -190484, -171206, -28192, 145315, 236274, 180035, 12238, -159305, -228232, -156158, 10215, 159579, 191127, 86031, -83656, -211504, -213273, -84290, 88990, 193453, 166161, 27373, -132974, -206368, -141292, 18389, 169091, 217398, 130821, -35144, -168871, -181779, -69104, 95661, 207523, 188149, 47050, -122047, -212179, -168439, -17972, 141849, 202239, 123871, -40137, -186040, -220489, -115416, 60785]
860F0785J32225N923j21464j72855j11722K7261J47186J70626Q8489n0144j59621
871A6689j64226o1404P7919J64820J48839L4018j05971j74663j31615q839J19134
882h5299J71318J09321k4522j38403j63450q5857M9409J53156J54550N7345p2267
893A25301j55671j38711k7446J01204J60106J18938K942j16500j58965r2855L0941
904a50716J32636J50918P0832n8516j47086j38269m2173P9867J52549J23118R744
915A82904j07552j55148j05383J3561J25627J52772P7729m5238j40902j48539
925a50169n7532P2831J51978J33558L1641r3504j59165j18101M94J16507J61025
936H9563J04118k2703j33270j54036p6010N0333J48735J51998N5791p4066j52575
$$ y = [60785, 193010, 198933, 77469, -95386, -207108, -179847, -32661, 137965, 226454, 176310, 16689, -147537, -208941, -131022, 33798, 182637, 216655, 110684, -63979, -195594, -204433, -85299, 86019, 195340, 170818, 32415, -131035, -216892, -167483, -14327, 140223, 197568, 125301, -30370, -169081, -196527, -95323, 64783, 183721, 186663, 70163, -88802, -181657, -150716, -18080, 132838, 203670, 145154, -1932, -140201, -182374, -102507, 50042, 173160, 182904, 75352, -79796, -185179, -171618, -45991, 106781, 184510, 139272, -1630, -150169, -207701, -134870, 17108, 150666, 182307, 88803, -70362, -188463, -187969, -71462, 89563, 193681, 170978, 37708, -116328, -192338, -142005, 6730, 158728, 214519, 140453, -12122]
947a2122j35103l0372R6457J58835J16116m61j16302j61697j03777K1003J26426
958d0997J46660P3397n0370j43842j43625n0753P0828J45354J27954K5717r3140
969F7183j46200j04456N425J14544J52302R1076k5400j19675j34585o0178N7674
980a02290J38223J27693L6220p8571j44104j16893j2262R6498J39194R1545j8601
991A56652j20367j44395p4693M0247J27619J32706M8656o9779j41246j22490k5823
1002a92913Q8980J47534J09874J243j05802j43726q9749K6555J26764J43709P0490
1013A82959m6752j35325j34909m5276P3298J44530J24906K6722q9660j44852j05323
1024a49682J019J06825J44784Q8197k7959j23859j41682p0868M3894J30033J27199
$$ y = [-12122, -147225, -177597, -81140, 77695, 193811, 193350, 77048, -84649, -188426, -167423, -40997, 105663, 179060, 128690, -15152, -158777, -209530, -138702, 6652, 134606, 160323, 67183, -79017, -183473, -178048, -63504, 88798, 179874, 154474, 34799, -99786, -159964, -102290, 35933, 163626, 199846, 121275, -22829, -139722, -151984, -55486, 83708, 175253, 156652, 36285, -108110, -182803, -142556, -14937, 117769, 166425, 96646, -44600, -167090, -192913, -103933, 43601, 153475, 154718, 48916, -94810, -184559, -158004, -31240, 112469, 182959, 136207, 882, -134027, -179303, -106005, 38525, 163431, 190153, 100493, -44359, -149682, -148663, -41838, 102946, 191143, 163184, 39325, -102357, -173225, -129331, 702, 127901]
1035A27901M0874p0476j37577j17642k1129Q8785J36281R6510m760j04958j36652
1046a02843p7966L0396J16939J29546N9402n0912j25238j14649l0051P4849J34897
1057D4370J06652Q992r1166j28863q3886J8790J12417J32926O7665l7795j18272
1068C1830j23010m5758O2305J26029J07054J7778q8641j42318j05580m997R2881
1079g2427J27422P7069k9738j20151j32503o2518M5811J27453J27753M5130o1714
1090G1587j23014j03003j1543R6387J45979J05458O060r2231j28871p7474K8232
1101h2433J13014J23607N5632n2076j32008j28484m6270N5953J16311R8691R630
1112A31567r1026j32377r1222L045R6868J28044P3644k6849j04360j13876m8203
$$ y = [127901, 168775, 98299, -39278, -156920, -178049, -89264, 47017, 143527, 138767, 33809, -102843, -180809, -150413, -33474, 96072, 155474, 104562, -20676, -135325, -165376, -90527, 44370, 151022, 160014, 68848, -60015, -143901, -125111, -12694, 120232, 187897, 150102, 31830, -91180, -136938, -74633, 51396, 158450, 176228, 87587, -54731, -160311, -165308, -72427, 54995, 132064, 102326, -17825, -150328, -212846, -167035, -39582, 88171, 133301, 71587, -51427, -154430, -165973, -69586, 76393, 181851, 187911, 95680, -33191, -110665, -82433, 30581, 154188, 209820, 157744, 25736, -102748, -149018, -93065, 23246, 121937, 131567, 40541, -91836, -183058, -180013, -83145, 44899, 118543, 91694, -12666, -126542, -174745]
1123a74745N4994J24313J12320L2110o4496j18804r4258l006Q9561J22431P9845
1134A60265j3664j00458j19790n8129L9195J10957J14114M2302n9672j20789j02531
1145a08200k1083P4053J22637Q6985q479r7674j27027p9966J7932J02485J13819
1156G5482M8243m8442j19056j17126l7557O5138J22636J04358K2910p3646j17361
1167g4421p7829J7018J04578J32741Q2326j8713j01665j11452m9936M4041J12442
1178E9130J05100K5692p1397j25251j05810k3524P0891J10160P1361j5854r8136
1189B362j22125o8349K9024J03239J09953M9103m3621j05422r2458j5011P3293
1200h0012J20166R4921R948p7667j08480o7511J7629R5339J11074N2252m0352
$$ y = [-174745, -119751, 4562, 116882, 148992, 84496, -34308, -128566, -131572, -42011, 80420, 160265, 146601, 46143, -73647, -131776, -92581, 18376, 132490, 174792, 115120, -5669, -108200, -129283, -55230, 67407, 154392, 145913, 48239, -78788, -158754, -140822, -38337, 75482, 123725, 75283, -43773, -160899, -198456, -133318, -10682, 93676, 116586, 42940, -74421, -152250, -135232, -30654, 102087, 184413, 165700, 64035, -47417, -97353, -53312, 59130, 164230, 189922, 118525, -6726, -112536, -136060, -65169, 44991, 116352, 100498, 2362, -119763, -188112, -159088, -55849, 54104, 103207, 59586, -45836, -138294, -153305, -80012, 40154, 135075, 145023, 67356, -41124, -108635, -91006, 4333, 115407, 167659, 127307]
1211A27307j06473j06531l9969N3598J08778Q9269J1196p5492j17200q4359M186
1222a35690Q6555J11055O5278k4049r9628j09492m7072M3816J07740J04077L2090
1233A34680o1560j12465r0621j1937P6337J16622P9956p661q7507j10192o2565
1244a36913K8665J02163J08874M7746m1990j05102r9642k7840O1024J08107Q6776
1255A31868Q778p7534j13331p5676P725Q4047J05262N5909l2170r8284j01555
1266a04961m1597M5732J03096R2345K1528o0510j02683p8428J81P9825J07280
1277F1808O7582j4420q6685j01482m7807L7247R6732R5068L1792n4400j04216
1288a8781q6400j4028O6143J03909P2496q194q3349j05345o1636K2481R2127J00797
$$ y = [127307, 20834, -85697, -125666, -72068, 36710, 125979, 137175, 61683, -55517, -139876, -135690, -49135, 61920, 127198, 103149, 3521, -105971, -153043, -109227, -1487, 102590, 134680, 73120, -39345, -129966, -141903, -65566, 51056, 131012, 123351, 35844, -74348, -136913, -108248, -6085, 102789, 150535, 108545, 3443, -96199, -124039, -63015, 45092, 131868, 140646, 63112, -50219, -125895, -118170, -34123, 71139, 127048, 94878, -3406, -104961, -146558, -100826, 2270, 94615, 116143, 55633, -47050, -125478, -125297, -45472, 61808, 129390, 114970, 28285, -73197, -121004, -83757, 12975, 108043, 139835, 85435, -18781, -105181, -119209, -53066, 50843, 123339, 115145, 31796, -73549, -135185, -112704, -20577, 80220]
1300H0220M3298m0909r8539r3732k5620O0219J06367Q4453J0719p0454j05726
1311d9704p0363J0444Q2919J03361N7795k7473r4278r8826m1745M1398R8312R0653
1323A02493K2539n9806j01918q0519o896P2336J02730O6148j1250q1173r8713
1334g4029n1184L1118R1080R2538L6714m4342r6407q3797j6788N9343R7391P3259
1346A14896p09p4585r7877n9346J6243Q2468R4460M2508l6316r0004q7457k8209
1358a23928N1613R7086P8108J0275o2846r6843o7438Q789P7682R5522N4362k3261
1370I9121q7233r3325l7939M0144R1628Q5548K2377n6868r7230p5184p066O6953
1382d9074R8678O4533j1931p8007r4145n1837K7290Q8889R0644L5542m0582r1623
$$ y = [80220, 123518, 82609, -15930, -109662, -135282, -75063, 31304, 115757, 126476, 56022, -49704, -120067, -109623, -26704, 76657, 134452, 106979, 12701, -86125, -127870, -86472, 11840, 102493, 125032, 65226, -36692, -117211, -124107, -51771, 50959, 117107, 105857, 24684, -74029, -125213, -94095, -3015, 89523, 126237, 81895, -14512, -98309, -115097, -55754, 41637, 114896, 114187, 39602, -58275, -117621, -101378, -18910, 75550, 118058, 81742, -8262, -95719, -123928, -72315, 24771, 102879, 113154, 50308, -46535, -113973, -105184, -27502, 68020, 122382, 99121, 11888, -81437, -119376, -79232, 12396, 97944, 120321, 63453, -33777, -108961, -116027, -49074, 49604, 114137, 102206, 24199, -69946, -121783, -94493, -5604, 85040, 120582, 80000, -11623]
1394a1623q3766j8942N7443R3928P1990M191o8755r6299n9912J3173P5601R0996
1406F8025M6493l0396q6038q4882l1136M2795R0341P7864J3697n6770q9869o6482
1418a06358J979P0813R1216N2890j7179p6264q7390l9430L5502Q4468P9363K4978
1430A14588m8235r0286p1897p711N9651Q8940O1812r084p3320q8508m8251K2375
1442h9926Q0738Q5559L3481l9245q4772p8398k0264N3224R0412O8254M177o2730
1454D0510r0836n8615J2988P4264Q6557M6084k5660q2076q2751l0468M0975Q5247
1466A6219P7186J6787n4334q7344o5130j913O4111Q8656N4235j5053p2779q4410
1478f3769m2438K8418Q0025P6881K5717m2805q4324p2297j1846N4641Q3449O0110
$$ y = [-11623, -95389, -114331, -56888, 37040, 109030, 113221, 44466, -51833, -111745, -98572, -22971, 68025, 114518, 84122, -1916, -86798, -117934, -75139, 15202, 93066, 106763, 49993, -39876, -106358, -104379, -33566, 57650, 110540, 93361, 17097, -70293, -109723, -74221, 10247, 89610, 114588, 66353, -23933, -95830, -103541, -43890, 45050, 106862, 97778, 24458, -64050, -112301, -89926, -9188, 76371, 109852, 70607, -14165, -92563, -112827, -59603, 30809, 99063, 103240, 40510, -50326, -108941, -95953, -21689, 64868, 110952, 85292, 3216, -79535, -110003, -69028, 16219, 93405, 110192, 55858, -31486, -96616, -98529, -34418, 54238, 108473, 93420, 20641, -63769, -106207, -77789, 2236, 79117, 104834, 62029, -22295, -94592, -106438, -51797, 31652, 91762]
1490I1762k810o5456q3608m6656J9205P3760Q1736L6474l2606p8046p1686k0044
1502i7975M6583Q4288O6077N327n7401q2795n6229Q733O7469Q0361M1323k4756
1514H1005p6557q0104l1393L6247P8299P0080J5792n0552q3627o1400p82O0662
1526d2330Q4717N4366j1907o7756p8288l9346K7376P7450P7044K6879l8936p9152
1538i883o9719j3730N1098Q0703N8206j107o1691q2599m9793J4303O7436P6544
1550E9768L6885k9110p5215p1675k2365M0525P8539O5518R670n1538p7397n4648
1562i1043M478O1724P7870M2694j8972o8305p4212l2103L2763P3483O7222J8404
1574I4003m3247p7142n9170k358N4872P7438N1146r658o3808p4898l8508K2523
$$ y = [91762, 88952, 23496, -60112, -106768, -87563, -13803, 67933, 104407, 71801, -6245, -77931, -97975, -51392, 32896, 98973, 104300, 46899, -35896, -92125, -83392, -15923, 64438, 105761, 81005, 4448, -75656, -107049, -70802, 7497, 77577, 93369, 42817, -40810, -102210, -102992, -42330, 42387, 96753, 84846, 17090, -61198, -100544, -73168, 4282, 81326, 108205, 69269, -9883, -79602, -93332, -42234, 38469, 96675, 95568, 33877, -48722, -98515, -84212, -16776, 59768, 96653, 67543, -7672, -79347, -101712, -61187, 17352, 82870, 92540, 41002, -36395, -91043, -86565, -24841, 53029, 95723, 76751, 8446, -65766, -97869, -65106, 8377, 75599, 94003, 50756, -26386, -85556, -87914, -33042, 44396, 95542, 85884, 22076, -52822, -91330, -68807]
1586f8807O9870P1436K4875l7565p4537o6289j4687M7010P6540N5084q54n6422
1598B5654p7310m7068J4792O5943P3836L6874k4879p0513o8312k0805L9091P4550
1610B1853O4039J0987m9521p5686n3148J853N6845P4485M2092j8051o5792p1707
1622f1751l3586K8081P0246O4895J8768l8531p2451n8998m881N0681P2541M9652
1634H4666n670n8732p1685l7870J9177O3561O8410K7807l1883o9361o0340j4410
1646h6330M2027P2976N4854J440n0768p0204m5824J0613O0492O8606L3483k3786
1658F7579o5932o7751k4068L4306O7452N7866J1001m5874p2023n0965K570N3472
1670c2367P1788M4089j3074n9894o5544l0259K5739O7634O5086K0355l5822o8023
$$ y = [-68807, 1063, 72499, 97374, 59809, -14728, -81017, -95704, -48694, 27846, 82930, 82076, 25654, -51656, -98724, -83932, -17989, 55847, 92721, 67842, -2671, -70983, -91788, -52697, 21853, 85892, 96879, 47358, -28328, -81476, -79623, -22778, 51707, 93799, 75748, 9956, -61751, -95337, -67256, 2990, 67885, 86653, 48122, -24329, -83327, -88208, -37527, 35014, 84666, 78996, 20264, -51421, -89291, -70114, -6553, 61857, 89664, 57781, -11580, -71920, -86330, -44303, 28673, 83527, 84967, 34199, -36005, -81829, -71216, -10724, 57882, 91365, 67579, 1647, -66104, -90172, -55866, 11586, 69452, 80453, 34579, -37444, -88409, -85839, -32367, 39421, 83510, 70436, 10542, -55002, -85261, -59522, 8112, 73198, 93553, 57731, -10292]
1682a0292n7752r166M6144O9259M6880n770n5387p2093m1568J4640N8550O3553
1694D6998K8259k6902o5078n8905j4366L9787P0048N7730P736m5324o5439m3400
1706f8856O558N4082O5771L2564k2031o2218o5316k7170K8799O2700N4980J1439
1718G1302l9561o5700m9194J173N0393O6993M3036q741n5066o2443k8535K4028
1730e2315O2508O1285K0244l4592o5202n4510j0456M0535O3623M2986o576n3014
1742A4516o6759m0244J4054N7483O2805K9324k2668n9153n5579j2682L9083O6763
1754B6943N4226P719m3978o5015m3249M706M8942O1436L1954k0639o0066o2284
1766e9305k7811K4631N9556N3802J2873l6085o1406m7498j37M8615O6493M3171
$$ y = [-10292, -68044, -77210, -31066, 38193, 85073, 79303, 23916, -48177, -89745, -75105, -16555, 46998, 75257, 48355, -16723, -75628, -89994, -50207, 19841, 77571, 85307, 39983, -25456, -68856, -62298, -8216, 57555, 90119, 68088, 5870, -59446, -86616, -57817, 4883, 59863, 71302, 31741, -33959, -83153, -81980, -31587, 35406, 78442, 69701, 14635, -47808, -76343, -52315, 10193, 71478, 91722, 57130, -8072, -62582, -73038, -32503, 31120, 74106, 67530, 14516, -52243, -92487, -78433, -20950, 41855, 71179, 48511, -10642, -66221, -78903, -39820, 26943, 81169, 88888, 44910, -20105, -63354, -58648, -9706, 51730, 83684, 63045, 2979, -59305, -87116, -62485, -2929, 50873, 63746, 27661, -33745, -81243, -81380, -32765, 33728, 76899]
1778G6899n026m8605n9136k8018K0998N6419N6442J9811l1564o3164n4593j3497
1790g3034L4464N8588M2325l617m8181o2118l7207J2068N4855O0795K8692j9767
1802D7863n3951n2091j3981L5776O1789N0320Q131l9137o1523m2454L231M5335
1814a0692N7778L1969j7024n7033n9568k6653K2775N6739N2420J3557l4448n8244
1826b8424m5684k293M3915O1741M0576m773m5979n7194l0795J7715N3633N5034
1838E7472K1494k6545n8693n1787j1989L4169N7479M3649J52m4192n8177l5501
1850g2469R583M8765N7088K7709j8400n1586n1634j8283K8819N7050M7091P481
1862G1214l6735n8903m2327K423M3505N5164L1848j3239n0526n4344k2522K2605
$$ y = [76899, 71873, 23268, -35868, -63886, -42888, 13531, 69973, 89784, 58220, -4944, -59537, -73034, -38570, 20018, 62343, 58726, 10545, -51573, -88780, -76712, -21857, 38938, 67630, 47863, -6088, -58179, -72160, -36384, 25405, 75725, 83856, 44719, -16804, -59258, -56027, -10692, 47086, 79055, 62031, 4998, -54570, -81223, -58448, -1709, 50711, 64268, 29820, -28424, -74108, -76401, -32486, 29255, 69831, 65058, 19079, -38115, -68910, -51195, 2438, 57472, 78966, 52421, -6272, -58059, -70048, -35879, 21600, 65249, 65401, 21209, -36968, -72469, -62886, -14121, 42967, 70676, 52276, 690, -50944, -69227, -40408, 16642, 63733, 71214, 34479, -24424, -66751, -64328, -20823, 34341, 66189, 52950, 2424, -51920, -74442, -51837]
1874e1837N3341N1190J5731l0198n4471m3395m454L8521N7792L8754o190m4880
1886A9904n5883l0880J5254N1216N1847J9414k4609n4271m8908j1802L2757N3679
1898A7718M1542K282m0278n5890l5063P493M5296N4760K9244j6888n0492m9570
1910d9846j8166K6434N4462M6630P929l3667n3475l9903J49M1110N2737L1582
1922F5976r403m5262n2737k5030J9029M8959M8445J6050k8086n4060m3317n500
1934f4936L4967N3507L7268m250m1687n0916k8440J2465M6979N0336K0408k0323
1946D5378m9039m6325j3238K9667N2536M0114L134l6839n3817l4819P346M2696
1958a3206N0489K6640j5764m7747m7807j7509K3252M8903M4295R774l1062n0938
$$ y = [-51837, 1504, 52694, 68425, 38227, -16244, -59639, -64093, -25572, 32220, 70974, 64784, 19904, -35979, -66859, -51605, -389, 51458, 70872, 46263, -8008, -56916, -68718, -35961, 17718, 59260, 61542, 21264, -34626, -69689, -62196, -16900, 37860, 67104, 50216, -276, -49846, -68012, -41578, 12884, 59514, 67443, 33776, -19699, -59602, -59453, -18343, 34394, 65976, 56573, 11311, -41426, -66456, -47427, 1532, 49977, 66027, 37941, -16119, -59436, -64936, -29969, 23538, 60806, 56556, 14869, -36047, -64487, -52022, -5043, 45293, 65701, 45378, -3661, -49986, -63224, -33557, 18979, 59093, 62227, 25388, -28429, -63248, -55902, -13206, 37283, 63923, 48159, 412, -47395, -64904, -41652, 7251, 51546, 61320, 30258, -20680]
1970b0680l8480j408L7857N2847L2364q621m2778m9922k4001J8283M8570M5650
1982D9681J5061k4954m9643m1584o326L2417M8730L5836j163l8895n0284k9840
1994f0964R380M2066M8234K0904k1002m7973m4706j3076K7455N0138L9507L651
2006E3614l2596m6808l1799O307M0564M8313K6528j0906m2827m6401j8754K0932
2018c3833M6336M2093J0018l0677n0480l7460k218L4098M7517K9197r316m1022
2030D253m6269k3190J4940M4252M4415J6408k0849m4841m0152p025L1257M8855
2042B2054L5958k13l6437m9016k7981R914M0466M4974K0345j8249m4752m1541
2054d4478j2873K3255M5577L8473N529l0539m5958l2838K284L7517M7830K6310
$$ y = [-20680, -59160, -60568, -22711, 30136, 62500, 53879, 11101, -38821, -62822, -44539, 4031, 49681, 64742, 39788, -9855, -51439, -57765, -25348, 23382, 59218, 58055, 19160, -31124, -60964, -51584, -9518, 38716, 59620, 38618, -9355, -54061, -67137, -39682, 10456, 49963, 53614, 21018, -25790, -57589, -51282, -10718, 37595, 64123, 53217, 10390, -36011, -54765, -33833, 12503, 54596, 64614, 33937, -16543, -54003, -56221, -22123, 25394, 54591, 45275, 4253, -42016, -65206, -50266, -6014, 38401, 54809, 33960, -10881, -51033, -58058, -26801, 22054, 58012, 57799, 21362, -27654, -55635, -45721, -5255, 39719, 60064, 41815, -2937, -44478, -57351, -34096, 11481, 49954, 55483, 24944, -21014, -53852, -51568, -14051, 33779, 60089]
2066F0089j0972m1314m4737j8845J9950M3342L8696Q971k6839m6603l5911l203
2078e7376L0319M4215L0212n112l7039m3959k3342J3411M2747M4557J7180k0135
2090C5678m2432l6881o265K9932M6808L3438j56l2144m3996k7625P524L5866M0977
2103D0724J9853j6622m3432m3435j6050K0252M1834L5984M070l1120m5560l1137
2115f4639K573L5435M5228K5992q475l5284l8638j5889J9158M3569M0336J3617
2127F2983k1092m2353l5647m139K9330M2883K8555n809l7572m5043k3661J0408
2139d1157L6891L8648J4285k0414m1113l5692r328K4308M2798L3372K505k8389
2151A6714m1332k6959O642L6747M1829J9869j4673m0828m0711j3791J9937L9183
$$ y = [60089, 49117, 7803, -36934, -55779, -35829, 7513, 46209, 55180, 28341, -18262, -54173, -57376, -27057, 17158, 47370, 42258, 5219, -38740, -62082, -48671, -5924, 38633, 55813, 35678, -6754, -43635, -49900, -19968, 26840, 60278, 60122, 27978, -16018, -43643, -36119, -253, 40724, 60577, 43955, 523, -42912, -58962, -38710, 3124, 39108, 43178, 12058, -33502, -64639, -62066, -26631, 18597, 44589, 36114, 830, -37808, -53697, -34539, 9030, 49366, 62983, 41891, -462, -36109, -40248, -10918, 31965, 60520, 54711, 17139, -27904, -51565, -41157, -4266, 34382, 48667, 28253, -12860, -48552, -57880, -33572, 9226, 42598, 45103, 16714, -24618, -51577, -44935, -8188, 33641, 53510, 38837, -1991, -42702, -56493, -36556, 2627]
2163B627L3668N899k5666m0042k6862L703L2867M4292K8462n403l3420l8438j7995
2176c6308J5214L9695L6874R347k4888m3622l6161o864K5314L7035K2813p148
2188C1301l5142m3194k4761Q067L4405L8437J8542j3460l5300l1186l874K8775
2200b7390M7664L8273O958k5370l7049k3729O308L2392L7091J5575j6244l9650
2212A4829m1878j9464J2996L2834K9044M752k5553m1977l1246J43L0781M1344
2224F605K7438m342l0921l4863j3428J6862L8837L7167J2219j9197l6536l1671
2236c1830o495K3339L7615K6007k752l0791l9659k3866Q563L4943L7099J6566
2248D8739j5217l6285l3363p341K2437L7469K9428K951k6478l8115k5609J711
$$ y = [2627, 36295, 42194, 16528, -23514, -50376, -46673, -13806, 30486, 58948, 53545, 20125, -18313, -36308, -21094, 18601, 55475, 64822, 39934, -3688, -39849, -46713, -21399, 15636, 38449, 31301, -3841, -47035, -71796, -63729, -29324, 9113, 27655, 14195, -21105, -52291, -56165, -27390, 20274, 58547, 65505, 40135, 3086, -20643, -14335, 18057, 55148, 70723, 54479, 14829, -27049, -46513, -33517, -683, 28361, 33113, 7560, -34417, -65663, -65520, -34739, 6605, 34043, 29701, -1220, -36083, -49511, -32649, 6188, 43355, 55574, 36377, -159, -31830, -38325, -14986, 22629, 48636, 45884, 15093, -24566, -48432, -39869, -4926, 32173, 48739, 33522, -2763, -36126, -43467, -21030, 16439, 45867, 48818, 22340, -15775, -41384, -39673]
2260c9673K7785L5933J8323j2630l6130l7731j6270J5793L7372L3414P487k0559
2272A3114l4325k5082L667L1885M0072K5908k719k8414l4936j7407J0703L1104
2284A3570L2238R987k0882m0106l4747r070K0510L5525K4932l374k9062l5543
2296c6022k0437Q976L3532L6043J6653j0540l0467l0161q098K0460L6459K9765
2308D6163M973k3837l7610k5580J978K7814L4222J8412j1900l3987l4233j3430
2320d7015J4561L3514L0694P154j9498l3367k6211j759K5378L6104K3632l975
2332C9212k8734l6047j8671J1102L2306L2135J1342j6962l4712k8836m551K2206
2344b0210L4644K5971L19k4965l3030k0443N035K8717L3823J6099j2689l2700
$$ y = [-39673, -11888, 24045, 42368, 29738, -6392, -44123, -60393, -44600, -7228, 26186, 33673, 13114, -21211, -46293, -42626, -10741, 29331, 55239, 52520, 24106, -10830, -28237, -17534, 13570, 45808, 55795, 34913, -5193, -39940, -49010, -28500, 7025, 31957, 28583, -479, -36022, -56459, -47483, -13951, 22092, 38745, 28205, -2262, -32423, -40521, -20061, 16398, 46163, 51136, 27299, -10311, -35891, -33913, -6099, 28123, 46535, 34635, 648, -33585, -47015, -32454, 1060, 31754, 38908, 19410, -13957, -40168, -41927, -16549, 19555, 43187, 39212, 10478, -25569, -44240, -33138, -832, 31303, 42645, 25683, -9029, -37865, -42416, -20210, 14434, 40405, 40724, 15759, -17271, -37714, -32679, -3962, 29861, 45960, 33271, 571]
2356E71l2461j1594J7139L3651K6691K262k3340l5009k3780K566K6384L2934J9491
2369C5505o008k7484l0039j1839J4508L3258L2532J0334j7953l3505k6796l260
2381c0747K2126L2438J9969o946k9431l4358j8964Q048K8914K8985J1202j3716
2393A7520l0844k7488n436K0745L3677K6537L287k3166l2338j9309O683K8395
2405a737L3101J5692j1940l0269k9348j0183J5253L0283K5228L066k0836l2859
2417a4549k4380k45K4103L1861J8738n692k8033l0930j3692J3561L0713K8765
2429C0220Q714j7714l1177k4037k141K0792L1176K1620k787k4674l0572j7318
2441c7898P174K8092K9772J2074j3086l0022k7915o867J9349L1540K3139R68k2001
$$ y = [571, -31890, -43484, -26345, 7306, 33997, 36259, 12919, -22090, -45870, -43304, -16920, 16014, 35505, 29497, 2013, -28026, -39865, -25357, 7901, 40433, 50767, 32814, -691, -27487, -30747, -8621, 23817, 43786, 36840, 7409, -26949, -45913, -37865, -8951, 20034, 31236, 17520, -13324, -40812, -46248, -25503, 8174, 34711, 37998, 14832, -17506, -36815, -30132, -1737, 31364, 47056, 35116, 4847, -24501, -34684, -19431, 10852, 36080, 39146, 18310, -14549, -38929, -39174, -15071, 16790, 35528, 29836, 1803, -29127, -42819, -29258, 1455, 30220, 38934, 21220, -9957, -33994, -36135, -15343, 15833, 37453, 34666, 9992, -20580, -37898, -30724, -2632, 27140, 39214, 26128, -3894, -31809, -38676, -19327, 12213, 35352, 36320, 14319]
2454A4319l1237j9037N168K4899K9169J5330r570k8037k8103j0837J3581K9483
2466E128K6607M939j9653l0888k2329J75K3420L1217J7517o683k5394k8815j3543
2479c8302J1567K7891K6374Q957j4357k9461k4209l080J9488K9989K1846j629
2491C5074k4163l0301j6892P031K5538K8533J1030j3381k7586k5426p275J6750
2503b1068K9752K2705K374j8918k8533j9407L472K4581K9040J5425q000k6777
2515D646k8128j0281J3005K7023K3931L777j9246k9407k1738j180J9529K8268
2527A0199J7479m466k3069k6447j3191J0208K8562K7851J0105j2201k6670k3111
2539b4751k644J9979K8358J9554j278k2714k8738j6461N030K2059K4943J0933
$$ y = [14319, -16918, -35955, -30787, -5888, 23281, 38611, 29041, 1004, -27099, -37936, -24355, 5128, 31735, 36674, 17021, -13867, -36196, -36021, -12601, 18616, 36133, 29450, 4056, -24759, -38302, -26735, 1156, 27530, 36487, 22130, -7331, -31540, -34620, -15132, 14857, 36703, 35074, 10911, -19390, -36282, -29251, -3713, 24820, 35850, 22469, -5117, -30543, -37818, -21068, 8684, 31389, 33763, 14845, -13688, -33095, -29623, -5042, 23998, 39423, 31423, 4646, -23482, -33763, -20758, 6265, 30196, 33973, 14727, -14680, -36418, -37598, -18069, 10199, 27678, 23212, 143, -26304, -39495, -29287, -725, 27126, 37231, 25030, -1640, -24751, -27395, -7416, 20942, 40496, 39218, 16504, -12234, -28695, -23665, -1606, 23337, 34270]
2551C4270j2260k7770k6166q777J3684K7415K2338K394j8956k6955j7952L722
2563c5013K4095K8597J5402o374k2841k5096r545J2610K6359K3644O067j5298
2575B2607k7522k1089j118J8641K6739J7609m282k3814k7367j3172P691K4586
2587d91K4551P804j3401k6237k2182m817J6607K6451J8903j61j9397k6955j6355
2600c5680N260K2960K6236J2321q990k5009k3343o244J4281K6234K1807K770j7448
2613A5155k5852j7227J734K0462K6224J4598o075k2370k4413j1233J0395K5367
2625F765K2115N431j5162k6970k1174j781J7473K4704J6110l283k1945k5251j3203
2638c6171P227K2167K3667R387j2055k4167k0931m385J6239K7276K0228R57j6860
$$ y = [34270, 22010, -5760, -31926, -40703, -27019, 396, 22734, 25128, 6172, -20783, -38735, -35013, -10918, 17679, 33081, 26707, 3866, -21230, -30775, -18165, 8194, 31838, 37905, 22607, -4915, -26004, -27122, -8481, 18258, 35867, 31585, 7771, -19596, -32768, -25077, -491, 24060, 31864, 18463, -7774, -29956, -34773, -18166, 8285, 27188, 27027, 7630, -19325, -35680, -30420, -7460, 18776, 31097, 22107, -2902, -26245, -32489, -18208, 8026, 29833, 32603, 15155, -10697, -27924, -26190, -5728, 20496, 35094, 29019, 6649, -17764, -28997, -18602, 6765, 28880, 34311, 19149, -7821, -28995, -30776, -13303, 11401, 27511, 24228, 2283, -22968, -36171, -28944, -6777, 16890, 26277, 14222, -9945, -30876, -35261, -19022, 8254, 28482, 29439, 12579]
2651A2579k3684j4214N262K2598K4660J1560q413k3608k3465q190J1574K2775
2663I434J9265K908j6983k6037j8353J0J8037K4237J3643o359k2285k3527j0862
2676c6872R644K3823K1994O173j2769k3089j8691j419J7517K4883J6746j494j8336
2689H110k3867j2059P245K2547K3455J0332r763k2973j9822m472J3857K4056J7525
2702C4171n04j8661k4577j6208J155J8014K1914R563q841k2801k3312r013J0748
2715b8352K2888J9337M190j4056k3184j5540K730J9660K5703J6062k170j8049
2727I219k0387q297R167K2013K1407N965j3182k3629k0036m348J4099K2299J4514
2740B8804k906j8953k3960j3228N353J9841K0742Q156r798k2446k0617n401J2337
$$ y = [12579, -11105, -25319, -20057, 2541, 27201, 38761, 30348, 6740, -16725, -24915, -13341, 9434, 28699, 31607, 14624, -11413, -29766, -29756, -11719, 12518, 26161, 19802, -2483, -26010, -36872, -27228, -3405, 18589, 24762, 11993, -11096, -29787, -31206, -13689, 11194, 27940, 26446, 8110, -15757, -27816, -20571, 1976, 25431, 35763, 26000, 3027, -16795, -21267, -7410, 16646, 34171, 33667, 15006, -9571, -25779, -24624, -6610, 15304, 24867, 16026, -6775, -30087, -39100, -28352, -5464, 13873, 18063, 4007, -19177, -34717, -31987, -12327, 13376, 29438, 27268, 9219, -11168, -19465, -10298, 11715, 33122, 39087, 25905, 2276, -17760, -22108, -8009, 14290, 28804, 25898, 6945, -17015, -30243, -24890, -5049, 15693, 23849, 14051, -8395, -29012, -34413, -22076]
2753b2076K1943J7624K005j5945k1974j3836L688J9611K3809J3029n695j8707
2765C476j9218o742J1736K3390J9550M497j2721k1871j6882p02J5996K0571J1653
2778C2733m863k1195k4209j2639N335J7501J8197M573j2743k3007j7866k253J5135
2791b5301K3675J7816J163j3643j8206r042P594K1804K2935J0370o890k0007k0041
2804g773o817J0708J9076J4375o87j6927k4797j6142M92J5628K0020J0801o080
2817A1877j9159j8881o708J0158K1939J9922N470j0704j9825j5027p3J5947K1493
2830A6429J2570l540j8007k1661j0921O319J8231J8026O387j0236k0512j6711
2842b3626k418J3412K1702J5952K85j5172k0186j1371L964J7741J9840P988q557
$$ y = [-22076, -133, 17491, 19496, 3551, -18423, -32259, -28571, -8960, 14849, 27878, 22183, 3476, -15742, -22484, -10748, 12642, 32192, 36689, 23968, 2097, -14785, -15487, 509, 21080, 32733, 27870, 6675, -17534, -30173, -24838, -7337, 10860, 15433, 2690, -20317, -38183, -40436, -25301, -1626, 16190, 17353, 3710, -14496, -23538, -15944, 5860, 28795, 39165, 32275, 12268, -7773, -14590, -3882, 15194, 29569, 28882, 11955, -12842, -28984, -28492, -12864, 7156, 17957, 11877, -7282, -26163, -32871, -22713, -774, 19148, 24618, 13914, -5911, -20938, -21011, -5064, 16429, 28999, 25459, 7452, -14209, -25130, -18811, -580, 17446, 23833, 13597, -6915, -23626, -26044, -12632, 9070, 25022, 25307, 10135, -10051, -21422, -17458, 283, 20123, 28111, 19554]
2855A9554k0201j9268o858R996J9482J4722J146j3574k0909j4056K487J6951K0693
2868A0165J2677l405j6249j7653n747R916K0194J8758M405j2104k0442j6482k606
2881a8573J2466J8410J0238m796j7930k1198j1018N114J8081J8140P067p876j8042
2894i917j5384j032J4221K1459J5954J999j3241j8684j0728M248J6317J8168Q536
2907C1916q782j9438j8767p500Q083J7862J4162P13j3636j9866j3704Q83J5514
2920a2560J9566J1010l601j6049j7442o477Q690J9229J7238N715r659j8406j3997
2933a6743p00J2949J9074J2496k870j5755j8881j0490M013J6520J6964O059q851
2946A3785j8473j6099m073J1370J8812J3651N67j2982j8934j1556L761J5057J7791
$$ y = [19554, -647, -19915, -26773, -16777, 2705, 17427, 18573, 4999, -15910, -29966, -27479, -10528, 10165, 22842, 19437, 3188, -14465, -20212, -10296, 9898, 28656, 33061, 20957, 515, -15967, -18573, -6107, 12303, 22541, 17745, -185, -21383, -32401, -27287, -9206, 8934, 16001, 8125, -9917, -25301, -26333, -12112, 9347, 25301, 27300, 14059, -4625, -15353, -11105, 5212, 23380, 31916, 23134, 3696, -15071, -22571, -14488, 3374, 17536, 18249, 4613, -15253, -28957, -28074, -12560, 7006, 18016, 14415, -1634, -19076, -25553, -16863, 2366, 19604, 25319, 15660, -2746, -16743, -17443, -4494, 14580, 27076, 24206, 8451, -10430, -20920, -16907, -387, 16577, 22636, 13785, -4688, -20787, -24860, -13490, 5322, 18973, 19540, 6558, -12376, -23932, -20171, -5114, 12677]
2959A2677Q893n844j7384j6397n175Q869J8260J5944K719j1589j7609j2821P03
2972a8754J4190J8431R801l562j5450j8104q160O957J7008J5405M803r864j7952
2985e251j4552j512J1687J7821J2016j588j4616j7798r435M410J5559J7380O796
2998B0917p593j6591j5126l511J0460J8421J3267R75j2098j7722j1348K604J4766
3011b579J7018Q233n268j6283j6563n530P560J6319J4179K552j1306j7607j2181
3024b1456K24J2853J7685J0669l043j4003j5625p136O508J6941J5508M858q635
3037A5348j6924j4568k172J0890J6288J0719j486j4132j7717r792L585J4368J5921
3050A0328O812o776j5991j3868l258R689J7733J3938J654j0622j5782j0394K475
$$ y = [12677, 21570, 15726, -1658, -18055, -23230, -14361, 3899, 19843, 22562, 10973, -6636, -19457, -18754, -4564, 13867, 23668, 20106, 4656, -13448, -21608, -14651, 2357, 17762, 22565, 12701, -5251, -19803, -21315, -9628, 8193, 20209, 18621, 4005, -13793, -23228, -18818, -3259, 14121, 20917, 13324, -3267, -18393, -21904, -11444, 6977, 20244, 21219, 9121, -8601, -19949, -17345, -2579, 14439, 22672, 17404, 1121, -15442, -20972, -13412, 2907, 17086, 19638, 8332, -9275, -21456, -21232, -8379, 9306, 19975, 16932, 2929, -12696, -19832, -13324, 3617, 19125, 23983, 15348, -1576, -16144, -18316, -7426, 8862, 19581, 18095, 3963, -13754, -23546, -19961, -5593, 10328, 17140, 10364, -5627, -19495, -22753, -13064, 4669, 18607, 20261, 9639, -6143, -16537, -14062]
3063a4062J4391J6267Q000m720j5189j6280o386P049J5029J2847K571j0507j7531
3076h521j2378m05J1396J6159J0453k871j3617j5497o765N426J5590J5448M899
3089A9317q041j5216j3411k036J0584J6414J0983l84j1840j6458q639M100J4200
3102d27J5376P056n193j5058j3991l611Q431J5294J2357Q53j1814j6421j1231
3115a8379N17J1829J5005P405n088j4345j5287o204O665J4763J3913L453q124
3128F123j4927j0950J171J2153J6444J0887q24j1969j4663o854M744J4063J3931
3141A9329M703q488j5472j3631l404Q554J4642J0226j536j1580j5258r697K520
3154a9092J3144J4695O765n246j3668j3249l673Q714J4934J2398K092r533j4899
$$ y = [-14062, 329, 16596, 24596, 19876, 4687, -11593, -17979, -10930, 4099, 16946, 19517, 9010, -8521, -20899, -21304, -9908, 6251, 16704, 13833, 216, -15281, -22046, -16620, -1030, 14418, 19317, 11276, -3940, -17351, -19387, -8803, 7611, 18594, 18210, 6370, -10088, -18727, -14627, -427, 14949, 22005, 16812, 1754, -12237, -15848, -7417, 7877, 20234, 21087, 9273, -7148, -18379, -17862, -6033, 8972, 16377, 11289, -3056, -18343, -24547, -17882, -3119, 10794, 14247, 6123, -8804, -19754, -18583, -6430, 10014, 20901, 20077, 8108, -6555, -13409, -8665, 5398, 19329, 24032, 15544, 72, -13559, -16963, -8409, 6233, 16459, 14923, 3343, -11915, -21612, -19092, -5948, 8747, 15512, 10266, -3402, -16651, -20324, -11610, 3324, 15722, 17814, 8281, -6618]
3167f618j0080J057J1393J4935Q263m142j2989j3999n897N938J4439J3457L040
3180A8797p705j4317j1677p33J0531J4603R249j424j1929j4852p427M201J2863
3193A80J3244M647o636j4785j3026k788P883J4153J0351k98j0961j3914q868K634
3207a8184J2667J4634P083m379j2563j2639l295P785J4565J1876K223q612j4157
3220b996r568J099J0755J3690P946l218j2885j4118o300M365J2194J1732K628
3233A5324q781j4100j1625j633R422J4020R497j523j0157j3584o720M504J3086
3246b270J3809N583n166j2710j1405k089Q418J3667J0449M05r992j3898q493J552
3260a2140J1516J3000O226m811j2420j2357n105O632J3092J0645J526q538j4398
$$ y = [-6618, -16698, -15641, -4248, 10687, 18950, 14808, 1819, -12180, -18077, -12139, 2300, 15757, 18797, 11092, -3225, -14902, -15635, -5104, 9499, 18748, 17324, 5395, -9457, -16884, -12683, 180, 13424, 18071, 11435, -3350, -16376, -19164, -11281, 2872, 13223, 12925, 1964, -11950, -20818, -18184, -5517, 9117, 16200, 11821, -742, -13381, -16676, -8891, 5674, 17550, 19773, 11161, -2996, -12564, -11465, -710, 12980, 20926, 17708, 4823, -9295, -15595, -11230, 964, 12696, 15324, 6543, -7557, -19182, -20815, -11393, 2627, 12124, 10601, 444, -13140, -19860, -15356, -2270, 11539, 17122, 11956, -754, -12159, -14248, -5830, 7837, 18286, 18691, 8699, -5199, -13692, -12140, -624, 12376, 18602, 13791, 1371, -10986, -16091, -9459, 3633, 14278, 15804, 7266, -7132]
3273g132j0034K9R764J2868P226k632j1891j3096n234M863J2567J2326M087o560
3287G151j2580r683j71R343J4466J0044j76r614j2188o890L810J1710J2392M279
3301B1893o002j3264j2900m229O091J1525Q597n75j0438j3725r039J283J0127
3314a0656J2814P697l178j0906j0477k932P083J3926J2302K893o750j2059q882
3327i125Q1R511J2250P014k805j1182j3237o565L787J0977J0393L210o566j2897
3341e154j0603j604P914J2405R166n16j0035j2020o478L000J1366J2226N284m717
3355A0234j1184j0713l085P181J2516R271R70p970j2533q101J347J0092J1995
3368A0020O450k896j1210j1165m441N013J1273J0059J857p707j2696r490p94P928
$$ y = [-7132, -17166, -17137, -7373, 5495, 12721, 10089, -1802, -14898, -20132, -15269, -2702, 9624, 13711, 7151, -5429, -15112, -15283, -5940, 8526, 18570, 18394, 8780, -3408, -10298, -6488, 5222, 17614, 21893, 15891, 2627, -10273, -14502, -8411, 3114, 11711, 11136, 698, -13027, -22066, -20783, -10656, 2158, 9855, 6677, -4229, -14706, -17638, -10555, 3371, 15673, 18566, 11816, -243, -9125, -9044, 467, 12717, 19731, 16926, 5744, -7493, -14058, -10271, 706, 11099, 14309, 7743, -5154, -15757, -17361, -9447, 2958, 12124, 11608, 1573, -10447, -16925, -13925, -2559, 9667, 14951, 10234, -950, -11663, -14748, -7567, 4949, 14220, 15190, 7220, -5313, -13414, -12067, -1975, 10020, 16470, 13574, 2364, -8801, -13242, -8229, 3044, 13103, 14960, 7253, -5443, -14933, -15727, -7799]
3382g799J2058P128k083r765j1580n666M728J1676J1472M113m969j0749r573o34
3396a1643P948J2045Q664J64r335j2133o849J614R262J0600M182n153j2222j0796
3410a3652l851N628J1549R225J337p588j0840p666J439J0300J1777O639k214r760
3424B323j0530l930N241J0731J0102K656o716j1768q509q22P266J1364P002k040
3438A2370r946j1145o038K682J0177J0276L362n517j0393r610k023P416J1414
3451C025Q188O47q169j1052o430K611R917J0543N360l411j0392r878l050N592
3465f499J0894R202J235p262j0961p735K14Q311J0700N609l172r608j0776n039
3479a4887M052J0158Q959K606o155j0761q370l43P710J0778Q152q23q463r936
$$ y = [-7799, 4259, 11387, 9304, -461, -12041, -17707, -12979, -1303, 10169, 14282, 9313, -1436, -11009, -11643, -3695, 8350, 17014, 17178, 7843, -4290, -11139, -9525, -263, 10337, 14519, 9366, -2856, -13652, -17503, -11875, -326, 8899, 10236, 2648, -8192, -15858, -14419, -4119, 7658, 14297, 12083, 2323, -8207, -12137, -6896, 3835, 13937, 16593, 9877, -1891, -10400, -11222, -3956, 7408, 14410, 12370, 2424, -8721, -14759, -12077, -1900, 8376, 11738, 6221, -4172, -13782, -15805, -8389, 3025, 11213, 11860, 3691, -7361, -13791, -11180, -1263, 9280, 14640, 11229, 837, -9041, -12091, -6499, 4395, 13597, 14832, 7570, -3391, -11126, -10912, -2601, 8099, 13708, 10536, 928, -9848, -14887, -10835, -677, 8282, 10888, 4733, -6028, -14398, -14741, -7031, 3747, 11899, 11076, 2613, -7323]
$$ [...]
8191G59
##END NTUPLES=NMR FID
##END=
