##TITLE=H1
##JCAMPDX= 6.0         $$ Bruker NMR JCAMP-DX V2.0
##DATA TYPE= NMR SPECTRUM
##DATA CLASS= NTUPLES
##ORIGIN= UXNMR, Bruker Analytische Messtechnik GmbH
##OWNER= root
$$ XWIN-NMR		Version 3.5
$$ Sun Jan 10 10:02:37 2016 Russian Standard Time (UT+4h)  servis@DPX200
##.OBSERVE FREQUENCY= 200.131235884673
##.OBSERVE NUCLEUS= ^1H
##.ACQUISITION MODE= SIMULTANEOUS
##.ACQUISITION SCHEME= undefined
##.AVERAGES= 1
##.DIGITISER RES= 18
##SPECTROMETER/DATA SYSTEM= spect
##.PULSE SEQUENCE= zg
##.SOLVENT NAME= DMSO
##.SHIFT REFERENCE= (INTERNAL, DMSO, 0, 16.5164)
##AUDIT TRAIL= $$ (NUMBER, WHEN, WHO, WHERE, WHAT)
$$ ##TITLE= Audit trail, XWIN-NMR		Version 3.5
$$ ##JCAMPDX= 5.01
$$ ##ORIGIN= Bruker BioSpin GmbH
$$ ##OWNER= servis
$$ F:/spectra/data/servis-vadim/nmr/H1/1/pdata/1/auditp.txt
$$ ##AUDIT TRAIL=  $$ (NUMBER, WHEN, WHO, WHERE, WHAT)
(   1,<2016-01-10 10:01:26.46 +0400>,<servis>,<DPX200>,
      <created by zg, POWCHK disabled, PULCHK disabled
       configuration hash MD5:
       00 E9 B6 7A A2 85 ED C7 34 08 36 98 17 FE 4E 26
       data hash MD5: 16K
       C8 16 E1 57 3B A3 C0 C2 B8 42 EA D2 78 84 E9 EA>)
(   2,<2016-01-10 10:01:29.12 +0400>,<servis>,<DPX200>,
      <Start of raw data processing
       efp BC_mod = 2 LB = 0.3 FT_mod = 6 PKNL = 1 PHC0 = -219.5752 PHC1 = 3.843713 SI = 32K 
       data hash MD5: 32K
       2F EF 7E 6B AD D7 1B 77 A3 44 A3 78 FD 1B D3 4F>)
$$ ##END=
$$ 
$$ hash MD5
$$ B1 F9 22 03 52 A3 98 46 93 D5 C6 A8 A8 D5 AF F4
##$RELAX= 
##$RELAX= 
##$RELAX= 
##$RELAX= 
##$RELAX= 
##$RELAX= 
$$ Bruker specific parameters
$$ --------------------------
##$DU= <F:/spectra>
##$EXPNO= 1
##$NAME= <H1>
##$PROCNO= 1
##$TYPE= <nmr>
##$USER= <servis-vadim>
##$AMP= (0..31)
100 100 100 100 100 100 100 100 100 100 100 100 100 100 100 100 100 100 
100 100 100 100 100 100 100 100 100 100 100 100 100 100 
##$AQSEQ= 0
##$AQ_mod= 1
##$AUNM= <au_zg>
##$AUTOPOS= <>
##$BF1= 200.13
##$BF2= 200.13
##$BF3= 200.13
##$BF4= 200.13
##$BF5= 500.13
##$BF6= 500.13
##$BF7= 500.13
##$BF8= 500.13
##$BYTORDA= 1
##$CFDGTYP= 0
##$CFRGTYP= 5
##$CHEMSTR= <none>
##$CNST= (0..31)
1 1 145 1 1 1 1 1 1 1 1 1 1 1 1 1 1 1 1 1 1 1 1 1 1 1 1 1 1 1 1 1 
##$CPDPRG= <>
##$CPDPRG1= <>
##$CPDPRG2= <>
##$CPDPRG3= <>
##$CPDPRG4= <mlev>
##$CPDPRG5= <mlev>
##$CPDPRG6= <mlev>
##$CPDPRG7= <mlev>
##$CPDPRG8= <mlev>
##$CPDPRGB= <>
##$CPDPRGT= <>
##$D= (0..31)
0 1 0 0 0 0 0 0 0 0.06 0 0 0 0 0 0 0.0002 0 0 0 0 0 0 0 0 0 0 0 0 0 0 
0 
##$DATE= 1452405685
##$DBL= (0..7)
120 120 120 120 120 120 120 120 
##$DBP= (0..7)
150 150 150 150 150 150 150 150 
##$DBP07= 0
##$DBPNAM0= <>
##$DBPNAM1= <>
##$DBPNAM2= <>
##$DBPNAM3= <>
##$DBPNAM4= <>
##$DBPNAM5= <>
##$DBPNAM6= <>
##$DBPNAM7= <>
##$DBPOAL= (0..7)
0.5 0.5 0.5 0.5 0.5 0.5 0.5 0.5 
##$DBPOFFS= (0..7)
0 0 0 0 0 0 0 0 
##$DE= 6
##$DECBNUC= <off>
##$DECIM= 32
##$DECNUC= <off>
##$DECSTAT= 4
##$DIGMOD= 1
##$DIGTYP= 9
##$DL= (0..7)
0 120 120 120 120 120 120 120 
##$DP= (0..7)
150 150 150 150 150 150 150 150 
##$DP07= 0
##$DPNAME0= <>
$$ [...]
##$SUBNAM3= <"">
##$SUBNAM4= <"">
##$SUBNAM5= <"">
##$SUBNAM6= <"">
##$SUBNAM7= <"">
##$SUBNAM8= <"">
##$SUBNAM9= <"">
##$SW= 20.6817932712277
##$SWIBOX= (0..15)
0 0 3 0 0 0 0 0 0 0 0 0 0 0 0 0 
##$SW_h= 4139.07284768212
##$TD= 16384
##$TD0= 1
##$TE= 0
##$TE2= 300
##$TE3= 300
##$TEG= 300
##$TL= (0..7)
0 120 120 120 120 120 120 120 
##$TP= (0..7)
150 150 150 150 150 150 150 150 
##$TP07= 0
##$TPNAME0= <>
##$TPNAME1= <>
##$TPNAME2= <>
##$TPNAME3= <>
##$TPNAME4= <>
##$TPNAME5= <>
##$TPNAME6= <>
##$TPNAME7= <>
##$TPOAL= (0..7)
0.5 0.5 0.5 0.5 0.5 0.5 0.5 0.5 
##$TPOFFS= (0..7)
0 0 0 0 0 0 0 0 
##$TUNHIN= 0
##$TUNHOUT= 0
##$TUNXOUT= 0
##$USERA1= <user>
##$USERA2= <user>
##$USERA3= <user>
##$USERA4= <user>
##$USERA5= <user>
##$V9= 5
##$VALIST= <valist>
##$VCLIST= <CCCCCCCCCCCCCCC>
##$VD= 0
##$VDLIST= <DDDDDDDDDDDDDDD>
##$VPLIST= <PPPPPPPPPPPPPPP>
##$VTLIST= <TTTTTTTTTTTTTTT>
##$WBST= 1024
##$WBSW= 4
##$XGAIN= (0..3)
0 0 0 0 
##$XL= 0
##$YL= 0
##$YMAX_a= 3730
##$YMIN_a= -3126
##$ZGOPTNS= <>
##$ZL1= 120
##$ZL2= 120
##$ZL3= 120
##$ZL4= 120
##$ABSF1= 0
##$ABSF2= 0
##$ABSG= 0
##$ABSL= 0
##$ALPHA= 0
##$AQORDER= 0
##$ASSFAC= 0
##$ASSFACI= 0
##$ASSFACX= 0
##$ASSWID= 0
##$AUNMP= <proc_1d>
##$AZFE= 0.1
##$AZFW= 0.1
##$BCFW= 0
##$BC_mod= 2
##$BYTORDP= 0
##$COROFFS= 0
##$CY= 18.4799938201904
##$DATMOD= 1
##$DC= 0
##$DFILT= <>
##$DTYPP= 0
##$F1P= 9.9274215381318
##$F2P= -0.165520771350173
##$FCOR= 1
##$FTSIZE= 32768
##$FT_mod= 6
##$GAMMA= 0
##$GB= 0
##$INTBC= 1
##$INTSCL= 1
##$ISEN= 128
##$LB= 0.3
##$LEV0= 0
##$LPBIN= 0
##$MAXI= 10000
##$MC2= 0
##$MEAN= 0
##$ME_mod= 0
##$MI= 50
##$NCOEF= 0
##$NC_proc= -11
##$NLEV= 6
##$NOISF1= 3.799351
##$NOISF2= 2.8
##$NSP= 0
##$NTH_PI= 0
##$NZP= 0
##$OFFSET= 16.51637
##$PC= 4
##$PHC0= -219.5752
##$PHC1= 3.843713
##$PH_mod= 1
##$PKNL= yes
##$PPARMOD= 0
##$PSCAL= 4
##$PSIGN= 0
##$REVERSE= no
##$SF= 200.13
##$SI= 32768
##$SIGF1= 3
##$SIGF2= 2
##$SINO= 400
##$SIOLD= 16384
##$SREGLST= <1H.CDCl3>
##$SSB= 0
##$STSI= 32768
##$STSR= 0
##$SW_p= 4139.07284768211
##$SYMM= 0
##$S_DEV= 0
##$TDeff= 16384
##$TDoff= 0
##$TI= <>
##$TILT= no
##$TM1= 0
##$TM2= 0
##$TOPLEV= 0
##$USERP1= <user>
##$USERP2= <user>
##$USERP3= <user>
##$USERP4= <user>
##$USERP5= <user>
##$WDW= 1
##$XDIM= 32768
##$YMAX_p= 391108827
##$YMIN_p= -3180117
$$ End of Bruker specific parameters
$$ ---------------------------------
##NTUPLES= NMR SPECTRUM
##VAR_NAME=  FREQUENCY,     SPECTRUM/REAL,   SPECTRUM/IMAG
##SYMBOL=    X,             R,               I
##VAR_TYPE=  INDEPENDENT,   DEPENDENT,       DEPENDENT
##VAR_FORM=  AFFN,          ASDF,            ASDF
##VAR_DIM=   32768,         32768,           32768
##UNITS=     HZ,            ARBITRARY UNITS, ARBITRARY UNITS
##FACTOR=    0.126318333923829, 1,           1
##FIRST=     3305.42128286362, 0,            0
##LAST=      -833.651564818493, 0,           0
##MIN=       -833.651564818493, -3180117,    0
##MAX=       3305.42128286362, 391108827,    0
$$ Real data points
##PAGE= N=1
##DATA TABLE= (X++(R..R)), XYDATA
$$ [...]
17608 36159840 36056749 36017442 35969574 35853831 35653104 35334566 34812994 34008064 32917674
17599 32917674 31606168 30136727 28550075 26905961 25304936 23841972 22548520 21399193
17591 21399193 20370142 19469159 18706775 18066085 17521562 17070613 16722556 16469207 16293442
17582 16293442 16194026 16167766 16180210 16201597 16264245 16421709 16649447 16872900 17127074 17587450
17572 17587450 18354684 19280331 20125104 20860598 21692775 22791675 24131266 25631647 27327337
17563 27327337 29304159 31553025 33986142 36549521 39221673 41920962 44499340 46824695
17555 46824695 48803231 50332116 51314573 51745484 51725681 51371313 50757602 49966615 49125159
17546 49125159 48340202 47616535 46871627 46014111 44978990 43707457 42142363 40263659 38115360
17537 38115360 35788703 33383332 30984153 28661749 26476304 24468317 22646488 20996248
17529 20996248 19505200 18172392 16991894 15944563 15015143 14199795 13483795 12832781 12226737
17520 12226737 11680770 11202354 10748641 10269814 9786110 9371863 9056585 8788577 8511877
17511 8511877 8233909 7990138 7780220 7575784 7366758 7163853 6970091 6781206 6603268
17502 6603268 6442404 6286696 6122632 5957946 5803681 5648679 5482953 5333495 5238282 5188344
17492 5188344 5134363 5053016 4967432 4893397 4807425 4690515 4569481 4483999 4434093 4390006 4338133
17481 4338133 4286033 4232041 4163863 4087973 4030452 4000316 3974522 3928937 3865447 3798703 3735313
17470 3735313 3680411 3646502 3633956 3614721 3562742 3498350 3474272 3509680 3562100 3577978 3549836
17459 3549836 3505452 3461793 3418931 3386934 3381816 3392619 3386287 3355525 3331808 3336863 3352728 3362928
17447 3362928 3392036 3465857 3550732 3578424 3530567 3458073 3411604 3393820 3394218 3427056 3500230 3575702
17435 3575702 3604816 3594369 3600295 3657338 3749444 3851094 3956769 4053588 4106666 4110056 4127117
17424 4127117 4229865 4400498 4542551 4605159 4650487 4764631 4938999 5093629 5202877 5334255
17414 5334255 5547086 5806037 6031914 6205795 6380522 6603359 6866457 7132931 7382212
17405 7382212 7625385 7894983 8220947 8603731 9017897 9455535 9948769 10524484 11156267
17396 11156267 11801848 12479087 13257316 14171721 15198073 16325623 17599785 19059564 20674852
17387 20674852 22381256 24134466 25879307 27496329 28844490 29857361 30558327 30999277
17379 30999277 31245422 31417093 31666925 32066476 32540129 32928788 33082296 32873189 32186682
17370 32186682 30980144 29356695 27528098 25683824 23914745 22256611 20755201 19454241
17362 19454241 18345886 17379165 16522963 15792483 15204708 14735821 14345761 14026876 13796034
17353 13796034 13643268 13524699 13417303 13348286 13348573 13404330 13485544 13603028 13797576 14079139
17343 14079139 14417436 14797990 15249378 15798832 16431280 17116660 17861683 18714431 19725823
17334 19725823 20918114 22282456 23799011 25466428 27309009 29332928 31468530 33577922
17326 33577922 35530863 37254758 38706010 39831904 40598513 41047437 41299471 41499979 41756138
17317 41756138 42089081 42411992 42568563 42423994 41917079 41018798 39684888 37905623 35791813
17308 35791813 33552139 31365375 29303751 27382165 25631765 24095394 22781758 21660231
17300 21660231 20693563 19857808 19141220 18542405 18065930 17709637 17459625 17299373 17214378
17291 17214378 17188392 17209294 17277220 17389153 17521547 17659602 17844818 18150911 18592924 19098221
17281 19098221 19598355 20119683 20748374 21534041 22472689 23562711 24818814 26232730 27780821
17272 27780821 29490383 31449966 33722417 36279550 39050643 42001096 45117691 48329937
17264 48329937 51492238 54451368 57103365 59381431 61223991 62579493 63429833 63791672
17256 63791672 63701846 63213920 62399104 61327415 60036898 58523597 56761319 54727574 52417225
17247 52417225 49849733 47077192 44183445 41265118 38406758 35672398 33117600 30800238
17239 30800238 28766683 27019977 25508730 24164637 22958221 21906307 21017713 20251719
17231 20251719 19554131 18921111 18390366 17967888 17605834 17270387 16988834 16793928 16657185
17222 16657185 16529944 16430698 16428365 16536922 16688447 16830142 16993444 17236855 17570758 17983302
17212 17983302 18500867 19165457 19972000 20884544 21908690 23095996 24473537 26016438 27698029
17203 27698029 29518030 31457651 33441172 35362620 37117492 38587852 39642960 40212885
17195 40212885 40357696 40224784 39934275 39530585 39032822 38476040 37872984 37165966 36255459
17186 36255459 35071727 33599027 31851073 29871550 27765344 25678410 23709627 21868470
17178 21868470 20153264 18636634 17405861 16421625 15514878 14565369 13631218 12848528 12240096
17169 12240096 11691941 11106868 10508356 9974990 9532448 9149427 8802262 8493705 8216404
17160 8216404 7939264 7643195 7350966 7105626 6921878 6768149 6600798 6410462 6225112
17151 6225112 6069079 5933853 5794169 5637222 5467521 5299953 5159535 5067691 5010451 4938768
17141 4938768 4821686 4682038 4559393 4461430 4377914 4311900 4256451 4169695 4028939 3890892
17131 3890892 3834103 3848565 3848762 3795494 3731205 3684242 3619374 3514736 3412711 3347314 3283967
17120 3283967 3185875 3087695 3043220 3040284 3028447 3001420 2993045 3010584 3023645 3006786 2954293 2870426
17108 2870426 2778498 2715377 2684479 2644258 2574710 2514300 2491769 2469804 2409585 2344905 2328551
17097 2328551 2344758 2342396 2319134 2302475 2281895 2234199 2183977 2162955 2142998 2087734 2029856
17086 2029856 2008488 1976708 1878262 1770387 1743321 1756626 1703857 1614398 1620882 1726156 1782001
17075 1782001 1723031 1642321 1599749 1544503 1476671 1481083 1532525 1488986 1363253 1339308 1392606
17064 1392606 1223361 824637 789891 1617411 2879153 3575211 3306761 2645222 2271219
17055 2271219 2210134 2121276 1932371 1834699 1876986 1916555 1889569 1862290 1854465 1819743 1771371
17044 1771371 1756441 1738852 1661119 1582363 1600810 1673753 1670699 1582374 1521013 1523846 1514231 1466680
17032 1466680 1455838 1507873 1540289 1498665 1439025 1423216 1432561 1437605 1461608 1514136 1537902 1487781
17020 1487781 1410251 1387095 1434692 1497915 1513211 1454103 1349259 1272496 1278348 1338422 1380455
17009 1380455 1385292 1388605 1393932 1364032 1308470 1290645 1318052 1313218 1239253 1171610 1185179 1243211
16997 1243211 1268254 1259320 1257914 1249273 1189902 1106218 1076501 1119654 1173608 1183985 1154169 1110065
16985 1110065 1073544 1071629 1116872 1173575 1190877 1170332 1153241 1144574 1108611 1047423 1019641 1054973
16973 1054973 1104139 1110751 1090681 1095635 1126347 1132291 1090461 1040799 1033131 1065995 1093177 1078110
16961 1078110 1029744 990808 1001142 1069380 1166065 1237711 1241499 1185288 1129719 1128747 1164905 1167423
16949 1167423 1103614 1024958 1002052 1037204 1071053 1060745 1017189 970231 933250 910123 907537
16938 907537 922394 932072 913601 868821 822994 800214 802590 812499 815435 817799 834256 859191
16926 859191 866449 842725 805076 777603 769034 782939 825747 884792 920053 904587 859436 824345
16914 824345 808780 798017 791094 799023 815381 822824 823071 828794 832609 817797 793655 784879 792114
16901 792114 801252 823816 881016 950864 984826 980441 977932 975179 918340 807798 739614 783630
16889 783630 876391 905195 858905 818006 820160 823235 801624 792523 819231 838775 809038 757886
16877 757886 737219 742534 729465 691582 669671 684355 705024 700209 685590 698060 740661 780407
16865 780407 795986 800615 807809 796681 737105 644232 578369 578695 620244 656624 684155 729591
16853 729591 785211 804581 777359 763398 814705 891430 905746 842346 781659 788630 827347 821324
16841 821324 763386 715794 715375 731995 727659 709313 701021 698991 683160 651781 619071 594723
16829 594723 585486 596492 609173 583928 517534 474336 516291 615263 683054 683974 665745 672828
16817 672828 684057 659993 607715 564862 547367 543716 542530 541299 540958 547140 562048 568847 549865
16804 549865 527237 548303 612768 653655 619302 540506 484902 477686 502881 548632 604534 639744
16792 639744 634545 618292 629785 654400 646337 598519 542720 497705 473833 513469 653441 840429
16780 840429 951791 922732 803386 679173 591894 553032 566814 606153 621222 606642 608901
16769 608901 636357 625679 545404 469076 477451 538989 567368 558813 578546 630453 645361 609869
16757 609869 604973 675353 745510 730082 667220 665005 745867 821743 819644 762844 710694 675024
16745 675024 632971 588330 575029 607194 660957 710358 754747 799707 831496 828379 787767 727545
16733 727545 667959 625754 616545 642448 680879 706474 723431 754272 796342 817710 805468 789666
16721 789666 800114 821514 815937 776007 730827 705790 698911 695819 690433 688087 697177 716518 727093
16708 727093 706422 660326 629553 651190 719398 794283 842285 859044 862424 874727 905195 941938
16696 941938 967360 982637 1002889 1028755 1047078 1063872 1103650 1161135 1188240 1154600 1091978
16685 1091978 1051054 1043657 1059057 1103497 1178104 1242890 1255358 1232711 1229196 1263476 1313988 1370097
16673 1370097 1432710 1475739 1469708 1442002 1451284 1500713 1542821 1573855 1643147 1748258 1806425
16662 1806425 1775127 1725701 1736937 1779304 1779168 1750732 1777483 1881474 1992312 2049617 2070149
16651 2070149 2097077 2133010 2149492 2137458 2127627 2163682 2252822 2342025 2364511 2319907 2279569
16640 2279569 2296253 2346605 2390455 2440407 2521842 2600469 2616659 2578028 2555612 2590216 2655355
16629 2655355 2709907 2734108 2714947 2653857 2596919 2602375 2662067 2701342 2672261 2604121 2546950
16618 2546950 2507507 2460329 2387588 2293105 2205925 2171397 2198296 2215052 2132328 1959834 1806275
16607 1806275 1747877 1753653 1758472 1742811 1707783 1640830 1557994 1522045 1558073 1597191 1565621 1488197
16595 1488197 1438032 1422407 1394930 1352711 1335836 1338622 1303407 1210260 1104084 1024097 971996
16584 971996 959006 1012240 1109639 1173182 1160858 1113195 1076390 1032655 949873 855799 809870
16573 809870 824964 861258 881604 876843 852044 824208 825197 876446 963840 1054329 1123893 1153558
16561 1153558 1123843 1043954 966766 938058 941254 926292 882747 845469 832882 824364 806786 801118
16549 801118 822119 844604 837733 810742 793848 787022 763194 723043 710070 749505 795160 772562
16537 772562 674940 582558 569323 615638 641381 606322 539124 475568 418746 372916 366743 409709
16525 409709 461365 483280 494168 529637 569956 562277 506348 461579 463486 484966 491636 482854
16513 482854 458643 402016 330221 313498 389833 493432 525781 481154 445572 477759 545885
16502 545885 585152 565771 493789 396049 324061 324688 376700 395649 336442 258603 252174 327218
16490 327218 418997 478000 503441 501916 471645 431726 414179 412875 386941 334559 318671 387114
16478 387114 498352 560275 523850 414113 292035 214679 211288 262465 310976 318063 297358
16467 297358 273909 236718 168100 96818 72942 99008 132927 152065 162396 147910 76981
16456 76981 -23028 -59840 18867 159395 274099 334445 352326 316943 215433 94642 34730
16445 34730 54371 87534 63889 -19880 -112952 -163388 -151160 -93800 -30775 7564 15732 -4363
16433 -4363 -55496 -122425 -161526 -144353 -97283 -69355 -75736 -99431 -124473 -130844 -84680 12751
16421 12751 82638 33830 -131792 -325260 -468129 -530344 -493531 -359721 -201751 -126281 -165818
16410 -165818 -264483 -369253 -460667 -499371 -445272 -346021 -300276 -310140 -287649 -235089 -271402
16399 -271402 -421284 -538920 -527242 -455916 -348567 -78909 314716 445878 56909 -462891
16389 -462891 -474320 -10278 148962 -522247 -1599015 -2249447 -2164120 -1662623 -1146964 -819168
16379 -819168 -778004 -985805 -1152822 -982593 -559859 -232007 -106881 35659 296855 451281
16369 451281 322402 96323 68956 267311 508513 689226 826881 914739 918117 865181
16359 865181 809402 750099 687294 678537 739428 778088 742407 733284 836462 943154 906008
16348 906008 790951 779485 871766 896637 802861 726507 741951 747989 662715 553324 491602
16337 491602 437057 356155 316746 356581 378753 297300 190725 186659 265288 299917 244653
16326 244653 168092 132198 141656 194743 288994 377722 395240 331161 236354 170335 177677 275691
16314 275691 411869 474609 411089 302406 260600 289037 313062 306694 302106 302784 282960 261477
16302 261477 283284 329039 333580 300531 307520 378545 438222 426008 380259 366195 380705 375335
16290 375335 332425 278199 245903 249121 268825 260207 202662 139685 127481 152380 156645 140743
16278 140743 165166 240346 296491 292232 275965 296938 325479 313113 271485 236649 208690 183044
16266 183044 190147 241856 284570 271731 241340 250037 267556 219552 114078 41589 55054 126056
16254 126056 217209 317702 395731 395846 317835 240105 227756 259235 274852 259332 241618 242453
16242 242453 260094 293865 349000 417218 470324 479537 440698 380096 328453 286310 230316 160957
16230 160957 117846 126539 157562 170964 176226 204551 242505 248505 227429 230232 274408 319029
16218 319029 328590 308699 265374 186605 90539 39387 67590 133355 174791 180649 174750 166610
16206 166610 155605 154638 170012 180402 171710 169781 200695 240783 249121 233531 238006 271346 293009
16193 293009 272903 228374 195013 189472 207329 234232 253733 261142 269157 284700 288366 258061
16181 258061 205594 166984 163656 195006 255091 323984 353741 305896 205369 118490 72796
16170 72796 39624 4883 6880 74383 167826 225532 244592 268260 302573 299142 237330 179506
16158 179506 202044 285216 320315 244623 131765 104171 171627 217835 163249 77052 74495
16147 74495 149315 188774 141986 83874 90569 133159 144565 127935 130530 150382 144708 114550
16135 114550 107772 136544 159646 162820 195005 290730 399930 436273 375488 276627 218591 233710
16123 233710 288612 314974 273515 196684 148991 143805 137514 117649 142059 248535 370141
16112 370141 403330 338598 259547 222875 208585 192364 191773 213009 217874 188478 174764 225026
16100 225026 304176 336497 307973 271090 258459 246129 206678 153072 116083 109041 126897 157756
16088 157756 186582 202717 205890 194962 162980 121473 109864 147745 192484 185788 135403 104749
16076 104749 120697 140591 122655 83675 66135 83842 120149 150024 148812 110432 70179 75728
16064 75728 123555 162185 168539 170915 178627 151936 81402 35972 70418 130028 120568 47642
16052 47642 11179 67322 163407 216633 200819 143185 82231 45488 37156 37920 37429 56974 109574
16039 109574 156076 148611 107014 97127 134865 169610 169480 163496 180532 199967 189235 148152
16027 148152 93586 40555 18783 63447 160365 236670 234983 169735 93608 44475 41111 83752
16015 83752 131496 126371 74802 59369 127516 213028 220940 153584 91450 75923 79100 78226 90146
16002 90146 123822 156917 176778 198183 221022 212783 162757 123970 162950 272035 358315 330953
15990 330953 193948 45039 -18933 10380 63185 75152 41725 -855 -17188 6571 51628
15979 51628 69380 28260 -34109 -43437 15187 78513 99697 107148 136056 159073 140515 114598
15967 114598 141449 210516 253414 237808 187356 120834 36252 -46389 -87839 -82867 -62925 -43709
15955 -43709 -16421 11400 17981 11418 20844 41936 43152 28268 36531 73255 96646 85888 68601
15942 68601 67081 69928 70951 82409 94402 76786 38901 29184 54477 61607 27145 1111 21911
15929 21911 48499 28951 -11674 -8326 52130 126166 176437 197657 199919 198092 197634 173437 98421
15916 98421 9876 -6179 70643 151783 155273 111578 99693 127186 141453 125079 108904 109380
15904 109380 115530 125692 144801 159071 158857 166487 197351 221426 212236 200430 220772 240023
15892 240023 205661 136848 92305 73150 39760 5022 18121 62371 66204 24565 15163 73724
15880 73724 143027 175419 198867 239411 257366 214748 143900 96274 75339 68341 90312 139676
15868 139676 157776 100816 23407 21328 98202 148868 88007 -43215 -119866 -69738 48178
15857 48178 108629 59466 -26598 -52240 -12312 29636 49424 78891 123936 142748 120629 98488
15845 98488 103194 110451 101444 94935 94918 70618 24636 16059 68404 113859 85683 16912 -13197
15832 -13197 8273 29848 21210 -937 -14521 -12792 2894 19209 19798 17755 42878 79267 72655
15819 72655 28944 32793 116373 184936 148544 61033 34070 67366 75685 50730 71364 152974
15807 152974 204194 162198 78397 33225 39137 64864 95347 129168 158751 181558 200045 199836
15795 199836 164275 114604 92746 99656 96030 69576 54076 71941 102114 117183 115646 109472
15783 109472 110607 128300 149813 138292 88244 59596 102746 172287 182501 132428 97760 104108
15771 104108 94649 36131 -25281 -40434 -20067 8298 47178 101592 149364 162724 130023 57354
15759 57354 -15273 -20951 54003 122061 98676 27259 12298 56691 76600 58754 71118 117528
15747 117528 124726 92049 104602 162548 152805 46276 -31839 -1901 51378 46398 39677 88505
15735 88505 123390 79975 28217 42836 66880 31831 -9533 -985 -2911 -54361 -55634 52095
15723 52095 134040 65868 -56981 -103709 -133306 -215260 -223241 -91230 -64202 -325854 -591532
15712 -591532 -570667 -663634 -1504602 -2764286 -3180117 -2126845 -524799 310759 223227 27661
15702 27661 171991 340224 259529 147131 212760 293207 221119 139523 201989 280717 215569
15691 215569 101226 93252 130876 79876 -7466 3995 84215 99289 43349 25833 77313
15680 77313 127458 145051 163337 185640 181324 163053 172549 201070 203191 175202 152493 147597
15668 147597 149517 161103 184167 195726 186979 189653 215783 216198 154890 79754 57452 79237
15656 79237 94816 97885 108434 108105 69575 23487 23283 64386 103850 133896 166320 172304 118778
15643 118778 47289 34763 84072 130607 148052 164281 176264 141975 71532 38821 74538
15632 74538 123721 139469 144646 163545 165727 130097 103305 130994 174171 160246 92980 49868
15620 49868 78157 144596 190048 192735 167181 129348 81717 27925 -7706 10885 87694 167699
15608 167699 182246 125695 59003 30436 25433 8333 -22114 -43227 -44089 -22118 30457 104723
15596 104723 160710 170002 158490 172664 214180 242271 233710 204969 177577 156561 145336 148380
15584 148380 152786 137524 108239 92574 92825 78097 39993 20790 57766 126391 172883 184241
15572 184241 188372 196866 191188 166892 149196 150917 149880 128122 104814 105763 123026 132588 134982
15559 134982 147780 168506 176548 167677 157038 149464 137461 131135 157051 214695 260213 250217
15547 250217 185949 104728 45131 26695 40235 46918 11027 -51327 -79885 -45083 8151 16518
15535 16518 -19402 -37812 6499 90331 146991 131058 63063 13523 28893 74217 77518 33158
15523 33158 14323 62174 116940 104841 47570 21651 39681 46382 21145 8575 39925 89808
15511 89808 124082 133154 107854 44385 -12874 -1647 60994 80806 20317 -38826 -14882 59338
15499 59338 102995 108781 119468 127126 87150 14278 -23425 -6217 19585 31347 60219 113393
15487 113393 140772 114724 82512 94951 128875 128752 92348 64235 61947 57449 30616 2307
15475 2307 4054 37758 76926 97544 98984 94792 86740 58426 4863 -41920 -40421 7109 54708
15462 54708 72377 77977 95531 110946 97551 67983 66097 108159 158829 172209 139790 92344
15450 92344 68855 90476 151649 222526 263038 249039 194321 143572 132850 152658 157568 118440
15438 118440 57667 24176 41252 90886 141854 175598 187656 183815 178126 178211 169816 132958 76800
15425 76800 39741 48114 90967 140192 175489 182717 152173 94593 40783 10185 -3522 -3746
15413 -3746 25981 85765 128579 102260 16675 -61367 -80055 -45451 4288 38921 46518 31032
15401 31032 11878 9957 25392 40484 46514 51705 59933 60461 46845 30794 27970 40681 60433
15388 60433 77056 82100 75975 74359 92115 117021 117177 81060 32587 -599 -13332 -8058 20539
15375 20539 66253 98081 92903 68619 59473 69311 76008 72066 68379 62447 40139 14087 22410
15362 22410 72324 116027 106423 55574 14908 14572 44286 76526 82134 38966 -39672 -90694
15350 -90694 -53355 55271 145767 150032 87711 28907 16024 41166 78414 107902 114245 89678
15338 89678 46311 9617 -7886 -17785 -35647 -56656 -57809 -23518 34262 83774 102461 96023
15326 96023 86268 86112 95243 113151 137110 146880 116772 56016 15089 29844 73780 90823 66468
15313 66468 38460 38894 54648 53381 26835 -4347 -17359 -10808 -7103 -28393 -60606 -53328 20897
15300 20897 115492 152749 120133 84665 97890 127831 114390 57737 9794 -2136 1713 122
15288 122 -1778 5250 20617 48957 97003 145705 156516 122087 86092 93055 135903 171133 171010
15275 171010 142567 107794 85911 88155 109157 123271 104985 56609 7599 -13814 -2334 27282
15263 27282 55290 69959 74218 81071 97823 115482 118623 104840 88966 87096 100379 117056
15251 117056 129396 144521 172541 204140 212745 190396 170778 194855 255394 300378 296215 260188
15239 260188 219382 171223 111670 72425 86647 131657 152399 139259 135630 163241 190585 191978
15227 191978 186315 187334 165191 103285 52577 70682 132901 166731 158493 156849 176540 176805 147910
15214 147910 138348 161641 150250 55845 -63423 -117966 -103144 -76097 -57842 -33626 -19269
15203 -19269 -41403 -68018 -49814 -27506 -96255 -240131 -302512 -176551 50394 206211 230195
15192 230195 193572 171677 174244 183034 187682 181400 166642 164061 183184 195601 170717 123873
15180 123873 95158 96115 110585 129022 146159 145458 123703 108517 113710 108321 76611 70287 134924
15167 134924 216436 222675 160176 120119 133596 137724 97119 59053 55958 47141 6149 -16146
15155 -16146 24764 87229 107753 88338 62670 31785 -5072 -10182 32028 60208 16016 -57753
15143 -57753 -72452 -16426 49217 88145 106810 101866 71656 61447 111908 173128 156969 70946
15131 70946 9323 7587 4324 -32159 -41304 20314 95229 112963 94462 102052 136228 152069
15119 152069 144887 151287 179679 196929 181253 146313 114020 95365 95937 113795 131868 129940
15107 129940 102483 56955 5765 -31716 -34644 -285 50884 91730 98078 52595 -30168 -88383
15095 -88383 -65519 14693 68227 57147 31600 48480 94475 116721 90709 30809 -31330 -56696
15083 -56696 -26955 16375 7624 -44827 -53196 23392 111994 134855 118579 124600 131946 83378
15071 83378 9357 -174 62075 106698 84962 50950 64489 110410 147065 172062 202900 237516
15059 237516 263421 271149 243243 168818 79970 30695 29740 39021 43161 64059 96504 96227 57468
15046 57468 38027 70959 109671 102472 67025 43296 24339 -10027 -35804 -25232 -10334 -37649
15034 -37649 -81772 -73886 -7626 49550 52012 23061 -536 -13496 -15004 11004 61081 97101
15022 97101 96069 85468 97551 111826 81655 10001 -40731 -24893 30047 65382 69387 79368
15010 79368 110120 124503 95827 60910 71311 117429 149977 159984 177753 197328 173042 107529
14998 107529 72782 108464 160702 166718 143965 140030 144767 121256 87427 90618 120579 122559
14986 122559 89883 73350 97076 129448 143490 144958 131793 87117 28881 9207 41104 73639
14974 73639 61469 14969 -37074 -86853 -126154 -132190 -104969 -80465 -78300 -72411 -40851 -7233
14962 -7233 -881 -9160 -3070 17808 37280 53199 66500 64842 44713 24010 8169 -23852 -72119
14949 -72119 -93389 -64833 -32005 -43640 -69956 -43696 38081 113191 143145 141758 119095 61303
14937 61303 -20894 -78087 -78824 -43014 -4062 27471 51107 63795 73659 93349 109483 95206
14925 95206 64184 68925 124518 175573 167717 114780 61140 13018 -47267 -103757 -118053 -93254
14913 -93254 -78545 -101606 -133422 -132988 -97226 -50355 -7660 28574 50756 47349 23454 4833
14901 4833 12977 39506 52250 30045 -12704 -43074 -48451 -45979 -51039 -53042 -34858 -3130 20183
14888 20183 31158 47367 74899 91064 71122 21120 -28746 -59378 -78875 -99740 -108679 -73333
14876 -73333 12479 99447 121081 69830 14033 17670 58518 58984 -6143 -75173 -87048 -61595
14864 -61595 -57428 -79874 -81612 -46537 -19638 -40425 -89756 -125556 -137142 -135867 -119514 -81084
14852 -81084 -37042 -12657 -6394 3020 20658 32925 34079 28797 16505 1630 8157 46690 75562
14839 75562 42520 -32710 -69839 -36000 10935 13099 -6338 3989 33214 28876 -14416 -45996
14827 -45996 -34612 -2839 18488 27842 34317 35429 28558 21859 20752 17288 369 -30697 -61381
14814 -61381 -65826 -28652 27035 53584 37736 20441 33014 45170 18012 -19738 -7332 48870
14802 48870 76410 40262 -16029 -45456 -54899 -65594 -70017 -57391 -38151 -16133 21115 59069
14790 59069 50726 -13194 -74500 -84895 -67792 -61415 -49010 -1510 51933 62623 42270 34773
14778 34773 29996 -17067 -89070 -109628 -54955 12366 43698 68034 118208 155710 125754 50585
14766 50585 9258 37197 92648 120914 113712 97724 92771 96725 98486 90277 67339 26935 -21688
14753 -21688 -49691 -28989 30792 81732 88975 68711 57701 61836 60186 45082 25134 -2885
14741 -2885 -49036 -100135 -130586 -142281 -156168 -164736 -138200 -85599 -60679 -87580 -126109 -136845
14729 -136845 -136192 -150306 -153845 -104890 -20120 34478 24008 -21402 -52426 -50526 -30900 -19160
14717 -19160 -28792 -49390 -59644 -56313 -53824 -48077 -11135 55808 96515 64924 -6996 -52230
14705 -52230 -63787 -91863 -146806 -164468 -92273 32555 121918 128175 70656 -5913 -67964 -99941
14693 -99941 -106462 -110902 -132233 -157662 -150805 -93945 -15723 30520 16723 -34163 -73311 -73552 -47506
14680 -47506 -22151 -7289 5730 23638 39347 38605 15759 -13537 -18478 15555 62227 78417
14668 78417 56762 33511 37507 56449 66045 63813 53464 25897 -13506 -26045 10662 53281
14656 53281 40398 -19175 -54677 -30314 14263 28459 9175 -21234 -52557 -78010 -82068 -64325
14644 -64325 -50926 -58531 -68368 -58030 -38909 -39051 -64427 -97415 -119459 -117113 -81025 -20656 29027
14631 29027 35325 1514 -34820 -33643 15451 79555 102672 58416 -18520 -73166 -94143 -106311
14619 -106311 -111650 -88142 -48296 -36835 -52376 -36736 25102 62166 26284 -20118 2466 59577
14607 59577 54092 -20392 -72946 -55441 -16776 -6357 -9855 -6264 -11256 -26928 -13653 45460
14595 45460 104232 117325 98058 76045 46425 4263 -17679 2780 29688 23419 9009 31729
14583 31729 72128 70701 21849 -23034 -41389 -61761 -92990 -95861 -49032 9035 34718 35331
14571 35331 37761 34544 1690 -47190 -64585 -27376 35001 76115 79753 64722 52590 42400
14559 42400 21537 -5222 -13932 3392 17862 -2575 -47152 -73301 -60438 -27285 5268 38257
14547 38257 70397 78860 48128 1695 -20025 -7336 12792 14756 -468 -18946 -35370 -53123
14535 -53123 -71924 -83948 -80455 -58757 -25016 5395 11503 -20359 -78710 -126206 -131668 -107940
14523 -107940 -103655 -145853 -202819 -220597 -187699 -142067 -116866 -104060 -77917 -33226 12642 41788
14511 41788 46262 24012 -23186 -86643 -148152 -182309 -170874 -124157 -79344 -63695 -68871 -78656
14499 -78656 -104481 -158565 -203510 -181969 -107386 -70592 -124864 -210216 -235689 -200138 -175520 -192991
14487 -192991 -210164 -189723 -149167 -116639 -87482 -49935 -16788 -4475 -8195 -21845 -56678 -112741
14475 -112741 -153909 -145304 -105528 -89397 -118473 -155126 -152503 -110289 -68040 -54199 -58831 -59502
14463 -59502 -59637 -83989 -137175 -188154 -207687 -202290 -191412 -168992 -118165 -53325 -10301 3590
14451 3590 11132 14853 -9056 -52778 -61758 -8480 57934 74443 45968 22026 15702 -3910 -47760
14438 -47760 -83932 -84224 -58359 -33898 -26328 -32930 -38881 -32616 -28202 -55230 -105575 -117346 -51087
14425 -51087 39243 61741 2728 -65118 -86160 -75974 -67589 -62981 -55546 -50726 -46328 -36564 -44534
14412 -44534 -97305 -162428 -179765 -170422 -221451 -321024 -313454 -104550 171944 306193 275094
14401 275094 228131 244968 253876 200687 150725 162698 178030 122092 36620 19513 79276 132911
14389 132911 123388 68912 11353 -22255 -15221 27610 66336 66103 45315 45631 64645 62642 30282
14376 30282 1854 -2784 -5356 -25778 -46667 -37245 10321 77683 132677 141305 92435 18422
14364 18422 -30226 -37858 -33360 -45254 -70312 -90624 -95693 -78584 -35647 15566 39137 18229
14352 18229 -24659 -56790 -68081 -62733 -39114 -1123 23421 4442 -48989 -90455 -87298 -56368
14340 -56368 -39470 -51952 -68209 -57538 -22395 6618 7121 -15007 -39418 -50904 -43507 -22195
14328 -22195 -8245 -24840 -62905 -78298 -44384 5226 12232 -35097 -93390 -122855 -123088 -107329
14316 -107329 -75796 -31383 3749 9385 -8669 -31789 -53014 -73221 -85118 -78551 -55084 -23811
14304 -23811 9696 36444 34590 -12977 -90945 -158273 -189082 -195214 -198976 -193371 -148747 -63068
14292 -63068 15219 35797 7768 -16617 -16887 -23066 -47672 -48349 3464 58182 50854 2421 -12489
14279 -12489 10604 -3556 -80367 -138587 -106044 -25531 12154 -8279 -33125 -34847 -34054 -43968
14267 -43968 -54120 -63438 -79214 -87923 -71064 -41801 -22421 2066 57863 121045 139393 110953
14255 110953 80635 58924 12251 -54715 -81129 -44509 -7099 -25470 -69939 -82999 -68630
14244 -68630 -65269 -68842 -49113 -19254 -20536 -45604 -43274 -5671 11716 -22083 -59043 -41181
14232 -41181 12406 31160 -10464 -64967 -82828 -74278 -78300 -93191 -77329 -24626 -566 -67697
14220 -67697 -190963 -261664 -222708 -131543 -80333 -87807 -100100 -73876 -19780 28371 51854 49591
14208 49591 26963 -7639 -44380 -73410 -83902 -71937 -54991 -62368 -98371 -129531 -122260 -77987
14196 -77987 -18485 40370 79171 65446 -11298 -108827 -170163 -183281 -173906 -154920 -122702 -92709
14184 -92709 -90828 -108014 -108602 -89898 -88629 -116478 -134415 -111234 -67233 -35096 -14271 6141
14172 6141 11909 -12187 -44389 -48392 -22329 3231 5843 -15146 -53269 -95224 -113961 -90046
14160 -90046 -41037 -8704 -13303 -32884 -29367 10403 55910 55415 -8916 -87619 -108842 -62854
14148 -62854 -12129 -4394 -12972 8413 47761 56255 25086 -8327 -20682 -22219 -20111 -9964 -6417
14135 -6417 -34872 -81933 -97854 -65605 -29022 -31380 -59710 -74004 -63072 -45237 -34812 -31639
14123 -31639 -28729 -14956 11645 24386 -8238 -65202 -79550 -31332 6809 -36916 -126009 -160894
14111 -160894 -115366 -61783 -58284 -78526 -76230 -58943 -55554 -54545 -28381 2482 -15944 -93633
14099 -93633 -175451 -205273 -180198 -133277 -92209 -69932 -71884 -90591 -104620 -100748 -90277 -89359
14087 -89359 -91402 -76917 -47025 -26695 -30773 -45458 -53844 -63897 -92324 -127319 -129924 -79939
14075 -79939 -6689 37313 27900 -13672 -49737 -61499 -56693 -54013 -65946 -91213 -117195 -130040
14063 -130040 -125699 -111931 -99946 -96171 -101974 -116328 -134550 -147271 -147039 -137516 -132010 -139853 -156040
14050 -156040 -166771 -163503 -148102 -125203 -95757 -62512 -38264 -40254 -71749 -112201 -131568 -117295
14038 -117295 -86454 -69616 -81353 -105724 -111488 -83190 -36611 -1269 10197 8281 2122 -17860
14026 -17860 -60963 -109149 -130395 -121212 -113672 -128648 -143257 -126668 -92101 -80349 -95482 -94949
14014 -94949 -55600 -14661 -19550 -62770 -99895 -115279 -129794 -148292 -143693 -105573 -67129 -60450
14002 -60450 -71753 -68230 -49628 -41761 -50031 -53706 -45868 -45953 -62792 -73771 -59260 -36190 -31707
13989 -31707 -36263 -15673 28488 45090 540 -65200 -83838 -50862 -32786 -75099 -142691 -175443
13977 -175443 -168884 -162030 -168947 -170046 -161342 -161328 -166805 -152366 -123573 -118334 -137054 -127202 -69478 -24965
13963 -24965 -49539 -107988 -130394 -114380 -103877 -97926 -61942 -15590 -21738 -80970 -119740 -102962
13951 -102962 -79923 -89171 -96019 -69285 -48798 -77301 -122645 -132928 -122126 -130865 -140509 -104599
13939 -104599 -42395 -19912 -44455 -55368 -26519 -6207 -34639 -81710 -96289 -74532 -51932
13928 -51932 -57679 -95393 -142897 -160245 -125086 -65986 -31102 -22824 -946 46762 82265 75872
13916 75872 42246 3108 -40899 -82594 -98844 -93181 -103341 -138573 -154403 -122812 -82602 -80280
13904 -80280 -104332 -125000 -156381 -218945 -273247 -260332 -191682 -132587 -105866 -80940 -56605 -77820
13892 -77820 -149492 -201925 -181253 -126473 -114188 -158040 -202462 -197165 -144306 -82342 -49032 -55408
13880 -55408 -80168 -93530 -91165 -92340 -103706 -108028 -95967 -82691 -79000 -71492 -51073 -38646 -56940
13867 -56940 -91044 -102678 -78472 -45273 -39757 -73311 -121278 -141279 -114404 -73829 -74090 -123032
13855 -123032 -168407 -168503 -148859 -159492 -196730 -208346 -172626 -133216 -142672 -195691 -234777 -212768
13843 -212768 -140505 -75061 -61759 -87779 -100844 -74596 -37633 -29240 -50108 -77135 -104177 -137070
13831 -137070 -164954 -174418 -182767 -214635 -247141 -225989 -148337 -84947 -95801 -158696 -209051 -220520
13819 -220520 -213786 -208809 -205601 -201010 -191684 -165542 -117357 -68356 -46471 -52419 -67771 -87219 -114459
13806 -114459 -133875 -122319 -90671 -77862 -95243 -111716 -108129 -110227 -141487 -172630 -154889 -90362
13794 -90362 -34968 -33928 -80368 -135490 -164319 -152025 -112309 -85468 -103162 -145106 -153313 -102693
13782 -102693 -36548 -13994 -40649 -75428 -91826 -99937 -109345 -104808 -73775 -34448 -15881 -23356
13770 -23356 -42719 -68450 -103578 -134594 -132426 -87715 -27669 13053 24563 14224 -16377 -65643
13758 -65643 -110756 -118176 -82509 -38978 -28045 -56666 -99478 -126958 -124900 -97142 -61465 -38562
13746 -38562 -35695 -43081 -50413 -59648 -74393 -85655 -81027 -64463 -54958 -65833 -93186 -122141 -136978
13733 -136978 -130578 -113960 -110143 -125581 -134275 -107020 -51695 -5425 9244 -2255 -32308 -77484
13721 -77484 -114271 -107209 -62591 -41909 -90302 -172793 -214502 -189144 -134184 -91055 -70081 -70357
13709 -70357 -91204 -114671 -112860 -87717 -74927 -94298 -124202 -140902 -153426 -176469 -195941 -192383
13697 -192383 -178772 -179605 -184251 -159794 -108732 -75215 -84161 -107956 -111300 -99962 -98475 -101642 -85740
13684 -85740 -61461 -74086 -137181 -199906 -208091 -175965 -160711 -175495 -172974 -125872 -80920 -101221
13672 -101221 -181101 -254690 -275857 -254280 -219110 -184915 -158972 -151140 -163877 -188583 -213253 -218884
13660 -218884 -180979 -104913 -47972 -62573 -121542 -151586 -143247 -161936 -230050 -273264 -233014 -166280
13648 -166280 -160530 -195858 -179618 -97263 -36705 -56160 -109890 -130438 -117382 -108777 -115693 -124820
13636 -124820 -131468 -135216 -127329 -108758 -98513 -104195 -108947 -106452 -120206 -163005 -202416 -196744 -150620
13623 -150620 -108604 -102087 -122684 -142864 -148157 -148855 -160811 -171455 -140003 -52921 37066 63936
13611 63936 29472 -13482 -47435 -95457 -138972 -113726 -19686 44337 9974 -64056 -89824 -83487
13599 -83487 -118468 -192656 -239585 -248032 -269052 -304787 -288346 -196446 -99064 -62965 -72339 -81665
13587 -81665 -89629 -117199 -154523 -173063 -166807 -152388 -147302 -163732 -200624 -232488 -233972 -219786
13575 -219786 -224841 -243184 -234158 -196860 -181288 -204186 -212032 -163671 -99620 -84399 -117100 -143623
13563 -143623 -130546 -88594 -46276 -32090 -59414 -103994 -124482 -123250 -144334 -189907 -198464 -145218
13551 -145218 -98595 -116098 -145897 -113794 -57442 -71750 -147826 -177995 -121971 -60233 -58554 -78208
13539 -78208 -65111 -46257 -77272 -148434 -200778 -203474 -172410 -137554 -122533 -130478 -128442 -77965
13527 -77965 544 34550 -6846 -70786 -100798 -110323 -136676 -168695 -173542 -160986 -163308 -173432
13515 -173432 -158786 -122254 -96117 -85065 -68165 -53337 -75459 -133127 -175506 -167002 -126993 -90892
13503 -90892 -67278 -52740 -58319 -93015 -134903 -143051 -100167 -36098 -6457 -41616 -110603 -144513
13491 -144513 -106902 -31852 19135 22231 -5594 -48689 -102693 -148646 -155629 -118882 -69322 -36172
13479 -36172 -20593 -11473 -5070 -1054 2252 1947 -3895 -2724 20086 51992 59197 29171 -12774
13466 -12774 -35731 -31369 -4655 37993 79448 94622 78944 55829 41437 21465 -19796 -66346
13454 -66346 -89133 -85572 -77609 -76782 -71880 -50045 -14590 18943 35153 29363 13092 5049 11307
13441 11307 20825 24729 28986 40342 51217 49297 33557 11830 -8387 -18982 -13179 1685 5751
13428 5751 -8518 -27071 -41473 -67203 -116020 -166691 -188103 -179939 -163932 -145107 -114785 -88241
13416 -88241 -100057 -150968 -192839 -186539 -150164 -127166 -126600 -123406 -106966 -96925 -107419 -122818
13404 -122818 -123114 -116254 -126182 -154787 -174562 -162949 -130103 -103637 -95086 -93524 -87228 -76713 -65732
13391 -65732 -54107 -44786 -45605 -56885 -67585 -70287 -68388 -61651 -40772 -9501 4498 -17806 -54604
13378 -54604 -68077 -54208 -39863 -34004 -17306 12047 20690 -7801 -34641 -17727 15462 -6357
13366 -6357 -96406 -179015 -184116 -138780 -126962 -175598 -226851 -226269 -192164 -174286 -181817 -192384 -208550
13353 -208550 -253428 -313878 -341005 -321159 -300140 -313545 -335711 -329924 -308489 -297713 -277546 -216026
13341 -216026 -145162 -135114 -192091 -246057 -252377 -243245 -254060 -260436 -230908 -193522 -196386 -232307
13329 -232307 -254415 -246794 -230940 -217005 -197584 -180935 -181485 -180900 -147542 -96027 -76601 -96255
13317 -96255 -102567 -66069 -28933 -38666 -74433 -82905 -60747 -53560 -82850 -118089 -124744 -106060 -87629
13304 -87629 -84803 -96521 -115328 -133623 -148526 -163982 -180788 -188223 -179689 -173658 -197425 -243743
13292 -243743 -264918 -226488 -154174 -108994 -121914 -171515 -222350 -259750 -277809 -259108 -195151
13281 -195151 -120106 -93635 -139792 -221917 -288222 -322600 -335517 -327929 -295470 -257501 -243858 -247730
13269 -247730 -226575 -165910 -113596 -126652 -202159 -284709 -328804 -330308 -308742 -288041 -290245 -317790
13257 -317790 -338201 -313232 -251532 -208112 -218567 -254814 -263594 -232708 -197447 -190194 -206707 -221983
13245 -221983 -219045 -195827 -160465 -132623 -139174 -189825 -254564 -280752 -244870 -181302 -147252 -162089
13233 -162089 -196631 -221547 -241621 -268212 -281162 -248665 -177854 -114561 -89459 -91677 -102037 -121873
13221 -121873 -152197 -171383 -159337 -126011 -90273 -47945 5944 36503 -2770 -94311 -153679
13210 -153679 -127233 -60382 -36279 -70453 -108583 -118611 -133112 -183912 -238117 -237756 -183039 -133625
13198 -133625 -128223 -142766 -141783 -135634 -156797 -200294 -224742 -208587 -172986 -145675 -131625 -126897
13186 -126897 -131640 -135135 -116446 -80987 -70647 -109062 -157037 -157178 -111327 -76583 -87264 -117229
13174 -117229 -124739 -101916 -68453 -42338 -30124 -28708 -29243 -32611 -55767 -99726 -122812 -86603
13162 -86603 -24492 -10826 -52799 -75857 -43439 -23465 -83378 -177883 -214713 -191626 -182345 -207175
13150 -207175 -211286 -175053 -154254 -183329 -216293 -202949 -160262 -125797 -97398 -67044 -63257 -102670
13138 -102670 -138004 -114498 -53456 -24817 -55430 -114879 -173486 -220520 -238103 -213286 -173411
13127 -173411 -160761 -173648 -176764 -163996 -161523 -171545 -166897 -146180 -141349 -160576 -174008 -168707
13115 -168707 -167882 -180875 -184857 -174066 -174526 -187280 -172934 -124212 -97915 -132002 -181734 -189307 -171556
13102 -171556 -178415 -201835 -196058 -166087 -163745 -203512 -250384 -291541 -351189 -420703 -439744 -378184
13090 -378184 -289289 -247207 -264717 -302321 -329278 -341778 -338667 -313137 -268030 -221675 -196100 -201976
13078 -201976 -229000 -251330 -251893 -238767 -227558 -217606 -203302 -195951 -206669 -217175 -201448 -170887
13066 -170887 -159641 -167245 -160183 -134770 -128617 -153899 -168028 -136363 -81517 -41771 -20985 -11964
13054 -11964 -28695 -74676 -114414 -121634 -126289 -166527 -221695 -246063 -245119 -256966 -272946 -245609
13042 -245609 -176502 -129466 -143165 -189762 -237492 -292321 -347329 -350996 -277277 -187935 -168107 -218138
13030 -218138 -260209 -245290 -206673 -202784 -246705 -307693 -354288 -374657 -368977 -343976 -314642 -296033
13018 -296033 -286239 -266073 -227294 -196842 -213285 -272067 -316332 -302681 -258439 -242995 -263026 -266918
13006 -266918 -226683 -181100 -176031 -197446 -196572 -160461 -123262 -116306 -136738 -163504 -178992 -171211
12994 -171211 -134674 -79705 -33998 -27211 -67892 -128514 -158389 -129793 -75316 -59673 -105467 -166893
12982 -166893 -188246 -164516 -125592 -86241 -43477 -8525 -5506 -39875 -95405 -161039 -234550 -299591
12970 -299591 -327130 -308121 -265895 -229939 -212330 -212231 -226675 -251534 -282197 -312430 -324013 -290485
12958 -290485 -213281 -143281 -133777 -172970 -197515 -178185 -154638 -170582 -212352 -239732 -247368 -257000
12946 -257000 -265266 -242574 -185780 -135811 -128932 -154572 -178721 -191683 -208968 -230650 -227622 -181799
12934 -181799 -123071 -102601 -131242 -167286 -171727 -152961 -142332 -147338 -153686 -158145 -167968 -174216 -159105
12921 -159105 -132356 -129428 -165078 -214151 -247247 -261524 -267396 -269769 -274688 -291607 -315356 -325627
12909 -325627 -315652 -300875 -290252 -274302 -252687 -244040 -252067 -252720 -236284 -230947 -258126 -295237 -314264
12896 -314264 -326265 -349044 -361070 -337694 -311210 -335978 -401270 -437261 -411613 -365751 -344446
12885 -344446 -341632 -335320 -328420 -326763 -314635 -283428 -256105 -253322 -258103 -243406 -217255 -211566 -235924
12872 -235924 -266408 -275706 -258120 -229069 -210223 -210231 -216595 -215282 -214765 -231103 -251961 -245368 -209585
12859 -209585 -181185 -181486 -189339 -185157 -185614 -206753 -225687 -216018 -197162 -207651 -244001 -265625 -252711
12846 -252711 -222864 -194813 -171341 -158652 -167965 -188876 -187844 -147002 -90179 -59487 -70021 -91785
12834 -91785 -81812 -42292 -34373 -104351 -203033 -230259 -171414 -123863 -150627 -181997 -137234 -80437
12822 -80437 -140543 -300182 -393248 -332530 -220252 -183000 -204425 -198995 -163916 -155285 -166221 -137155
12810 -137155 -68920 -28905 -43069 -64489 -60671 -57586 -74968 -83259 -57819 -25617 -22609 -42659
12798 -42659 -62235 -83614 -117734 -148005 -149599 -134465 -144173 -196891 -261577 -287234 -248740 -168067
12786 -168067 -97942 -77110 -93331 -98043 -64665 -22131 -20338 -70392 -131069 -152349 -126007 -94937
12774 -94937 -112704 -186716 -262368 -276111 -225380 -168887 -152962 -160672 -149774 -119524 -110197 -143103
12762 -143103 -191756 -219412 -222060 -221263 -230404 -244598 -256427 -265503 -272666 -276159 -275399 -270791 -259771
12749 -259771 -242026 -228333 -230815 -240341 -230624 -197353 -176832 -202944 -255443 -280977 -265120 -249737
12737 -249737 -268139 -297333 -298307 -275146 -259842 -256252 -238799 -202088 -174077 -174555 -191350 -206409
12725 -206409 -218878 -231713 -238843 -238229 -238567 -241688 -236429 -221026 -212735 -221068 -228382 -214844 -191814
12712 -191814 -192535 -232161 -287062 -313610 -287906 -233507 -204357 -225084 -254957 -237186 -182188 -164942
12700 -164942 -226661 -315548 -351116 -318999 -270557 -249630 -254949 -263157 -254884 -222092 -177277 -152172
12688 -152172 -164198 -191225 -203896 -212204 -247090 -300900 -324639 -292121 -234655 -199017 -196382 -206926
12676 -206926 -213344 -212529 -207286 -201170 -195465 -185036 -164602 -141388 -131901 -144214 -170858 -195299 -195609
12663 -195609 -152972 -78322 -23873 -39144 -111434 -174650 -183295 -154576 -130762 -125801 -123875 -111705
12651 -111705 -94554 -86580 -91712 -90006 -52146 15067 50763 1412 -103640 -179068 -190504 -186681
12639 -186681 -207328 -212110 -144319 -30594 35500 -236 -102014 -194897 -233790 -223471 -198396
12628 -198396 -189062 -196993 -204768 -210508 -229334 -252153 -238561 -176953 -118515 -113864 -143354 -154572
12616 -154572 -144971 -152672 -179875 -188296 -172134 -173621 -210511 -243307 -239355 -222196 -225739 -237721 -224681
12603 -224681 -186008 -148211 -123937 -108536 -104770 -121251 -150542 -170316 -165631 -139358 -106783 -87991
12591 -87991 -95780 -122559 -147646 -160961 -167505 -169242 -163378 -160971 -180779 -215170 -228151 -201376 -159846
12578 -159846 -138886 -148245 -180415 -225880 -261964 -255424 -202129 -143422 -119558 -125416 -131586 -125636
12566 -125636 -110315 -87361 -69942 -83266 -119602 -120373 -46372 53073 88168 37788 -32405 -58087
12554 -58087 -43708 -41185 -92880 -193749 -283241 -285861 -192845 -90726 -70665 -123661 -170516 -179158
12542 -179158 -190857 -232673 -271922 -274571 -251423 -224299 -196328 -176393 -183217 -203185 -194322 -154485
12530 -154485 -130716 -135492 -118257 -59223 -22731 -58212 -110198 -103325 -67083 -84513 -148227 -169989
12518 -169989 -127450 -97976 -126453 -154278 -123572 -75311 -83104 -139498 -171135 -140614 -79617 -35274
12506 -35274 -30665 -72931 -156244 -245574 -286112 -248986 -163707 -97277 -96997 -150778 -206090 -229936
12494 -229936 -238851 -260633 -286326 -287083 -265232 -250873 -250986 -243845 -229102 -236860 -269471 -280145 -240012
12481 -240012 -188310 -178102 -202636 -218354 -216804 -223407 -236684 -222375 -173324 -129847 -125542 -147621
12469 -147621 -167954 -182836 -198380 -199267 -163470 -103481 -67071 -88124 -148816 -201049 -219903 -221174
12457 -221174 -222645 -209056 -160330 -105149 -107191 -183436 -269249 -292618 -260065 -235482 -249929 -272744
12445 -272744 -268446 -242178 -220322 -218156 -238332 -273224 -293824 -261419 -172067 -75834 -32878 -55490
12433 -55490 -103062 -126909 -112261 -83242 -73718 -91501 -114338 -126812 -147215 -195372 -243830 -238298
12421 -238298 -173279 -109916 -99169 -119628 -120256 -99260 -102586 -154721 -227461 -279030 -296737 -296024
12409 -296024 -298649 -317963 -349477 -369991 -357689 -317023 -275367 -255196 -258298 -274586 -294327 -311173
12397 -311173 -322310 -326380 -318094 -292962 -263689 -257120 -279267 -297387 -280108 -245152 -237333 -262702
12385 -262702 -279513 -261274 -232491 -221815 -210338 -159567 -76246 -13690 -5145 -21243 -5942 57476
12373 57476 127777 149551 107818 37554 -15782 -37306 -42991 -50773 -64576 -82318 -102392 -118287
12361 -118287 -120098 -107125 -89429 -74684 -65279 -68887 -93823 -128239 -143436 -128659 -105110 -93909
12349 -93909 -90010 -83139 -81447 -89635 -84420 -46517 -4959 -9316 -58786 -99353 -99176 -86259 -92953
12336 -92953 -101546 -77379 -29188 4073 15825 41731 103295 172880 207148 195807 165988 152571
12324 152571 174686 230197 300699 364987 414164 452496 484734 511232 537083 574239 625999
12313 625999 675297 696405 677321 629673 582063 563321 579958 604166 596761 552839 513340 516793
12301 516793 550237 568949 558467 549832 570287 606682 629433 628076 607609 575997 559990 607190
12289 607190 731393 867243 926132 902620 882918 933736 1023452 1077136 1071564 1039607 1009656
12278 1009656 986929 981402 1007834 1056919 1102037 1135134 1163228 1174224 1149757 1114607 1122038 1172919
12266 1172919 1200961 1169654 1135553 1167552 1240824 1272075 1239932 1202596 1197262 1191807 1157974 1131307
12254 1131307 1156816 1217319 1265041 1298512 1354071 1429261 1470295 1450512 1417745 1433456 1490604
12243 1490604 1528440 1520279 1507982 1537347 1589594 1606110 1569333 1524924 1517371 1534051 1533659 1508508
12231 1508508 1488614 1492978 1509530 1526474 1553515 1598946 1647912 1680212 1695430 1705914 1717161
12220 1717161 1730068 1753376 1799137 1870230 1960222 2056928 2139210 2184684 2193984 2195714 2213395 2239094
12208 2239094 2254350 2262382 2277994 2297209 2304297 2305759 2330739 2392826 2469850 2525757 2540818 2524065
12196 2524065 2510743 2540053 2615928 2697881 2753048 2804213 2892301 3001948 3072960 3089960 3107923
12185 3107923 3169001 3244015 3288431 3311129 3343311 3374861 3375461 3358342 3368681 3417886 3480170 3549827
12173 3549827 3648380 3768493 3862610 3907748 3943885 4026920 4170856 4349736 4526187 4662606
12163 4662606 4735033 4757610 4772210 4800328 4829529 4857358 4913626 5017590 5144379 5260274 5364540
12152 5364540 5469967 5569879 5656407 5747365 5860237 5979159 6081631 6178434 6291991 6416723
12142 6416723 6541158 6686114 6869315 7049071 7165046 7232395 7333409 7508379 7715255 7911237
12132 7911237 8110555 8334178 8562185 8775394 8994048 9231235 9453288 9638023 9834759
12123 9834759 10107635 10443789 10775468 11075369 11370983 11676293 11973790 12266621 12587086
12114 12587086 12938677 13282848 13604504 13945456 14348181 14804460 15285405 15788047 16322756
12105 16322756 16882371 17454996 18047163 18665348 19291339 19905718 20525216 21188582 21909249
12096 21909249 22665041 23434487 24225336 25063875 25965756 26920124 27902565 28908944 29972596
12087 29972596 31133354 32391752 33716277 35097811 36566382 38141272 39796233 41499722
12079 41499722 43267940 45150896 47181224 49361573 51688301 54160757 56776124 59538326
12071 59538326 62465089 65569986 68851793 72318771 76002368 79923870 84073367 88455293
12063 88455293 93131238 98176918 103618416 109461149 115766605 122642802 130165587 138371654
12055 138371654 147329707 157146885 167886651 179549732 192167111 205843099 220653929
12048 220653929 236549476 253397013 271060117 289353301 307933125 326283692 343778710
12041 343778710 359693459 373185457 383372973 389507906 391108827 388010185 380395096
12034 380395096 368805996 354051298 337037988 318663162 299778766 281109872 263121054
12027 263121054 245996390 229796208 214612192 200553297 187640933 175788269 164876510
12020 164876510 154812371 145522103 136933853 128978834 121596638 114741819 108391774 102532715
12012 102532715 97128992 92129121 87513681 83303161 79491379 76001666 72745963 69705355
12004 69705355 66912883 64373033 62038047 59851060 57772903 55778721 53871786 52091162
11996 52091162 50458419 48922990 47411026 45923460 44524558 43228980 41971687 40713628
11988 40713628 39504976 38397009 37351567 36299206 35242529 34232666 33274170 32330892
11980 32330892 31414555 30586389 29856720 29150915 28403651 27636292 26910341 26246313 25622383
11971 25622383 25019196 24428906 23843722 23271268 22745072 22287224 21871748 21452280 21013361
11962 21013361 20567097 20115392 19652630 19197385 18780329 18399128 18024833 17659612 17344854
11953 17344854 17092179 16845836 16546333 16203522 15869787 15562555 15259123 14958876 14697540
11944 14697540 14487420 14288541 14064335 13831389 13622104 13426056 13210264 12981813 12781453
11935 12781453 12613596 12430248 12201559 11962598 11763202 11602533 11445839 11280591 11115321
11926 11115321 10938872 10728332 10495986 10282674 10096865 9905153 9699478 9527853 9426630
11917 9426630 9359139 9262930 9132849 9012509 8919533 8827922 8719998 8608464 8502120 8393020
11907 8393020 8287320 8207318 8148339 8073697 7971402 7875485 7805733 7728141 7613275 7498061
11897 7498061 7438838 7423446 7382839 7283035 7156786 7044560 6952551 6877885 6829911 6805976 6777866
11886 6777866 6721712 6639328 6540294 6429709 6323206 6243595 6188718 6131483 6064410 6010034 5969521
11875 5969521 5900005 5773590 5627165 5518750 5459667 5423482 5394044 5363224 5306739 5213795 5125590
11864 5125590 5090406 5087746 5052292 4971913 4902842 4878827 4865538 4826360 4778111 4751771 4746635 4755860
11852 4755860 4788296 4823876 4795932 4674599 4531733 4458664 4443561 4399893 4303075 4219585 4191957
11841 4191957 4173663 4111731 4030510 3985362 3977144 3963708 3926260 3873111 3798239 3690831 3579615
11830 3579615 3515598 3504258 3498620 3470488 3446892 3457432 3484468 3494767 3489934 3488189 3475674 3418913
11818 3418913 3321809 3230633 3175083 3137387 3092464 3048630 3027061 3022363 3008995 2975722 2931782
11807 2931782 2886947 2846873 2822856 2823806 2838449 2844341 2835676 2825581 2821453 2817292 2812159 2815039 2824956
11794 2824956 2825697 2809563 2789521 2777940 2769578 2757342 2749607 2756908 2771992 2777197 2764920 2740741
11782 2740741 2713177 2687676 2663201 2631612 2592704 2570174 2589983 2635181 2648949 2599462 2517987
11771 2517987 2452741 2409810 2365926 2315497 2269916 2227003 2178446 2136155 2113801 2092088 2043661
11760 2043661 1986788 1968969 1995992 2024008 2030446 2045558 2095811 2158982 2201098 2223800 2247732
11749 2247732 2275139 2293669 2296620 2281870 2253614 2238118 2266800 2326733 2363168 2354278 2346621 2386567
11737 2386567 2453316 2497726 2513373 2522638 2519619 2480089 2413107 2352769 2308583 2270345 2250663 2270410
11725 2270410 2307269 2313119 2284714 2264130 2263314 2244747 2193627 2154980 2169632 2214034 2233482 2203608
11713 2203608 2134341 2044747 1961451 1915383 1912769 1928497 1945340 1973171 2011056 2024036 1987757
11702 1987757 1930441 1899087 1904100 1925567 1951815 1978552 1989283 1975385 1966118 2002082 2079528 2148449
11690 2148449 2165756 2130632 2073279 2029549 2020740 2038582 2054418 2055289 2057997 2075410 2091697 2090920
11678 2090920 2083853 2079349 2058543 2014457 1986862 2007218 2033553 2002918 1934237 1905465 1928081 1926625
11666 1926625 1865676 1813584 1829528 1857232 1804502 1684691 1597457 1586732 1597919 1580112 1555144
11655 1555144 1556972 1562756 1531270 1475675 1447993 1462827 1480342 1468064 1443114 1438759 1456676 1474823
11643 1474823 1484195 1489421 1482280 1449228 1409084 1407365 1454657 1500797 1498323 1467892 1465287 1500706
11631 1500706 1534071 1543321 1548600 1562030 1561974 1538453 1524211 1550672 1600492 1632888 1635274 1623072
11619 1623072 1606956 1588266 1573602 1568004 1562531 1548499 1533006 1522759 1507001 1475439 1437685 1406076
11607 1406076 1377401 1351485 1344592 1358854 1364335 1344349 1331598 1356469 1384716 1362989 1311593 1305618
11595 1305618 1361214 1407360 1389100 1337671 1307560 1297649 1276811 1247155 1234351 1239559 1243504 1242607
11583 1242607 1245217 1245370 1233577 1223273 1236106 1268493 1297460 1308835 1296212 1249295 1176134 1124252
11571 1124252 1140056 1206940 1256401 1244602 1192120 1147583 1139734 1167856 1210591 1235735 1224492
11560 1224492 1195275 1186374 1211117 1247363 1270417 1273482 1255706 1218795 1182385 1175088 1199123 1227690
11548 1227690 1246058 1266727 1291427 1292218 1255694 1217346 1217714 1242464 1242262 1202599 1157985 1139758
11536 1139758 1145289 1162289 1187270 1206032 1188705 1130232 1074959 1069432 1097728 1094759 1029853 950970
11524 950970 928425 970903 1021481 1031844 1012090 997807 995106 984454 964888 960435 979706 998129
11512 998129 991917 967794 946529 937318 942354 964330 989200 983027 934329 884024 880338 913095
11500 913095 929036 910137 896953 925063 974956 1003903 999770 982072 970816 974360 990105 998588
11488 998588 974894 924835 890356 897271 918543 917210 904933 919939 959710 980364 962653 934918
11476 934918 921872 912559 896616 893760 920029 954151 967991 968289 975940 980874 954110 898731 854954
11463 854954 851040 873540 889182 876220 833688 780489 746989 748110 764145 768173 770356 807462
11451 807462 883652 950914 960887 911601 831135 745491 684791 689787 770629 870202 909447 873258
11439 873258 820307 802580 808237 798830 771810 756452 763816 774434 775346 779440 796147 805562 783300
11426 783300 740709 716128 725708 745938 753528 760142 787874 826271 841946 826448 805612 797890
11414 797890 792460 780216 778771 805411 844236 863453 853082 825285 790238 755121 736905 749774
11402 749774 782858 811267 824853 828367 824414 819553 832740 865641 878567 838615 782644 778057
11390 778057 818720 823519 758736 696274 709085 766330 789593 767889 748536 746101 738516 738669
11378 738669 786656 865283 901315 869756 825077 803521 770833 711299 694015 777351 897045
11367 897045 933451 867030 785859 746874 714537 652859 598891 601980 644432 672879 675368 678850
11355 678850 689979 687008 666962 659221 682502 716859 732713 730472 735499 759456 780033 766186
11343 766186 722455 697246 732747 808944 858429 844972 805154 793025 803196 782116 711378
11332 711378 643331 639423 697828 762610 789955 783523 771777 774032 791467 811542 811853 774995
11320 774995 714725 678006 700731 760526 793031 764407 711837 696570 728761 761360 755015 723250
11308 723250 706119 722064 761384 810693 862982 910036 942694 957583 952718 920913 859107 779838
11296 779838 702689 640102 601604 600211 635560 677799 690151 666305 628323 593794 567838 561484
11284 561484 587125 633398 673400 700189 722094 721722 665696 571348 514931 540065 598354 621043
11272 621043 611447 614246 625856 604551 556537 537056 557412 561118 517942 480217 505933 572635
11260 572635 614535 613931 607899 620943 635345 626364 595826 567588 565003 589929 617653 624723 622623
11247 622623 637741 656042 631487 565091 520641 525783 516232 440780 371674 420919 569908 682354
11235 682354 691059 671214 698834 735139 713865 666304 674744 743450 798863 800550 778540 764053
11223 764053 749468 727075 713448 718203 729180 743571 776862 823210 840218 798553 727571 689562
11211 689562 717066 787318 849791 870374 855193 836280 832381 831739 822174 821574 853033 899328 916474
11198 916474 894324 868938 865566 865060 846254 829043 843959 879031 891332 863759 819496 780456
11186 780456 740490 690038 646010 637529 665974 694744 687517 652493 635724 663713 704782 704853
11174 704853 656300 608094 603804 633325 658377 665238 672524 698163 737498 769132 769848 730951
11162 730951 672708 635977 646912 694407 749217 793276 819643 820663 797349 770137 758094 754357
11150 754357 743876 737183 757441 794468 803336 760593 699362 673521 700481 750913 784493 785500
11138 785500 769233 760030 762221 757565 736801 718958 719770 715350 671893 607783 583074 615647 650792
11125 650792 639208 606916 610411 650808 677396 660500 615066 559435 498578 451840 450368 489924
11113 489924 522708 517082 497343 503490 535656 559991 550197 504521 442289 403000 424226 493064
11101 493064 541791 526104 489434 507311 579163 627660 609917 573417 576112 599684 587063 536193
11089 536193 502044 511674 527890 510250 473887 464257 496901 547458 588852 613726 623508 618305
11077 618305 604797 599040 608652 617320 599721 554845 514478 508629 527251 531494 506109 482689
11065 482689 496172 531692 538681 495125 432621 392439 382069 388571 410633 452168 497239 518887
11053 518887 510486 487287 460509 433202 419095 434895 466031 470310 433620 397186 405297 445383
11041 445383 469679 463315 455797 468689 489903 507333 530606 560240 567878 537279 501865 505383
11029 505383 538787 555702 545033 543108 566467 580535 560239 539776 560542 598054 592828 542891
11017 542891 509763 525826 549850 538247 513111 519454 548736 556662 542356 554087 608527 651814
11005 651814 625292 539043 452184 400431 374225 358937 361761 389167 421567 430738 415998 405452
10993 405452 417961 437927 439518 427184 431764 463157 489111 477573 444037 431853 452527 474721
10981 474721 475188 470279 482777 503363 508845 502838 511207 542222 574945 587079 573431 535156 474729
10968 474729 412921 389941 426013 485724 503911 454301 377993 332675 325428 315455 279572 246689
10956 246689 252882 285868 303626 298121 304665 342592 380959 382707 358162 349069 374138 415992
10944 415992 453011 477215 482322 460335 418549 384020 381037 408514 439969 441421 396343 324608
10932 324608 272561 272743 316978 377033 438295 494678 524449 504221 448292 403019 391815 391028
10920 391028 372958 347789 342454 356429 364583 357780 358207 391231 454066 514534 534850 499906
10908 499906 431652 375737 364657 387622 398880 362877 295273 252053 266339 302165 294296 235720
10896 235720 191021 205168 239032 235052 211258 227557 277918 295232 268694 270889 335594 389880
10884 389880 366100 314506 326754 393783 428507 405677 386364 404585 418607 394414 360498
10873 360498 348298 343219 332400 344594 397849 453392 470316 471168 503224 560278 593948 587867
10861 587867 572076 568793 567310 555575 540749 530606 521405 512148 510536 517763 522686 517125 507494
10848 507494 508507 529438 562591 582939 571072 542175 535184 562341 589103 580498 546963 521529
10836 521529 511101 500934 493931 509120 542876 564158 553781 524424 497788 483631 484973 502749
10824 502749 528335 546465 550073 542352 527361 511206 505346 511719 512157 492528 470082 474031 504678
10811 504678 535440 550187 554425 555961 561499 586347 637770 692919 722348 728697 731523 727846 710309
10798 710309 710244 763437 833979 838322 759408 673526 642877 646821 648336 657852 685937 699675 685413
10785 685413 696288 769229 846697 858381 835556 855859 910404 927642 909494 930112 993095
10774 993095 1003916 918374 818724 791399 812768 816342 802129 807772 822900 808170 771897 762462
10762 762462 797806 850923 892424 909325 899093 879536 883766 913699 925692 895510 863222 872699
10750 872699 904399 920185 937574 993126 1060330 1081279 1066446 1081504 1134248 1157445 1120628
10739 1120628 1079692 1083876 1104878 1103098 1104909 1158525 1253627 1340577 1404378 1469155 1543689 1606561
10727 1606561 1640399 1649369 1647861 1654462 1686046 1736109 1773200 1783666 1799867 1859556 1951681 2031947
10715 2031947 2082586 2127365 2192072 2276674 2365741 2445612 2512787 2581815 2679904 2818034 2974040
10704 2974040 3117451 3238471 3337856 3410027 3464746 3548005 3702497 3911570 4118781 4304128
10694 4304128 4504307 4749581 5017531 5270114 5509713 5770265 6063945 6363358 6641402
10685 6641402 6913693 7227921 7609838 8032085 8451844 8874849 9357535 9939509 10603708
10676 10603708 11324263 12127767 13075261 14199467 15493000 16947940 18573353 20381702
10668 20381702 22394479 24659828 27230203 30117120 33284796 36664032 40117452 43381932
10660 43381932 46084677 47837121 48326228 47394524 45146072 41988940 38473372 35015598
10652 35015598 31790997 28870332 26342553 24247580 22495197 20967164 19659618 18628094
10644 18628094 17827269 17121312 16454436 15902764 15528137 15272433 15044546 14840264 14716593
10635 14716593 14695787 14755921 14888142 15105152 15401141 15747863 16130866 16555734 17011829 17453965
10625 17453965 17834790 18151746 18456128 18810861 19237150 19710925 20215379 20774867 21415656
10616 21415656 22115237 22826933 23538201 24254094 24927098 25463955 25820357 26040690 26188574
10607 26188574 26295912 26407926 26610844 26954692 27391344 27851007 28343964 28911322 29493127
10598 29493127 29929596 30106912 30038312 29786132 29371259 28798728 28125061 27448717 26847491
10589 26847491 26352494 25964975 25668045 25428277 25205452 24957497 24632964 24182282 23594010
10580 23594010 22901714 22138198 21306125 20419525 19548971 18777967 18114353 17487958 16850273
10571 16850273 16238817 15714499 15262242 14795153 14252053 13652208 13044859 12440488 11817001
10562 11817001 11170231 10523969 9896710 9290088 8713002 8189817 7735885 7345704 7011371
10553 7011371 6728664 6475560 6213393 5930189 5661149 5442094 5259712 5073669 4873449
10544 4873449 4683498 4520933 4379983 4256782 4158976 4084411 4013871 3933367 3847228 3763927
10534 3763927 3683008 3599456 3509366 3410851 3309241 3217581 3142334 3077887 3026355 3004880 3011821
10523 3011821 3004532 2942711 2841698 2749730 2685484 2637251 2608621 2609506 2604480 2534523 2407290 2306426
10511 2306426 2282196 2285246 2245383 2169294 2114826 2104190 2110988 2108974 2088735 2043491 1978260 1919983
10499 1919983 1887103 1866024 1843678 1834670 1842192 1825620 1753331 1660160 1602705 1584078 1577094 1591727
10487 1591727 1648333 1703991 1689448 1618448 1576642 1590040 1588969 1529062 1464942 1458733 1486113 1488562
10475 1488562 1461487 1430976 1391053 1329354 1280104 1284757 1321200 1333231 1315371 1309794 1328697 1338489
10463 1338489 1321300 1298981 1288582 1278687 1259135 1235864 1207850 1165506 1122860 1118702 1169885 1243968
10451 1243968 1287947 1271323 1204845 1136386 1120577 1166643 1222550 1236213 1219324 1216306 1225947 1204828
10439 1204828 1145332 1093696 1079792 1082550 1082534 1094409 1119759 1120692 1080339 1043973 1050538 1059403 1004068
10426 1004068 899132 833582 859146 935525 992456 1002596 979952 942867 902447 870847 861402
10415 861402 879179 911377 929221 915549 896446 919299 982994 1024220 1005875 981942 1018540
10404 1018540 1076924 1052119 927200 806743 772395 783534 767795 739388 755137 800529 806907
10393 806907 766196 744478 772982 799103 772146 719012 697040 713353 732755 739391 748775 768729
10381 768729 781899 767244 720098 654956 602607 595303 636625 691022 717794 709480 684517 655041
10369 655041 624483 609358 633262 691020 740553 745232 713626 684235 676590 671714 644823 607657
10357 607657 604520 660751 744993 797142 791555 755886 726136 706149 683534 662715 657750 664321
10345 664321 664631 655800 650571 651763 648041 635382 622074 611268 599217 592334 603355 625540 632891
10332 632891 614225 587473 571888 565532 559979 558499 568435 591964 633074 693737 751660 763876
10320 763876 711656 627961 564456 543262 552682 573377 592396 604434 613313 621630 615102 580460
10308 580460 544895 561360 634933 701827 711840 692978 692714 694979 657800 607504 618389 698717
10296 698717 769672 774601 746177 739983 757826 769848 764541 739370 682652 606293 564163 594371
10284 594371 664736 712840 720273 711737 701865 684882 664640 653965 648140 632940 616243 621713
10272 621713 652929 689364 713876 720216 701213 657847 615412 602404 614984 626626 628164 631941
10260 631941 641310 645139 640496 632648 615284 581432 552922 565202 618300 673942 705930 720892
10248 720892 723643 700941 656597 627657 639119 665338 661381 617578 563326 530876 533461 566841
10236 566841 614493 658120 692739 721317 731082 698203 629863 577733 584108 627407 645955 609616
10224 609616 546200 501023 492826 512467 545351 582578 616147 634921 632368 617714 609987 613961
10212 613961 611818 591813 573893 583591 607070 603793 566686 535038 535332 544080 531814 513113 521099
10199 521099 553317 577666 580406 575254 570256 556790 532972 512988 508456 517113 530757 540304 535362
10186 535362 512399 479172 440054 388757 332281 306123 337206 400254 443211 454085 468556
10175 468556 506779 539965 537564 516358 513648 529681 529873 501312 476799 491384 535084 567712
10163 567712 571680 566920 571073 570672 549457 524408 522667 532459 515463 471177 448416 476599 522291
10150 522291 538790 527313 518753 521209 519448 505666 477866 427973 366165 336283 367911 430596
10138 430596 473974 491224 497806 475240 401316 321494 314935 385334 456341 485507 508331 548889
10126 548889 566518 533299 496303 509001 553340 583366 599669 624202 642098 629662 609385
10115 609385 617597 642462 651178 653537 676421 696099 665031 597432 559843 573993 590925 569683
10103 569683 525253 487670 466585 469909 507521 559664 586498 584509 589816 611941 613317 574922
10091 574922 532502 518116 511242 485308 464250 487655 544048 582763 580416 560436 554396 572822
10079 572822 607855 639869 646398 624861 600779 596056 597070 572812 518748 464822 442921 460862
10067 460862 505790 558851 603747 629265 630809 614978 602259 611419 631364 625346 582771 548700
10055 548700 570747 631347 672873 678419 675824 665993 614050 528219 480033 510405 572258 607002
10043 607002 622445 645094 651250 614044 576326 597037 649502 653896 599748 555338 554500 554831 523928
10030 523928 491520 486568 487112 470315 460615 487228 531994 556165 549243 522746 486715 460025
10018 460025 472338 525738 581056 607506 616845 625551 621148 598186 588135 609635 622047 579824
10006 579824 508452 470541 472549 464552 426417 391923 380190 363817 327387 306191 333865 388989
9994 388989 428693 446968 462556 469515 442714 389310 357278 380386 434863 463179 432880 367123
9982 367123 323521 344008 417749 491632 523542 523995 534615 565894 575937 525498 438969 382401
9970 382401 380178 384783 347189 291790 288371 358578 445188 478758 445977 384338 338082 333150
9958 333150 367831 406918 406497 366307 337642 356372 391031 389282 355563 339290 355587 368508
9946 368508 360127 366196 417301 481877 503763 476401 445099 444866 468069 492804 512375 524993
9934 524993 516006 471186 403101 348639 336152 362419 404950 447364 482599 498453 480078 433441
9922 433441 390398 377419 388328 398575 395391 380410 356030 331277 332875 381561 453042 487188
9910 487188 449670 372336 321801 333129 379082 402636 380913 354711 379806 446434 478345 434558
9898 434558 377277 391259 459033 482818 429240 377581 399112 457593 475934 445854 411617 386205
9886 386205 353659 331906 359032 418098 441895 405579 360263 356757 383500 403048 408866 416636
9874 416636 429215 439606 448697 456258 451470 433619 425879 445438 471052 463925 418800 376566 380879
9861 380879 428147 465656 445162 379562 332620 343050 379691 394419 394354 417797 454035 449395
9849 449395 401332 382146 438667 522637 562683 559642 558762 563765 540763 488423 441982 412252
9837 412252 376604 332590 307930 308380 304061 282093 269422 284649 305582 307126 299829 308123 336306
9824 336306 376207 423444 465585 478262 455784 426247 416337 420651 424730 435423 463608 496819
9812 496819 517085 530400 549656 561286 540237 490642 440801 401569 361380 324120 319287 361646
9800 361646 423897 465782 477392 479788 490032 498645 483786 443026 404284 397469 417401 430316
9788 430316 422215 419890 447221 480110 474027 427500 384788 373061 369992 347255 317389 311622 327068
9775 327068 328381 305057 299096 353432 442879 486289 439496 352046 304453 306052 299003 262505
9763 262505 254240 317546 398779 413775 368031 345185 383854 432645 438513 417630 410443 416154
9751 416154 409605 388945 368707 349189 327361 320721 348352 399715 448086 483829 511864 528728
9739 528728 525284 502931 469942 434476 414333 430568 471452 489639 463241 432721 441948 470537
9727 470537 472130 456866 473816 518547 527380 478525 434707 451480 494241 493062 447185 423001
9715 423001 459615 522468 555227 543304 512671 488648 475849 471051 475218 484077 478852 444643
9703 444643 397000 369087 366427 359579 336253 330718 371684 425949 435078 393607 347463 325106
9691 325106 318121 323285 348144 372914 366669 350799 381061 446886 460696 385851 305913 310114
9679 310114 369394 396620 382919 390524 435998 467129 453146 423024 406366 398877 395786 403895
9667 403895 412593 405461 404244 443128 493672 482091 399423 328675 333329 378950 399798 384872
9655 384872 355212 311047 256148 230962 261018 302768 299926 271183 282763 348428 415683 445475
9643 445475 449430 446894 438867 434022 451830 482633 484166 437946 378895 350568 356169 371034 381337
9630 381337 390657 401574 407214 396981 366808 329705 311030 319665 330735 316011 284207 267019
9618 267019 272765 285471 305456 350224 408508 435727 412835 372296 343575 310293 253108 201729
9606 201729 200627 241260 271770 266767 248893 244242 253966 272371 297160 314122 305436 285643 297262
9593 297262 351286 399623 393086 347917 324974 351704 393699 404362 378775 350879 352742 384185
9581 384185 413254 403192 349061 291059 280551 326739 385270 404849 376817 333883 311238 319034
9569 319034 344094 364202 362926 342455 322720 320281 329861 334492 329690 325678 327443 326548 315746
9556 315746 301141 296606 313423 353944 405075 440740 444951 430604 419687 410278 388266 368550
9544 368550 385436 429201 434772 366609 282961 271102 335767 398554 401108 360202 316416 278328
9532 278328 238860 207730 196731 195265 187176 176289 172462 165820 138624 95780 64072 64910 101515
9519 101515 165788 241723 306386 343578 357540 364222 371231 374119 367816 351860 326594 292979
9507 292979 256410 226158 211041 214463 227811 230544 208888 177387 169601 202583 262467 328418
9495 328418 392383 444728 460179 421045 348648 291930 281544 304056 321585 310415 280006 257314
9483 257314 255024 262897 274989 308250 371432 428124 428337 378493 338932 340713 350343 339664 339034
9470 339034 375090 398072 338369 218736 141100 156605 209511 227726 215438 225198 277441 345267
9458 345267 398541 430856 449992 461595 459066 423827 348297 263302 222207 244356 288996 298729
9446 298729 258585 202670 173129 182401 209646 228580 239820 267634 316225 347649 328887 285712
9434 285712 270685 283973 274567 226759 191658 208936 246661 256843 250659 269419 305957 309160
9422 309160 261657 207442 194710 221863 249690 249059 230407 232113 273776 318988 307013 233788
9410 233788 171594 181800 235343 256535 224617 186931 181760 195670 199880 187424 164619 138451
9398 138451 123118 133617 164411 193670 210202 218432 223998 237158 276560 336598 366651 329451
9386 329451 271123 275214 342903 382195 336085 259028 230106 245380 246863 218440 196435 207064
9374 207064 244663 299555 362592 409193 417060 394824 364653 331842 303995 315574 381732 441413
9362 441413 408676 286966 176199 151279 186426 221865 250164 295104 346899 371753 365551
9351 365551 349576 323848 272023 210391 184145 204263 230108 233458 240703 280496 321519 309080
9339 309080 252239 224395 266266 328451 333985 270353 191981 151349 159071 199823 251554 287755
9327 287755 290942 270782 247791 220292 176136 136939 149697 217661 276343 265650 198683 131934
9315 131934 95373 86842 110088 170809 243721 287342 291611 276520 250098 209378 178671 194961
9303 194961 246135 274814 260585 245806 253272 236112 158586 78726 80987 151290 195410 179816
9291 179816 177034 247783 346604 391766 381509 380774 414586 436287 403967 336551 275721 231671
9279 231671 195787 181366 213434 281758 337076 347549 340349 367399 434185 483021 458168 376171
9267 376171 310399 302529 312872 278774 205582 163337 190635 241332 249356 214751 189333 197516
9255 197516 217186 233053 258189 291204 299375 269886 239210 239001 245853 225267 197648 207551 240681
9242 240681 232460 168153 119290 153398 247300 323669 346707 345048 354587 376362 393033 399536
9230 399536 405846 420347 437968 442650 421411 376585 321591 268464 228891 221423 256138 309244
9218 309244 338081 332899 328715 347829 357992 320098 258794 242519 294551 364823 400509 407027
9206 407027 417123 430659 420620 385798 361000 370463 397090 408077 392616 361855 326179 290360
9194 290360 265245 265666 293033 331025 361672 376797 373392 353025 332784 340434 382508 426437
9182 426437 432292 397766 354369 323389 298263 272679 261033 278005 314993 351455 377787 393894
9170 393894 396515 384008 367176 360070 362354 362548 357068 355809 368421 391112 406893 398251 366163
9157 366163 338192 345954 388075 427973 438530 436254 455805 500258 536314 536508 507447 472494
9145 472494 441711 408488 368961 333850 317181 317394 319139 317888 330444 366477 399806 392284 343389
9132 343389 288356 247411 213655 198348 238312 327333 385072 346363 256387 221323 275959 355931
9120 355931 398033 407155 409979 400036 362513 316139 294186 303294 326060 346995 355634 342481 314007
9107 314007 298053 314894 353130 387722 408162 414736 402414 367070 318710 273640 240245 221953
9095 221953 224275 248768 287556 328818 358474 358240 321886 275725 258325 272297 281257 263838
9083 263838 242050 241515 253485 257485 254577 253525 248554 238196 243797 278663 317200 326516 314182
9070 314182 313048 330257 342630 334763 313719 292496 281982 288861 300601 290121 259401 252856
9058 252856 292198 325396 291119 216513 191242 246752 319599 341834 312302 264361 217472 185422
9046 185422 186344 214867 238787 245928 258250 279064 271154 220239 177982 196727 251930 278633
9034 278633 265056 258522 286212 320154 327373 314149 305338 307676 311089 310831 313571 326561 347797
9021 347797 367283 379605 393089 416078 434285 420849 376180 335675 323691 323556 315011 316112
9009 316112 351462 393539 382143 308176 238124 235666 286162 322852 310929 278644 269823 291302
8997 291302 316052 321797 310619 296028 288390 296833 328426 372832 400810 396733 385260 404150
8985 404150 452923 490740 485897 444802 390552 339452 304386 292140 285379 255553 209511 195271
8973 195271 240828 313103 361799 380089 394030 413262 424664 420146 399252 355721 291991 237079
8961 237079 219210 228224 234993 240370 271681 333252 393373 424475 429967 426553 420711 405949 369545
8948 369545 307534 246636 234563 283175 337095 332450 276872 235754 246378 284053 310269 313422
8936 313422 297301 266519 232778 207967 188457 171743 179761 228373 282351 289105 256223 242608
8924 242608 267217 284773 267456 250183 265582 288162 281429 256853 246440 253056 265505 288679
8912 288679 320428 330018 298542 252934 224508 205599 185833 195084 258630 336536 364715 341510
8900 341510 319455 319920 310628 270817 231161 235149 288709 355183 384754 356916 309148 303408 344876
8887 344876 366684 326410 275820 282262 318607 305013 240677 211036 260321 334518 369208 365620
8875 365620 353233 337719 319459 314491 324123 324886 315730 331204 377473 399950 353415 267881 204579
8862 204579 178028 164349 160118 183403 227697 260085 267640 273436 299348 332879 339555 303297
8850 303297 252512 239446 282089 336070 347311 322996 314415 334167 339777 309520 282210 297027
8838 297027 339275 374716 394920 397301 365592 310327 285831 318810 357792 346908 314825 327170
8826 327170 377781 400935 381232 375389 416039 461847 466164 440929 422741 415988 401614 376522
8814 376522 355583 346570 341199 326426 298860 270239 251816 230277 182209 126485 127232 210153
8802 210153 308551 341945 321195 313855 327302 308338 258690 259302 348028 450592 481475 453153
8790 453153 431408 431877 422967 398264 381642 373752 347727 296726 247320 227081 244902 292357
8778 292357 338365 338908 283782 220803 204039 232647 269546 298166 320746 321017 281667 232563
8766 232563 227463 267363 296808 286757 270418 277394 283658 262337 241612 262357 302697 300174
8754 300174 244975 199188 209866 246093 250204 221972 214603 257913 321033 353643 335470 279008
8742 279008 212304 171578 181284 218888 224477 174270 122670 134580 193690 225276 203594 183267
8730 183267 215982 288094 360598 422748 475619 502209 490150 456083 416495 362261 292599 243748
8718 243748 247110 284398 320074 351363 387707 410634 401778 385486 391429 396958 363701 312262
8706 312262 296072 313308 314365 291674 287368 307942 310318 287467 286889 318306 326176 293465 288906
8693 288906 352572 411152 384162 313330 297152 339796 361196 333793 310827 321089 327967 307566
8681 307566 286262 277386 253845 214258 209478 263655 325596 343153 338203 359381 400628 420565
8669 420565 413632 406109 399785 375696 346598 351453 393022 427495 426426 408252 395501 381094 358218
8656 358218 346935 360296 371772 353729 331048 354533 424703 482834 485875 454263 430346 424406
8644 424406 428300 451624 502371 546750 536137 477075 431526 435414 457940 462444 465193 495094
8632 495094 526789 506681 434716 368374 341926 330228 306813 291272 309063 339197 341503 317835
8620 317835 307435 327740 355238 367725 374208 391799 416657 433570 439189 440455 440226 439420 445936
8607 445936 464413 479508 467656 430285 399236 398615 414091 415638 401278 395771 407115 411492 393134
8594 393134 375633 391826 437861 482917 515255 548661 585090 604785 603576 609386 642110 680419
8582 680419 692027 679155 666889 659038 636921 597960 563208 541549 515652 475317 440301 433803
8570 433803 452154 477364 501934 521801 522085 496596 470431 473395 496531 507308 505983 526376
8558 526376 569964 582970 528855 450894 423611 462449 521453 563354 583514 572927 516710 442004
8546 442004 412628 447543 487485 475668 433578 416181 424491 414156 373369 338614 335205 348834
8534 348834 361325 374209 386870 384482 359267 320215 279139 252166 269493 345555 438256 481032
8522 481032 464893 445707 457497 467161 438816 393953 370260 361169 340901 318392 318599 332733
8510 332733 334481 328535 336031 346308 332969 307948 306916 325274 324398 303956 307291 339303 339828
8497 339828 272420 191286 176470 234127 303180 338226 343543 338225 329324 319489 310520 296364 273394
8484 273394 255166 255710 261550 244893 206907 184388 204511 250576 285257 297218 309674 342498
8472 342498 376971 369520 303907 220623 181345 205481 255540 285227 283132 263770 239597 219600
8460 219600 217291 235649 253289 248579 231605 229104 242245 246669 236152 236515 264305 297672 308533
8447 308533 305020 316182 343623 356306 335177 298089 270915 255644 244787 251026 294910 365123
8435 365123 417562 422305 391175 349748 306580 268848 263381 307002 366502 386786 361029 337400
8423 337400 348363 369502 364434 335909 307559 284769 265223 264841 295909 333084 338366 313946
8411 313946 296895 305278 322305 331891 336193 336711 331594 334349 359425 383972 364223 302694 257487
8398 257487 263592 286043 281719 268059 286225 325734 340083 322841 310960 312376 287772 221479
8386 221479 160657 152532 177233 178387 138766 91798 72271 88112 131467 183806 212946 199920
8374 199920 174877 194246 268887 342313 358159 325012 291553 280229 278880 284338 312167 359075
8362 359075 392972 394919 381302 367454 339413 287897 243304 238790 254387 243035 209526 212790
8350 212790 271612 313687 258979 130893 38945 51669 125418 172325 167779 162842 204060 275049
8338 275049 326891 342489 347285 363447 379862 376093 355867 339279 332747 325947 313919 303979 301888
8325 301888 307702 323890 348721 361150 334998 276327 227777 224444 258973 298113 317795 312582
8313 312582 288598 262224 252225 257705 253777 221593 172029 128520 99864 83034 78283 85303 97420
8300 97420 115524 153349 211278 260927 277219 270647 264781 259352 244428 233266 243030 254264 231969
8287 231969 182658 147443 139894 138240 142199 181328 249354 286588 260733 217504 210426 222585
8275 222585 208191 177495 178865 213655 232810 218568 211021 239514 277080 286648 274721 270528
8263 270528 277563 275776 258873 242906 238939 234263 207092 157282 117921 126217 176815 217722 208083
8250 208083 167625 147042 160591 177387 173390 157937 148371 153226 182861 236590 271922 234818
8238 234818 141803 84463 118713 192539 226068 221416 233931 265774 263881 216959 178599 180733
8226 180733 192556 189832 199394 235508 250967 207402 150880 152858 203306 231218 217454 212890
8214 212890 239918 252139 220873 196265 233506 303175 331041 301047 263269 252893 257206 263190
8202 263190 283688 320093 341535 323551 276117 214877 139417 66272 47199 109890 199348 227287
8190 227287 178169 122649 120128 151857 168367 161856 156706 154179 130068 83049 48694 56081 94098
8177 94098 131731 154532 168192 177386 176683 162212 143423 137796 151830 168558 161169 124045 83206
8164 83206 67901 80114 104432 137081 180781 213848 197806 130980 68757 66709 119374 178753
8152 178753 218522 249245 277576 287169 268086 237073 216947 216915 240378 285150 322718 307245
8140 307245 231339 152532 135536 180739 235006 257713 244562 200882 136109 85521 92100 150405
8128 150405 202370 206496 181175 161231 144766 112666 75622 65696 92373 136260 178233 210042
8116 210042 225702 227895 234117 251217 253944 216760 157453 118134 111060 116774 126999 147851 164424
8103 164424 150954 122579 127251 172051 208002 209291 213872 251449 283966 267925 233003 236950
8091 236950 270883 276417 242197 214974 216741 218427 205348 202414 211215 183517 96229 7238 -7605
8078 -7605 54824 133014 174725 169369 131181 89297 80856 119140 175324 215407 240808 268129
8066 268129 290333 292747 289248 300247 306505 272741 214485 189976 215820 240344 221686 186501
8054 186501 178093 184465 164778 127212 128220 190204 261266 276112 233751 193328 202832 251464
8042 251464 293033 300233 284104 266028 248611 223488 195652 182288 189532 206612 224060 240941
8030 240941 250380 237685 204526 178940 184618 209596 221980 210960 195301 192690 197532 194097 179604
8017 179604 165703 162650 171220 191154 228587 284065 333887 340692 296643 244778 236636 274102
8005 274102 317088 344252 371368 404044 415517 395879 383479 406540 423266 373343 275181 213619
7993 213619 228370 271386 290059 297019 325578 362411 370168 348690 327691 315546 300495 294244
7981 294244 327843 398794 460605 477270 459612 436434 417301 400490 394709 409171 432057 439309
7969 439309 424597 408659 415859 445321 468643 461012 435333 433020 470251 507312 493667 436350
7957 436350 395377 409742 456832 492679 502192 493530 470262 433568 394291 360099 325169 292413
7945 292413 287123 322049 365666 378045 366866 370138 388154 376344 315425 248903 228910 252323
7933 252323 274511 267711 243279 228528 240644 274671 303035 296809 259714 229265 232585 256355
7921 256355 274497 285498 298584 300195 268411 216367 187372 200387 227881 238422 237111 247073
7909 247073 268178 275830 256391 227076 216569 232967 256501 264688 259817 262038 274808 274408 246819
7896 246819 219248 230043 272641 297239 272906 224021 195988 205638 237185 269008 290028 302508
7884 302508 319938 349119 365618 326202 222313 105895 42632 49452 93697 138746 167031
7873 167031 169721 144885 107853 79413 59339 31853 1762 3013 58266 143403 206538 218038
7861 218038 192953 166140 153321 142409 122910 112207 135566 181752 203954 177559 133659 113820
7849 113820 113144 100020 77833 86322 140875 206963 243780 244786 227395 210532 211445 237376 269427
7836 269427 279243 269344 268442 279296 267868 221452 180896 188422 232639 272170 286552 276991 246747
7823 246747 213251 210505 241454 254726 210796 145378 118384 124455 114422 89817 104833 171264
7811 171264 230642 239279 221580 215022 216123 210249 207414 215844 220099 215191 222289 240629 227845
7798 227845 165804 104245 94838 119419 131713 133239 149490 160973 127023 64606 35569 56900
7786 56900 85275 93005 97291 105348 94285 66782 68409 117668 165893 162057 120480 90310 89988
7773 89988 106423 131620 163998 192622 211624 234421 268277 294493 299979 305514 330267 349004
7761 349004 323397 263194 216747 206591 212013 213727 217585 227809 230924 219811 209534 216097 235775
7748 235775 253136 254737 231577 185983 141467 128821 155770 203312 253260 301427 341131 357789
7736 357789 353402 358679 401528 468977 514772 506803 462419 434930 461642 522412 557044 531451
7724 531451 476504 447663 458013 475033 476655 477348 491779 504123 492242 460923 429847 401950
7712 401950 364483 315661 274384 264550 295453 350025 387516 371563 307239 240902 213469 223233
7700 223233 242317 253939 257338 247776 213599 153969 87097 38208 20895 24307 18520 -14882
7688 -14882 -57241 -77573 -84522 -120900 -191420 -234203 -199584 -128620 -107293 -159556 -235233 -292970
7676 -292970 -335972 -362595 -347264 -295821 -262324 -270670 -265387 -189768 -78600 -15945 -20255 -31568
7664 -31568 -7703 27230 40813 43522 56117 67614 58406 37212 22850 9310 -18843 -49109
7652 -49109 -50331 -14065 39341 91297 135606 162392 162688 154728 175528 230764 276173 269330 224104
7639 224104 191313 195742 217536 231961 237566 235013 205362 137426 68295 64101 145331 249263
7627 249263 290019 252263 201853 198927 227559 231835 198965 169182 168848 177866 177861 191916 243927
7614 243927 306179 328585 306392 276930 255847 224404 185795 182479 231726 284779 286608 248328
7602 248328 220769 216233 202072 165206 136884 144899 177863 210833 236372 253130 250069 225873
7590 225873 206559 217087 242118 239463 194808 143716 129778 152839 173266 165539 150651 163691
7578 163691 200571 220034 200135 166539 150764 144839 122306 85426 58078 41828 17122 -11924
7566 -11924 -12067 31389 95174 155913 211670 251718 245528 190310 136328 128852 148013 142959 107604
7553 107604 82743 93399 123925 152674 174979 189379 193075 195923 211568 230617 227915 199202
7541 199202 165621 141126 123331 117684 137607 173539 195027 195239 201118 224548 236794 213132
7529 213132 172617 146571 133673 117701 108425 127260 162568 175629 150968 112461 88226 84283
7517 84283 94819 113913 129937 127850 106875 83873 72212 65924 49531 17988 -14934 -25964
7505 -25964 -5064 27197 35434 11844 -8838 9506 59870 106532 132873 150954 169861 182382
7493 182382 185008 186081 188252 183940 173615 168431 170314 171271 175947 196314 214279 183830 95385
7480 95385 11324 3032 65641 128000 139917 115273 89220 71082 55941 53562 77240 113874
7468 113874 130376 113078 85198 77070 86650 80971 39915 -10380 -21321 19291 68098 78457
7456 78457 59209 59558 100538 150347 175204 184981 206521 234410 241361 227745 223762 239132 247073
7443 247073 233515 229601 267803 327688 358021 341507 305441 274070 245123 215884 198029 194957
7431 194957 192116 182461 176326 174913 164038 150039 165968 213264 232123 175144 88288 64155
7419 64155 119681 174569 160349 99972 56852 49297 52576 58789 91602 163642 246579 290175
7407 290175 264075 185614 111350 90643 120297 154336 160739 152033 155298 174009 192453 200321
7395 200321 199026 197190 208474 236496 255702 233124 180580 153652 177883 208110 191578 142926
7383 142926 118105 135786 167680 191614 208207 213265 201753 199198 241871 316890 363031 343350
7371 343350 282828 225095 187462 169010 165548 160442 133320 93263 72909 78264 80047 67737
7359 67737 70189 101964 132817 139084 142296 159842 159069 109834 51086 48678 103905 156796 169767
7346 169767 157266 139461 119806 110776 131118 166424 174950 145832 115202 112157 122223 117067
7334 117067 90292 52581 18941 7516 21120 26657 -9322 -57970 -45899 47571 154304 201033
7322 201033 187176 153548 120745 97927 108929 155232 182742 144554 79081 65500 110421 142791
7310 142791 125107 103454 124879 164544 174802 163749 175792 216627 245516 236665 208131 185170
7298 185170 167483 145585 125612 117718 110482 77849 15200 -43924 -56841 -14954 48665 92874
7286 92874 101033 81879 54450 41005 59442 103582 136939 126193 82124 51054 62926 102509
7274 102509 134933 143805 137706 133252 140807 156815 162979 142627 104167 77837 82322 105416 124752
7261 124752 134433 140358 142875 140793 143083 155986 161568 131455 68167 14732 9486 39940 56009
7248 56009 28340 -18354 -34957 -3251 46819 72776 63180 43474 46689 83254 132799 159368
7236 159368 141027 91887 49434 34906 36910 41723 60326 103922 149321 162099 147415 140220
7224 140220 144973 128554 83450 51449 61775 90383 112281 147765 209659 247572 211234 142442
7212 142442 126929 164619 171556 118557 77392 95894 115585 75621 25618 49233 122507 145945
7200 145945 98515 60147 74915 89326 59614 33169 64504 115345 112838 68646 61222 113648
7188 113648 165354 172789 169113 196154 231825 227946 186236 149863 134957 116223 82609 68900
7176 68900 113670 204369 281889 296051 250262 194521 176112 194490 207669 186429 150576 137166
7164 137166 144618 136763 101966 73185 73621 75167 41911 -6658 -15680 28136 77966 89387 67862
7151 67862 45292 41774 64689 113781 164640 174149 130996 81235 73682 96195 100272 76877 65683
7138 65683 87322 108562 92522 53484 38096 68186 121828 161622 167380 148842 138340 164471
7126 164471 222477 274992 289049 267547 240135 230798 239212 245249 225976 177047 124311 105884
7114 105884 133453 175474 186599 154366 114583 117605 172289 223613 204707 122898 68548 107574
7102 107574 186941 197044 120020 50925 56518 84387 57871 1116 -1301 63932 124541 130691
7090 130691 105999 85506 68828 53829 60670 94591 126713 136965 140222 149192 149507 134837 127993
7077 127993 139589 143639 126473 122697 162491 215025 229809 209183 190980 179128 146595 98891
7065 98891 78275 99581 130318 144624 152861 163409 157642 127100 103329 122434 178084 230839
7053 230839 250519 234720 200637 173844 172857 190871 200920 187023 160502 141319 137181 146230
7041 146230 164369 181842 185769 172777 148648 116587 83373 73627 108522 164524 186099 155194
7029 155194 117736 118650 138443 125646 73692 30903 40462 98144 166043 204577 194193 149087
7017 149087 111181 112553 141923 160949 151166 131131 129136 151241 175459 171098 129954 82354
7005 82354 68149 85383 89771 58961 30271 48591 101083 139288 148559 153855 165958 167504 154346
6992 154346 148849 162858 181219 189142 184431 160630 116126 82861 98857 140878 137412 73026
6980 73026 26210 63187 140344 165394 121896 72067 55306 50019 35678 29711 44072 53740
6968 53740 36083 9492 6259 28296 52638 65703 71428 74792 74948 71475 66345 61008 56368 52604
6954 52604 47027 36342 21536 6647 -4925 -8512 1232 20687 36211 42166 49589 64290 69958
6941 69958 53355 34383 43965 78141 103965 109815 118422 145931 179237 201964 212415 205308 168309
6928 168309 113529 81675 92626 118382 128365 134179 159709 191611 198017 182162 177666 194960
6916 194960 208747 201251 187297 189815 212408 239572 246693 214535 155999 120602 141789 184615
6904 184615 183497 133953 103026 134117 185135 189013 139282 79078 33943 887 -12247 11810
6892 11810 55918 70390 34662 -13691 -28206 -6739 22116 42729 58649 70783 76333 83207
6880 83207 100370 115226 105800 79769 74850 106139 136443 123782 83550 71047 104960 143974
6868 143974 150192 141080 153282 183162 201535 211331 243184 292411 308730 267329 209537 184296
6856 184296 183325 172036 157663 177432 230352 272525 283754 290699 310789 318558 290819 245024
6844 245024 202535 150960 83598 44497 78321 148456 165039 101466 29946 22799 65630 97299
6832 97299 95018 78408 56432 19263 -24370 -44044 -26335 12739 55776 96360 122096 117500
6820 117500 93186 82813 96545 103434 78369 43894 42211 81586 134164 175246 200148 209427
6808 209427 203541 193313 195369 213245 236760 260054 285560 310130 323229 322497 319182 325419 344077
6795 344077 367587 376543 349164 291717 250454 263375 301887 298154 240751 201439 238811 311086
6783 311086 329270 276980 224415 224274 247824 244077 217025 206814 222023 235426 238093 253212
6771 253212 288221 311990 302040 286690 308085 356953 380672 358266 333457 357338 423287 481997
6759 481997 505303 507847 511287 514897 507845 491903 482819 497037 537162 581725 596928 576961 566484
6746 566484 616853 720408 818634 879910 932039 1002386 1066478 1088757 1083013 1089716 1112049 1119286
6734 1119286 1104047 1089553 1079170 1043198 965841 868143 773323 685693 617589 597996 628891
6723 628891 663064 654221 608204 559407 517625 467450 404424 341181 287017 248926 245141 288220
6711 288220 354364 393042 371821 300938 220415 176681 198054 267941 327912 331582 292860 260997
6699 260997 257401 265250 272570 285284 293442 267085 205531 157991 169403 228596 294334 350571
6687 350571 404855 447425 451109 415233 378758 375621 393831 392372 349774 284566 232082 212215
6675 212215 221773 248856 284350 320211 348814 371591 399506 434798 460761 463676 456346 458990
6663 458990 461658 433954 377441 339635 360523 426995 496848 547066 578188 591514 590989 596838
6651 596838 627983 673407 704728 715678 727390 755872 796207 839568 884642 929527 970920 1012799
6639 1012799 1058323 1095762 1115819 1141082 1207692 1312375 1411420 1486346 1576353 1720791 1899895
6628 1899895 2069263 2234111 2446323 2731300 3057809 3387401 3716555 4048771 4348283 4546999
6618 4546999 4591625 4472351 4216837 3872977 3491784 3109350 2741816 2403682 2124366 1931466
6608 1931466 1816953 1734995 1640882 1524429 1402159 1291218 1203045 1149511 1131125 1118248 1068136
6597 1068136 974189 882392 840897 842362 835530 788644 718380 654439 601797 552556 515240 507929
6585 507929 527799 549396 556333 557328 562027 554104 505511 418613 341079 326915 382486 459592 505869
6572 505869 514199 514617 526320 536055 525857 502209 483328 468916 442149 401779 375273 390412
6560 390412 440759 489047 504775 491813 476768 477639 492260 511827 528357 525765 487592 432845
6548 432845 423347 498678 607370 643771 566891 447778 377721 363160 345934 301621 268642
6537 268642 282304 323264 344895 325406 281494 248809 254956 294480 328129 325261 305344 312365
6525 312365 348827 369085 347238 315506 314289 334580 338032 312211 276484 249067 237272 248250
6513 248250 280481 313043 329830 344834 375187 400844 388461 350457 336776 361024 378128 352943
6501 352943 310287 288476 279079 254022 228533 245546 300801 333431 306750 259198 247687 267492
6489 267492 265287 222678 188450 215415 289337 341581 324849 259384 203821 192965 209880 213016
6477 213016 183820 145984 138453 171872 217160 238521 228809 204975 179424 153770 136692 142775
6465 142775 164525 167760 133836 92993 93936 145709 209085 242460 236850 206278 165779 127196
6453 127196 101456 94316 105261 131627 165274 188825 191497 188121 202434 229011 236150 214961
6441 214961 197657 208786 225245 214804 194674 211630 268954 314878 313670 292860 299783 336788
6429 336788 363785 349165 295691 228365 180108 179466 223705 264649 249282 183089 131340 145719
6417 145719 206856 252372 246032 203222 161975 150445 176034 222961 258125 257103 228938 202715
6405 202715 189056 171019 136718 104009 103635 147882 220416 286192 310552 286117 245796 229970
6393 229970 233836 210517 139436 66850 56190 115676 196726 247612 247679 209140 172652 181325 226965
6380 226965 242580 186825 113322 103339 145804 151311 84794 10223 -13702 -7024 -3445 15043
6368 15043 63756 96479 70508 28289 41746 104466 151773 165643 182374 209448 218769 223155
6356 223155 271452 348169 363275 280943 184989 164484 195005 195122 153705 129303 148309 175587
6344 175587 183728 191973 225385 278293 331359 373150 391785 369056 297376 192812 87933 18173
6332 18173 5618 38398 71324 66815 35120 18816 39351 74928 91631 82122 69473 79530
$$ [...]
##END NTUPLES=NMR SPECTRUM
##END=
