##TITLE=H1
##JCAMPDX= 6.0         $$ Bruker NMR JCAMP-DX V2.0
##DATA TYPE= NMR SPECTRUM
##DATA CLASS= NTUPLES
##ORIGIN= UXNMR, Bruker Analytische Messtechnik GmbH
##OWNER= root
$$ XWIN-NMR		Version 3.5
$$ Mon Jan  4 10:25:50 2016 Russian Standard Time (UT+4h)  servis@DPX200
##.OBSERVE FREQUENCY= 200.131235884673
##.OBSERVE NUCLEUS= ^1H
##.ACQUISITION MODE= SIMULTANEOUS
##.ACQUISITION SCHEME= undefined
##.AVERAGES= 1
##.DIGITISER RES= 18
##SPECTROMETER/DATA SYSTEM= spect
##.PULSE SEQUENCE= zg
##.SOLVENT NAME= CDCl3
##.SHIFT REFERENCE= (INTERNAL, CDCl3, 0, 16.5164)
##AUDIT TRAIL= $$ (NUMBER, WHEN, WHO, WHERE, WHAT)
$$ ##TITLE= Audit trail, XWIN-NMR		Version 3.5
$$ ##JCAMPDX= 5.01
$$ ##ORIGIN= Bruker BioSpin GmbH
$$ ##OWNER= servis
$$ F:/spectra/data/servis-vadim/nmr/H1/1/pdata/1/auditp.txt
$$ ##AUDIT TRAIL=  $$ (NUMBER, WHEN, WHO, WHERE, WHAT)
(   1,<2016-01-04 10:23:41.71 +0400>,<servis>,<DPX200>,
      <created by zg, POWCHK disabled, PULCHK disabled
       configuration hash MD5:
       00 E9 B6 7A A2 85 ED C7 34 08 36 98 17 FE 4E 26
       data hash MD5: 16K
       57 C0 B2 76 E7 BB B1 E7 E6 BB C4 A4 4E 54 DA 01>)
(   2,<2016-01-04 10:23:46.68 +0400>,<servis>,<DPX200>,
      <Start of raw data processing
       efp BC_mod = 2 LB = 0.3 FT_mod = 6 PKNL = 1 PHC0 = -104.5595 PHC1 = 3.843713 SI = 32K 
       data hash MD5: 32K
       FA 62 D4 F1 26 B7 04 4A 3E AD A3 53 42 E5 E8 D0>)
$$ ##END=
$$ 
$$ hash MD5
$$ 5D AF BC 1A F9 82 A4 FB D2 B9 B2 E8 4C 52 B9 88
##$RELAX= 
##$RELAX= 
##$RELAX= 
##$RELAX= 
##$RELAX= 
##$RELAX= 
$$ Bruker specific parameters
$$ --------------------------
##$DU= <F:/spectra>
##$EXPNO= 1
##$NAME= <H1>
##$PROCNO= 1
##$TYPE= <nmr>
##$USER= <servis-vadim>
##$AMP= (0..31)
100 100 100 100 100 100 100 100 100 100 100 100 100 100 100 100 100 100 
100 100 100 100 100 100 100 100 100 100 100 100 100 100 
##$AQSEQ= 0
##$AQ_mod= 1
##$AUNM= <au_zg>
##$AUTOPOS= <>
##$BF1= 200.13
##$BF2= 200.13
##$BF3= 200.13
##$BF4= 200.13
##$BF5= 500.13
##$BF6= 500.13
##$BF7= 500.13
##$BF8= 500.13
##$BYTORDA= 1
##$CFDGTYP= 0
##$CFRGTYP= 5
##$CHEMSTR= <none>
##$CNST= (0..31)
1 1 145 1 1 1 1 1 1 1 1 1 1 1 1 1 1 1 1 1 1 1 1 1 1 1 1 1 1 1 1 1 
##$CPDPRG= <>
##$CPDPRG1= <>
##$CPDPRG2= <>
##$CPDPRG3= <>
##$CPDPRG4= <mlev>
##$CPDPRG5= <mlev>
##$CPDPRG6= <mlev>
##$CPDPRG7= <mlev>
##$CPDPRG8= <mlev>
##$CPDPRGB= <>
##$CPDPRGT= <>
##$D= (0..31)
0 1 0 0 0 0 0 0 0 0.06 0 0 0 0 0 0 0.0002 0 0 0 0 0 0 0 0 0 0 0 0 0 0 
0 
##$DATE= 1451888621
##$DBL= (0..7)
120 120 120 120 120 120 120 120 
##$DBP= (0..7)
150 150 150 150 150 150 150 150 
##$DBP07= 0
##$DBPNAM0= <>
##$DBPNAM1= <>
##$DBPNAM2= <>
##$DBPNAM3= <>
##$DBPNAM4= <>
##$DBPNAM5= <>
##$DBPNAM6= <>
##$DBPNAM7= <>
##$DBPOAL= (0..7)
0.5 0.5 0.5 0.5 0.5 0.5 0.5 0.5 
##$DBPOFFS= (0..7)
0 0 0 0 0 0 0 0 
##$DE= 6
##$DECBNUC= <off>
##$DECIM= 32
##$DECNUC= <off>
##$DECSTAT= 4
##$DIGMOD= 1
##$DIGTYP= 9
##$DL= (0..7)
0 120 120 120 120 120 120 120 
##$DP= (0..7)
150 150 150 150 150 150 150 150 
##$DP07= 0
##$DPNAME0= <>
$$ [...]
##$SUBNAM3= <"">
##$SUBNAM4= <"">
##$SUBNAM5= <"">
##$SUBNAM6= <"">
##$SUBNAM7= <"">
##$SUBNAM8= <"">
##$SUBNAM9= <"">
##$SW= 20.6817932712277
##$SWIBOX= (0..15)
0 0 3 0 0 0 0 0 0 0 0 0 0 0 0 0 
##$SW_h= 4139.07284768212
##$TD= 16384
##$TD0= 1
##$TE= 0
##$TE2= 300
##$TE3= 300
##$TEG= 300
##$TL= (0..7)
0 120 120 120 120 120 120 120 
##$TP= (0..7)
150 150 150 150 150 150 150 150 
##$TP07= 0
##$TPNAME0= <>
##$TPNAME1= <>
##$TPNAME2= <>
##$TPNAME3= <>
##$TPNAME4= <>
##$TPNAME5= <>
##$TPNAME6= <>
##$TPNAME7= <>
##$TPOAL= (0..7)
0.5 0.5 0.5 0.5 0.5 0.5 0.5 0.5 
##$TPOFFS= (0..7)
0 0 0 0 0 0 0 0 
##$TUNHIN= 0
##$TUNHOUT= 0
##$TUNXOUT= 0
##$USERA1= <user>
##$USERA2= <user>
##$USERA3= <user>
##$USERA4= <user>
##$USERA5= <user>
##$V9= 5
##$VALIST= <valist>
##$VCLIST= <CCCCCCCCCCCCCCC>
##$VD= 0
##$VDLIST= <DDDDDDDDDDDDDDD>
##$VPLIST= <PPPPPPPPPPPPPPP>
##$VTLIST= <TTTTTTTTTTTTTTT>
##$WBST= 1024
##$WBSW= 4
##$XGAIN= (0..3)
0 0 0 0 
##$XL= 0
##$YL= 0
##$YMAX_a= 16036
##$YMIN_a= -17650
##$ZGOPTNS= <>
##$ZL1= 120
##$ZL2= 120
##$ZL3= 120
##$ZL4= 120
##$ABSF1= 0
##$ABSF2= 0
##$ABSG= 0
##$ABSL= 0
##$ALPHA= 0
##$AQORDER= 0
##$ASSFAC= 0
##$ASSFACI= 0
##$ASSFACX= 0
##$ASSWID= 0
##$AUNMP= <proc_1d>
##$AZFE= 0.1
##$AZFW= 0.1
##$BCFW= 0
##$BC_mod= 2
##$BYTORDP= 0
##$COROFFS= 0
##$CY= 18.4799938201904
##$DATMOD= 1
##$DC= 0
##$DFILT= <>
##$DTYPP= 0
##$F1P= 9.9274215381318
##$F2P= -0.165520771350173
##$FCOR= 1
##$FTSIZE= 32768
##$FT_mod= 6
##$GAMMA= 0
##$GB= 0
##$INTBC= 1
##$INTSCL= 1
##$ISEN= 128
##$LB= 0.3
##$LEV0= 0
##$LPBIN= 0
##$MAXI= 10000
##$MC2= 0
##$MEAN= 0
##$ME_mod= 0
##$MI= 50
##$NCOEF= 0
##$NC_proc= -10
##$NLEV= 6
##$NOISF1= 3.799351
##$NOISF2= 2.8
##$NSP= 0
##$NTH_PI= 0
##$NZP= 0
##$OFFSET= 16.51637
##$PC= 4
##$PHC0= -104.5595
##$PHC1= 3.843713
##$PH_mod= 1
##$PKNL= yes
##$PPARMOD= 0
##$PSCAL= 4
##$PSIGN= 0
##$REVERSE= no
##$SF= 200.13
##$SI= 32768
##$SIGF1= 3
##$SIGF2= 2
##$SINO= 400
##$SIOLD= 16384
##$SREGLST= <1H.CDCl3>
##$SSB= 0
##$STSI= 32768
##$STSR= 0
##$SW_p= 4139.07284768211
##$SYMM= 0
##$S_DEV= 0
##$TDeff= 16384
##$TDoff= 0
##$TI= <>
##$TILT= no
##$TM1= 0
##$TM2= 0
##$TOPLEV= 0
##$USERP1= <user>
##$USERP2= <user>
##$USERP3= <user>
##$USERP4= <user>
##$USERP5= <user>
##$WDW= 1
##$XDIM= 32768
##$YMAX_p= 374740749
##$YMIN_p= -1344388
$$ End of Bruker specific parameters
$$ ---------------------------------
##NTUPLES= NMR SPECTRUM
##VAR_NAME=  FREQUENCY,     SPECTRUM/REAL,   SPECTRUM/IMAG
##SYMBOL=    X,             R,               I
##VAR_TYPE=  INDEPENDENT,   DEPENDENT,       DEPENDENT
##VAR_FORM=  AFFN,          ASDF,            ASDF
##VAR_DIM=   32768,         32768,           32768
##UNITS=     HZ,            ARBITRARY UNITS, ARBITRARY UNITS
##FACTOR=    0.126318333923829, 1,           1
##FIRST=     3305.42128286362, 0,            0
##LAST=      -833.651564818493, 0,           0
##MIN=       -833.651564818493, -1344388,    0
##MAX=       3305.42128286362, 374740749,    0
$$ Real data points
##PAGE= N=1
##DATA TABLE= (X++(R..R)), XYDATA
$$ [...]
21240a78492J62220M7213N2741R2954M6915m3277r8703j46848j93861j21493J07898
21229b72733K81623J83576p6303j90311o0564J21047J68545P8502p7806k34180
21219g8604k77911j16352J39043K19613J8694k55447l24742j44868R8514K08131
21209e13929J32837j3438m5066J07010K77217K36757O151j40925m4827J22234
21199A24021J18412k3974q2393J2206J05551P5455k0836q7397j26647j62776j40921
21188b09299o530J67749K32517J32994l6304j51058j73125j32446n6024L2595
21178a98931Q1499N6103J5791O1823J78212K07915N3197j69132k62001j85832
21168a61356n7427M3216J24086J52809N0441j31982j87428j1844K18511K50046
$$ y = [-178492, -16272, 30941, 83682, 176636, 223551, 180274, 81571, -65277, -259138, -380631, -272733, 8890, 192466, 116163, -74148, -134712, -13665, 154880, 233382, 155576, -78604, -356515, -472867, -333824, -114211, -95517, -350964, -675706, -820574, -722060, -513929, -381092, -394530, -439596, -332586, -55369, 181388, 187539, 46614, 1787, 124021, 242433, 218459, 136066, 148272, 253823, 329278, 308442, 221045, 94398, -68378, -209299, -215829, -48080, 184437, 317431, 281127, 130069, -43056, -175502, -231526, -198931, -117432, -61329, -45538, 16285, 194497, 402412, 455609, 286477, 24476, -161356, -218783, -175567, -51481, 101328, 151769, 19787, -167641, -179485, 39026, 289072]
21158B89072O3794j31874j74100r4345j3362M181k2414l2936J8129J04678J33429
21147A44252N0093p0544r1380K8595J78012K02126O0664j15744j45203j0131Q2184
21136C12924n1690k86677l10652o2976J41597M4493j81721j85140O5568K75407
21126b38867K61799J43349P3267K4895p0601j57709j46331n5447K7263N3061K3398
21115f1923k9788m0315L0513J07252P5833l8614r1526m0941q779p3936j50553
21104c22777j42714q2447l2121J8806P2704P1720K0978K8328J16838J41318J6817
21093i2550j16298j06152k4322p580k188J11984K47976K16754N0762l4842J1871
21082B55415K8098n1900r0392j6640L2168n2962j69320j76291r7830l3140M134
$$ y = [289072, 352866, 220992, 46892, -47453, -60815, -56634, -79048, -111984, -93855, 10823, 144252, 194345, 123801, 32421, 61016, 239028, 441154, 501818, 386074, 240871, 230740, 312924, 261234, -25443, -336095, -399071, -257474, -212981, -394702, -579842, -514274, -238867, 22932, 166281, 239548, 264443, 193842, 36133, -110198, -165645, -138382, -85321, -61923, -91711, -132026, -101513, 5739, 81572, 42958, -48568, -89509, -98288, -172224, -322777, -465491, -547938, -580059, -561253, -488549, -416829, -395851, -367523, -250685, -109367, -92550, -208848, -315000, -339322, -346902, -349090, -237106, 10870, 227624, 278386, 243544, 255415, 283513, 231613, 141221, 124581, 156749, 103787, -65533, -241824, -339654, -372794, -368660]
21071c68660M1169M8887J233m9321m2127J6297R8357J82766J97816O7591j27992
21060F6016j87741o5617M4241M535n4125K6015J37219O7446j45487k48685j25326
21049d81509Q9391K27840K41639J38463m9630k09422k16282r7131L490L3980P4171
21038b45000J49769J67733Q4954m158j6191P121P04j8477j5604n671Q076O2251
21026A75507J32703J10175m1685j96633k18378j19005J0989J29841K04848J52793
21016C41155m0402k11301j80549R946J52229J34905K0841j03263j96954j93263
21006b66656l5185J70001J98815J073j93690j66496P629R7225M5815k36M0856
20995a00849P2345R274p1022n9884M635P506m7975m0163P5219J81724J58876M1505
$$ y = [-368660, -327491, -278604, -277371, -326692, -368819, -352522, -254165, -71399, 126417, 194008, 66016, -121725, -187342, -143101, -138566, -192691, -166676, -29457, 37989, -107498, -356183, -481509, -392118, -164278, 77361, 215824, 166194, -43228, -259510, -356641, -353151, -319171, -245000, -95231, 72502, 157456, 153298, 137107, 144228, 144932, 126455, 110851, 105180, 113256, 175507, 308210, 418385, 376700, 180067, -38311, -157316, -146327, -16486, 188362, 341155, 300753, 89452, -91097, -81151, 71078, 205983, 226824, 123561, -73393, -266656, -301841, -131840, 66975, 68048, -125642, -292138, -284509, -187284, -141469, -141705, -100849, -28504, -19230, -90252, -150136, -145501, -137995, -185970, -226133, -150914, 30810, 189686, 231191]
20983B31191m3095m5651k3990k2785r565M7837J02507P5260l7376j37071j17217
20972B0045J6240J26122P8308r0658j89349j02773M4930N0141q1152j36935r570
20961b74651J43667J29496j2692q9019j8278J05486J67949J31130J2774j10403
20951A85459j13968K8548J42052M4339j72258k31573n8586J24595J40027P8176
20941A66811P3504O6229l7175j36756r2071J5979J2860o0805k5435R2782P7431
20930A53354r3471j67361j9117J32914P5258n8943j2883J83944K68033J24411
20920E86139j03567k49805k71767j76444O176J56651J44944J6064m6976J7549
20910G8964P1753R546p8574n6660N4026J19344O4615p0982j86232j72836l865
$$ y = [231191, 188096, 142445, 118455, 95670, 86105, 133942, 236449, 311709, 274333, 137262, 20045, 36285, 162407, 240715, 150057, -39292, -142065, -97135, -46994, -128146, -265081, -274651, -130984, -1488, -14180, -103199, -121477, -15991, 151958, 283088, 295862, 185459, 71491, 100039, 242091, 286430, 114172, -117401, -175987, -51392, 88635, 166811, 240315, 306544, 269369, 132613, 40542, 56521, 69381, 8576, -16859, 75923, 153354, 59883, -107478, -126595, 6319, 81577, 22634, 9751, 193695, 461728, 586139, 482572, 232767, -39000, -215444, -209268, -52617, 92327, 108391, 61415, 78964, 150717, 160263, 81689, 25029, 79055, 198399, 263014, 192032, 5800, -167036, -170901]
20899a70901J78793J71697j8404j29773Q445J99355J24275j97599m05864k68766
20889e08742M1526K18744J98997J34538J06144M4209p9279j50633p9350M3743
20879c0103O6097N163K4833J60476K13876L0719k25998k59796o1776O7400l7624
20868d6733j63907o1030J64621K15898N2911p8995l9157M0134J3198p0917j01964
20857g5941p2699j5826P2072J48825J12831k4212q9325Q006J19532Q4961j8917
20846B49307l1793M243o5147j96529j77486K9968K08218K01253J06426O3402M1966
20835D33828l0911q8537l5039O1627O0103k5932o1715l4848q2321k31572k83795
20824c19112p5845K42425L49868J59232o4639m7832J41171J97040q757k57758
$$ y = [-170901, 7892, 179589, 161185, 31412, 39857, 239212, 363487, 165888, -239976, -508742, -467216, -248472, -49475, 85063, 191207, 235416, 156137, 5504, -73846, -30103, 35994, 41157, 65990, 226466, 440342, 471061, 245063, -14733, -76509, -9109, -46733, -210640, -271670, -107049, 108849, 161760, 82765, 43608, 83742, 96940, 26023, -75941, -148640, -164466, -92394, 56431, 169262, 145050, 55725, 63731, 183263, 268224, 249307, 217514, 221757, 156610, -39919, -217405, -187437, 20781, 222034, 328460, 391862, 433828, 402917, 314380, 279341, 340968, 401071, 375139, 313424, 278576, 196255, -35317, -319112, -394957, -152532, 197336, 356568, 291929, 244097, 385268, 582308, 573551, 315793]
20814C15793k69204n2708J16206L5587j98596l19274j82024R6154K69757K15012
20804B6703M0494n6096j8279L2357r520q2909o2199M7555J04724J4732j45403
20793a07841k03220o9900J52741K45447R5993j42946j98554j1280J80036J53104
20783I3580j8435j19748j12430j15919j45489r1957M2786J09703N6456J0858N2325
20772b38270Q3530K3254l9305N00Q9610J16821P1059m976j02149j79287j34701
20761c13914L2638J50337R5232k1033k9790M2056N6421m31m2721o0214q4194n2944
20749b28557R1428K29248J92236K7827p0965o7434r2185j66370j51181r22J51872
20738h5003K06210J88825J11987m9298j98708j69075L266Q4407j559o5189P572
$$ y = [315793, 46589, -6119, 110087, 145674, -52922, -372196, -554220, -458066, -188309, 26703, 67197, 11101, -7178, 25179, 15659, -67250, -129449, -81894, 22830, 37562, -107841, -311061, -380961, -228220, 17227, 113220, -29726, -228280, -239560, -59524, 93580, 75145, -44603, -157033, -272952, -418441, -510398, -467612, -357909, -301453, -290595, -238270, -154740, -131486, -170791, -170291, -80681, 36140, 107199, 102223, 74, -179213, -313914, -281276, -130939, -35707, -56740, -86530, -44474, 11947, 11516, -31205, -91419, -175613, -228557, -137129, 92119, 284355, 312182, 241217, 173783, 81598, -84772, -235953, -236875, -85003, 121207, 310032, 422019, 372721, 174013, 4938, 8204, 92611, 91052, 25863, 33435]
20727C3435P3376K4680j0441N2383M6465j27885k26587j4242K97442L13517L6764
20716D98907j72258j46022n4896j7764N5636J71737J52735m2883j92573j55028
20706I7591q8055j48545k04677o3526J81797K64610J13998q5220j51283o7821
20696a51131P2431J54040R9911m8853j46582j12333k4706K3391O3716J36397J46244
20685B12525L411j65541j47085L6751J36099L2653j01104p9520L1642N8964K915
20674B1710J507O6944M8897j03615k05537p7435J64463K17181q392k48719k30056
20663c53052k8570O1407m0864j03138M7611K47466K29118Q981j44503q6998M5281
20652a17261Q1662M9347O6425J21548R8751j4869p6708K2602J96753K49986J02343
$$ y = [33435, 106811, 131491, 121050, 173433, 219898, 92013, -134574, -148816, 148626, 462143, 498907, 326649, 180627, 125731, 107967, 163603, 335340, 488075, 445192, 252619, 97591, 9536, -139009, -343686, -407212, -225415, 39195, 153193, 67973, -83310, -151131, -78700, 75340, 175251, 126398, -20184, -132517, -157223, -133832, -70116, 66281, 212525, 215936, 50395, -96690, -59939, 76160, 108813, 7709, -71811, -40169, 18795, 21710, 23217, 90161, 139058, 35443, -170094, -247529, -83066, 134115, 125723, -122996, -353052, -381622, -320215, -361079, -464217, -416606, -169140, 59978, 68959, -75544, -162542, -117261, -35599, 13748, 80173, 201721, 300472, 285603, 208895, 231497, 428250, 678236, 780579]
20641G80579j18572k16862j31295J8909P8089J6108o5714p1446j8304Q205j9864
20630B59833m0852r492J9140l0370j18347j22547j9336O2382K2531n9924m7115
20619h4097N0462J00871N2622j4137l5432m1006o3047p5643n5271q372P6331J96096
20607I9377K49165J26909p9892j41885k6363K4994j23462k50669j14173J36702
20597i9297J63943l8470j47143k9112O7243n8597k22357j37286J49835L17062
20587c4179J79405j24023l16538k41587K8983K53559K28746J1801j20535l448
20577a37816K07635K54454J10779m0645j00505j38447j87528j44411M5840K44678
20567A14034K75757J47246R079n7152q3925q0319K932J30931J43745l5762k40010
$$ y = [780579, 662007, 445145, 313850, 332759, 410848, 426956, 361242, 289796, 271492, 279697, 259833, 218981, 209489, 228629, 198259, 79912, -42635, -61971, 411, 22942, -36982, -84097, -33635, 67236, 119858, 105721, 70289, 29283, -33764, -109407, -164678, -173050, -96719, 99377, 348542, 475451, 395559, 253674, 227311, 252305, 128843, -121826, -235999, -99297, 64646, 26176, -120967, -150079, -82836, -141433, -363790, -501076, -351241, -34179, 145226, 21203, -295335, -536922, -507939, -254380, -25634, -13833, -134368, -137816, 69819, 324273, 435052, 394407, 293902, 155455, -32073, -176484, -130644, 114034, 389791, 537037, 546116, 488964, 405039, 324720, 327652, 458583, 602328, 566566, 326556]
20556C26556k40075n2500Q8445O4795J0075N6616J24382Q5073p906k3852J0392
20545D42001k7068j14295j13158j4735M6940L0860L2198O4902K1130r1655r6459
20534A80661O6185K01180J40096k2041j11218j18923j06003m1044P5104Q8319
20524C52316q1806k31131j31944J03515J78606M7531p6460q7300o9346m1891P1513
20513C3603J97322J39824q0043j96669r8592J4626j9342q7715m9684L0398N6680
20502e9592P4614R9867Q980k02204k84153r6199J11776O0041j07594o0093J69542
20491b85015K41475O1589j00977p6928k5546r8543j74869r0962P9075J43524O3190
20480b63987l0088q288J27424K32960J37749j24965k60735o5669K21773J86834
$$ y = [326556, 86481, 33981, 122426, 187221, 197296, 253912, 378294, 463367, 455461, 431609, 442001, 414933, 300638, 187480, 172745, 219685, 250545, 282743, 347645, 368775, 277120, 180661, 246846, 448026, 588122, 566081, 454863, 335940, 229937, 188893, 263997, 352316, 270510, 39379, -92565, 10950, 189556, 237087, 160627, 73327, 3981, -37910, 33603, 230925, 370749, 290706, 94037, -4555, 10071, -9271, -96986, -146670, -116272, -59592, 15022, 114889, 123869, -78335, -362488, -458687, -346911, -286870, -394464, -454557, -285015, -43540, 18049, -82928, -159856, -185402, -283945, -458814, -549776, -470701, -327177, -263987, -294075, -302363, -174939, 58021, 195770, 70805, -189930, -255599, -33826, 153008]
20470A53008j47132l00597k6308L29083L47991J15611j1424L5645N3351j3201
20460E36027k7191K3885L073r0410j05239k2985J3469k3973k2514j0449j55058
20449A18635l92128l83954k2729L12796K48298o2770j90688m3504R1014M4929
20439b80101j8672O6201K01624K03117O9793m6717m9934J6967M8073j1865j05710
20428I2776j18263k7451M2704q336r4191o2491O8226J39714R9168M6870L5453
20417B14179J413o7207p7060j0267J4605n0544q3246k523Q4485P3802L8587O1617
20405A97841N7601n1155j34459n5292N7321k182j48524j21526Q0269J96630J35669
20394B12193P8483J02628M1342j58453k62512j25090M2536J2255r3079m1037J00149
$$ y = [153008, 5876, -294721, -321029, 8054, 356045, 471656, 460232, 495877, 549228, 536027, 508836, 532721, 535794, 445384, 340145, 317160, 330629, 306656, 284142, 273693, 118635, -273493, -657447, -680176, -367380, -119082, -181852, -372540, -416044, -325030, -280101, -298773, -232572, -30948, 172169, 241962, 195245, 145311, 162278, 210351, 198486, 92776, -25487, -52938, -10234, -18570, -112761, -175252, -107026, 32688, 131856, 178726, 214179, 215592, 148385, 71325, 61058, 75663, 25119, -58127, -60650, 23835, 97637, 136224, 197841, 255442, 204287, 69828, 14536, 71857, 69675, -78849, -200375, -120106, 76524, 212193, 290676, 393304, 434646, 276193, 13681, -111409, -68873, -56618, -149697, -190734, -90585]
20383i0585R9960k1546m2288O8534J19210M5984L262O7650J07585J7213j27157
20372B47822k14902k31568j84178o0193Q1504J27661O9393R211j5314o1508j15683
20361c47755p8444M1100J01096N5137J9200M5456L0574n9614q3717K9257J25375
20350a22335P3697j0705K8905J20356R5047l2883j18581j18253q1304o344J05127
20339f7273J41948K7056j12980j17780m5316m3692o6498K9766J73681J52912j9906
20328E1918j07559l3252K3187l6054p8127j5193M4765L6124O4048J57994J50240
20317B58091k9078j70640j00100L6611K6484n9981k8817P5010N0184j01457j76321
20306b20014r6887J1508O3969J07147J54937J42887P8019N1956P1101L7942o8115
$$ y = [-90585, 9375, -12171, -54459, 14075, 133285, 179269, 182531, 250181, 357766, 374979, 247822, 32920, -198648, -382826, -443019, -361515, -233854, -164461, -155250, -170564, -232072, -347755, -426199, -385099, -284003, -228866, -209666, -164210, -133636, -193250, -276967, -247710, -122335, -48638, -59343, -30438, 89918, 184965, 152082, 33501, -84752, -166056, -172400, -67273, 74675, 101731, -11249, -129029, -174345, -218037, -284535, -254769, -81088, 71824, 51918, -55641, -88893, -65706, -101760, -179887, -195080, -150315, -114191, -50143, 107851, 258091, 229013, 58373, -41727, -5116, 21368, -38613, -67430, 7580, 57764, -43693, -220014, -316901, -305393, -241424, -134277, 20660, 163547, 241566, 293522, 364623, 402565, 334450]
20295C34450j47232j45565j15186q1097j150J07746J53540J18682Q4459P4931
20285C83578K8391m3555l9769L5894M3325n6171j13025l8955L7712o279q4554
20274A46592p4220l5884p5123j16499k7153J28007J71767R2490K4531J168m9575
20263A86101r3336j7076J23034J25953l6665j62352j44206j14028j58171j42392
20253d33138J6137J33994M2447j02868n6181J12791J44281L5057K8925J69093
20243I0538K04508K6952j20741l9953R4553L2474j35572j40338J8436R1496J472
20232A23825n6406L0430J09295L7549q4078r9890n0277o3845j18590r4647M248
20221b62386O5351P4579J27801K18778J91564k1345k49695k85156j47149k9690
$$ y = [334450, 187218, 41653, -73533, -154630, -155780, -48034, 105506, 224188, 308647, 383578, 411969, 368414, 328645, 364539, 407864, 351693, 238668, 199713, 237425, 231146, 146592, 72372, 36488, -38635, -155134, -182287, -54280, 117487, 209977, 234508, 235676, 186101, 92765, 75689, 198723, 324676, 288011, 125659, -18547, -132575, -290746, -433138, -417001, -283007, -240560, -343428, -399609, -286818, -142537, -107480, -78555, 90538, 295046, 321998, 201257, 161304, 255857, 288331, 152759, 12421, 30857, 122353, 123825, 67419, 97849, 207144, 244693, 160615, 60725, 10448, -53397, -171987, -266634, -262386, -197035, -122456, 5345, 224123, 415687, 394342, 144647, -140509, -287658, -317348]
20211c17348k4807k6711P6012K23815K64124J45588l3509j42792j24260J725J58182
20200B00019K29024J33031p4275k25980k20777j29600p6217p2763n6986l6292
20190c30816o6490j02922k1701J72899K97137K16692J9825j16972j34877p3636
20180a40861M5725J86971K27065P9177j41143k21732j23740j1891q054n0843l3977
20169a93303L8190Q9584P7505R477p5269j09613n3471L4131N2348K09k5744J4934
20157a41022O1765Q1520J16054J58370J13677l8852j62608j37443k3312M2121
20147G0270K1117m1210j18074j76181j35677J9832J58670J50456M5255j5045l647
20136b4234N086m65K7265O0202K1515o0452p3086J036O0943M8436L804l5850n8207
$$ y = [-317348, -342155, -368866, -292854, -69039, 195085, 340673, 307164, 164372, 40112, 41837, 200019, 429043, 562074, 487799, 261819, 41042, -88558, -164775, -237538, -294524, -330816, -397306, -500228, -521929, -349030, -51893, 164799, 184624, 67652, -67225, -140861, -95136, 91835, 318900, 398077, 256934, 35202, -88538, -100429, -108483, -159326, -193303, -155113, -65529, 11976, 21453, -53816, -163429, -216900, -182769, -130421, -130212, -155956, -141022, -79257, 2263, 118317, 276687, 390364, 351512, 188904, 51461, 28149, 70270, 91387, 50177, -67897, -244078, -379755, -359923, -201253, -50797, -5542, -20587, -24234, -19148, -19613, 7652, 67854, 89369, 28917, -44169, -43133, 17810, 66246, 70050, 34200, -24007]
20123b4007p796J43266K60892J74705l8815j09063K9981J14088o1426l30491l99770
20112b48436k37542l1305J06747J76849J32141p3459l00827l11711p2394J93046
20102f66891K81231J97818N1526p9245j26946l6177J29495J95658Q5003o3794
20092c2322p1151N4751J53280J31623N6847L5880Q0591J18809J01521N8853L8229
20081G26911J2934r1105k56851l35796k23883l2752K6555p4132j37363j6920J79350
20070b23052K42563J32074j0024o3669m1673q332J2749K6781L3841L9567N6133
20059A96958O8850M2778j0992j9547N4970J34189J07476n578n7792K1705J02618
20048F35635J7601j95596l31881k89071j64335n2505Q6454K55837K79666L1457
$$ y = [-24007, -31803, 111463, 372355, 547060, 508245, 399182, 429163, 543251, 481825, 151334, -248436, -485978, -517283, -410536, -233687, -101546, -175005, -475832, -787543, -859937, -666891, -385660, -187842, -136316, -215561, -342507, -378684, -249189, -53531, 31472, -32322, -103473, -48722, 104558, 236181, 293028, 328908, 409499, 528308, 629829, 688682, 726911, 739845, 648740, 391889, 56093, -167790, -200542, -173987, -248119, -385482, -402402, -223052, 19511, 151585, 141561, 77892, 36219, 27887, 40636, 67417, 101258, 140825, 196958, 265808, 308586, 297594, 278047, 333017, 467206, 574682, 569104, 511312, 533017, 635635, 653236, 457640, 125759, -163312, -327647, -380152, -293698, -37861, 241805, 273262]
20038B73262k78848k90858K1011K78698J96627n7953j38375J1482J50559J12686
20028B78291j8114q9747o6685j732M7512K9687p5152j94441k02710o9540Q7687
20017b74944J39739Q8363L4293L9822O8270M8914k8637r3634p0554K3443Q1461
20006E6536K8156q7906j54690j20418j6380J03727J79115J32557m9022k23473
19996a51798k00656J3353J83626J35474j1876j4865J43970K24530O7873j73085
19986B16546k32720p6761Q0533Q0517J210j2421K7233J3052m3747k3643P9019
19975A08818J06481k7716j91160k17016j23097k7697N0233J49680K02052J01115
19965A31693q2517j50840n8478M1204N8606P4129J19914P7244q2125j58270j0548
$$ y = [273262, -5586, -296444, -275433, 3265, 199892, 141939, 3564, 15046, 165605, 278291, 260177, 170430, 103745, 102013, 149525, 179212, 104060, -90381, -293091, -362631, -274944, -135205, -46842, -12549, 27273, 95543, 144457, 115820, 22186, -48368, -24925, 56536, 84692, -3214, -157904, -278322, -294702, -190975, -11860, 120697, 71675, -151798, -352454, -339101, -155475, -20001, -31877, -46742, 97228, 321758, 389631, 216546, -16174, -92935, -12402, 68115, 69325, 56904, 84137, 97189, 53442, 29799, 108818, 215299, 187583, -3577, -220593, -343690, -371387, -321154, -171474, 30578, 131693, 49176, -101664, -160142, -118938, -60332, 13797, 133711, 210955, 128830, -29440, -39988]
19954c9988J82175J67571K907n5076L3088N6618o7843j55382n9447J01145J31314
19943B97082J9063r9018j17832l0094Q9612J16185m799j37323r1338R1643J64311
19932B97492M2702n9620J8158J17343L2695j32092j30531K6574J10738N6133K1845
19921D01437P5039Q1312l1711j37096j26754p0187n2112k6508M8337Q3475P826
19910B53058p7898m4385N4874O2358m4763j29109q5601M6825J57478J69439Q3057
19899D45333k7992p9021o6753o1540q3989o4665K6172R8707P1084m180l2172j7074
19887B03910p521K1891J01554J38703J9448j76393k23925m7765J62032J79815
19877C71749l516k05102k55147j36484K9014J03441O8328K9246N7615Q1868J0108
$$ y = [-39988, 142187, 309758, 312665, 257589, 290677, 347295, 279452, 124070, 64623, 165768, 297082, 316145, 217127, 99295, 69201, 158813, 274998, 270199, 132876, 41538, 133181, 297492, 340194, 280574, 298732, 416075, 448770, 316678, 186147, 212721, 323459, 379592, 401437, 476476, 557788, 526077, 388981, 262227, 192040, 139928, 113420, 161757, 245232, 253058, 175160, 130775, 185649, 248007, 203244, 74135, -11466, 35359, 192837, 362276, 445333, 417341, 338320, 271567, 210027, 126038, 61373, 87545, 186252, 257336, 253156, 220984, 203910, 196389, 218280, 319834, 458537, 477985, 301592, 77667, 29902, 191934, 371749, 368233, 163131, -92016, -228500, -199486, -96045, -27717, 1529, 59144, 141012, 151120]
19866A51120r7141r6655K1207J16467R8988J8139n4517j02537j05671l6612M9842
19855c7370N2512j3266j9634O4355J11262M5680l2666k4386J2780p501m4360l0566
19843G6840j5052o0312r1520p673J19197J17209l8420j89564j99894q8619L3324
19832c44484P9730N7711O9661J94427L30303K69890L802k01149j56366k4004m6452
19821B33069j55173j09555P5640J47923L2980p4583n8432j9560j2853N3654J60275
19810B73385J18510q2538j63736J3996J76934M6327k11506k43171m6607P9567
19800c8839K7077k1704L7224Q2549L8111J3708Q3155J43031J02473L9239N2564
19789E58588R5401O5658l0399j02055r8219m1054J4937J9531l1113p9749q8174
$$ y = [151120, 53979, -42676, -21469, 94998, 193986, 212125, 157608, 55071, -50600, -87212, -37370, 15142, 1876, -17758, 46597, 157859, 203539, 170873, 146487, 159267, 151766, 107406, 76840, 61788, 1476, -90044, -97717, 21480, 138689, 100269, -89295, -289189, -377808, -344484, -264754, -207043, -137382, 57045, 387348, 657238, 661040, 459891, 303525, 279521, 233069, 77896, -31659, 43981, 191904, 224884, 150301, 91869, 72309, 59456, 113110, 273385, 391895, 309357, 145621, 159617, 336551, 382878, 171372, -71799, -118406, -38839, -11762, -33466, 3758, 86307, 124418, 138126, 221281, 364312, 466785, 506024, 558588, 653989, 719647, 689248, 587193, 488974, 447920, 462857, 482388, 451275, 371526, 283352]
19778B83352j07313j81718k24547j21781O0939J42067R9366Q9957J56254J30263
19768C26839o4199k23840j51187L5429Q3337j5054m9643N7258J56919J35304O6681
19757C57844N7554R2546R8404N0332l2536j07678j05274m404P9173R061j48285
19746C46737j70987p444J15072J6408j59573j59768K359R3483K9849k5775M0416
19735A20777J08812L0340j35666k09293j26752K2118J35561J76516J40860M3757
19725C07030o5012j32161j43931j07799k5413P5868J28512R5336J6370n9733j32093
19714d3026j77697j09412R0921K67245K55029J10946K7794M8662M1999l9640q2061
19703C90760m3495n5999j78742k35412o4673J99396K83365J34155m8908r3846
$$ y = [283352, 176039, -5679, -230226, -352007, -291068, -149001, -49635, 40322, 196576, 326839, 262640, 38800, -112387, -76958, 6379, -8675, -58318, -1060, 155859, 291163, 357844, 415398, 507944, 606348, 656680, 624144, 516466, 411192, 406788, 485961, 495022, 346737, 175750, 168306, 283378, 299786, 140213, -19555, -17196, 76287, 106136, 80361, 120777, 229589, 259929, 124263, -85030, -211782, -189664, -54103, 122413, 263273, 307030, 242018, 109857, -34074, -141873, -167286, -91418, 37094, 132430, 148800, 89067, -43026, -220723, -330135, -239214, 28031, 283060, 394006, 421800, 470462, 512461, 472821, 390760, 347265, 291266, 112524, -122888, -187561, 11835, 295200, 429355, 380447, 286601]
19693B86601j2538Q7349J00994l5546k64031l80812k35651N6512K35883K15536
19683E4297J35020J06775Q0388m941r0839r6285l3852L3027O2715K6130q2125
19672A90310j85035j69888l7311Q1941R7312N9144N0240O4916M8314j1235p6508
19661A12200j05550q4514n2907p3717j24789p9288J09288K77585K53763J18124
19651C50195P0468R5882J2663j62861j93930j7324J37729J23776P1388P6607P922
19640E72515j73532k14690K4849K39115R5202k16146k37461O9862K93243J81344
19630F34301p9632k18153j83187n6064O5755N6389j19958k59364j32164J54536
19620a37541K76023J65363O2114P1060K6053j26372j71894j1993J25162N5109
$$ y = [286601, 274063, 361412, 462406, 426860, 162829, -217983, -453634, -397122, -161239, 54297, 189317, 296092, 376480, 371539, 280700, 184415, 150563, 183590, 246305, 272435, 190310, 5275, -164613, -201924, -119983, -22671, 36473, 86713, 151629, 199943, 188708, 112200, 6650, -77864, -130771, -204488, -329277, -408565, -299277, -21692, 232071, 350195, 420663, 516545, 529208, 366347, 172417, 155093, 292822, 416598, 487986, 564593, 572515, 398983, 184293, 209142, 448257, 543459, 327313, 89852, 159714, 452957, 634301, 554669, 336516, 153329, 97265, 163020, 219409, 99451, -159913, -292077, -137541, 138482, 303845, 365959, 437019, 463072, 336700, 164806, 152813, 277975, 333084]
19610C33084o7855m4026L9935J2143p2596p3547l1971m9454o1869J5250O5558
19599F4652m1225j70190j07024P4022J15414q464p0474K6839J22846Q8247M886
19588I9529r562L1578O1487N8171J3261p0746j14967k0717J65020K52387J32250
19577E97691q0843j78379q7314N9754P5288n7296j36318L095K16554K00091o0295
19566E52028k17123n9481J59592J11092j07995j63678k8564K3745q8247j41913
19556C9456l0788M8811n5796k04090k02079p0277O3360J50420J77739J07160k1120
19545B796p8053m0089l7109j13609j23313J7083J51179J15739p367m6260j1690
19534a70693k0843m9878K4329J77921K34546J17989m3470j00736n9235k1272k5741
$$ y = [333084, 265229, 221203, 261138, 273281, 200685, 127138, 95167, 45713, -16156, -906, 64652, 23427, -146763, -253787, -179765, -64351, -72815, -143289, -116450, 6396, 94643, 99529, 89967, 121545, 183032, 241203, 254464, 183718, 68751, 48034, 213054, 465441, 597691, 516848, 338469, 251155, 310909, 386197, 328901, 192583, 195678, 412232, 612323, 552028, 334905, 275424, 435016, 546108, 438113, 274435, 245871, 269616, 181369, 39456, 8668, 57479, 1683, -202407, -404486, -474763, -411403, -260983, -83244, 23916, 2796, -75257, -115346, -152455, -266064, -389377, -372294, -221115, -105376, -112743, -159003, -170693, -191536, -241414, -217085, -39164, 195382, 313371, 269901, 169165, 109930, 88658, 62917]
19523F2917j0477P4035J61953J36992L981q8395n4879o724o4289j37164p0394
19512G556O5771O6385o2461j20153p9871j25695k52529j78954J69851M21977K62051
19501A73928q8611j96111j4594J57053J62288R1127k288j43016k36080j40852
19491b37156O0351J48646J12808J24664J82848J01578j08102j79721j9528J14657
19481C01045K0806j31394r5084O2689J04482R385l4793M1166R6704K0520j12525
19470B83001j63720r8732J0302Q4307R9528Q1072O3533N7720M7444Q161o9147
19459D03469j47578j40873N49J78908K05999L1364j60735j63490O992J63537J78110
19448E56252O5682q8689j75333j03362Q0075J83101J02288k6768m8795l7724j32769
$$ y = [62917, 52440, 126475, 288428, 425420, 429401, 341006, 286127, 279403, 215114, 77950, 7556, 73327, 139712, 77251, -42902, -122773, -248468, -500997, -679951, -510100, -88123, 173928, 85317, -110794, -125388, 31665, 193953, 285080, 282792, 139776, -96304, -237156, -176805, -28159, 84649, 209313, 392161, 493739, 385637, 205916, 186388, 301045, 321851, 190457, 95373, 158062, 262544, 271929, 237136, 278302, 375006, 395526, 283001, 119281, 20549, 30851, 115158, 214686, 295758, 359291, 417011, 464455, 472616, 403469, 255891, 115018, 115567, 294475, 500474, 531838, 371103, 207613, 214605, 378142, 556252, 621934, 533245, 357912, 254550, 334625, 517726, 620014, 593246, 544451, 506727, 373958]
19437C73958k43290j73487L1515J47299J40555J73808K44139J53674r6873k20155
19427E31143p5397J08391J03049Q909K6726J33119J83837J52508P8666n3310k08574
19416I89067k39517r9847L8335M3863L2532J41268K73215K65539J51975N5174
19406A651604l1413j45027j86303p8790L1405l1429j83786k09581q3298M1376
19396G74758P2987J8597j12305k46802k19434o176J61006J28907Q3427K05294
19386H60259K80333K7392l47278l72355k4390K38764J71577K0615K7107P5965
19376I57989N433q9084o4856J9685M8651L4736K6158J3591J9971R1912J50466
19365A214652P1530n5294j4184J57708J90960M1440k7371P6920J00841p8199j90208
$$ y = [373958, 130668, -42819, -11304, 135995, 276550, 450358, 694497, 848171, 751298, 531143, 455746, 564137, 667186, 676095, 702821, 835940, 1019777, 1172285, 1250951, 1197641, 989067, 749550, 649703, 688038, 731901, 764433, 905701, 1178916, 1444455, 1596430, 1651604, 1620191, 1475164, 1288861, 1210071, 1241476, 1210047, 1026261, 816680, 733382, 774758, 847745, 866342, 754037, 507235, 287801, 281625, 442631, 571538, 654965, 860259, 1140592, 1167984, 820706, 448351, 423961, 662725, 834302, 854917, 882024, 957989, 963422, 874338, 809482, 829167, 877818, 912554, 938712, 952303, 972274, 1064186, 1214652, 1286182, 1230888, 1216704, 1374412, 1565372, 1606812, 1579441, 1656361, 1757202, 1679003, 1488795]
19354A488795l9015J24820J1050k24889k47537o2403P4390Q8115R1121R2976J8744
19343A416167q6068j38964j97116l04796l09867j01284J22171J17802p044J3236
19333E24237J43477J32405l0388j06447k0989N9102M6749J7265j3996q5523q9238
19322E76654R1719K69550J44247j83973k90563o9877J07810l000j74553j43874
19312C24140k1220j1307m5737J8637Q5790K996j32045j31930l9052j3088k4497
19301A2687O2349J88303J65241J0850m8417O7594J64273O9771j13953j62114k7262
19290C89322J20726J27492L8863Q747O0177M1260j27600k72528j77701Q1490K08596
19279D98844Q7463r1267j45909j29863j45632j35428j1328J50193K06459J50025
$$ y = [1488795, 1449780, 1574600, 1585650, 1360761, 1113224, 1050821, 1125211, 1213326, 1304447, 1397423, 1416167, 1330099, 1191135, 994019, 689223, 379356, 278072, 400243, 518045, 511001, 524237, 667714, 800119, 769731, 663284, 642295, 701397, 748146, 765411, 751415, 665892, 576654, 668373, 937923, 1082170, 898197, 607634, 537757, 645567, 642567, 468014, 324140, 302920, 291613, 245876, 264513, 350303, 353299, 221254, 89324, 50272, 37184, 12687, 75036, 263339, 428580, 439430, 391013, 458607, 622880, 692651, 578698, 416584, 389322, 510048, 637540, 676403, 685150, 745327, 786587, 658987, 386459, 208758, 290248, 498844, 586307, 495040, 349131, 219268, 73636, -61792, -73120, 77073, 283532, 433557]
19269D33557Q0109M8241L8138K5702k1872j19575j77580o5135J68207K86690J79533
19258H76015J5535l0540k4743q4641j22696l554J67777J61757l1661j93842j81892
19247E47515n7196N9975R5531J4459j32181j89872p8141O8296Q6535L4134O4700
19236E13755J33139N8835j47281k60327j65856M410R7011J11096J07711J06192
19226E58685J05792P8456n0850k67825l59290j51035J71395K36819L220j77909
19216A47458q0141J04131J23273M5430O8072J60580J49335L2328l5460o886K2311
19205G30431J5335L8151R3363P5440o1103k00511j91445k1611J66865K14763R4730
19194I54408o0266q5622M8298K14091K69572J92217P6021L0031P4098J08737J9761
$$ y = [433557, 513666, 561907, 600045, 625747, 603875, 484300, 306720, 241585, 409792, 696482, 876015, 891550, 861010, 836267, 751626, 628930, 625376, 793153, 954910, 923249, 729407, 547515, 490319, 550294, 645825, 660284, 528103, 338231, 260090, 328386, 414921, 449055, 513755, 646894, 705729, 558448, 298121, 132265, 136675, 233686, 344782, 452493, 558685, 664477, 742933, 692083, 424258, 64968, -86067, 85328, 322147, 325367, 147458, 67317, 171448, 294721, 340151, 408223, 568803, 718138, 750466, 715006, 708120, 730431, 745766, 783917, 877280, 952720, 891617, 691106, 499661, 478050, 644915, 859678, 954408, 894142, 808520, 856818, 1070909, 1340481, 1532698, 1608719, 1638750, 1712848, 1821585, 1841346]
19183A841346j55257k33353j23318L6428Q6388Q4444J62390K39879J28188j15307
19173A951828k15875r5509K1399q060m1578L6987Q0126n3773k26124k42215j63269
19162A043937j55297j81652j00962M5458J02465P5896Q8271J18502L7809j18928
19152I55499j60156k9453J16132J43334Q1895Q007m9325o5043k2524K5389J6586
19141A020341j6400j6845k2152o7066m4948J37313L23015K61823o628j65383m6102
19130A356968J80348K84187K33525J11118k1346r9802p6804k6297n9645j08906
19120A773346q065J76924J73634m9474j61919K9431K46577J58785j03253j70809
19110B065177j7672L8298j38116l13367k70485r8474O202J7533K9536O2171M5964
$$ y = [1841346, 1686089, 1452736, 1329418, 1365846, 1452234, 1536678, 1699068, 1938947, 2067135, 1951828, 1735953, 1640444, 1661843, 1653783, 1612205, 1649192, 1729318, 1675545, 1449421, 1207206, 1043937, 888640, 706988, 606026, 651484, 753949, 829845, 918116, 1036618, 1074427, 955499, 795343, 765890, 882022, 1025356, 1107251, 1115258, 1065933, 1000890, 978366, 1003755, 1020341, 1003941, 987096, 964944, 897878, 852930, 990243, 1313258, 1575081, 1568453, 1403070, 1356968, 1537316, 1821503, 2055028, 2166146, 2144800, 2044998, 1968194, 1941897, 1882252, 1773346, 1765281, 1942205, 2115839, 2066365, 1904446, 1933877, 2180454, 2339239, 2235986, 2065177, 2047505, 2085803, 1947687, 1634320, 1363835, 1265361, 1271563, 1289096, 1318632, 1380803, 1426767]
19099A426767n7826k03724l03380k87815j58884M827J15879J48739J29510R1495
19089I05588P0509R4131J31862J09847K0029n5356q0009j27451k26327k53546
19079E89277j14546O2286Q0765k9005n4902P9008K22234K35235J41464J4083j16948
19068A108951j95180j39483J4456J19756J31759J61738K41415K15733L276k04541
19058A457880j89884k8653M5418L170K689N5695p859j99846k70605p3854J82905
19047I77056K27644R9461L4286R3731J34545Q7019L1513O741l5685o2162L3632
19036A627781J91425J80362n3386k44493j71292K3392O8749l4688q7453m4717
19026A455680k8222m8369L000R3547O5344o1696p9914M6669R4282l7357j32089
$$ y = [1426767, 1368941, 1165217, 861837, 574022, 415138, 419965, 535844, 684583, 814093, 905588, 976097, 1070228, 1202090, 1311937, 1331966, 1276610, 1196601, 1069150, 842823, 589277, 474731, 537017, 617782, 588777, 533875, 612883, 835117, 1070352, 1211816, 1225899, 1108951, 913771, 774288, 788744, 908500, 1040259, 1201997, 1443412, 1659145, 1662421, 1457880, 1267996, 1239343, 1284761, 1287931, 1290620, 1346315, 1338456, 1138610, 868005, 794151, 977056, 1204700, 1304161, 1338447, 1432178, 1566723, 1653742, 1685255, 1691996, 1656311, 1594149, 1627781, 1819206, 1999568, 1946182, 1701689, 1530397, 1553789, 1622538, 1587850, 1500397, 1455680, 1427458, 1379089, 1382089, 1475636, 1540980, 1479284, 1399370, 1446039, 1540321, 1502964, 1370875]
19015A370875j8947J24305N6471j34156j77631k9224J23179J67371J42628P0561
19005A695432n7610j58242j30090l0843P199J541O6121J76704K08092J78166K15749
18994B172219K86834K10942q508j28566k7179J19049J32294Q5268J05291J25938
18984C073582K7740j15420j36522l9137K8933K2484M3951J41285K07121J25036
18974C379053o7111k11160k01466r4030k8138m6523n3166R717L4327q4699k28135
18963B408669j81735L0052J47660M6206j08828j45009j08250r4770o6321J1764
18953A939438L1589p2388j53100o8889N9441L5331p2690l0633J69669K77346J54790
18942B269904m2740j13423n2952J8937L8888L2366N0976J22420K08425K15318
$$ y = [1370875, 1351928, 1476233, 1532704, 1398548, 1220917, 1191693, 1314872, 1482243, 1624871, 1695432, 1637822, 1479580, 1349490, 1318647, 1325846, 1327387, 1393508, 1570212, 1778304, 1956470, 2172219, 2459053, 2669995, 2661487, 2532921, 2505742, 2624791, 2757085, 2842353, 2947644, 3073582, 3101322, 2985902, 2849380, 2810243, 2839176, 2861660, 2905611, 3046896, 3254017, 3379053, 3311942, 3100782, 2899316, 2805286, 2777148, 2730625, 2677459, 2687176, 2721503, 2636804, 2408669, 2226934, 2256986, 2404646, 2450852, 2342024, 2197015, 2088765, 1993995, 1927674, 1939438, 1971027, 1898639, 1745539, 1676650, 1736091, 1771422, 1698732, 1668099, 1837768, 2115114, 2269904, 2227164, 2113741, 2060789, 2079726, 2118614, 2150980, 2201956, 2324376, 2532801, 2748119]
18932B748119J07180k6447r2226j19571j58247j30335N2406K76914L28428J90661
18922C176882N6747L5512M6142L3865P5872J93292K50682J58185K3056j8340N750
18911D037645o510n4497p2002n9023o3664q9064j06501j09454q9543k3483N7181
18900C421085O0598l6664j32489j33095o3515J2737Q7588J54439J65114J20804
18890C656602R9389J09777M7857r5640j35414L5867K14195J46113o9602j04108
18880C905036J09171K84303K24310P8793M9032Q0529L0015m5975M133J37382J61444
18869E018173L4909q4400r5417o4518m2995L4534J79332K46281J47610M6804J56938
18858E577251M06658N03175L28963Q8075O459N7776Q5163N3368L9870O3825P1587
$$ y = [2748119, 2855299, 2828852, 2736626, 2617055, 2458808, 2328473, 2380879, 2657793, 2986221, 3176882, 3233629, 3269141, 3315283, 3349148, 3425020, 3618312, 3868994, 4027179, 4050235, 4031895, 4037645, 4031135, 3976638, 3904636, 3845613, 3781949, 3692885, 3586384, 3476930, 3387387, 3363904, 3421085, 3481683, 3445019, 3312530, 3179435, 3115920, 3128657, 3216245, 3370684, 3535798, 3656602, 3755991, 3865768, 3913625, 3817985, 3682571, 3718438, 3932633, 4078746, 4009144, 3905036, 4014207, 4298510, 4522820, 4601613, 4650645, 4731174, 4761189, 4715214, 4719347, 4856729, 5018173, 5053082, 4968682, 4873265, 4808747, 4765752, 4800286, 4979618, 5225899, 5373509, 5420313, 5577251, 5983909, 6487084, 6816047, 6904122, 6910581, 6968357, 7053520, 7106888, 7146758, 7210583, 7282170]
18847G282170N2616M4045M1080Q633l7016n1241l8348j7872M0388J44375K00713
18836G669543J38657N8590J00828K15761K51158K27602K93019M07236L50981J17172
18826I830547M935J76129L78561L22442J22158J06754L31199N42374N57933M37687
18816A2810719L13447K59676L16720M60129N60295N28954M72521N43157O90488
18807A6956106P46044P08315P29804Q35055Q77689Q07713P72388Q88908J090647
18798B4412669J268612J423118J612959J870111K204548K591743K951936L255297
18790D1590993L621094M170807M832820N483128O226119P282356Q621930J0011557
18782I1840804J1425601J3001616J4440420J4869391J3642072J1035954P850488
$$ y = [7282170, 7334786, 7378831, 7419911, 7428544, 7391528, 7340287, 7301939, 7284067, 7324455, 7468830, 7669543, 7808200, 7866790, 7967618, 8183379, 8434537, 8662139, 8955158, 9362394, 9713375, 9830547, 9835482, 10011611, 10390172, 10712614, 10834772, 10941526, 11272725, 11815099, 12373032, 12810719, 13124166, 13383842, 13700562, 14160691, 14720986, 15249940, 15722461, 16265618, 16956106, 17702150, 18410465, 19140269, 19975324, 20853013, 21660726, 22433114, 23322022, 24412669, 25681281, 27104399, 28717358, 30587469, 32792017, 35383760, 38335696, 41590993, 45212087, 49382894, 54215714, 59698842, 65924961, 73207317, 81829247, 91840804, 103266405, 116268021, 130708441, 145577832, 159219904, 170255858, 178106346]
18775A78106346M542121J152241k035702m249051m785386l596598j239046J569123
18767A69464048M248542O341683P318762O500128L397974j658481p330391j1964603
18759A76317662j4587248j5224488j4457704j2932469j1204323r659690q380357
18752H9871383p208313o029467m902305l914712l086188k443696k021687j737725
18744E8527290j432994j088557q35276o98438n23067k31443M8748K35551M78513
18735E4480327R26994J473128J921092K295218K775573L409281M097362M828135
18727G6207110N719737O830386Q102320R512257J1120107J2912335J4661531J5910985
18719A60976768J6046963J4594652J1772793Q714873O702613N933057N287934
$$ y = [178106346, 182648467, 183800708, 181765006, 177515955, 172730569, 169133971, 167894925, 169464048, 173712590, 180054273, 187373035, 193873163, 197271137, 195612656, 188282265, 176317662, 161730414, 146505926, 132048222, 119115753, 107911430, 98251740, 89871383, 82663070, 76633603, 71731298, 67816586, 64730398, 62286702, 60265015, 58527290, 57094296, 56005739, 55170463, 54472025, 53948958, 53717515, 53766263, 54001814, 54480327, 55407321, 56880449, 58801541, 61096759, 63872332, 67281613, 71378975, 76207110, 81926847, 88757233, 96859553, 106371810, 117491917, 130404252, 145065783, 160976768, 177023731, 191618383, 203391176, 212106049, 218808662, 224741719, 230029653]
18712B30029653L593873R77374j244107j847000o08198J841077M506404O267640
18704B43516716O160895L902820O7986m472394r173499j3705358j7467353j9666067
18696A89163746j9952797j8715299j6667490j4368323j2166925j0293215q789570
18689H8210127p517092o394823n508924m879989m315247l670278l093395k794125
18681E0036254k694815k548644k313317k150916k098594k001755j789255j577181
18673C2861777j447946j333551j191014j113360j169167j262604j244456j081049
18665B3018630q66345p38369p87173r53485j036005r10393p02291o02692n76023
18656A5845854m58833k99772l22175n26302o29143m91875l19504k99617l23369
$$ y = [230029653, 233623526, 234600900, 233356793, 231509793, 230901595, 232742672, 237249076, 243516716, 249677611, 253580431, 253648417, 249176023, 240002524, 226297166, 208829813, 189163746, 169210949, 150495650, 133828160, 119459837, 107292912, 96999697, 88210127, 80693035, 74298212, 68789288, 63909299, 59594052, 55923774, 52830379, 50036254, 47341439, 44792795, 42479478, 40328562, 38229968, 36228213, 34438958, 32861777, 31413831, 30080280, 28889266, 27775906, 26606739, 25344135, 24099679, 23018630, 22152285, 21413916, 20626743, 19673258, 18637253, 17726860, 17024569, 16421877, 15845854, 15387021, 15087249, 14765074, 14238772, 13609629, 13117754, 12798250, 12498633, 12175264]
18647A2175264k49354j79110k33844k85219j78617l6505m9762j24355n0343J00548
18637A0888703R1645l6720j0388J94891K81681J20226k9236O6014K45426K00056
18627A2012298j05699m38685n88451n02303k49987m286L8497j35657k98958k50072
18617I476697p1593R467m8984q0499j537N1996m9856k00443j84590P051J37150
18606I044859L5449j66141k14008o8264Q9798J52479K02041K96633L31786K23910
18596I928542P9953M9251J24745K22660L35964M55090M59420K79689P8311O9305
18586A2082930K26234L58212L98604M09746L81583K73596K05123L34545N61947
18577A5232520O16059M44765K63413K06633K02725K15818L21878M84677N38063
$$ y = [12175264, 11925910, 11746800, 11512956, 11227737, 11049120, 11012615, 10962853, 10838498, 10788155, 10888703, 10980348, 10943628, 10933240, 11128131, 11409812, 11530038, 11500802, 11566816, 11812242, 12012298, 11906599, 11467914, 10879463, 10377160, 10127173, 10122887, 10161384, 10025727, 9726769, 9476697, 9405104, 9414571, 9365587, 9285088, 9283551, 9335547, 9285691, 9085248, 8900658, 8907709, 9044859, 9080308, 8914167, 8700159, 8631895, 8721693, 8874172, 9076213, 9372846, 9704632, 9928542, 10008495, 10057746, 10182491, 10405151, 10741115, 11196205, 11655625, 11935314, 12013625, 12082930, 12309164, 12667376, 13065980, 13475726, 13857309, 14130905, 14336028, 14670573, 15232520, 15848579, 16293344, 16556757, 16763390, 16966115, 17181933, 17503811, 17988488, 18526551]
18568A8526551M73536M85752O55907Q48028R84934J150485J352277J484167J600079
18559B7561716J901485K368231K753758L040235L504188M222569M974845N789032
18551E6116059P055811Q879086J0909628J3096963J5797158J8524095J9407228
18544A49786028J6952297J1944666O537677J708620l133047p965546j1021049
18537A64809646j0589272p071991k386305K125520O260428R636718J0854459Q620689
18529A82259892L600332j358022l436094k609771j896091m304399r610829j4658679
18521A47986339j6713836j5765675j3509282j1157681q915620o829496n141220
18514F9953529l924683l036432k422479k077467j818521j469639j134401r54804
$$ y = [18526551, 19000087, 19485839, 20141746, 20989774, 21974708, 23125193, 24477470, 25961637, 27561716, 29463201, 31831432, 34585190, 37625425, 41129613, 45352182, 50327027, 56116059, 63171870, 72050956, 82960584, 96057547, 111854705, 130378800, 149786028, 166738325, 178682991, 185220668, 186929288, 183796241, 175830695, 164809646, 154220374, 147148383, 144762078, 146887598, 153148026, 162784744, 173639203, 182259892, 185860224, 184502202, 181066108, 178456337, 176560246, 172255847, 162645018, 147986339, 131272503, 115506828, 101997546, 90839865, 81924245, 75094749, 69953529, 66028846, 62992414, 60569935, 58492468, 56673947, 55204308, 54069907, 53115103]
18506E3115103p75884l81766J36059N91630J068517J701211K315340K699865L053135
18497F3523210L732754M704988N650108O504209P549244R106114J1446622J4794969
18489A27012218J9053867K3638013K7634370K9627954K7353838J8851923N167600
18482B78339783q797064j7617393j9578744j6804987j1854879n762258R28301
18475A98852759P392095J3393944J9076868K3002417K2214663J5665268O145663
18468C05743677k808669j0718672j8951391k6721725l0905980k9978341k5934176
18461A59724723k1635570j7985944j4566468j1477041r208428p586052o092449
18454G1172771m807460m098936l744090l206332k536995k233270k342186k391691
$$ y = [53115103, 52339219, 51957453, 52093512, 52685142, 53753659, 55454870, 57770210, 60470075, 63523210, 67255964, 71960952, 77611060, 84115269, 91664513, 100770627, 112217249, 127012218, 146066085, 169704098, 197338468, 226966422, 254320260, 273172183, 278339783, 269542719, 251925326, 232346582, 215541595, 203686716, 197924458, 198852759, 206244854, 219638798, 238715666, 261718083, 283932746, 299598014, 305743677, 302935008, 292216336, 273264945, 246543220, 215637240, 185658899, 159724723, 138089153, 120103209, 105536741, 94059700, 84851272, 77265220, 71172771, 66365311, 62266375, 58522285, 55315953, 52778958, 50545688, 48203502, 45811811]
18446D5811811k161456j923497j883839j871586j670993j315700r78717q01389
18438C3204634q38975r95502j062175r71431r01683r82071j069674j007494q92102
18429B4483527q42038p19850l93250q2655q6154k85280k99889o2165J36821J44965
18419B1994032J26127K19732L69741N51225Q44600J191937J376227J370249J450863
18410B9494733J829735K405303L035468L827152M945468O316608P753089R183770
18402F8791326J0366897J0412647Q157286L476537j941529n655128o486061n238932
18394H1883043l384568j523361N54235K882982N182786P420614R480909J0137439
18386A12634079P500269J288360n977193j0933957j2303548j1289165r552663
$$ y = [45811811, 43650355, 41726858, 39843019, 37971433, 36300440, 34984740, 34006023, 33204634, 32365659, 31370157, 30307982, 29336551, 28434868, 27452797, 26383123, 25375629, 24483527, 23641489, 22921639, 22528389, 22445734, 22359580, 22074300, 21774411, 21712246, 21849067, 21994032, 22120159, 22339891, 22709632, 23260857, 24105457, 25297394, 26673621, 28043870, 29494733, 31324468, 33729771, 36765239, 40592391, 45537859, 51854467, 59607556, 68791326, 79158223, 89570870, 97728156, 101204693, 99263164, 93608036, 87121975, 81883043, 78498475, 76975114, 77529349, 80412331, 85595117, 93015731, 102496640, 112634079, 120134348, 121422708, 115445515, 104511558, 92208010, 80918845, 71366182]
18379G1366182p782644o105722m746954l815855l086198k402571j894677j563185
18371C9968376j126310n30842j50848j86250k94414j35796J19363J79674J60440
18362C8003393L36648O70738R80060J335345J911848K625059L254886L790477
18354E2908454M379051N081394N895014O846755P920471R159088J0950123J3815889
18346A16956239J7761986K2239971K6657399K9917145K9258602K1342564O232113
18339B70366019j0452932k1359390k3637097k0186928j5071668r727169m012374
18332A65918461J540454O302156J0782610J5108261J7002004J3520380M909574
18325B35083900n023895j2712006j7500822k0231433k0993623j9508303j6582022
$$ y = [71366182, 63583538, 57477816, 52730862, 48915007, 45828809, 43426238, 41531561, 39968376, 38842066, 38311224, 38160376, 37974126, 37679712, 37543916, 37663279, 37842953, 38003393, 38340041, 39010779, 39990839, 41326184, 43238032, 45863091, 49117977, 52908454, 57287505, 62368899, 68263913, 75110668, 83031139, 92190227, 103140350, 116956239, 134718225, 156958196, 183615595, 213532740, 242791342, 264133906, 270366019, 259913087, 238553697, 214916600, 194729672, 179658004, 169930835, 165918461, 167458915, 173761071, 184543681, 199651942, 216653946, 230174326, 235083900, 230060005, 217347999, 199847177, 179615744, 158622121, 139113818, 122531796]
18318A22531796j3675133j1352012r210993p108811n469287m432456l585390k681902
18310F5015812j960233j586951j353255j107233r95017j058643j012196o54872
18302E5287412j76558J65616M02410P00981J106958J598094K170520K755927L283854
18293F7295214L880433M709312N613090O367447P352286R357023J2497835J6012355
18285A33084995J9420788K2845552K5289076K3657323J5408505K361973r641045
18278B32427167j5608515j5177182j1352663o824181k380705K184363P164551
18271A90432835J2849917J9336572K6174801L2304612L5762592L3292304K1902639
18264C72056272K684477j7500217l0353511l2850608k8562725k2430818j6150310
$$ y = [122531796, 108856663, 97504651, 88293658, 81184847, 75715560, 71283104, 67697714, 65015812, 63055579, 61468628, 60115373, 59008140, 58013123, 56954480, 55942284, 55287412, 55110854, 55276470, 55678880, 56379861, 57486819, 59084913, 61255433, 64011360, 67295214, 71175647, 75884959, 81498049, 87865496, 95217782, 104574805, 117072640, 133084995, 152505783, 175351335, 200640411, 224297734, 239706239, 242068212, 232427167, 216818652, 201641470, 190288807, 183464626, 181083921, 183268284, 190432835, 203282752, 222619324, 248794125, 281098737, 316861329, 350153633, 372056272, 374740749, 357240532, 326887021, 294036413, 265473688, 243042870, 226892560]
18257B26892560r211030k010380M195850R153708J2977238J3924838R162628j451113
18249B63634299j3785171k2606107k5676423k4332680k1081142j7602140j4548977
18242A24001659j2074207j0133260q589386p265678n986018m717476l667713l026641
18234F8541280k625941k139146j600914j350782j422517j417511j101881o99201
18226E6183387m17724j12572L58016Q49860J270385J811437K555585L229849L675946
18217F9404169M195336N072940O146135P274841Q856354J1336727J4503528J7775941
18209A44565971K0765507K2722589K1742945J5856680N523296n644733j3344273
18202B12187982j5651897j3577522r270875m313477O24290N331450R468753J1999838
$$ y = [226892560, 217681530, 215671150, 219867000, 229020708, 241997946, 255922784, 265085412, 263634299, 249849128, 227243021, 201566598, 177233918, 156152776, 138550636, 124001659, 111927452, 101794192, 93204806, 85939128, 79953110, 75235634, 71567921, 68541280, 65915339, 63776193, 62175279, 60824497, 59401980, 57984469, 56882588, 56183387, 55765663, 55653091, 56011107, 56860967, 58131352, 59942789, 62498374, 65728223, 69404169, 73599505, 78672445, 84818580, 92093421, 100949775, 112286502, 126790030, 144565971, 165331478, 188054067, 209797012, 225653692, 231176988, 225532255, 212187982, 196536085, 182958563, 173687688, 169374211, 169998501, 175329951, 184798704, 196798542]
18194A96798542J1180632N765179l302410j2700276j8845315k0431659j8808347
18187A39656346j6068887j3267152j0521914q036342o191279m851226l431782
18180G7287764j810180m67850N17681J870732M049938O531395Q829459J1372412
18172A08181351J4077005J4553061R656671m48710j1083692j7016080j7055101
18165A00864505j3979373j0784765q335412o306499m680303l588615k671961j517863
18157D8999714l73429K37660M06984P92671J758958L044751M287127N386967O161585
18148G0702988O011074M336106J285679k113982m627963n567029m998460l469502
18140F1558911j625022P5459J462679K473279K801026J895745m29449l421098
$$ y = [196798542, 207979174, 213744353, 210441943, 197741667, 178896352, 158464693, 139656346, 123587459, 110320307, 99798393, 91762051, 85570772, 80719546, 77287764, 75477584, 75009734, 75527415, 77398147, 81448085, 87979480, 96808939, 108181351, 122258356, 136811417, 146468088, 146019378, 134935686, 117919606, 100864505, 86885132, 76100367, 67764955, 61458456, 56778153, 53189538, 50517577, 48999714, 48626285, 48863945, 49270929, 50063600, 51822558, 54867309, 59154436, 64541403, 70702988, 76714062, 81050168, 82335847, 80221865, 75593902, 70026873, 65028413, 61558911, 59933889, 60009348, 61472027, 63945306, 66746332, 68642077, 68212628, 64791530]
18132F4791530n735883o539573o117083n317376m629258l989977l272682k592320
18124B6597378k114832j829142j607923j360400j066501p59930n21735m24188
18116A6912727m62202n78020p17220q03806p36120n18882l37420l60278n03566
18107A1895213n38760m13517l03410l36433m30654m54493m10286l84857m11405
18098H211398m48370m39797l60231k45037j83472k28881l21585l54037k87472
18089E342516j48577K8644J65931J21226j48262m44919n11280l37191j38718n4573
18079C874797l5780k5226m6114q2772o4920j7556m4668j17001p4842Q7552J49200
18068C602670j4869k27605k64238j52565p1716q2951j08372p6090L6199K05629
$$ y = [64791530, 59055647, 52516074, 46398991, 41081615, 36452357, 32462380, 29189698, 26597378, 24482546, 22653404, 21045481, 19685081, 18618580, 17858650, 17336915, 16912727, 16450525, 15872505, 15155285, 14351479, 13615359, 13096477, 12759057, 12398779, 11895213, 11356453, 10942936, 10639526, 10303093, 9872439, 9417946, 9007660, 8622803, 8211398, 7763028, 7323231, 6963000, 6717963, 6534491, 6305610, 5984025, 5629988, 5342516, 5193939, 5222583, 5388514, 5509740, 5361478, 4916559, 4405279, 4068088, 3929370, 3874797, 3839017, 3813791, 3767677, 3684905, 3619985, 3602429, 3557761, 3440760, 3365918, 3453470, 3602670, 3587801, 3360196, 3095958, 2943393, 2871677, 2788726, 2680354, 2604264, 2640463, 2846092]
18058B846092L14898K16827n3544k60181k55597j43761o1501J3213J04059J00293
18048B820798l5262j21834m2994K2988q8901j92404m5785J80850J28508j53917
18038B472047k66926j03810O117j25919k58160j68604j2694n295o8109n4946n5144
18027A358557j77997k54505q0812J87239K16761L304j23143R648K03835K19500
18017A562387P4825o9540j40710j56954j25325n0345J5172J2800m9017j07930
18007I65363j17341q0834l0628R667L3576K7255k7784r2897o1652J01729K43986
17996I70440J72129p2641k36760j84872m6984K5744O1739J07344O2236j26544
17986G31831k59301j20304J65101K64397R3676j09510j65086j42999j30175o1403
$$ y = [2846092, 3160990, 3377817, 3324273, 3064092, 2808495, 2664734, 2603233, 2616446, 2720505, 2820798, 2785536, 2663702, 2620708, 2643696, 2554795, 2362391, 2316606, 2497456, 2625964, 2472047, 2205121, 2101311, 2107428, 1981509, 1723349, 1554745, 1542051, 1536756, 1468647, 1413701, 1358557, 1180560, 926055, 845243, 1032482, 1249243, 1252547, 1129404, 1139052, 1342887, 1562387, 1637212, 1567672, 1426962, 1270008, 1144683, 1094338, 1109510, 1122310, 1073293, 965363, 848022, 767188, 736560, 746227, 779803, 807058, 779274, 686377, 624725, 726454, 970440, 1142569, 1069928, 833168, 648296, 601312, 627056, 688795, 796139, 858375, 731831, 472530, 352226, 517327, 781724, 875400, 765890, 600804, 457805, 327630, 266227]
17976B66227R9507K13263J52286j092q2957p4081p2433j17378j57636j45117p3939
17965F650K9831J00767Q1960K9590P7470K30338L00516J52340q7699j93008j32058
17954E96697n5365m3056l7570j8069n9746j65368j91489m7600J29566J27126n5344
17943A79782j88660j02834J03015J99324J14502q212l1803P676J0142j0681K3186
17932B95437P4940J6968j47701k35811j27752N7301J29079P7763L9419P0498Q8586
17921C38727K3493q4641j49523j24773k3410Q7088J20096O0262j636J5016O5456
17910C26155N8080N693n942K8221L1781q103k2344R67j4892r6669j65385j55213
17898a7651q4819J3036J16255J50251M9570p7838k3116K08638L41447K07836k87
$$ y = [266227, 365734, 578997, 731283, 730191, 647234, 573153, 500720, 383342, 225706, 80589, 6650, 36481, 137248, 219208, 248798, 326268, 556606, 857122, 1009462, 921763, 728755, 596697, 541332, 498276, 460706, 442637, 382891, 217523, 26034, -21566, 108000, 235126, 179782, -8878, -111712, -8697, 190627, 305129, 296917, 265114, 272790, 282932, 272251, 295437, 370377, 387345, 239644, 3833, -123919, -66618, 62461, 140224, 179643, 250141, 338727, 362220, 277579, 128056, 3283, -20127, 66961, 187057, 247319, 245683, 260699, 326155, 384235, 389928, 383986, 412207, 443988, 435885, 413541, 414508, 399616, 302947, 137562, -17651, -102470, -89434, 26821, 177072, 226642, 148804, 125688, 334326, 675773, 883609, 883322]
17887H83322k8966O6292P3481M962M1693J73148J97959P5680j8343k1168o7488
17876A380572j74403j49795M7867J55070R399j56153q0261R5997P8632p7127q4752
17865A045046M9332K5527k13980l46524j76092O8537J19030N3985P2362J25338
17855H22561N3933p6857q8829m0727j47745l64521l69039n1656K54456K07446
17845A99022o7911j63478M6135K63716K10901j1930j26239p8124l8881o0242K0335
17834A93304K49456L60882J19164k68291l51555l1264L14716L51638J75902N7980
17824A171932L5937k8696j54090k30898k25695j90824j34436n2517j1182k3323
17814A56208M9755K61889L71993J58561j50586j29549J81180K77227n2351l93643
$$ y = [883322, 854356, 920648, 994129, 999091, 1040784, 1213932, 1411891, 1487571, 1469228, 1448060, 1380572, 1206169, 1056374, 1104241, 1259311, 1268710, 1112557, 1032296, 1128293, 1206925, 1129798, 1045046, 1094378, 1119905, 905925, 559401, 383309, 451846, 570876, 624861, 697223, 822561, 876494, 799637, 710808, 670081, 522336, 157815, -211224, -262880, -8424, 199022, 131111, -32367, 13768, 277484, 488385, 476455, 350216, 272092, 233211, 172969, 193304, 442760, 803642, 922806, 654515, 302960, 271696, 586412, 938050, 1113952, 1171932, 1207869, 1179173, 1025083, 794185, 568490, 377666, 243230, 190713, 179531, 156208, 205963, 467852, 839845, 998406, 847820, 718271, 899451, 1176678, 1124327, 730684]
17804G30684l40192p1244J1985q2223o0021R8672J27930m2613j74634j09245L7632
17793A26731J08815Q1614k0623j55572j78648K0159K64268K40240l9088k01024
17783B46872n2138J34119N1741j68573j83617L5669J90747J04470p7442j44840
17773A37008p9160l38L718o1397j25023j10064j1184Q8781J19180J01377P9677
17762A42575L8678k7518l4483P9654K04821J70448N18r5086j6632Q4222L4763
17751E81960j07745j49625l5266R9621J34521J07435J16362J60672J50087L9671
17741A097693j11804k17804k39488j71952k3387J44463K15872J44336M2745N1104
17731I31778J26604Q6682j13790k78080k15890N741J59896J37005J7465q4146
$$ y = [730684, 390492, 319248, 331233, 249010, 188989, 287661, 415591, 372978, 198344, 89099, 126731, 235546, 317160, 296537, 140965, -37683, -17524, 246744, 486984, 447896, 246872, 194734, 328853, 380594, 212021, 28404, 64073, 254820, 359290, 281848, 137008, 57848, 57510, 61228, -169, -125192, -235256, -246440, -157659, -38479, 62898, 142575, 181253, 153735, 119252, 198906, 403727, 574175, 574693, 479607, 462975, 547197, 581960, 474215, 324590, 289324, 388945, 523466, 630901, 747263, 907935, 1058022, 1097693, 985889, 768085, 528597, 356645, 333258, 477721, 693593, 837929, 880674, 931778, 1058382, 1145064, 1031274, 753194, 537304, 543045, 702941, 839946, 857411, 773265]
17721G73265j31803j38647j23329j04105p6068q079Q2709R5051l0194j78695j67760
17710g655J3293J69156J31870m9245j81328j34068N1305K14687K23750R6062l2553
17699D95274p8149r1022j19922q5901Q6620K77994K83233J05970k9854R435J13601
17688I67279J39856J05624P5602J7786q7598j21796J6345J98906J92080k2720
17678A481364k03428j46013Q5355K60936K34333N1440j30343j90159j33193n6250
17668A254042l3214n4512p7513q7966r0702q8229r2984j09199q8446J6640J29662
17657F77579R5799q5115j96042q7362Q8069Q2664q4403j67734o5947O0679P2167
17646C90354M3190Q1493J19164L2616j23997j65667l8857R4687P1609o4540j40407
$$ y = [773265, 641462, 502815, 379486, 275381, 199313, 191234, 273943, 368994, 338800, 160105, -7655, 5638, 174794, 306664, 257419, 76091, -57977, -6672, 208015, 431765, 527827, 495274, 417125, 326103, 206181, 120280, 206900, 484894, 768127, 874097, 844243, 853678, 967279, 1107135, 1212759, 1288361, 1306147, 1218549, 1096753, 1113098, 1312004, 1504084, 1481364, 1277936, 1131923, 1217278, 1478214, 1712547, 1763987, 1633644, 1443485, 1310292, 1254042, 1220828, 1166316, 1088803, 1000837, 910135, 821906, 728922, 619723, 531277, 547917, 677579, 773378, 688263, 492221, 404859, 492928, 575592, 491189, 323455, 257508, 318187, 390354, 433544, 515037, 634201, 666817, 542820, 377153, 338296, 432983, 504592, 440052, 299645]
17635B99645j00186p2135j45842j84022L262L28932M70874L07778J10220J44299
17625A162825K68659J71606j09964k23067l6973J69437J40024k0542q3897l8982
17615A399126j1754j9422k736J3257l1053j04216j52460k02874k64427k37601
17605C85840p8130O1155L4492m8385J5439J84601K27232Q1040p0695r3494n8337
17594F40758o4233r4677j11599j32097j46580r5435J3185P8879N0594j0774m0402
17583H7619l5597j821N1876O2754r052o3812J7870J47817J23503l4953p3808J05510
17571C77906K88595K87365J99536J78402J69931P7040j0046K0267O1038l6406
17561A613628j64681j05877R7900J86590O9249p8719j11344q0297p7190j03447
$$ y = [299645, 199459, 127324, -18518, -202540, -199278, 129654, 600528, 908306, 1018526, 1162825, 1431484, 1603090, 1493126, 1270059, 1233086, 1402523, 1542547, 1522005, 1438108, 1399126, 1387372, 1367950, 1365214, 1378471, 1347418, 1243202, 1090742, 887868, 623441, 385840, 307710, 368865, 403357, 354972, 370411, 555012, 782244, 863284, 792589, 699095, 640758, 576525, 481848, 370249, 238152, 91572, -3863, 9322, 88201, 138795, 128021, 87619, 52022, 50201, 102077, 164831, 155779, 91967, 109837, 257654, 381157, 346204, 272396, 377906, 666501, 953866, 1153402, 1331804, 1501735, 1578775, 1568729, 1588996, 1650034, 1613628, 1448947, 1343070, 1440970, 1627560, 1696809, 1618090, 1506746, 1426449, 1349259, 1245812]
17551A245812j41824j99073k40228k08401j21051l4465N4832J43836J30660k9214
17541F00884j51122m5753J36701P7079k02979l27812j28127J15443J19410k2043
17531A71681q5286o4474m6097J7866J53099J82684j4947k24658j61974Q9846J97655
17520B15395O0510j02032j04077J7211J44965J91958R5400q9778j47192K9796
17510C12156K03348R7474j40872j26837J47379K77083P9361j44829j27010j9703
17500E57550m0796p7907M4418J71599M7134k33952l42134j89385J3740J08029
17490E8296J09714L8911r2842j50058n083J99163J85681m3247j98639j43640n3763
17479i5507o1582l5746J33924K84740K20043J7446j08914j14265q7995l3857Q7448
$$ y = [1245812, 1103988, 904915, 664687, 456286, 335235, 300770, 355602, 499438, 630098, 600884, 449762, 404009, 540710, 617789, 414810, 86998, -41129, 74314, 193724, 171681, 86395, 21921, -24176, -6310, 146789, 329473, 314526, 89868, -72106, 17740, 215395, 275905, 173873, 69796, 87007, 231972, 423930, 519330, 429552, 282360, 312156, 515504, 612978, 472106, 345269, 492648, 769731, 849092, 704263, 577253, 557550, 516754, 438847, 483265, 654864, 701998, 468046, 125912, -63473, -49733, 58296, 168010, 206921, 114079, -35979, -41062, 158101, 343782, 300535, 101896, -41744, -95507, -157089, -192835, -58911, 225829, 445872, 463318, 354404, 240139, 152144, 118287, 205735]
17468B05735J72354P0560j48155k41269j30591M662K1615Q832Q4859J62745Q1365
17457B92712j06316j58651K1321K18393J60773j19990k98737j48384J69496K95192
17447C25809J16054j05809r1776R1707J52757j1305j88088j60518J2146J14014
17437B54991O4839l3324q4764r4886q1409k7436L4858J0635j10457j83891q8002
17426c38846R1154J71427J31403J11652J59405J37586m3321k46761k82804j60154
17416b69259k8838N6203J49899K26649J63388m4274k06654j67812k125J03367
17406a9456P8311p236p6181j01587p6481k1799K067k8792m4458J8337R2427O1390
17394a23458m6823o4783Q5741K67879K88848J21584q7874j89976j54080m8676
$$ y = [205735, 378089, 448649, 300494, 59225, -71366, -66704, -45089, -36257, 48602, 211347, 292712, 186396, 27745, 49066, 267459, 428232, 308242, 9505, -138879, 30617, 325809, 441863, 336054, 244278, 335985, 488742, 477437, 289349, 128831, 140977, 254991, 319830, 286506, 201742, 106856, 25447, -1989, 32869, 43504, -66953, -250844, -338846, -247692, -76265, 55138, 166790, 326195, 463781, 420460, 173699, -109105, -269259, -298097, -241894, -91995, 134654, 298042, 253768, 47114, -120698, -122823, -19456, 58855, 51619, -24562, -126149, -202630, -224429, -222362, -251154, -295612, -277275, -184848, -123458, -170281, -235064, -149323, 118556, 407404, 528988, 441114, 251138, 97058, 48382]
17384D8382M4540Q9790R4352O3913j4023j18128j57375n9197J02109J49071J7130
17373B60564j42654j44484J467J25268J28941P0762J6663o1955j74550k03954
17363a23932m2389K03787K87558J27346p9366j14644j3742K4849o2008j34985
17353G2474q2034K3604N1277m944n4438n2113k2013K0320P7979J21788J12402
17342B64302P1639N8831P4502O1545J1532r311L1844P3302M9180j9849p7517j20455
17330D69545j71127k01110j58146n6889K8423O3559Q1175R9194Q3840K5871j3121
17319B51214J1424M0059j4202j23789j64621q2488L9733J06754J19315J07881
17309B91280M5184p9578j60613q1427R0372J49883K6111j19952j26807m2331r437
$$ y = [48382, 92922, 182712, 277064, 340977, 326954, 208826, 51451, -7746, 94363, 243434, 260564, 117910, -26574, -25107, 100161, 229102, 299864, 316527, 254572, 80022, -123932, -166321, 37466, 325024, 452370, 373004, 258360, 244618, 269467, 207459, 72474, -9560, 14044, 65321, 60377, 5939, -46174, -68187, -47867, 30112, 151900, 264302, 335941, 394772, 469274, 530819, 542351, 533040, 564884, 638186, 687366, 667517, 590000, 469545, 298418, 97308, -60838, -117727, -89304, -25745, 55430, 154624, 238464, 264335, 251214, 262638, 302697, 288495, 164706, 85, -82403, -42670, 64084, 183399, 291280, 336464, 256886, 96273, 14846, 105218, 255101, 281212, 161260, 34453, -7878, -17315]
17298a7315m2538m4039J7046P6294R6011R1314M7748n9294j58627j29846J1481
17287a11765J00049M6868l7052k2825L4404o072j28747j57063l995J79723J76559
17276G0084j7261j62783o5948J58011K06978r480k27255j82337J7152O4339p1781
17265b20281j10533P1730K27803J39953k6457j2658Q6721j1245k61538l03447
17255d19952k0919K47232J92515m1716j21684k27J11167J20854J37273J97803
17245D02346J68853j9349k21744k63997j61577n2259N332N3056J00428R2561J7895
17234A21545m9482n0988j6039R719M0739Q7015P1080p8680k62542k66337l4398
17223d28368K19428K58555J04990k8762l2426P196j0035n6862o2530l2000j4324
$$ y = [-17315, -59853, -103892, -86846, -10552, 85459, 176773, 224521, 165227, 6600, -123246, -111765, -11716, 35152, -1900, -24725, 9679, 3607, -125140, -282203, -286198, -106475, 70084, 52823, -109960, -175908, -17897, 189081, 179601, -47654, -229991, -212839, -148500, -220281, -330814, -259084, -31281, 108672, 82215, 69557, 156278, 145033, -116505, -419952, -440871, -193639, -1124, -42840, -164524, -164751, -53584, 67270, 204543, 402346, 571199, 551850, 330106, 66109, -95468, -147727, -142395, -89339, 11089, 103650, 121545, 72063, 21075, 5036, 14755, 55494, 142509, 213589, 134909, -127633, -393970, -428368, -208940, 49615, 154605, 125843, 93417, 100613, 90578, 33716, -28814, -60814, -75138]
17212g5138j5160l942K5683M7991L6781j8417j00153j51916j15751k478J03819
17201b68681J26826O3877k2683m8860L4341J72833K20669R6217q7407j41869m6184
17190I9079M5600M4959L0586O4389O6943k1922r8098m7814N8096P7567K2523L626
17178C45534J0848o2643j99032k48941j63019n6570r584K7789P9614P0641m572
17167b09935n727J34128K53484J80954J421p3269k7802l7038j53862k11790r3736
17156b43172P7042J20104N0451K0224P6750J13390N0000n1307q1107k1381N0788
17145A61782O0254L026o2547p6013l7253q497l4517p2767m5813L9536Q7919N1917
17133F7027M596K4853P0761M7072l7531p6620k5972L3345J2648p4562j43783j23960
$$ y = [-75138, -90298, -94240, -68557, -20566, 16215, -2202, -102355, -254271, -370022, -372500, -268681, -141855, -77978, -100661, -149521, -115180, 57653, 278322, 374539, 287132, 145263, 99079, 144679, 189638, 220224, 284613, 351556, 329634, 231536, 183722, 241818, 319385, 341908, 345534, 356382, 293739, 94707, -154234, -317253, -373823, -383407, -355618, -276004, -205363, -209935, -215662, -81534, 171950, 352904, 354325, 281056, 253254, 216216, 62354, -149436, -243172, -166130, -46026, 4425, 24649, 101399, 214789, 264789, 213482, 132375, 110994, 161782, 222036, 225062, 162515, 86502, 49249, 40752, 6235, -66532, -112345, -72809, 15110, 67027, 71623, 96476, 167237, 214309, 176778, 100158, 74186, 107531, 120179, 45617, -98166, -222126]
17121b22126k257J49555J91884M9616j56494k12586p8058O2687O3649K847J6148
17110a35135P2794N4114l0297n8327J3553J05633J34747P5550n1819j55688j08795
17099h3670O8291J55806K7537j14386k1107J81675J55380j00085k12787k4478
17089C2176J53725M4144j61419j24727J23448K81924K27057P5552q1644k24912
17079C45324k62162j14078R0129J40683M3192k7850k1631k3052k3162N5368J27545
17068C30306K8524j62658j78778J1564J38229O5282k1777R956M32j69050k86302
17057b34272j18878J92807L27903K25581Q1584L0057P2048K00511L38020K57668
17047A373029j46432n78513o27979l06289n612O1290N6315J20378J35569J4480
$$ y = [-222126, -224383, -74828, 117056, 166672, 10178, -202408, -280466, -217779, -154130, -151283, -135135, -62341, -8227, -38524, -96851, -83298, 22335, 157082, 232632, 180813, 25125, -83670, -15379, 140427, 167964, 53578, 32471, 214146, 369526, 269441, 56654, 32176, 185901, 230045, 68626, -56101, 67347, 349271, 576328, 651880, 570236, 345324, 83162, -30916, 59213, 199896, 243088, 215238, 193607, 170555, 147393, 202761, 330306, 358830, 196172, 17394, 28958, 167187, 232469, 210692, 220648, 221080, 52030, -234272, -353150, -160343, 167560, 393141, 474725, 504782, 576830, 777341, 1115361, 1373029, 1226597, 648084, 20105, -286184, -291796, -230506, -174191, -53813, 81756, 96236]
17037I6236q1898j4686Q1341L4202o4889l0791Q6116Q7988l3138q9225p893O4393
17025A27756k52j35617j93475j20153J9270J18679J14634M6831K4701Q4389J24241
17014B11004N5169m8227n6913P224J6484m4031o4907j8396l019m9416n7400L480
17002d8948L680j20089j99696o1552J79483K38276M1199j78322j83299M1J60558
16991a68669J53525K2701q0062o3583M012j5226j24545j50177K4289K58697L17860
16980A78822J83133M4734K062l7384j25931j48596l4839P6793L9855o1613m8113
16969F8923P2253J38266R6282M0358K0760M15l717O7942J41742N1068j81568k99385
16957B13339j55943P0137J41562Q2833N7197N8079m2795k00521k04703j4288J32098
$$ y = [96236, 14338, -348, 80993, 115195, 50306, 19515, 105631, 193619, 160481, 71256, 63363, 127756, 127504, -8113, -201588, -321741, -302471, -183792, -69158, -22327, 2374, 86763, 211004, 266173, 217946, 161033, 168257, 184741, 140710, 75803, 57407, 54388, 4972, -52428, -48948, -45268, -165357, -365053, -426605, -247122, -8846, 32353, -145969, -329268, -329227, -168669, -15144, 7557, -72505, -136088, -132076, -147302, -271847, -422024, -397735, -139038, 178822, 361955, 406689, 408751, 371367, 245436, 96840, 62001, 138794, 178649, 117036, 68923, 141176, 279442, 375724, 416082, 436842, 437257, 433540, 501482, 643224, 694292, 512724, 213339, 57396, 127533, 269095, 351928, 409125, 467204, 424409, 223888, 19185, 4897, 136995]
16946A36995L6386j81203k42986o0370J92314L02319K22420O7168k3868j0053
16936D39122L5040K7691j8850k8253P669L961q5335j80827j77899q3973O342M2350
16924a2962N8660R5271J32534J16696K3133j08005j89783j64712q0075m8789j00530
16913b78562j19990j234J71965K02044M2246j21352j06600L3656J05918M3651
16903b8258l5766k9952J5910J4879k6822n6118q1865j42224k00746j71939m2297
16892g85198J13668K27730K66964J91620N967j43091p1024J75736L01207J23895
16882D07474j61841k41309j03106r333p9303j31960J273K06039K54173J16405
16872B58512l6398p7641l7895J808J2558O40k6116m0960K178J08985J97642J51004
$$ y = [136995, 173381, -7822, -250808, -311178, -118864, 183455, 405875, 473043, 449175, 439122, 474162, 501853, 483003, 454750, 462419, 466380, 381045, 200218, 22319, -61654, -55312, -12962, 45698, 140969, 273503, 390199, 413332, 305327, 115544, -49168, -129243, -178032, -278562, -398552, -399786, -227821, -25777, 16469, -104883, -211483, -177827, -71909, -28258, -64024, -93976, -78066, -63187, -90009, -146127, -227992, -370216, -570962, -742901, -785198, -671530, -443800, -176836, 14784, 20751, -122340, -193364, -17628, 283579, 407474, 245633, 4324, -98782, -108115, -187418, -319378, -318105, -112066, 142107, 258512, 222114, 144473, 106578, 108386, 120944, 121584, 95468, 54508, 56686, 165671, 363313, 514317]
16860E14317n2005k63003k77398o1740J77438K17720P6341m5323l7523K5224O2629
16849C36677J00166J48323J23127r003j26054j13110l8033l2552p4324m0322O6232
16838C41127J05289J8222q6137r6061l7909j0638n5882j29906j58854j07670k1581
16827b40000K0242J5765M1105R5808N6413j09794k05512n8571J71278J77983k9339
16816f4622j22030N1593K46581K15675O3647J9796O6576L3383p9374j22869p1963
16805B36393l7539m2386p523M7195P597j05464j18836K0811J41153R6465k9965
16794B07901p9814m8470l9796q2907j17159j09160p9158l7406K2694Q4571J22907
16783a55797J38327J30146O8520m8146j37556j03979M0727J76527J93803Q1428
$$ y = [514317, 462312, 199309, -78089, -139829, 37609, 255329, 331670, 286347, 248824, 274048, 336677, 436843, 585166, 708293, 699290, 573236, 460126, 422093, 389541, 315217, 274895, 341127, 446416, 464638, 378501, 282440, 244531, 233893, 178011, 48105, -110749, -218419, -240000, -219758, -203993, -162888, -67080, -10667, -120461, -325973, -384544, -213266, -35283, -64622, -186652, -135059, 111522, 327197, 390844, 410640, 477216, 510599, 431225, 308356, 236393, 198854, 156468, 148945, 196140, 203737, 98273, -20563, 248, 141401, 237866, 207901, 128087, 79617, 39821, -43086, -160245, -269405, -348563, -385969, -363275, -278704, -155797, -17470, 112676, 181196, 133050, -4506, -108485, -67758, 108769, 302572, 384000]
16773C84000q3654j93911j77178n3880P5309J29950J21894R9094N9505j7335q7314
16762B56480q2598l1632l7350j11653j37707n4226K8719l95n5245K9046K15472
16751A8911K79788J31189n1701q0933R0N1792P0064J13448J10836l6845k15472
16740C91167k05115l7274J2177j44488k44117q5565J37378J35392l2412q5403
16730a58260K7786J03485N8152K5778O3857N3670l3355m0144Q5310J47749J6813
16719C50841j27023o1075J23762J60892K73j60444j81933j10701k3516N8047Q9629
16708A18752J9087q8992r6548L385O8607M0254M6147J85074L25535K45607o8520
16697G98388l66808l91305j44730J15454J51898J843r0076j150J09622N3486q7206
$$ y = [384000, 300346, 106435, -70743, -124623, -49314, 80636, 202530, 301624, 361129, 343794, 256480, 173882, 142250, 104900, -6753, -144460, -198686, -169967, -170362, -225607, -196561, 18911, 298699, 429888, 378187, 297254, 297344, 349136, 419200, 532648, 643484, 606639, 391167, 186052, 148778, 160955, 16467, -227650, -313215, -175837, -40445, -72857, -158260, -130474, -26989, 31163, 56941, 120798, 174468, 141113, 100969, 186279, 334028, 350841, 223818, 162743, 286505, 447397, 447670, 287226, 105293, -5408, -28924, 29123, 118752, 137839, 48847, -47701, -44316, 24291, 64545, 110692, 295766, 621301, 866908, 798388, 431580, 40275, -104455, 10999, 162897, 164740, 74664, 73514, 183136, 236622, 149416]
16686A49416q4752O0376J02276n6284j86166p7079J28566J40209n5742j88926
16676f8106q7771J22357K19065J29055n7697j94810j64784K8410K07139J66297
16666B99155p1524k44962j69314K9247R3717k1134j17700m5944J12287J86565
16656E0393J36656N3028O681r254j2979L67J6103k384m4895m6987O649L1365l8863
16643A45880j27206r9197M0735J35648P9280n5409j32424j18562p0470j9339M7965
16632a73099J21964J63165J57939J28131R1716N6196L3570J7900k7028j09106
16622D61348j71814j76641j74100k05362j86292k6443J61595J53988m6028j58299
16612c68048k3341J35490L5750k15067k53413J98K18762J50327l7335m9937R5606
$$ y = [149416, 64664, 125040, 227316, 171032, -15134, -92213, 36353, 176562, 120820, -68106, -155877, -33520, 185545, 314600, 256903, 62093, -102691, -74281, 132858, 299155, 227631, -17331, -186645, -157398, -63681, -84815, -202515, -248459, -136172, 50393, 187049, 240077, 246758, 237504, 224525, 224892, 240995, 238611, 193716, 146729, 153378, 184743, 145880, 18674, -80523, -39788, 95860, 175140, 119731, -12693, -131255, -201725, -221064, -173099, -51135, 112030, 269969, 398100, 489816, 546012, 579582, 597482, 570454, 461348, 289534, 112893, -61207, -266569, -452861, -479304, -317709, -163721, -209749, -368048, -391389, -255899, -220149, -435216, -688629, -688431, -469669, -319342, -356677, -406614, -311008]
16601c11008J53274N7001j0393N2610J10673M1804n4837l5339M4967L3565n2726
16590B9591n3552N4252R2989l6647j72960j12287R3977K15115J67384R4989J06737
16579D79588J00099n2035k52853k68659l8733K29267K97407J43884n8941j42110
16569D36914p6687L1567M0395r7913k69516l00801j56757Q835L8643m5190r5407
16558d85917k6784J15706K28420K12138J5956k72789m18332k58269N8587K05026
16548f26258Q5401m3804N2769K51860K60093L6253j64979j44348K1970J39666
16538a31377J34264P4977N0382P6544Q9959K0422r8999j35355l5414O2737J5555
16527A23695r0572o3567O7453P6413p9793j60722l0956R9061Q685j66405j54235
$$ y = [-311008, -157734, -100733, -111126, -58516, 52157, 93961, 39124, 3785, 48752, 82317, 29591, -23961, 30291, 123280, 86633, -86327, -198614, -104637, 110478, 277862, 372851, 479588, 579687, 527652, 274799, 6140, -32593, 196674, 494081, 637965, 579024, 436914, 360227, 391794, 432189, 334276, 64760, -236041, -392798, -383963, -345320, -390510, -485917, -512701, -396995, -168575, 43563, 59519, -213270, -631602, -889871, -831284, -626258, -540857, -584661, -531892, -280032, -19939, 16314, -148665, -293013, -271043, -131377, 2887, 77864, 128246, 204790, 294749, 315171, 216172, 80817, 45403, 108140, 123695, 33123, -30444, 37009, 113422, 33629, -127093, -158049, -58988, -50303, -216708, -370943]
16516c70943J6605Q9401O342m3141J3717K7643n9773q1592O4188K29808K61943
16505A54198K22973K10711J47537n2817k53178k50112q0535L6830J9746j2432
16495A42921K8119Q5731R7443Q2206N9621P410o2024q5871m6156Q49R321j6172
16483C03398o7882j38891j76452j16824K1544J46810J90469J36587j619j44143
16473A52997j44539L3782J89038J04268j24188j90337k3318J12408L3781r6959
16463D6933p3589J7065k1575j42239j39977J149J04253J06606J25049K00391K00563
16452D24629M3538j56345k44629k05442j19920m9920j8763k2521k0192J4913K4809
16441c29843n8270j65342j43192K3360J74338K02663J80354J87935J60709K3274
$$ y = [-370943, -354338, -264937, -258595, -301736, -288019, -260376, -320149, -401741, -337553, -107745, 154198, 377171, 587882, 735419, 682602, 429424, 179312, 98777, 135607, 155353, 142921, 171040, 256771, 354214, 436420, 496041, 503451, 441427, 355556, 309400, 310249, 319570, 303398, 235516, 96625, -79827, -196651, -175107, -28297, 162172, 298759, 297140, 152997, 8458, 42240, 231278, 335546, 211358, 21021, -2297, 110111, 143892, 46933, -26656, -9591, -31166, -173405, -313382, -312233, -207980, -101374, 23675, 224066, 424629, 468167, 311822, 67193, -138249, -258169, -308089, -326852, -349373, -369565, -354652, -329843, -388113, -553455, -696647, -673287, -498949, -296286, -115932, 72003, 232712, 255986]
16431B55986j29818j37522j1784O3465k3617j73663k13772j08609K0031P0500
16421c88803R5976K01283L29973K82801J6162k11306j44312J09531K28566J31340
16411F51211L3603N2967M4726q5003j82774j18294j3816k3072r0438j18959j66923
16400a6772k60393k23912L8507K88790K78623J46862J58437K21837P1568k02561
16390E00986k75554j61442j49246j79690J15021O34486P15570J12359n11753n07265
16380B93472j60972j47499m39958m30580M0949M48320L87914O8362j29955j43466
16370b13413j12911j14716j58156k14483j65148O5444L06489L14309J42270N3733
16360i6582Q2535K4121j24457j18624O1006J14939m4726r6658J32639L26871J95306
$$ y = [255986, 126168, -11354, -23138, 40327, 16710, -156953, -370725, -479334, -459303, -388803, -292827, -91544, 238429, 521230, 537392, 326086, 181774, 291305, 519871, 651211, 684814, 737781, 782507, 697504, 514730, 396436, 382620, 359548, 269110, 150151, -16772, -277165, -501077, -462570, -173780, 104843, 251705, 410142, 631979, 703547, 500986, 225432, 63990, -85256, -264946, -149925, 484561, 1200131, 1312490, 800737, 293472, 132500, -14999, -454957, -885537, -844588, -396268, -8354, 60008, -69947, -213413, -326324, -441040, -599196, -813679, -978827, -913383, -606894, -292585, -150315, -96582, -14047, 10074, -114383, -233007, -172001, -57062, -101788, -198446, -65807, 261064, 456370]
16349D56370m5577o9561J0410q4597k46695j80119L2601O6564n0677J224K09445
16338I9388J96372j08984k83070p7147J78669J08834j41395j97760l8279O9373
16328a93999L3881l206J3171q079o8744o0801K01l8843j91962k48833o6921K00783
16316f33352K95102J79663N1658N5618J12113O7151p9492j84146j67456j07385
16306d10526r5635r6756k4902J04733J93784J91862J24628L0059m3100k1655R4110
16295D6602J63640P1691p8616r9280j5040k8076j76887k55788j40912K1354O3480
16284d27832L8215O5769J07043O1220l3402o6359l4561p359Q324L8196N9383O4788
16272a26575J07723J70853J25015m5767j39356l5679O8846l6217j98791j32303
$$ y = [456370, 410793, 341232, 351642, 267045, 20350, -159769, -127168, -60604, -111281, -110057, 99388, 295760, 186776, -96294, -173441, 5228, 114062, -27333, -225093, -263372, -193999, -160118, -163324, -150153, -158232, -226976, -287777, -287576, -326419, -518381, -767214, -834135, -633352, -338250, -158587, -106929, -51311, 60802, 127953, 48461, -135685, -303141, -410526, -506161, -602917, -627819, -523086, -329302, -137440, -12812, 17247, -25853, -47508, 46602, 210242, 281933, 203317, 104037, 88997, 60921, -115966, -371754, -512666, -491312, -427832, -389617, -323848, -216805, -155585, -188987, -255346, -289907, -297266, -288942, -250746, -191363, -126575, -18852, 152001, 277016, 231249, 91893, 56214, 125060, 88843, -109948, -242251]
16262b42251R7264J65765J9472p0569L240L5517o5201q8300P2369J78651M7811
16251A53768j13538n5625Q7724M0465j35918j54363J4487J19777N6570j1685J6714
16240A8376K1296q7836j90057j40272K5239J67132K12337J75033J03397N5444
16230C60089N1999L7587l3714r3842n6091J0980m2396k00985k82578k05600q0502
16219e35053J0332J28002K84635L30241J75031k8708q9918m3107l8524p2777l0067
16208I0087O8447P2024m3877j23352p0080K2278M0017J0936J4871L8146J0386
16197A29883p4639j51085j59977r1535J5443Q9781Q8620N7517O8664R0543J7711
16186H0926j31979j73903q990J83333J52484p4810k19558j24966N9631J21633
$$ y = [-242251, -144987, 20778, 40250, -30319, -27079, 8438, -56763, -145063, -72694, 105957, 153768, 40230, -15395, 72329, 112794, -23124, -177487, -163000, -43223, 13347, 1662, 18376, 39672, -48164, -238221, -378493, -353254, -186122, 26215, 201248, 304645, 360089, 412088, 449675, 415961, 322119, 266028, 277008, 234612, 33627, -248951, -454551, -535053, -524721, -396719, -112084, 218157, 393188, 364480, 274562, 231455, 192931, 120154, 90087, 158534, 230558, 186681, 63329, -6751, 15527, 55544, 66480, 81351, 119497, 129883, 55244, -95841, -255818, -347353, -331910, -242129, -153509, -95992, -27328, 63215, 80926, -51053, -224956, -233946, -50613, 101871, 27061, -192497, -317463, -257832, -136199]
16176a36199O2357K6211N9114P7655L9271J0256N0172J23028J53429J09306P892
16165E82492j05047j62458j19708k0944K8395r965n4668k5634L0964J0649p9812
16154G4264j10727r800J21555J31155J3685q9181q0271j8919p646l8199l0136
16143d4220J3118k267r1763j29945l2239Q8587O6758o0159q4643O7057K06398
16132c318J30223j03868k46551j48048J02753K94124K74032N1031k09342l07089
16122a66053j95058l0884J2070m7804n6203M6015J49758J37225J9236j06884j55875
16111c94457r0112O2074J91909J87939O6728l6087l4767J6213L2369J6093J0281
16100B8183J5638K4543O4297J21442R1114q5205k72750k63769m5349J69986K05212
$$ y = [-136199, -73842, -47631, 11483, 89138, 128409, 138665, 188837, 311865, 465294, 574600, 582492, 477445, 314987, 195279, 174335, 202730, 192765, 138097, 112463, 143427, 154076, 74264, -36463, -46263, 75292, 206447, 220132, 130951, 50680, 31761, 24115, -14084, -44220, -31102, -33369, -125132, -255077, -287316, -198729, -131971, -192130, -276773, -209716, -3318, 126905, 23037, -223514, -371562, -268809, 25315, 299347, 350378, 141036, -166053, -361111, -391995, -379925, -427729, -483932, -437917, -288159, -150934, -131698, -238582, -394457, -484569, -422495, -230586, -42647, 24081, -12006, -46773, -30560, 1809, 17902, 28183, 43821, 68364, 132661, 254103, 345217, 260012, -12738, -276507, -321856, -151870, 53342]
16089E3342J05233K2279J6351M2743O2745O8733L1204p9245k04810k14276m9937
16078a45638J75593K75250J74900k2054j53201j50305o6572J4517N8338P0971
16068B31799N4508K157p0765j18418j01310k8565M5514P3811O1776M9172N1179
16057B50858M4776J9518l36j1919o1704j58120k00227r0423R3573J55363L7586
16046G8945r0921o8175M5948Q4247J8342l5246j1390L1338K8335j2198n3988o1833
16034d6596R505J48903K14485O2060k19527l45903j86844N0694R9618j7584o7329
16023b98518L5765J32536Q8372j1574q016J07235K04624J89978P9439n8210j54121
16012C07510j56330p1449J4066K2709k665M7748J69475K08334O7612j27264j73227
$$ y = [53342, 158575, 180854, 197205, 239948, 302693, 371426, 402630, 323385, 118575, -95701, -145638, 29955, 305205, 480105, 458051, 304850, 154545, 87973, 102490, 160828, 231799, 286307, 288464, 217699, 99281, -2029, -30594, 14920, 88731, 150507, 199679, 250858, 295634, 315152, 314816, 302897, 241193, 83073, -117154, -207577, -114004, 41359, 78945, -11976, -80151, -34203, 50044, 68386, 33140, 21750, 53088, 81423, 69225, 15237, -46596, -37091, 111812, 326297, 388357, 168830, -177073, -363917, -313223, -213605, -231189, -298518, -262753, -130217, -41845, -53419, -61435, 45800, 250424, 440402, 519841, 461631, 307510, 151180, 79731, 93797, 116506, 113841, 161589, 331064, 539398, 607010, 479746, 306519]
16001C06519n7755L9664J0424n5583m8312o317j0537k2883K8585P7487K114j43983
15989A19423j64712j0658J36329J32877O6681P3513J05566L7311r2637j25428
15979B78265l3265M3031J5243m4618n3778m3172o9624j06615r8032n0473n247
15968a68285K4300K8731k3908j20274j60077o7201Q9278J71651J51490J16481
15958D2186J03287L7873j12475k28182j70773K1396J65099J46920K5502p7001
15948d6168j00703n1545L0943P0495M343j03981q7488R8248K49652J49311j16214
15937I6893k35746q1947J26734J36781j8239j16791n8159O3188J26050R4141p342
15926A25563j14424j44852q5918k7367k2681J4981J56433K71327J80738l9656
$$ y = [306519, 248764, 288428, 298852, 243269, 194957, 188640, 178103, 155220, 183805, 261292, 263406, 119423, -45289, -55947, 80382, 213259, 279940, 353453, 459019, 496330, 403693, 278265, 245000, 288031, 303274, 258656, 204878, 161706, 92082, -14533, -112565, -163038, -168285, -143985, -115254, -139162, -259436, -419513, -486714, -397436, -225785, -74295, 42186, 145473, 183346, 70871, -157311, -328084, -306688, -141589, 5331, 30833, -46168, -146871, -198416, -167473, -96978, -92635, -196616, -284104, -185856, 63796, 213107, 96893, -138853, -220800, -94066, 42715, 24476, -92315, -150474, -87286, 38764, 132905, 125563, 11139, -133713, -219631, -246998, -269679, -254698, -98265, 173062, 353800, 314144]
15916C14144j23383M99J08988M3110o3416m6535O664o1066j72113j35547J2727
15905a15928N1083o3363j21614J463J61001J83023J06658O2828N5734R864o2513
15894B68236q7177o3362m2098j1903O2733J15528L4414j45110k36917j41411K2541
15883b24526Q5401L5713j9232k9609l5726n5448m4940J4846O9543N8475j4383
15872a59886r0614r6800K6597K68778M95083N17744K79722o1695k79061k79684
15862F20184j41472L359O3994J4775r5117j64705j38080p1066m7203n1838n894
15851a3063R2403J52458J20838L6945m5484r7195p2160M9230J52424O9138j71710
15840B73824l18572k19150k8524L1546j5537n405O3311N5692k0557q969J07582
$$ y = [314144, 190761, 191260, 300248, 343358, 279942, 233407, 240071, 179005, 6892, -128655, -115928, -64845, -128208, -249822, -248359, -87358, 95665, 202323, 265151, 320885, 330749, 268236, 181059, 117697, 75599, 63696, 126429, 241957, 276371, 131261, -105656, -247067, -224526, -139125, -103412, -122644, -152253, -187979, -243427, -288367, -273521, -203978, -145503, -159886, -250500, -347300, -320703, -51925, 443158, 960902, 1240624, 1178929, 899868, 620184, 478712, 482071, 546065, 560840, 465723, 301018, 162938, 91872, 44669, -7169, -13063, 79340, 231798, 352636, 389581, 344097, 246902, 174742, 223972, 376396, 445534, 273824, -44748, -263898, -292422, -260876, -276413, -281818, -218507, -162815, -183372, -192341, -84759]
15829h4759J46871K4439r6146n7865N6725P9343Q262l7726j9918R487K9947N1290
15817A09950L7009m5834j32360j31834p1696n9085j09514j20187k2172J27040
15807d18683K17806J95601R4071Q727J8068Q2819O5250q6397k28766j94021k0610
15796b66135J06265J10109P7441P0751N2968K4528O1378J41074R4122j44535l60017
15785c2051k95370J048K28676K13680P6741J111j3515p4427j69735j55228K6358
15774a92712K15682K02876n804j77197j39020M788L5997n7375p2312Q2110K18904
15763A15937J40626n7928j21227k005R3769L6908m0622K8218J82855K25635R1361
15752F93527j00619k18052k19182j11729O0358J79557J30165m3985j58628j16845
$$ y = [-84759, 62112, 86551, -9595, -67460, -10735, 68608, 76870, 39144, 19226, 28713, 58660, 109950, 146959, 101125, -31235, -163069, -234765, -293850, -403364, -523551, -545723, -418683, -200877, -5276, 88795, 97522, 115590, 198409, 263659, 177262, -51504, -245525, -266135, -159870, -49761, 27680, 98431, 151399, 175927, 237305, 378379, 472501, 327966, -32051, -327421, -326373, -97697, 115983, 192724, 193835, 180320, 105893, -63842, -219070, -192712, 22970, 225846, 220042, 42845, -96175, -91387, -55390, -112765, -185077, -102967, 115937, 256563, 198635, 77408, 75403, 169172, 206080, 165458, 193676, 376531, 602166, 693527, 592908, 374856, 155674, 43945, 104303, 283860, 414025, 370040, 211412, 94567]
15742I4567j7107K7069N0323J03651Q4001j09266l14451k52776M6434K24277R2667
15731B9389j00314q0157K8119l5954j76302j04537Q7490j1745m14199n41678k4500
15720a344388O74726Q22885L78021l9319l5841J42193J27706m9804j45134j02931
15710D28114n4757p7694j44454k05465j86796k2861J89169K09234k0390k11308
15700i7208q9090J94023K50678J2058j81860q3376J27887J39399n3665j85257
15690C3589j03003O4717J15702J1864j21603j50433m5400J08602J81936J05437
15680B01408o3990j91030j89206r2925J984M6365O1711P3848P2254N2282N2572
15669B5273J03828J60152J34530P246j39147j99673j36890k518R5329O7385n9714
$$ y = [94567, 77460, 104529, 154852, 258503, 342504, 233238, -81213, -333989, -287555, -63278, 29389, -70925, -151082, -122963, -158917, -335219, -439756, -352266, -364011, -778210, -1319888, -1344388, -669662, 153223, 531244, 491925, 456084, 598277, 725983, 676179, 531045, 428114, 373357, 295663, 151209, -54256, -241052, -263913, -74744, 134490, 114100, -97208, -186298, 7725, 258403, 270461, 88601, 5225, 133112, 272511, 218846, 33589, -69414, -4697, 111005, 122869, 1266, -149167, -194567, -85965, 95971, 201408, 137418, -53612, -242818, -335743, -333759, -287394, -225683, -151835, -79581, -27299, 25273, 129101, 289253, 423783, 431029, 291882, 92209, -44681, -47199, 48130, 115515, 55801]
15658E5801j40268p2262N7497Q4661P562j6075P2665J39350Q3531n074k7800n1037
15646A88551j36922j48635M8518K86526K61830j8903k26707j75587l7743j1957
15636B8971l4328K8823J13779Q5192j8327o8172p0128j02873j12589J1846J92986
15625E5180K16829N1937q2018k5199J12149J40906N6136j3811l1505q1438j97680
15614B01486k83087k34830p7676P3667J41094J21230L2185r5379j72531j01041
15604c94882P6381J70917Q7278k3241J1994R7795K0055j61292j52239R4274K47837
15593G4877J03359q1160J572K06713J84237m3634j42929l4223J1739j22965j95332
15582c7746k4311K03496K28994P1996q9160j79221j93919r3741Q9202J90080J21922
$$ y = [55801, -84467, -156729, -99232, -14571, -7009, -23084, 49581, 188931, 272462, 267388, 239588, 188551, 51629, -97006, -48488, 238038, 499868, 480965, 254258, 78671, 40928, 28971, -5357, 23466, 137245, 222437, 204110, 135938, 65810, -37063, -149652, -137806, 55180, 272009, 323946, 241928, 216729, 328878, 469784, 525920, 512109, 480604, 399166, 201486, -81601, -316431, -394107, -320440, -179346, -58116, -25931, -121310, -293841, -394882, -318501, -147584, -60306, -83547, -71553, 26242, 46297, -114995, -267234, -172960, 74877, 178236, 97076, 98648, 305361, 489598, 445964, 303035, 268812, 280551, 157586, -37746, -62057, 141439, 370433, 442429, 353269, 174048, -19871, -113612, -24410, 165670, 287592]
15571B87592J2684m848J4902j1760k4905K4905K6145r4065j85851j05662L0512
15560c0351N3135L2195R8025J36637r037j72019q4765J10904K1293l21092m09615
15549e74690k8490L73712L21862k7524j76715J3303K41636K40702L4447k01075
15539B17168k95618j54607J33661L08690K16512J2969n7819Q455M4487P690r251
15528D32337k176n5659j33494r4526N5570J30353L5321r6445j10146k8176L2834
15517A65793K8256j0049m9131o3250k7728L9045P0278K5518n8364j04995o3676
15506d8303M9389J43190J20515j49q2053m6104K4397L4341K9912O9769N2640j22166
15494B25378k93860k02696Q6734K09468K3314j73289r8317R5370R0971r3058j63413
$$ y = [287592, 300276, 295428, 310330, 298570, 273665, 298570, 324715, 230650, 44799, -60863, -30351, 22784, 54979, 153004, 289641, 280604, 108585, 23820, 134724, 156017, -165075, -574690, -603180, -229468, 92394, 64870, -111845, -98542, 143094, 383796, 418243, 217168, -78450, -233057, -99396, 209294, 425806, 438775, 380956, 389411, 433898, 441588, 432337, 430161, 374502, 241008, 146482, 202052, 332405, 367726, 271281, 161135, 132959, 165793, 194049, 184000, 134869, 71619, 43891, 82936, 153214, 178732, 120368, 15373, -48303, 1086, 144276, 264791, 264642, 182589, 136485, 160882, 195223, 225135, 294904, 347544, 225378, -68482, -271178, -184444, 25024, 48338, -124951, -223268, -127898, -36927, -129985, -293398]
15483b93398k0245J27209J13917L1386K0484N4828L8994j4449k4968J3638L1013
15472G8409j2494q2950j18149p5394M1753J67475K05659J20598m873l7460N8349
15461C40923J56796R7554j09128k57252j86357n720L4621j04059j76257n147K36831
15450B2805K52961L7686j29900r1562j034m4952j52893j25228N4397J98005J79375
15439A99660P6702J9291N002n1928j49211j71271m8093J29926K04936J28993m267
15428C39740q9389j02769o1734K2510J01208P5705q0981k35279k29193q6029K9018
15417c17193M8382O8971J47155J76748P1079n5081l5716Q4664J12833J0546n0112
15406B62276K9103J20130R6715M2791P2615Q2471q6576l06734k66847M5157K46831
$$ y = [-293398, -313643, -186434, -72517, -41131, -20647, 34181, 73175, 58726, 33758, 47396, 78409, 65915, -17035, -135184, -210578, -168825, -1350, 204309, 324907, 320034, 282574, 340923, 497719, 595273, 486145, 228893, 42536, 36816, 71437, -32622, -208879, -214026, 22805, 275766, 313452, 183552, 91990, 90956, 46004, -106889, -232117, -177720, 20285, 199660, 276362, 295653, 300655, 248727, 99516, -71755, -119848, 10078, 215014, 344007, 339740, 250351, 147582, 85848, 108358, 209566, 285271, 204290, -30989, -260182, -346211, -317193, -268811, -199840, -52685, 124063, 195142, 140061, 104345, 189009, 301842, 312388, 262276, 291379, 411509, 508224, 551015, 623630, 706101, 619525, 312791, 45944, 91101, 337932]
15395C37932Q8241j73827j56971Q1000J66137M878j01922K4540J60053O8094j15813
15384C82342j30231j6728j4627j34674j44986K3488J43494M5711j23074j35065
15374a04350j2478M7142j4367n8722K899P2510L8105l1239J6762J62878K02170
15363C21310L4495j54795j32654L5675O1625j43423l25735k56085m6831N8247
15353e48171N8995J39016L07267L51415J69033o7692j51669r0167l0402m8734
15343H8891r7353r3083m905J03257J10881j6254j41400j07816M6759J40016Q9475
15332A18468k4431j17502j63657j10820O9831K33313J74232n7243j72588n3719
15322a04116R0303Q4123M8460J28745K03871J04067p1491j21223q0418j17495
$$ y = [337932, 426173, 252346, 95375, 176375, 342512, 347390, 245468, 270008, 430061, 498155, 382342, 252111, 235383, 220756, 86082, -58904, -35416, 108078, 153789, 30715, -104350, -116828, -69686, -84053, -142775, -139876, -67366, -29261, -60500, -43738, 119140, 321310, 355805, 201010, 68356, 104031, 165656, 22233, -303502, -559587, -606418, -548171, -489176, -350160, -42893, 308522, 477555, 409863, 258194, 168027, 137625, 88891, -8462, -101545, -106450, -3193, 107688, 91434, -49966, -157782, -111023, 28993, 118468, 94037, -23465, -187122, -297942, -228111, 5202, 179434, 122191, -50397, -104116, -13813, 70310, 118770, 247515, 451386, 555453, 483962, 362739, 282321, 164826]
15312A64826k02521j68909l3481L6359L2710R0917J80271J17419q3020j73799
15302c9228o4805L5458k2813r4976j3109J31051J52096N1634m0078p4946q2611
15291f2327n8241N422N6859O7930Q9718J31810R4893o4546k07404j77429j2517
15280a35832J25332J54111R6231j6824j37743j67326n6022R4529J36495N0280
15270A43231o7985j45146j72823j56299j03649l5069M4974J35305J76445R8997
15260h2019l2014n0746P2040J69283J30590M7999R305n7520j81764j97496j0076
15249a82418J63843Q4372j26030j72675m8311J7014j6901J9630J26085J07500
15239b7891l3801n5981Q2995J11532q2579k15412n1926K17509K90087J78969O7268
$$ y = [164826, -37695, -206604, -240085, -203726, -171016, -80099, 100172, 217591, 134571, -39228, -104033, -68575, -91388, -186364, -199473, -68422, 83674, 135308, 95230, 20284, -62327, -120568, -115146, -58287, 9643, 99361, 231171, 326064, 261518, 54114, -123315, -135832, -10500, 143611, 239842, 223018, 85275, -82051, -138073, -43544, 92951, 143231, 75246, -69900, -242723, -399022, -502671, -537740, -492766, -357461, -181016, -82019, -114033, -164779, -92739, 76544, 207134, 255133, 264438, 206918, 25154, -172342, -182418, -18575, 65797, -60233, -232908, -281219, -264205, -281106, -261476, -135391, -27891, -61692, -117673, -34678, 76854, -5725, -221137, -273063, -55554, 234533, 413502, 480770]
15228D80770k9252j57691j84384J4160K51156K49213O8500q135N1591K0145j43295
15217F12778k03391o8093M5216r979o6468M0820J72270J18791n4829j44060j41784
15206C01271j81794k30213j15177J35720K57717J32460j5456M7641K03888J60942
15196F96999r9468k84685k10484l3830K2565j5626K994O3379L6553m6129k1133
15185A11135J00015J04526o8922j92215r3379P7486J07815N5833R0396J46269
15175D38959K5564k24204l24663j65759O4400J82429K05426J88876J00721m6203
15165D45546j29937r4558l1702m194M2971J11345P8394q6076k16586k00739j49828
$$ y = [480770, 451518, 293827, 109443, 123603, 374759, 623972, 692472, 684337, 735928, 756073, 612778, 409387, 341294, 386510, 376531, 310063, 350883, 523153, 641944, 587115, 443055, 301271, 119477, -110736, -225913, -90193, 167524, 299984, 284528, 332169, 536057, 696999, 597531, 312846, 102362, 68532, 91097, 75471, 78465, 141844, 178397, 132268, 111135, 211150, 315676, 246754, 54539, -38840, 38646, 146461, 202294, 292690, 438959, 464523, 240319, -84344, -250103, -185703, -3274, 202152, 391028, 491749, 445546, 315609, 221051, 189349, 185155, 228126, 339471, 417865, 331789, 115203, -85536, -235364]
$$ [...]
##END NTUPLES=NMR SPECTRUM
##END=
