##TITLE=H1
##JCAMPDX= 6.0         $$ Bruker NMR JCAMP-DX V2.0
##DATA TYPE= NMR FID
##DATA CLASS= NTUPLES
##ORIGIN= UXNMR, Bruker Analytische Messtechnik GmbH
##OWNER= root
$$ XWIN-NMR		Version 3.5
$$ Mon Jan  4 10:25:34 2016 Russian Standard Time (UT+4h)  servis@DPX200
##.OBSERVE FREQUENCY= 200.131235884673
##.OBSERVE NUCLEUS= ^1H
##.DELAY= (6, 6)
##.ACQUISITION MODE= SIMULTANEOUS
##.ACQUISITION SCHEME= undefined
##.AVERAGES= 1
##.DIGITISER RES= 18
##SPECTROMETER/DATA SYSTEM= spect
##.PULSE SEQUENCE= zg
##.SOLVENT NAME= CDCl3
##.SHIFT REFERENCE= (INTERNAL, CDCl3, 0, 16.5164)
##AUDIT TRAIL= $$ (NUMBER, WHEN, WHO, WHERE, WHAT)
$$ ##TITLE= Audit trail, XWIN-NMR		Version 3.5
$$ ##JCAMPDX= 5.01
$$ ##ORIGIN= Bruker BioSpin GmbH
$$ ##OWNER= servis
$$ F:/spectra/data/servis-vadim/nmr/H1/1/audita.txt
$$ ##AUDIT TRAIL=  $$ (NUMBER, WHEN, WHO, WHERE, WHAT)
(   1,<2016-01-04 10:23:41.71 +0400>,<servis>,<DPX200>,
      <created by zg, POWCHK disabled, PULCHK disabled
       configuration hash MD5:
       00 E9 B6 7A A2 85 ED C7 34 08 36 98 17 FE 4E 26
       data hash MD5: 16K
       57 C0 B2 76 E7 BB B1 E7 E6 BB C4 A4 4E 54 DA 01>)
$$ ##END=
$$ 
$$ hash MD5
$$ E3 19 9F F9 58 D5 D3 6B FC C4 4E D5 1A D4 BE F5
##$RELAX= 
##$RELAX= 
##$RELAX= 
##$RELAX= 
##$RELAX= 
##$RELAX= 
$$ Bruker specific parameters
$$ --------------------------
##$DU= <F:/spectra>
##$EXPNO= 1
##$NAME= <H1>
##$PROCNO= 1
##$TYPE= <nmr>
##$USER= <servis-vadim>
##$AMP= (0..31)
100 100 100 100 100 100 100 100 100 100 100 100 100 100 100 100 100 100 
100 100 100 100 100 100 100 100 100 100 100 100 100 100 
##$AQSEQ= 0
##$AQ_mod= 1
##$AUNM= <au_zg>
##$AUTOPOS= <>
##$BF1= 200.13
##$BF2= 200.13
##$BF3= 200.13
##$BF4= 200.13
##$BF5= 500.13
##$BF6= 500.13
##$BF7= 500.13
##$BF8= 500.13
##$BYTORDA= 1
##$CFDGTYP= 0
##$CFRGTYP= 5
##$CHEMSTR= <none>
##$CNST= (0..31)
1 1 145 1 1 1 1 1 1 1 1 1 1 1 1 1 1 1 1 1 1 1 1 1 1 1 1 1 1 1 1 1 
##$CPDPRG= <>
##$CPDPRG1= <>
##$CPDPRG2= <>
##$CPDPRG3= <>
##$CPDPRG4= <mlev>
##$CPDPRG5= <mlev>
##$CPDPRG6= <mlev>
##$CPDPRG7= <mlev>
##$CPDPRG8= <mlev>
##$CPDPRGB= <>
##$CPDPRGT= <>
##$D= (0..31)
0 1 0 0 0 0 0 0 0 0.06 0 0 0 0 0 0 0.0002 0 0 0 0 0 0 0 0 0 0 0 0 0 0 
0 
##$DATE= 1451888621
##$DBL= (0..7)
120 120 120 120 120 120 120 120 
##$DBP= (0..7)
150 150 150 150 150 150 150 150 
##$DBP07= 0
##$DBPNAM0= <>
##$DBPNAM1= <>
##$DBPNAM2= <>
##$DBPNAM3= <>
##$DBPNAM4= <>
##$DBPNAM5= <>
##$DBPNAM6= <>
##$DBPNAM7= <>
##$DBPOAL= (0..7)
0.5 0.5 0.5 0.5 0.5 0.5 0.5 0.5 
##$DBPOFFS= (0..7)
0 0 0 0 0 0 0 0 
##$DE= 6
##$DECBNUC= <off>
##$DECIM= 32
##$DECNUC= <off>
##$DECSTAT= 4
##$DIGMOD= 1
##$DIGTYP= 9
##$DL= (0..7)
0 120 120 120 120 120 120 120 
##$DP= (0..7)
150 150 150 150 150 150 150 150 
##$DP07= 0
##$DPNAME0= <>
##$DPNAME1= <>
##$DPNAME2= <>
##$DPNAME3= <>
##$DPNAME4= <>
##$DPNAME5= <>
##$DPNAME6= <>
##$DPNAME7= <>
##$DPOAL= (0..7)
0.5 0.5 0.5 0.5 0.5 0.5 0.5 0.5 
##$DPOFFS= (0..7)
0 0 0 0 0 0 0 0 
##$DQDMODE= 0
##$DR= 18
##$DS= 0
##$DSLIST= <SSSSSSSSSSSSSSS>
##$DSPFIRM= 0
$$ [...]
##$SUBNAM0= <"">
##$SUBNAM1= <"">
##$SUBNAM2= <"">
##$SUBNAM3= <"">
##$SUBNAM4= <"">
##$SUBNAM5= <"">
##$SUBNAM6= <"">
##$SUBNAM7= <"">
##$SUBNAM8= <"">
##$SUBNAM9= <"">
##$SW= 20.6817932712277
##$SWIBOX= (0..15)
0 0 3 0 0 0 0 0 0 0 0 0 0 0 0 0 
##$SW_h= 4139.07284768212
##$TD= 16384
##$TD0= 1
##$TE= 0
##$TE2= 300
##$TE3= 300
##$TEG= 300
##$TL= (0..7)
0 120 120 120 120 120 120 120 
##$TP= (0..7)
150 150 150 150 150 150 150 150 
##$TP07= 0
##$TPNAME0= <>
##$TPNAME1= <>
##$TPNAME2= <>
##$TPNAME3= <>
##$TPNAME4= <>
##$TPNAME5= <>
##$TPNAME6= <>
##$TPNAME7= <>
##$TPOAL= (0..7)
0.5 0.5 0.5 0.5 0.5 0.5 0.5 0.5 
##$TPOFFS= (0..7)
0 0 0 0 0 0 0 0 
##$TUNHIN= 0
##$TUNHOUT= 0
##$TUNXOUT= 0
##$USERA1= <user>
##$USERA2= <user>
##$USERA3= <user>
##$USERA4= <user>
##$USERA5= <user>
##$V9= 5
##$VALIST= <valist>
##$VCLIST= <CCCCCCCCCCCCCCC>
##$VD= 0
##$VDLIST= <DDDDDDDDDDDDDDD>
##$VPLIST= <PPPPPPPPPPPPPPP>
##$VTLIST= <TTTTTTTTTTTTTTT>
##$WBST= 1024
##$WBSW= 4
##$XGAIN= (0..3)
0 0 0 0 
##$XL= 0
##$YL= 0
##$YMAX_a= 16036
##$YMIN_a= -17650
##$ZGOPTNS= <>
##$ZL1= 120
##$ZL2= 120
##$ZL3= 120
##$ZL4= 120
##$ABSF1= 10
##$ABSF2= 0
##$ABSG= 5
##$ABSL= 3
##$ALPHA= 0
##$AQORDER= 0
##$ASSFAC= 0
##$ASSFACI= 0
##$ASSFACX= 0
##$ASSWID= 0
##$AUNMP= <proc_1d>
##$AZFE= 0.1
##$AZFW= 0.1
##$BCFW= 1
##$BC_mod= 2
##$BYTORDP= 0
##$COROFFS= 0
##$CY= 12.5
##$DATMOD= 1
##$DC= 2
##$DFILT= <>
##$DTYPP= 0
##$F1P= 11.0000006437302
##$F2P= -0.999999642372123
##$FCOR= 0.5
##$FTSIZE= 0
##$FT_mod= 4
##$GAMMA= 1
##$GB= 0
##$INTBC= 1
##$INTSCL= 1
##$ISEN= 128
##$LB= 0.3
##$LEV0= 0
##$LPBIN= 0
##$MAXI= 10000
##$MC2= 0
##$MEAN= 0
##$ME_mod= 0
##$MI= 0
##$NCOEF= 0
##$NC_proc= 0
##$NLEV= 6
##$NOISF1= 0
##$NOISF2= 0
##$NSP= 1
##$NTH_PI= 0
##$NZP= 0
##$OFFSET= 16.51637
##$PC= 1
##$PHC0= -104.5595
##$PHC1= 3.843713
##$PH_mod= 0
##$PKNL= yes
##$PPARMOD= 0
##$PSCAL= 4
##$PSIGN= 0
##$REVERSE= no
##$SF= 200.13
##$SI= 32768
##$SIGF1= 0
##$SIGF2= 0
##$SINO= 400
##$SIOLD= 32768
##$SREGLST= <1H.CDCl3>
##$SSB= 0
##$STSI= 0
##$STSR= 0
##$SW_p= 4139.07284768211
##$SYMM= 0
##$S_DEV= 0
##$TDeff= 0
##$TDoff= 0
##$TI= <>
##$TILT= no
##$TM1= 0
##$TM2= 0
##$TOPLEV= 0
##$USERP1= <user>
##$USERP2= <user>
##$USERP3= <user>
##$USERP4= <user>
##$USERP5= <user>
##$WDW= 1
##$XDIM= 8192
##$YMAX_p= 0
##$YMIN_p= 0
$$ End of Bruker specific parameters
$$ ---------------------------------
##NTUPLES= NMR FID
##VAR_NAME=  TIME,          FID/REAL,        FID/IMAG
##SYMBOL=    X,             R,               I
##VAR_TYPE=  INDEPENDENT,   DEPENDENT,       DEPENDENT
##VAR_FORM=  AFFN,          ASDF,            ASDF
##VAR_DIM=   8192,          8192,            8192
##UNITS=     SECONDS,       ARBITRARY UNITS, ARBITRARY UNITS
##FACTOR=    0.0002416,     1,               1
##FIRST=     0,             0,               0
##LAST=      1.9789456,     0,               0
##MIN=       0,             -17650,          0
##MAX=       1.9789456,     16036,           0
$$ Real data points
##PAGE= N=1
##DATA TABLE= (X++(R..R)), XYDATA
0@%%%%%%%%%%%%%%%%%%%%%%%%%jKkKkKkLmMmNoOpQrJ0j1J2j3J4j5J7j9K1k3K5
53A3k8L1l4L8m2M7n3O0o8P8r1J08j32J68k29L56r20L086P300M529J819n34k324
76A3178m754n580n996n666l901j070L60J825M253N556M733L996L232J426o16j729
92I247l191m101l435k701k602j323O35J398J506K324K449J710J479J163j77n38
108C843p8p39j441q53m06r64q51m64o63n37K51J00r6R78J759J132R38J527J139
127D575J40k98r90j754j507j480k155j412K03M98L79J538K312J732J311J121K04
144D417m56n64j429k040j148m94r32n37P58Q99O09Q97P59J96K20K17o79n57K40
163C76J48l04L60O16Q7p5N5p81j039n54p78j136j87Q28P29J020J785J551J078
$$ y = [0, 0, 0, 0, 0, 0, 0, 0, 0, 0, 0, 0, 0, 0, 0, 0, 0, 0, 0, 0, 0, 0, 0, 0, 0, 0, -1, 1, -1, 1, -1, 1, -1, 2, -2, 2, -2, 3, -3, 3, -4, 4, -5, 5, -6, 6, -7, 7, -8, 9, -10, 11, -12, 13, -15, 16, -18, 20, -22, 25, -28, 32, -36, 42, -49, 59, -73, 95, -134, 222, -698, 2388, 9688, 14217, 16036, 15502, 13178, 8424, 2844, -3152, -8818, -12719, -13789, -13429, -11604, -7351, -1795, 2938, 6934, 10166, 11592, 10976, 9247, 6056, 1955, -1480, -4181, -6783, -8106, -7471, -6073, -4567, -2243, 206, 1916, 3395, 4558, 4381, 3843, 3765, 3026, 1585, 732, 326, -638, -1489, -1953, -2616, -3153, -2902, -2802, -2898, -1920, -161, 971, 1909, 3436, 4575, 4715, 4417, 3427, 1673, 166, -1314, -3469, -4881, -4678, -4180, -3801, -2263, 49, 1781, 3092, 4213, 4417, 3961, 3397, 1968, -72, -1220, -1714, -2646, -3183, -2425, -1526, -917, -20, 739, 935, 1155, 1372, 693, 136, 376, 524, 220, 580, 1196, 1283, 1208, 1263, 482, -557, -1111, -1889, -3025, -3212, -2384, -1655, -635, 1150, 2701, 3779]
182C779Q64J9j234j271j409k339k249q36k24l7J140K119K119K206J901Q20j1l02
200E055j421k709k210j477j661r72L85J252J562K264K090J276J207N91r64j773
216B495j342j643k078j190j46J61R47J659J432J299J547O78n81o33p15j487j614
233a211p81o81k82O62J017P10J154J416M95j96K8m10j183r37p03q38k44L84J38
252a462K76J156J017J29K88M79k58n37m24o16o58l7j15m60K11P48J46p3M68M94
272G72j69k2R5k80JJ76l57m46L32J05n34j05L28j25k32K60O0m1N43L14k16O7M61
295I87k49m96%j74n30q5J07k52J03O63Q9q2N00M02k83j19N4m09l41l3k24m03L68
318d07L74k08K10O52J32k27J33j2l68j79j10n36r1L53p2k53N04O47j00J56L65
$$ y = [3779, 4643, 4662, 3428, 2157, 748, -1591, -3840, -4676, -4900, -4937, -3797, -1678, 441, 2647, 4548, 5368, 5357, 5055, 3634, 925, -1285, -2762, -4423, -5395, -5010, -3758, -2196, 68, 2158, 3434, 4641, 5232, 4268, 2495, 1153, -490, -2568, -3758, -3904, -3743, -2796, -1137, 295, 1594, 3141, 3819, 3238, 2605, 1890, 403, -1211, -1992, -2673, -2955, -2293, -1276, -566, 588, 2004, 2499, 2303, 2331, 1921, 738, -199, -902, -1740, -1984, -1600, -1462, -1186, -30, 987, 1116, 1404, 1883, 1625, 1088, 664, 48, -610, -647, -762, -1222, -1011, -263, -117, -190, 278, 772, 603, 581, 676, 396, 397, 573, 216, -230, 102, 207, -327, -432, -104, -229, -461, -201, -141, -182, 361, 675, 459, 526, 987, 738, 242, 242, 68, -462, -547, -440, -692, -589, 74, 163, 81, 581, 983, 700, 581, 635, 226, -115, -148, -372, -775, -407, -33, -241, -31, 621, 753, 526, 659, 647, 279, 100, -10, -546, -637, -284, -356, -609, -105, 542, 442, 598, 963]
339I63r1k16k5l99o26K7r2n50k3N01J77M1O04N07J49K66K57l79l44m4o60q13j87
362i57j58m08J49O07L44M47R62N27kL66J17p16p05m28p27p89k75j25k9O20Q25
383c55L43O56J070L62k72pk15p85p66n23o98m51K28J6K9P48Q73K03L47O43Q0l00
405A226r3k96n75k28j35n69k04L39j24k36L16M13l9J90N05J54Q6M61J02l22M0
426A011q3o72o08j94n41n09J59K01J11P25R83L94M93P03J07n33l91n80j089p53
446a066m49n98j71P45O28M40J001J098L46J48L6m91q03o42q16q79j01K33J1L58
466i72R61O66K21L81J22l52m71l16o78m05K31J27M3O65P30J58M2J23m49q77n31
487e81o09p46M0M80M29P61J336J038M91M77q4r30j139j158j548j344m54n5K12
$$ y = [963, 872, 656, 631, 232, -394, -367, -459, -1009, -1032, -531, -354, -313, 291, 798, 947, 1213, 1470, 1091, 747, 703, 43, -770, -957, -1115, -1523, -1374, -767, -423, 24, 986, 1513, 1511, 1877, 1994, 1278, 573, 145, -582, -1371, -1646, -1771, -1800, -1180, -355, -12, 644, 1714, 2076, 1804, 1797, 1582, 797, 31, -492, -1190, -1641, -1413, -1397, -1368, -620, 253, 456, 803, 1446, 1526, 1226, 1133, 837, 262, 34, -101, -670, -874, -535, -659, -895, -579, -166, -205, -15, 490, 644, 730, 1191, 1293, 971, 1011, 928, 256, -352, -546, -1087, -1596, -1437, -1236, -1125, -400, 583, 977, 1470, 2173, 2280, 1747, 1356, 776, -313, -1066, -1515, -2113, -2284, -1539, -911, -471, 530, 1628, 1974, 2122, 2158, 1667, 864, 222, -594, -1473, -1574, -1341, -1330, -972, -11, 655, 876, 1257, 1379, 1027, 556, 240, -438, -843, -612, -485, -442, 223, 953, 1111, 1153, 1276, 827, -50, -581, -1190, -1936, -1896, -1416, -987, -226, 1110, 2148, 2639, 3116, 3032, 2102, 963, -195, -1743, -3087, -3541, -3596, -3384]
506c384J180J775J540J497J470N08j76n89j397k097j772j383j379p54N31J035
522c395J334J966J957J389J152N97n89j096j202j690j988j326o85n00J96R91J208
539a681J222J613J161O02M96J75p30r85p29j041j149p08m60m33N3N46M24N91J068
558C5R60N36P66O12m4k36l46r28j233q75j004j065m86J79L04P46J421J347J174
577A863J303P59p9m06o74j531j714j244j113r68p0O47R08J348J687J318Q99Q36
595C769M7q63r66j076j485j361o06l10M2P61J046R13J070J001K57j59r1o24j049
614C16p01m25m45m0M69M07L71P77L76j48q1k23p03o27j92k17o9N71P12M62O72
635A262P22N2l81l46p24j090q46n10m84R2O79P60P72J276J012K77J34j14p96j083
$$ y = [-3384, -2204, -429, 1111, 2608, 4078, 4586, 4410, 3821, 2424, 327, -1445, -2828, -4207, -4961, -4430, -3395, -2061, -95, 1862, 3251, 4403, 5000, 4411, 3315, 2113, 423, -1565, -2891, -3576, -4076, -3880, -2889, -1681, -459, 1154, 2315, 2917, 3413, 3588, 2858, 1873, 1144, 103, -1046, -1754, -2214, -2647, -2594, -2048, -1624, -1033, 35, 995, 1531, 2297, 2909, 2865, 2629, 2283, 1355, 122, -753, -1757, -2822, -3308, -3129, -2825, -2079, -658, 689, 1863, 3166, 3925, 3846, 3440, 2766, 1235, -479, -1723, -2836, -3804, -3874, -3227, -2319, -971, 716, 2034, 2933, 3769, 3816, 2953, 1987, 911, -574, -1935, -2541, -2851, -2809, -2048, -1002, -89, 981, 1982, 2239, 2080, 1989, 1365, 316, -385, -810, -1255, -1295, -826, -419, -48, 729, 1105, 957, 876, 653, -50, -677, -869, -1086, -1155, -584, 128, 590, 1262, 1984, 2036, 1655, 1309, 585, -505, -1351, -1861, -2345, -2253, -1574, -814, -42, 1234, 2246, 2523, 2657, 2543, 1747, 664]
655F64r52j006r75j50R3J99Q22J288R23O50P77K98l71n66o44j002r17m37m28k50
675a984M99O28M17O24Q54K54J1J57k69n98l45k65n23j80J64M4JM06L00q0K40J78
697E33k18r0J45j40k43J78J06k04k2J30j66j64J62j74j44K30K76j15J26L71K7
718F04j61Lo5m34j89n3k67l0L14J57J35N31M10q8P1K8m64m93k62m57m53J14K19
741h30J53M63Q94L59K35L45L9n33m66n22q17o52j26j19jO17P73N47P20P22J95
762A996j24p6o58j006o25n45o63k58L32L52N29R01P85M38M52K96m41m66m04p54
782F1q62m16j32j93J99N49M38N34P20L87j8J66m0n47n52j90m75m58oL7k0K84M64
805g0J39K33M05J04j36Q6k2l40j94o0k63k59J05qj75J55K36q5J38L39P3m9K20
$$ y = [664, -288, -1294, -2269, -2419, -2326, -2127, -1305, -17, 906, 1556, 2333, 2631, 2260, 1694, 1050, 48, -869, -1306, -1734, -1984, -1485, -857, -440, 184, 1038, 1292, 1303, 1460, 1191, 593, 248, -17, -540, -720, -556, -512, -511, -105, 195, 115, 355, 533, 315, 225, 370, 230, -13, 165, 271, 67, 45, 175, 9, -155, 7, -167, -311, -81, 195, 80, 206, 577, 604, 443, 446, 381, -53, -242, -295, -562, -592, -278, -121, 14, 545, 955, 867, 938, 966, 502, 9, -253, -710, -1163, -1049, -830, -677, -214, 680, 1039, 1274, 1619, 1658, 1125, 659, 137, -680, -1332, -1458, -1577, -1578, -961, -188, 359, 1079, 1801, 1996, 1872, 1796, 1138, 132, -493, -1038, -1701, -1959, -1627, -1275, -746, 155, 940, 1378, 1830, 2126, 1685, 1219, 815, 61, -801, -1217, -1349, -1542, -1343, -794, -356, 178, 898, 1285, 1267, 1433, 1393, 846, 294, 104, -371, -829, -835, -798, -818, -534, -70, 69, 302, 707, 811, 675, 761, 739, 399, 205, 145, -118, -377, -272, -280, -455, -300, -64, -149, -11, 328, 401, 352, 572]
828E72Q7k44k0M4l08k54O1j33k62N6J79r3J97L22M8K9L04M5k70P8L1l29j95nj09
853a69j96R4M4p3K33K52l0J7L68l2j82O4J4k71m2J4j99j70J49M4j95K30K02j30
877C6Q6K72p5j18J10Jk07J6Q9j87j48K01k2j62J18J57k16J2K78j79j54K26N4j68
901B0J08J93j33L1J33j33j14L7m6l22%J47j97l9L24J28j2K80J61m4J3Q7l34k62
925B6J2k14l11QJ96o2J17L75J85M1K64J49k44o0Kl53l20k3j07j93J27K70kJ58
949D1L38K8o1J64l3k66m8L2k64j32K02o2j26K84J52j79N3J55j91j57J48m4j21
972h7J74J41j15M6K92j39j44J38p2l10k6Pj02n4K08M3J2K75J38j59M0J46j84k15
996E3R1o9k36J32K6r8O8K05n8o0J64m0k16O5J15j58J1K28O5m5K00Q4k45m7p6l13
$$ y = [572, 659, 415, 395, 439, 131, -123, -62, -195, -457, -401, -222, -315, -118, 204, 252, 281, 585, 630, 360, 438, 469, 140, -55, -60, -169, -365, -271, -227, -300, -67, 185, 155, 172, 540, 508, 326, 390, 404, 133, 91, 105, -94, -264, -115, -71, -266, -36, 166, 36, 122, 394, 319, 201, 311, 312, 105, 121, 210, 23, -125, 76, 54, -108, 10, 167, -49, -37, 241, 62, -92, 134, 188, 20, 128, 321, 188, 219, 352, 219, 105, 142, 96, -226, -226, -79, -276, -315, 9, 137, 125, 405, 566, 522, 535, 622, 288, 26, 38, -176, -487, -479, -283, -345, -228, 147, 332, 373, 637, 786, 542, 482, 484, 131, -189, -212, -319, -512, -385, -115, -117, 41, 379, 407, 346, 510, 477, 211, 163, 195, -69, -201, 1, -61, -187, 97, 249, 70, 123, 278, 87, -70, 78, 34, -87, 87, 228, 113, 159, 451, 312, 168, 306, 234, -76, -102, -95, -197, -251, -43, 0, 12, 287, 425, 266, 306, 452, 268, 53, 144, 75, -161, -29, -3, -101, -33, 172, 114, 54, 218, 178, -38, 27, 142, -16, -5, 223, 288, 243, 443, 527, 282, 235, 159, -154]
1022a54j96J1r6l6J89L61O5K69L69N5l8J6j60m48l07k21l96j13J09O2J65N30M09
1045D45J82K48K52j45k70q0l55n51j54j53k42Q9L34J20J76N16K28j1R9Q3k82k44
1067B85q8k17k89N9O6j46J69K49pk3K05Mj30RP2k03K0K39q1l1J66R9k47K9jk90
1093h2j68J00r4j92K69K21lJ94L07ol3J50j36l23n0j17l53j08J38l6o8L39J49
1116I8L7J93K19j36n6J17j86k10O8j8k81J2J87j09p3J51J8j55J40J26j53P0K29
1139B88lpJ75M9j90l1L2l04k20Qj27j80R1K27n8K73L45Q6P9K85j7k81j10p2l86
1164d8l14L6j41j57K26J50P9L17L52OO1K37j11l25L0j45l08j88kj27o3J88R9r
1188a57K12K98p3P8J89j02q1J03p7k47p0L6k35j80Q2m8j21J97J75k3K05K46L0
$$ y = [-154, -350, -339, -435, -471, -282, 79, 144, 413, 782, 837, 799, 815, 655, 207, -100, -321, -717, -830, -721, -659, -494, 36, 445, 627, 875, 1127, 982, 712, 632, 277, -274, -428, -581, -823, -734, -400, -280, -104, 412, 640, 629, 728, 811, 529, 285, 197, -20, -309, -250, -184, -330, -161, 88, 81, 58, 263, 267, 137, 146, 218, 15, 35, 274, 193, 162, 328, 427, 180, 209, 208, -82, -250, -150, -244, -436, -167, 54, 51, 245, 552, 546, 513, 663, 527, 204, 154, 37, -316, -424, -286, -322, -390, -51, 98, 135, 328, 547, 411, 355, 472, 286, 76, 144, 126, -155, -143, 44, -65, -138, 13, 31, -124, 16, 142, -11, 59, 288, 285, 278, 453, 502, 312, 281, 313, 9, -211, -203, -330, -510, -419, -192, -250, 23, 368, 454, 533, 818, 801, 520, 410, 338, -48, -362, -326, -467, -624, -398, -248, -169, 148, 500, 506, 567, 804, 693, 368, 398, 253, -55, -243, -245, -372, -435, -247, -148, -157, 55, 353, 280, 358, 547, 445, 364, 467, 390, 143, 73, 109, -126, -306, -224, -272, -393, -196, -21, -44, 161, 407, 437]
1211D37l7K24k7k28p9q0l06j38M5j28j04J54J47L0J75L24OK0J85q2k20%r8l36
1235a16k6Rj68l8K04P7j15K70K06q4M3J60k3k01J29k7k40KR9k13n7J36p6j33R2
1260i0J44r7K2K65o3j3J94P5j69J12j9k14j05Rj66j87J12N3j18J25K43j4J40K42
1284D81P5j50R4o2k61j53l6j52k46J44Mm4K02K77QJ13K74m9q2O8j33k98q9J1k45
1309b49j06J54K8l2K25J96qJ23J64j03j46J28j59k68k0M4j20k0K32rjJ93J09j40
1333B15J5P9j67j77K5N1k33J24J47r7J02K59l3m4J11j6j98n7pk33j06J13k0n1
1357a98K19J70l8J14K23n2q7M9r6k50o4p0k25K2J16m2M6K84J00PJ75J87j61m4
1381C85L9j61k62j6o8k71L1J52n0K2L19J17L9J45J46j71l7P6k44k23j6m2k48P1
$$ y = [437, 400, 624, 597, 369, 290, 210, -96, -234, -189, -317, -421, -267, -120, -90, 85, 409, 415, 435, 620, 538, 318, 318, 220, -116, -142, -133, -301, -339, -135, -58, -173, 97, 303, 219, 262, 422, 399, 198, 327, 300, 60, 62, 161, -52, -109, 27, -49, -182, -90, 54, -43, -21, 244, 181, 168, 362, 437, 268, 380, 361, 147, 42, 51, -115, -302, -190, -137, -255, -130, 113, 99, 239, 481, 556, 406, 500, 438, 177, 24, -12, -164, -410, -266, -262, -306, -104, 173, 181, 294, 568, 519, 437, 505, 372, 74, -15, -4, -249, -355, -201, -173, -205, 20, 216, 208, 331, 495, 392, 246, 374, 215, -53, -73, -29, -149, -169, 63, 54, 53, 246, 355, 215, 230, 309, 142, -35, -10, 41, -192, -68, 79, -18, 84, 343, 310, 266, 377, 361, 163, 106, 99, -134, -240, -127, -147, -198, 21, 191, 153, 267, 490, 438, 351, 400, 304, 54, -10, -80, -305, -283, -167, -209, -163, 121, 221, 228, 403, 590, 429, 385, 424, 263, 1, -15, -83, -354, -323, -171, -221, -199, 120, 237, 276, 421, 567, 396, 359, 435, 191, -32, -48, -90, -338, -267]
1405b67R9m7Q7K69N1K2J89R6j30nLk46j17O6j51k16J19J09r5Q7K39L4j4J44P2
1430C98j55K6M2j99j33J29j31p0Q1R0j51J16J45q0k3J54n4j22Q4N5j41MJ40j08
1454I7p4J82K5j58K8J03j41n5J30p2j00Q4O1j11P5J72r8oJ54Kj89P5N3k09l4R3
1480H7j18j44J40P5j37J39K04p3J7K05p3j11Q0kk37p5j1j65l3J62n3pK13J52k8
1505B07J23J77r6j23L4m3k41m8k7j41n7J63k5l1K20J06l9J39J41r5j23J20p8k10
1529E3J9Jj64m0Q6k3n8J02J27j20J62J39n9K8J44k9j87O2l5k04p9Nj20k5J00Q5
1555c0k0J27J93oP7J25m3j43Km8k53m7K8j25m6J91Jj8J76J51r1J7J32r2j37O6
1581A87n3j20M7P1r9j2J21o3m7L3J2j58K0Q4p4L6K40J4N8J18J09j95n5o8k09k77
$$ y = [-267, -168, -215, -128, 141, 192, 214, 403, 499, 369, 364, 367, 121, 4, 70, -81, -297, -178, -69, -164, -77, 162, 196, 182, 326, 398, 243, 269, 311, 112, -21, 108, -23, -93, -12, 78, -73, 43, 188, 108, 85, 239, 185, 63, 147, 202, 61, 65, 205, 97, 23, 205, 230, 72, 100, 203, 62, 7, 137, 65, -35, 49, 110, -1, 74, 246, 148, 142, 296, 298, 109, 184, 237, 28, -6, 87, -31, -175, -35, 40, -97, 42, 246, 173, 190, 395, 322, 211, 291, 289, 52, -23, -34, -199, -232, -70, -123, -130, 83, 235, 207, 330, 507, 411, 288, 322, 279, 38, -10, -37, -178, -235, -72, -97, -128, 92, 198, 159, 298, 439, 344, 221, 341, 263, 53, 72, 73, -91, -131, -45, -68, -126, -24, 103, -17, 145, 284, 225, 253, 397, 368, 181, 243, 208, 4, -75, -70, -190, -215, -115, -30, -50, 77, 270, 264, 341, 466, 423, 280, 282, 234, -19, -66, -38, -163, -209, -18, -17, -35, 141, 292, 201, 218, 350, 258, 121, 187, 134, 14, 61, 132, 33, 21, 142, 79, 32, 65, 77, -81, -61, 23, -51, -15, 225, 239, 297, 415, 524, 329, 274, 206, -3, -280]
1607b80K4o1j25J18K78O0K05L53O8j9J14j41l44j38j90l74j33J14k5J18K41L75
1629B38J98J66K27m9j64n2k84l69k43n8k09nK58J66J91L60K61QR8Qk74k39j65
1652F8k57l12K3P5qJ72L49J41K14K80J0j87kj36l38k64p1k31r4J81J12O0K79L65
1676D29J09O3K22q0j87j14k23l45k29n3j95p0J87J46J58L69L68J26J75K33j35
1697I54k36j44l57m97k81j64k76j6K61K82L13M99N03K95K28J14k84l63l52n07
1717b8o08l61k09j22J00M71M07M81O97M66J99J50q9m43n14m85n91n75j59q9qL51
1739i59N89M06M83N62K90m1k0j34n39m51l30m29l26K8N8P5K95M38J73K51K71R3
1761G83q6K6j04k55j02p6j85k17M8n9r1M3J5k2N5K23J06N0K28J99pJ49M6k05j90
$$ y = [-280, -256, -317, -442, -324, -46, 14, 219, 572, 640, 621, 735, 594, 250, 112, -78, -452, -585, -471, -496, -378, -137, 238, 436, 602, 829, 780, 616, 564, 280, -89, -332, -390, -599, -604, -346, -180, 11, 371, 632, 640, 738, 746, 472, 233, 68, -189, -501, -478, -403, -411, -239, 110, 251, 465, 745, 755, 568, 566, 430, 92, -172, -243, -474, -568, -387, -275, -215, 64, 429, 538, 601, 823, 743, 556, 442, 219, -126, -355, -408, -603, -673, -486, -340, -182, 187, 555, 681, 856, 1089, 954, 718, 574, 217, -280, -561, -725, -1001, -1017, -756, -474, -161, 338, 841, 1136, 1364, 1478, 1194, 831, 479, -28, -636, -997, -1206, -1328, -1228, -757, -350, 131, 828, 1294, 1493, 1643, 1554, 1111, 597, 112, -479, -1054, -1213, -1302, -1310, -959, -370, 36, 519, 1081, 1371, 1330, 1310, 1176, 637, 186, -144, -573, -899, -871, -813, -738, -443, -5, 168, 419, 690, 783, 697, 723, 619, 364, 262, 186, 1, -216, -168, -227, -318, -275, -260, -282, -227, -4, 102, 152, 380, 579, 572, 721, 767, 562, 372]
1786C72p7l09l44j69j18j57P5K75K27K28M26L29J61J51N9k36k83k01m11m27k05
1807f34j72j79J09L33J95L19N11L02J57J71L9k07k32k52l86m74j59k22j95J16
1827h60J73K10L18M70K75K70K71J04j88j68k52m49m52k19k96k76O4K17K00L67
1847b21M81L46L15L58Ok25j56l20m92m51k92k83j39J59L19K10M30M98K72J43K28
1868A186j31k57k46l17m62l17p0j30k1K63K74K29L74K47Q2kL4k21k69j27k09k69
1890c59j5P8qP1K78J90L7J60J0j15p8j4k04j44J2J4p6J33J85J9L7J58rj16Mp9
1916A69k16l3J0q9n0K01K5O8J61J38n3O8L6j36j96l2j02j85J1L4l3M7K30M9J08
1941B30J56J03j02jpj94j75Qj31j93K8J00j3J05K77L0J04J00Om1l1p0k24k07L7
$$ y = [372, 295, -14, -358, -527, -645, -802, -727, -452, -225, 3, 429, 758, 919, 1070, 1129, 893, 610, 409, -2, -429, -634, -806, -985, -876, -543, -348, -29, 482, 784, 941, 1112, 1151, 944, 712, 460, 74, -400, -559, -781, -976, -860, -687, -477, -159, 311, 586, 856, 1127, 1231, 1043, 875, 623, 174, -278, -497, -793, -1069, -1005, -788, -588, -221, 260, 606, 921, 1279, 1285, 1060, 904, 584, 92, -359, -651, -934, -1073, -914, -595, -385, 45, 543, 815, 958, 1186, 1055, 798, 552, 235, -227, -544, -614, -744, -765, -502, -228, 1, 375, 622, 704, 702, 736, 515, 246, 119, -90, -359, -374, -296, -304, -233, 45, 235, 272, 432, 442, 327, 249, 235, 31, -113, -101, -87, -163, -30, 155, 174, 211, 369, 360, 244, 248, 169, -47, -80, -70, -159, -209, -8, 17, 85, 246, 384, 331, 399, 435, 299, 103, 71, -31, -216, -205, -171, -204, -157, 73, 122, 230, 386, 489, 387, 386, 379, 185, 10, 18, -113, -306, -278, -178, -191, -86, 191, 221, 325, 425, 431, 390, 359, 289, 65, -142, -105]
1966a05q3j21J21J18rJ60K42L5K3P3Nj92o8p2k79l8M1n9p1K18J38L3J69J46q3
1991C42qO4j00k04qr7j52oN2k5L8K17K6NJ31J33j05JL2j02j34oo4j95K2R7j18
2018a64M7J52Q8qJ93R5q7L8K5j44j44Qj15j84j6%k7O2K26P3J06J65P9m4k0K9k48
2045A85j44n4j49j57L1Q8l9J95K34Q6P9K09r5j18J9j20k27r7k4r0n2J18J07K1
2069FJ76J10jOJ9m9j51Ll8j95N2J14k0N3J30Rj07N3J5j73k9M4j03k4J23R1j6J51
2097B49J32n6oqm6j97l8m9k02nJ05%O8K11R0L0J01O2p5m2jj30j92l7p3j15K3Q1
2125a20k0M1J75Q4J3J68J01Nj5M0j52j61l8j58k51o6J3j02R8K09Q8K50K71K07
2149F80P2R7j1k29l19k10l62l16j52n9pK20M21L46L58M14K35j3l6k03m40m65l52
$$ y = [-105, -188, -309, -188, -70, -79, 81, 323, 358, 381, 454, 459, 267, 199, 127, -152, -190, -149, -208, -279, -61, 77, 110, 279, 425, 342, 334, 398, 298, 94, 86, -11, -163, -169, -117, -142, -104, 113, 139, 144, 275, 408, 303, 304, 336, 234, 100, 94, 30, -165, -143, -46, -164, -117, 35, 123, 115, 308, 403, 316, 354, 379, 235, 91, 99, -16, -200, -216, -216, -243, -181, 45, 118, 224, 389, 468, 424, 404, 433, 185, 41, -13, -162, -319, -288, -200, -239, -44, 190, 276, 355, 564, 469, 351, 370, 250, 23, -74, -98, -188, -240, -122, -15, 6, 182, 292, 291, 297, 316, 267, 116, 119, 81, -114, -62, 52, 32, 85, 215, 224, 117, 170, 185, 12, -17, 27, -76, -100, 23, 114, 98, 249, 381, 325, 319, 311, 265, 68, 30, -19, -221, -226, -121, -121, -53, 158, 248, 278, 379, 441, 366, 324, 323, 193, 1, -36, -109, -224, -201, -120, -140, -99, 76, 160, 173, 341, 442, 447, 432, 472, 320, 159, 121, -37, -288, -354, -341, -443, -345, -136, -48, 202, 473, 680, 752, 849, 838, 609, 290, 80, -282, -598, -750, -809, -816, -596, -175, 171, 529, 943, 1178, 1165, 1129, 926, 486, 21, -331]
2172c31m48l31%O8K65M13N84L77M10L14O6j66k12l81n83m37l36l04j52K05K75
2193g04K64N08M53L17K47J73j27k91k28l55m78k43j17k46K0K09K02K10L09L12
2213D35J38J31J88j07j49r9j94k95j80j19k32q6N3K0O3K78K28J63K24K46J6J1
2235G33P0k03k38j78k90k74j47o5m7O1K40K79J45L81K53J06K5L6j86k91j99k76
2257f5l43p0q6p2J07K12J77J81L18K08O4J00P5j35j81j08k07k49j72j33j53m2
2279e74J04N6R5L05K57J46K01K91lkj5k59l55k88k99l37j95oJ5K01L90M03L48
2302D79L92L67N8l4j55m43m77m33m21l62k04R1J47L67N90M38M09M20K58r1j86
2323A210l13n65n27l71l27l19O9K50K33M34N03L61L27K15O8k29k27l03m46m21
$$ y = [-331, -779, -1110, -1110, -1042, -777, -364, 220, 597, 1007, 1321, 1387, 1221, 1009, 628, 45, -392, -728, -1032, -1184, -979, -704, -440, 68, 521, 838, 1085, 1258, 1131, 840, 612, 257, -221, -464, -581, -827, -807, -598, -396, -186, 123, 435, 573, 704, 892, 785, 636, 537, 343, 48, -132, -251, -483, -569, -516, -496, -433, -155, 73, 236, 460, 706, 722, 733, 803, 600, 362, 184, -106, -380, -527, -592, -639, -578, -338, -59, 86, 467, 720, 826, 851, 887, 701, 410, 211, -65, -408, -478, -564, -636, -529, -317, -140, 41, 359, 567, 631, 731, 806, 671, 490, 382, 175, -74, -246, -379, -532, -574, -470, -414, -319, -14, 243, 389, 590, 881, 878, 876, 861, 602, 247, -41, -340, -677, -872, -878, -863, -662, -272, 131, 479, 871, 1238, 1296, 1262, 1107, 664, 187, -246, -667, -1029, -1233, -1142, -995, -628, -38, 400, 809, 1229, 1487, 1396, 1210, 897, 332, -195, -566, -893, -1212, -1143, -893, -660, -226, 277, 638, 965, 1180, 1248, 1019, 792, 489, 43, -378]
2343c78j88k21n6J47K43J82L49L56J90Q4J45rk84j31j82l10j65q1j23lJ09J50
2365a76J00J59K36P4J3J14m6j56k0j02j81p9m6p7l6J15M9J5J25J62k7L2O4m1r3
2390A78nn5j80M3Q7j12O8J08L2OP9j7r0J3p6o3j02J0O9k0R6J25J4O1J60r4o6n3
2418B16j11k16r2L8j31M8J45J79P2J72J77k3K6lj19k39r7j76k23L0rL1J20K34
2442D9J55J00K05P9m1n6p1k19j79j14j69j42L0J51J6J52K31R0J00J46L6j35o0
2465C54r5j47j38o2q0j16P8Q8nJ15K36j5Q4O2K3n5j0o5j71n3k8j52k5O7O2o0J58
2492E0J10J2P0R5pj37R2n8j33p1op8o0P1N7k3J00O7mL1O1k4p5L7J7j08J3M7r3
2521E3k9P3or4Q8k3l1j2P3q2M8J11K4j3P3J1o2k9L9j46p1k3l4j06Q0J28n8J25
$$ y = [-378, -566, -787, -843, -696, -453, -271, 78, 434, 624, 708, 853, 844, 560, 429, 247, -63, -228, -309, -432, -435, -326, -176, -76, 83, 319, 393, 406, 520, 474, 318, 298, 196, 15, -64, -110, -187, -223, -108, -59, -44, 81, 243, 216, 248, 312, 271, 178, 173, 118, -62, -19, 68, -44, 24, 132, 164, 170, 249, 232, 142, 155, 79, 16, -86, -76, -7, -27, 69, 194, 208, 269, 429, 335, 269, 216, 105, -111, -203, -165, -296, -248, -103, 76, 148, 320, 497, 474, 500, 497, 378, 139, 42, -134, -357, -327, -336, -305, -185, 49, 204, 304, 509, 588, 547, 491, 420, 201, 22, -92, -261, -403, -373, -222, -206, -54, 177, 267, 367, 513, 549, 414, 354, 259, 112, -26, -88, -168, -284, -206, -118, -123, -8, 228, 213, 297, 359, 382, 327, 317, 252, 81, 28, 0, -152, -177, -110, -48, -108, 50, 160, 172, 242, 337, 330, 193, 285, 227, 94, 23, 17, -61, -121, -50, 7, -16, 84, 151, 147, 178, 239, 215, 140, 177, 194, 86, 99, 146, 53, 24, 97, 91, -3, 85, 62, 31, 19, 92, 10, 58, 169, 193, 180, 253, 264, 202, 173, 212, 66, -5, -28, -62, -168, -88, 40, -18, 107]
2549A07J51L4J9N7l4q3n1oj70j32K0l0l3P3J10J9R1J34j0K9J3Jj10n1Kj24o6N4
2577A4q9k7N1Q4j9Q7J02j6OJ24l6k1k8K6j54m4j8j27p8Q3K4l4J17J13L8O8J03
2604C49M2r3L8r8j36j21o7q1j04R9N0J3K32J72L4P0M3p2p1p4j39k13l3op6M4J56
2631d2J29N9K18O8m4J7k8j56j71l7j07j41M4P1K5Q2J79Q3K8J49n0q0l9p4j17j17
2657e1l0k6l3N9J08MO7J37K0j7P2j6j25ML8j80m9K6j02j2P7KJ1OJ20N5MJ65kn8
2687B74N2k5j73m6k2j65o7K7l2k3J59J69J5R9K07j6j1nn2j38j68j06j21q3j0Q1
2713a80LJ40J80L6J30J26l1r3O7p6j78n7m1r7j06N7K6n7J00M2K0O2J14J2M3J22
2739C64%rk4Pj63j04k9k00j16k1Kp9J83K15N9K30K37R9M9n3n5k48k03j69l43k14
$$ y = [107, 258, 292, 311, 368, 334, 251, 200, 194, 24, -108, -88, -118, -151, -78, 32, 51, 142, 276, 266, 295, 308, 309, 199, 148, 150, 26, -40, 14, -75, -102, -51, 33, 14, 101, 203, 187, 193, 317, 281, 260, 232, 258, 104, 60, 42, -85, -163, -80, -56, -90, 27, 140, 178, 246, 349, 391, 298, 336, 238, 102, -19, -86, -167, -271, -172, -122, -109, 123, 295, 329, 399, 442, 370, 299, 225, 86, -127, -160, -166, -242, -198, -42, 87, 146, 364, 432, 388, 405, 377, 221, 50, 13, -94, -235, -191, -120, -95, -13, 166, 249, 277, 426, 376, 296, 257, 183, 66, -51, -81, -107, -140, -81, 27, 31, 98, 235, 255, 238, 310, 294, 169, 173, 211, 31, -18, 8, -94, -106, -29, -27, -16, -10, 110, 165, 169, 334, 332, 274, 326, 301, 128, 82, 60, -105, -172, -145, -177, -200, -41, 128, 143, 242, 449, 433, 422, 417, 365, 227, 59, -47, -168, -251, -261, -180, -177, -37, 143, 179, 309, 435, 404, 311, 378, 302, 124, 67, 26, -71, -177, -120, -94, -151, -51, -9, 11, 73, 187, 199, 242, 364, 364, 355, 331, 338, 175, 71, 42, -158, -274, -295, -293, -372, -189, 26, 85, 315, 552, 651, 700, 647, 592, 344, 141, -28, -371, -585]
2765e85jkP2K37K78K38L00K31R0j4m3k01l48k84j97k97j36PN4J12L36K88J92K54
2789E81K39j2l0p7k26k94j95k11k03j09N2L3J11K36K20J65J31K22m7Km4j13k22
2812B09j06j70k21p4O6q5P4J65J87Q1J82J68kM7J3j22j77r2j17j98k8l1m3M9J29
2837i6R6O6K12L3J1N7K1j24j00m9q7q4J6j6rN3J12n4QJ12o0n0K5N6j42L4R3K0
2865A54k0R0J6m7LK7j79n7pj05q4N0K8P3P2K22Q2N6P0j8r7m4o2j88j39k2j28q1
2893c35R1Q8J05J56K08L5L5J39m4j24q6p4j83n1m9j42rM2R3RJ49J39K9P6R1k3
2919C65l5j9m6j72l9m7j10k2k9J6n1J35R0K9Q7J59NK8L6l9o6o0n8j35j47N4o6
2946a37o7R0L9K6J20J38Q2N6M8oo1l3p9j63q1k8r7j00J23oK6Q2J32M8J50M8P9
$$ y = [-585, -586, -588, -516, -279, -1, 237, 537, 768, 858, 844, 801, 600, 252, -32, -229, -526, -662, -655, -601, -489, -153, 135, 327, 581, 820, 808, 778, 701, 475, 181, -14, -225, -428, -537, -485, -452, -341, -105, 115, 280, 411, 633, 586, 588, 544, 431, 209, 103, -67, -288, -362, -296, -381, -307, -142, 45, 126, 308, 476, 474, 521, 534, 412, 235, 143, 26, -172, -200, -231, -274, -225, -96, 0, 66, 278, 311, 322, 379, 400, 276, 176, 127, 40, -44, -28, -44, -53, 0, 112, 58, 66, 178, 118, 68, 93, 149, 7, 41, 134, 154, 134, 224, 240, 193, 196, 223, 44, -13, -20, -125, -209, -159, -131, -58, 14, 236, 318, 374, 444, 426, 329, 285, 223, 35, -104, -126, -254, -335, -244, -156, -51, 105, 313, 348, 383, 522, 478, 354, 268, 194, 11, -40, -89, -231, -240, -198, -105, -96, 53, 192, 221, 297, 388, 365, 330, 311, 265, 93, 54, 7, -103, -125, -154, -138, -189, -54, 36, 65, 152, 311, 316, 344, 380, 341, 275, 215, 157, 22, -125, -71, -137, -204, -114, -75, -49, 71, 209, 291, 347, 395, 389, 328, 295, 216, 53, -28, -56, -153, -253, -130, -136, -110, -28, 104, 152, 302, 350, 429]
2973D29p8J7%j84q8n5j50j12M8r0P0R9J23J15J24Q2M5k9Q8n9j34j16j18r7j10
2998a80Jp4rJ72J38J0J90J06J3K1lq1j46k3p1j75ql7J1N2P9R6O1M8Q6k1J1j7l1
3027B19j16K3n7p9K2J0k8m3Q1L7PL8M0KK6L2k0m9%mq4J2J4m8lK4m1k4J15L0m9
3058H7K6L8K5n9L5lq6Rjl7l2J03kk1N8K3o1K6L9j15k3P4l1n8P5K1k0K3O1j6l8
3089A20L9j0p3j1K1r4j6J12l9j8P4R8n1j8J45r8m3M0n7q8L6j7m4l3R6lRM8l3K0
3119A12K9N1n4o0P6p0kJ4K8o2J9N6n0p2P6k9KN4L7jK0M1o1j9O1n5r7L5J8j34M6
3150IM1J5k1R5J9j5O8L8m2m7o5L1j46L2j0k4K7M3N9J0N3K1l6kQq5m0L8pn1P2j3
3182G5jO0O3q2K5Kn7m2K3J5j5m9P9L7j9O0Qk5N5m4r8p0P7j00oN5J9K3P3R9j9J2
$$ y = [429, 351, 368, 368, 184, 96, 41, -109, -221, -173, -263, -193, -94, 29, 144, 268, 350, 395, 366, 454, 395, 261, 145, 27, -70, -180, -179, -253, -262, -90, 48, 58, 248, 354, 367, 388, 385, 304, 158, 135, 64, -111, -119, -156, -145, -93, -14, 82, 143, 191, 277, 256, 267, 250, 219, 103, 126, 69, -10, 12, 22, -6, -49, 32, 69, 76, 114, 154, 156, 182, 214, 194, 145, 145, 141, 57, 69, 83, 35, 32, 56, 15, -9, 106, 136, 87, 113, 151, 176, 117, 152, 149, 63, 72, 71, 34, 2, 105, 103, 82, 140, 163, 102, 128, 167, 52, 29, 103, 72, 14, 89, 110, 90, 113, 174, 158, 120, 159, 149, 76, 65, 86, -8, -24, 88, 49, 31, 105, 203, 152, 134, 279, 181, 138, 178, 121, 33, 69, 52, 8, -25, 71, 68, 77, 125, 92, 112, 141, 192, 138, 78, 154, 84, 82, 96, 124, 62, 81, 137, 87, 15, 91, 62, 64, 118, 155, 154, 174, 215, 154, 135, 196, 141, 44, 79, 97, -37, 9, 50, 65, 44, 139, 158, 143, 211, 249, 207, 160, 95, 126, -20, 12, 2, -22, 5, 48, 107, 117, 170, 191, 155, 153, 161, 76, 36, 74, 67, 16, 88, 75, 74, 134, 197, 115, 140, 142, 85, 43, 66, 81, 66, 17, 96, 133, 114, 174, 182, 157, 212, 168, 70, 0, 77, -23, -29, 26, 45, 68, 141, 240, 221, 233]
3214B33j0j7n9l3k7r6k7L3k3M7P6jJ6Q9M2k2m2J7p3k4j2o8o5P2J0J6mQ4M2m7M2
3245A69M3j19J4j7l9k9Q7m0l2M5J7l4j4N6ln7P9j6J1j4L8l1n1R4l9m1j9N5o4j5
3275C4O0mo4R7k0qMJ4mJ2K1m2o8P9j9j1PK3k5Qj7M2o9N1k0m0Q5J5m5m3N5N0n7
3308A01J5oj0n2N4l7m3J6K8j5O7lK5jQ5pq2Lm5l8n3Rn9L6N6N9L8K7O8qmpp9l4
3342A04n5o8m4K8k1O0J3J29j4K5J01M1n2m5j9r3n3m3Mr2O2M7j1N8R6k1L5M7L4
3371B53o9k3j1j12j1J0j5l6O4J3KM1K7j0KM9k0l0L1j2p7l4P8p1jN3j7j6L4j3J9
3402I8j6O7l2K4J8L7o8K4Qr2%K3j1o4k3L4l1J0P6J9O8L2QqJ5J7r6p1L9l6r7J0
3434a8KlM0O5N7j6P5R8q8N0k0r6k9n5k6q3pL9k5K5J06RN9R7L1k6PJ3j51m3jj02
$$ y = [233, 223, 206, 147, 114, 87, -9, -36, -3, -26, 21, 97, 96, 112, 201, 243, 221, 179, 196, 123, 99, 87, 19, -46, 26, 36, 52, 48, 132, 174, 127, 169, 212, 93, 107, 90, 51, 22, 109, 69, 37, 82, 99, 65, 51, 107, 104, 47, 126, 110, 121, 107, 145, 114, 63, 157, 118, 77, 58, 113, 49, 34, 94, 90, 26, 123, 103, 95, 99, 113, 109, 121, 142, 100, 32, 111, 92, 81, 88, 111, 86, 94, 77, 119, 50, 101, 81, 41, 126, 141, 96, 53, 108, 158, 101, 116, 110, 100, 48, 102, 65, 22, 38, 66, 51, 118, 115, 140, 139, 224, 217, 135, 138, 93, 55, 2, 11, -48, -12, 44, 103, 141, 168, 236, 228, 224, 217, 138, 104, 49, -19, -63, -35, -56, 4, 17, 146, 132, 157, 258, 299, 247, 202, 183, 90, 37, -6, -2, -94, -32, 15, 4, 62, 158, 137, 172, 219, 253, 184, 161, 150, 38, 27, 37, 22, -14, 50, 63, 65, 106, 133, 123, 125, 174, 154, 124, 155, 143, 66, 32, 110, 39, 38, 91, 74, 58, 92, 79, 98, 82, 149, 117, 141, 159, 196, 128, 152, 160, 68, 68, 91, 80, 16, -7, 27, -4, 6, 82, 101, 169, 201, 209, 201, 216, 233, 137, 66, 105, 69, -28, -18, -16, -19, 21, 86, 143, 127, 202, 300, 212, 262, 242, 146, 117, 62, 36, -47, -54, -15, -40, -15, 91, 100, 159, 256, 287, 261, 268, 281, 130, 87, 86, -16]
3466a6r2N4l1K5Q7J14j9O2J00k7Llj4j46o1J5j00n6L2K6M2P6R8k2N8J03m3n2K2
3495B35n6j00q6ll2l4Q8OK0O2P8j1Q6J3rr4ooj45j9K2n1l4R4N7j8Q6R4q9L1L8
3526B17m6o3L8o5j6l3L2p0L4P9k3J4Q4l1n1J9M3o6J9lm1l4N6K4n5N7J7j9l6M9
3556A30l4kjJ1n7K3N4j8QP1o5J8K8o6k5j4On6L2J2kl1Q1Q4k3Q0j6l5m7rl9q2j3
3589CJn6OJ08N7k6J21K9l0l5K5l0r0M1q2q6lO9j7MP9L9QN8KMm0Lk0o1j1n0m6M7
3623B1L5k9NR0rlP1Jo0K2Kp5l0O7j2n4L6K4k5J0R2l7n0N8j6m0L3nn8j0P3j4m2
3656G1J1L4o8P8K4l4ljJm9K1J3n1L3N2n0l0R1oK7j9K2o3J3ll6m9n3P7Nj2N7rL6
3690A30Q7rp7N5j4q3%Rp4j8j1L2j9M5Q0RK5P8j4m8j0k5r4l0L2r1J3M8L4J8L9N7
$$ y = [-16, -108, -54, -85, -60, 27, 141, 122, 184, 284, 257, 260, 257, 243, 97, 36, 51, -49, -105, -73, -47, -5, 71, 169, 147, 205, 308, 265, 213, 235, 179, 79, -7, -10, -42, -76, 12, 18, 38, 100, 178, 167, 253, 266, 257, 163, 157, 151, 6, -13, 9, -42, -76, 18, 75, 57, 143, 237, 148, 179, 217, 171, 108, 146, 81, 65, 32, 64, -6, 28, 107, 84, 98, 182, 151, 100, 119, 162, 96, 115, 112, 71, 37, 93, 117, 62, 119, 136, 117, 81, 130, 96, 94, 93, 104, 47, 70, 124, 106, 114, 185, 120, 138, 166, 100, 75, 61, 67, 11, 43, 55, 53, 22, 103, 187, 164, 244, 228, 193, 146, 137, 98, 16, 3, 4, -52, -46, 62, 119, 93, 214, 243, 213, 178, 203, 173, 83, 124, 42, -44, -47, 22, 5, 9, 88, 127, 135, 193, 195, 199, 159, 162, 142, 81, 70, 20, -26, 21, 56, 27, 32, 122, 113, 110, 181, 182, 122, 144, 146, 71, 41, 108, 96, 42, 78, 102, 77, 87, 179, 142, 92, 150, 134, 94, 127, 122, 64, 54, 127, 113, 71, 82, 116, 48, 126, 150, 116, 113, 112, 113, 64, 85, 98, 47, 80, 132, 82, 52, 143, 137, 164, 145, 167, 104, 117, 114, 78, 29, -24, 53, 58, 46, 103, 94, 130, 217, 208, 131, 186, 172, 89, 89, 98, 24, 6, -5, 27, 8, 53, 133, 142, 167, 245, 231, 183, 173, 148, 54, 24, 56, -35, -22, 26, 60, 78, 117, 174]
3722A74l0N6lj8p4J8n3k5rN0q4L4Q7l3J5N0L7l8J4lp7k9O2p5p1J12Qj8K2O7l7
3753A29k2L9m5m6N0j1k2k2M7k1l6O3L1n1M7PLnj6j2k5K1Ln8J0J8J3o3Q5L5l3K8
3785A41jp2P2J9l3l3Jk1k2j2N1o8J8M3K2k2N5N3K8m0M5j00o%n9p7K0J4m8kR2J3
3817G1O6N4J5rJjl5q0J0j7j19N6nm8K0J25j0PJ00K4rMQm9m8j6m4n7j2OLk2P2k8
3851C3K5J28J0j7L5M2r0J7jm5j07j4j5o7N4jJ4k4J33L8QR9Rk2J3k6r1q6m6j0j02
3882a06J9K7j3L0J65N4MP1N3j7m6Nj22l1j6j24n7K9L4m8Q9Q9N7K3J36o8J8l9R
3911B25o7o9rj14kj6J1rM9M8N7L1J03j0K9L0m6q0m2Op5j03M3l8PK7N8J3N7R9o
3942B07J8J18m3q3l7n0r8r3N9p9o0J17Q0oQ8J46l6K1M2m3p9p8j7p8p0K1l2OJ08
$$ y = [174, 144, 200, 197, 179, 105, 123, 70, 45, 36, 86, 2, 36, 123, 90, 105, 155, 192, 154, 168, 165, 88, 59, 121, 46, -25, 87, 95, 77, 99, 166, 129, 107, 146, 101, 55, 105, 94, 72, 50, 97, 76, 40, 103, 134, 83, 130, 137, 140, 135, 119, 107, 82, 103, 106, 48, 58, 76, 89, 26, 111, 146, 113, 141, 140, 68, 140, 159, 126, 93, 94, 73, 51, 39, 90, 22, 40, 83, 105, 83, 138, 191, 219, 179, 224, 124, 118, 118, 59, -18, 2, 16, -32, -34, 58, 71, 137, 191, 206, 197, 198, 197, 162, 82, 92, 75, -44, 12, 7, -41, -21, 104, 94, 101, 201, 225, 216, 220, 228, 179, 131, 115, 71, 14, 2, 8, 11, -11, 61, 33, 58, 186, 196, 179, 214, 256, 166, 183, 182, 137, 30, 16, 1, -66, -12, -13, 1, -23, 110, 148, 156, 255, 264, 242, 255, 229, 138, 52, 6, -4, -106, -87, -60, -73, -43, 122, 176, 180, 251, 304, 287, 241, 246, 124, 93, 77, -47, -104, -75, -41, -89, 0, 89, 146, 169, 305, 237, 255, 216, 225, 158, 89, 80, -34, -36, -52, -41, -50, -1, 47, 104, 135, 238, 228, 257, 287, 241, 161, 119, 125, 50, -53, -10, -48, -41, -14, 44, 57, 114, 213, 207, 225, 343, 300, 217, 180, 130, 32, -61, -2, -81, -141, -24, 56, 50, 138, 284, 248, 269, 311, 268, 189, 111, 94, 16, -54, -33, -65, -59, 49]
3971D9L8QQ8P3pj3O8p1r0m3n4q8JK0l0j5J27L8L5M6O0kqln2q8k1m2o3M1j2n1J15
4004E4N7j8J1M8O0l7L8k6n5l1K4p9p8K4J6j9J4P5M6PO9Ok9J3l1l4k1mm6o8J5J9
4036B0j5M7N9N1K3J2mJ2Nl7m2l7j7n2m5Q0J5l7K5M4nO0M1m4k6K5J6o7nnj9n2M1
4069F7K0n2N2J9m3J9N9j9j6L3Qn1J9Q8p5J4j1j3o0KJ2m2l5L8M9J5N1j4M4L0mm
4101B00p0l5%m3j9l4m7M6L0L2O4N0M3L1lK7p7n3J0j23k0k2O9j06Q2J8L3M7O3k7
4131A66M8K9m7Nn1o1m8l3j1l2pQ5k3M2K0J07K9qK3J6j01oM4j12n4J6j1k5J0M0
4161E0K9K2N9m7N6M6qq1j5M5m6n8M1p2l1P7J5o3Q9j6j2O0L2%o3L3L0m7l3N8q2
4192F8K5l3Km2M9Qj9K6J6RlL9N1m8K2j2k0j6j8k9n5M8l2o3R6J6j0O5mJ05j9j2
$$ y = [49, 87, 95, 183, 256, 249, 236, 304, 233, 143, 100, 46, -42, -41, -21, -51, -66, 61, 99, 134, 180, 240, 238, 230, 227, 175, 87, 66, 24, -39, 2, -10, -61, 54, 111, 93, 104, 152, 212, 175, 213, 187, 132, 101, 125, 46, -32, -8, 8, -11, 3, 78, 124, 131, 200, 206, 177, 190, 159, 125, 104, 100, 54, -14, 1, 20, 5, 52, 111, 162, 185, 197, 193, 205, 210, 173, 131, 94, 77, 25, -20, 60, 75, 38, 63, 107, 102, 162, 203, 159, 133, 158, 174, 107, 102, 97, 78, 26, 67, 87, 35, 87, 106, 63, 82, 141, 122, 106, 139, 147, 96, 115, 203, 128, 142, 131, 118, 58, 60, 72, 30, -5, 33, 82, 97, 148, 134, 178, 208, 204, 200, 130, 95, 95, 52, 33, -1, -48, -2, 28, 60, 124, 174, 217, 248, 245, 272, 195, 142, 152, 29, 9, -13, 56, -50, 32, 50, 83, 130, 193, 166, 214, 243, 196, 201, 150, 89, 41, 8, -3, -35, -42, 43, 20, 62, 82, 189, 218, 210, 233, 249, 148, 142, 186, 74, 20, 36, 25, 0, 10, 50, 79, 101, 160, 113, 169, 215, 207, 126, 111, 156, 110, 52, 93, 21, -10, 67, 82, 19, 108, 92, 80, 140, 172, 172, 109, 142, 172, 125, 92, 150, 68, 93, 60, 62, 20, 69, 77, 58, 84, 100, 109, 106, 145, 196, 148, 170, 158, 138, 122, 104, 75, 20, 68, 36, -27, 69, 85, 75, 140, 136, 241, 222, 210]
4224B10Mk7n6m1m3l5Ll3J0LR6qL5Q7JK4L9m0o1l0k1j09j9J0l6n0Q8P2k6Q4N1O6
4256B48m3P9l9p9n9nj05k6J2oJ7M4K2J4O4P4k0L7pl7m4l2J9q3l3J5%j8N3P2k2
4287A12P2J6l9j5N8m7l9J9j1n7LK2n3l0O1L1jL2j9rRL3m9k1L9j5k1L4Lj2Qk5m7
4320D2pL6K0l9M3L0oPN1k8qpJ5o5k2lj4j2K6K4m0Q9J6pL2J5j0n4Mj2j9k4l5k5
4354A3J3J1M4l9R9N0n2L6k6N0m7n9K0q2k3Qk3J7O6L3k7J14J3j3J1LJq3Mo9k4n5
4386a6qnl5J30J1L1J00J3K0K4m0j6p9p8k4r2k4RJ7N1M2J23N8M6M4l6M4l8p5j20
4416G7k7p5q1j5J9%J16R8L7R0P9K5k3m7l6j39n3n6p0mK8j0k4J33pJ15N0J06Ok5
4446B87k1o0r9m1l9p6k3M3k2j9J13K9M3N5N4M7j7K4m7l3q0k5o5m1n5JJ4J2P2N2
$$ y = [210, 214, 187, 131, 90, 47, 12, 15, -18, -8, -5, 91, 83, 118, 205, 206, 230, 269, 229, 168, 138, 117, 8, -11, -1, -37, -87, 1, 73, 47, 131, 182, 248, 205, 284, 245, 166, 107, 102, -3, -29, -17, -23, -6, 38, 60, 74, 138, 212, 192, 229, 222, 185, 141, 109, 128, 45, 12, 27, 27, 9, 62, 134, 112, 184, 200, 161, 146, 204, 157, 118, 137, 126, 69, 72, 94, 41, 11, 72, 103, 102, 134, 115, 106, 115, 148, 99, 78, 117, 102, 81, 115, 118, 106, 114, 89, 42, 35, 71, 91, 52, 95, 125, 119, 126, 177, 149, 141, 134, 149, 84, 62, 59, 45, 33, 59, 83, 43, 132, 148, 141, 173, 188, 178, 124, 128, 116, 97, 73, 38, 13, 26, 37, 81, 42, 141, 191, 139, 175, 149, 199, 152, 93, 113, 31, 8, 16, -7, 10, 76, 109, 82, 196, 209, 196, 207, 210, 211, 128, 132, 63, 39, -16, -24, -29, -64, 66, 77, 108, 208, 221, 241, 265, 225, 209, 130, 52, 28, -64, -88, -79, -62, -11, 31, 154, 212, 258, 302, 266, 310, 272, 197, 77, 50, -25, -106, -121, -102, -102, 14, 112, 149, 239, 318, 343, 320, 273, 237, 98, 45, -11, -81, -85, -57, -67, -91, 42, 35, 150, 200, 306, 312, 287, 266, 206, 107, 66, 27, -49, -72, -29, -51, -70, 43, 72, 115, 170, 224, 271, 254, 278, 231, 198, 118, 93, 28, -13, -68, -67, -53, -41, 31, 83]
4476H3O9M0L7N4K8l8n4pp9q3m1n0k7MM2J2J1J17Q8K3MP4k2o0k1m6o6p7m5l4K8
4507c6J6l1L7Q9MQ3Q7K4p1k4K7k3q3j5o1n2j6K1K5J0O3oQ3L4J3K0LN3p5l8p0n
4539H6p3j9qj9j9P7M0K9M8N0O4k7Pj7o4o3pp5J4l6n1M7L0Q3jO8J5J9k7J6j6p0
4571A01J1rl9nJ3k3j5M6L1J3qK5n6M4nj8K4J0n9M7M4m4j7p0P7o7k6jj0K2L5K2
4603I3%K4L2%JRMj9k0n7l4j4M8k2l3K8Q6j7N9OplN6o3k9k6J2q5M6Mo4J6N9k3q
4638E9QR6l2K8J5j3j9J9m8j4m1L4p4j9QL9Oj5P5l4L9L7N4m6j4K4m3m4J0j16J0
4669a1J4L4oQ9n1L8O3O2o2K6K5n3o2m4Qn7L5k3mj3J02K2k9O9M1o6K9kl9p6M2m1
4701F0k4j3L3K3Jj9L6J1N7j9L8m7j4l1J3J3j8m9L6nl4OJ5M1j2K1N0p8L6M9m9J1
$$ y = [83, 152, 192, 229, 283, 311, 273, 219, 212, 133, 50, 9, -41, -68, -64, -22, -10, 1, 118, 206, 229, 233, 307, 285, 225, 204, 158, 92, 15, -30, -64, -36, -20, -51, -14, 75, 79, 162, 249, 273, 202, 178, 205, 182, 99, 84, 23, -29, -45, -24, 1, 11, 74, 68, 151, 185, 198, 218, 221, 274, 199, 161, 91, 86, 13, -6, -14, -33, -52, 25, 65, 94, 142, 192, 256, 229, 236, 219, 155, 92, 85, 10, 24, -12, -63, -16, 14, 97, 96, 164, 179, 198, 171, 187, 171, 101, 112, 103, 64, 59, 72, 49, 34, 80, 111, 124, 116, 141, 85, 129, 124, 106, 130, 140, 81, 128, 172, 128, 111, 41, 118, 51, 25, 24, 14, 36, 71, 93, 93, 117, 149, 149, 150, 159, 163, 144, 124, 67, 33, 19, 67, 45, 12, 40, 126, 109, 168, 174, 167, 164, 220, 157, 128, 102, 114, 29, 75, 79, 15, 31, 90, 67, 59, 67, 163, 131, 159, 174, 161, 142, 161, 113, 99, 58, 92, 18, -1, 7, 46, 52, 37, 112, 78, 117, 154, 208, 162, 148, 172, 129, 85, 95, -21, -11, 3, 37, 31, 120, 69, 107, 170, 232, 170, 196, 221, 168, 106, 62, 70, 13, 48, 25, 21, 8, 110, 132, 103, 172, 213, 147, 176, 174, 135, 59, 101, 60, 36, 23, 56, 79, 80, 61, 97, 108, 165, 146, 184, 137, 123, 92, 105, 118, 100, 51, 87, 82, 48, 54, 69, 110, 98, 119, 169, 91, 127, 176, 127, 138]
4733A38Pj9n0l4J4L1k1J7K5K2K0k0j1K1Qn7l8Lk5L5k9L4nL9L9lMJ1Pn9J1J1m2
4766H4j3k5J6j7Q9m3MK1N3m2K7j1K9m4Kjo9l1M1k8LO6MJ5K1o8M4L9n6nl7K1j5
4799G4Nk2L4m1K4O9j8k0j2J0%OJ6j7L4n1M4n9N2j3k3j0M1o4%J8L7KK3jmK6j3L1
4833A78m8l1Ml1OJ9o2k5j0Q6K5l7J3M1J1N4m1Ll1J9o3m6K4k7l6O0k7O0M9rK6J9
4865A73K6Mn6K9p3p9K3m9M3QM3p6N1L5P2k1J7O8m3l6Nl4n3n3k1j6O5j0kQQ9j9
4897A18O1L1k8j3l6j9l1m0nQn4K9L5RO2PK9l2N1jl2Pn3Pk9l8J8m4oK7L0M0N1j4
4931A45j6M6m3j9OL1o5J9pk8k6K2PRK1rL3OqqJ8k9J2o5O4k6j3rJ4J6k9K6qk4M7
4966A10K8k1J9l8M1M7o8N2j06K9Nj1l7qJ4oL4M5K1j4M9mm7K0Oo9k9j4L8p1PK4
$$ y = [138, 145, 126, 76, 42, 56, 87, 66, 83, 108, 130, 150, 130, 119, 140, 148, 91, 53, 56, 31, 66, 37, 71, 66, 105, 144, 141, 145, 156, 163, 104, 115, 126, 84, 71, 46, 62, 45, 134, 91, 95, 116, 169, 127, 154, 143, 172, 128, 130, 129, 60, 29, 70, 42, 45, 111, 115, 130, 151, 83, 127, 166, 110, 105, 68, 89, 74, 79, 57, 91, 50, 74, 143, 125, 105, 93, 103, 103, 109, 125, 108, 142, 91, 135, 76, 128, 115, 92, 82, 123, 59, 59, 77, 114, 116, 139, 138, 134, 160, 147, 178, 130, 99, 103, 72, 78, 97, 35, 10, 0, 86, 111, 74, 87, 128, 139, 193, 152, 155, 124, 143, 80, 34, 58, 31, -5, 55, 28, 88, 137, 128, 154, 173, 199, 203, 147, 176, 103, 24, 47, -2, 41, 49, 92, 16, 67, 102, 174, 153, 170, 238, 195, 159, 164, 130, 77, 24, 3, -13, 52, 42, 40, 48, 137, 118, 179, 210, 182, 169, 133, 114, 83, 43, 38, 46, -8, 21, 56, 65, 127, 134, 163, 131, 182, 181, 149, 156, 103, 110, 81, 43, 61, 17, 11, 38, 68, 108, 159, 145, 129, 175, 132, 113, 119, 150, 85, 104, 97, 69, 43, 65, 72, 81, 102, 93, 126, 132, 124, 116, 134, 105, 117, 52, 116, 90, 77, 68, 82, 98, 69, 95, 87, 63, 110, 138, 117, 136, 98, 139, 186, 118, 170, 64, 93, 98, 87, 50, 42, 56, 50, 84, 129, 150, 136, 185, 181, 134, 154, 160, 91, 62, 48, 86, 15, 22, 46]
4998D6k2O4J04m2K4J5k5l9kkn3m7N6p0j9Q5j1L3N0J8k2N5l0J9q4l1lj7JK4ql7
5030C0L8O7j2mO3m3M2k1j5p5J5K8p8%L2OL1Kk9O6OK0l0Rm3j5qJ3n9J0J9J7LQO
5065I9P2L2o1Rm8J8Lm5l7j5J9OL8J3RM9L2Mp6O8p7k3J3o7on9N3J8J8j0Q7N9J4
5098B09M1n6m9no6m3N5q0J4nO5j1K6N8LK2L3K2n9m9j5l3p3L6Jn3N6M0RK6N2L4
5130B05kmpo3k2j1m6n1O3j6kL8M2ok1P4Qk2K0m7jl3o2jj1M1rPM7m2L8K8k4QN0
5165A66Lko2MJ8j7j7k0pl8K3N0J4k5MM5JJ9Kn6M3k4n4L4n6Mj5L3J0k8L2J9L4j4
5199A23M2j0PMo0j0Lqj7p7N8mj3O3M6j9j6P5m4K0J4nn8k8J8n4k4M2njJLJ6L8O2
5234A82j7l6N3n8J1j1rn5n7N3l4OO3n5K1O4J6qM7j2rjm9mJ4o2qK7m4M4lK5L4O2
$$ y = [46, 24, 88, 192, 150, 174, 189, 164, 125, 123, 121, 68, 21, 77, 7, -12, 73, 62, 95, 145, 163, 141, 196, 166, 185, 101, 70, 67, 50, 51, 75, 67, 30, 68, 135, 123, 119, 182, 139, 181, 160, 145, 70, 85, 113, 35, 35, 67, 73, 104, 106, 77, 143, 149, 169, 139, 148, 105, 90, 82, 95, 36, 46, 65, 82, 85, 93, 99, 171, 203, 142, 151, 103, 121, 124, 79, 42, 27, 46, 52, 90, 103, 112, 161, 193, 197, 121, 189, 112, 89, 102, 35, 29, -30, 23, 41, 59, 49, 136, 195, 209, 250, 194, 145, 140, 74, 31, 86, 6, 20, 15, 80, 69, 95, 153, 156, 178, 211, 233, 174, 125, 110, 77, 4, 40, 41, -12, 44, 84, 93, 119, 171, 205, 203, 199, 192, 129, 107, 96, 50, -1, 62, 46, 44, 82, 124, 118, 97, 171, 179, 157, 177, 130, 129, 96, 34, 33, 22, 63, 54, 61, 108, 66, 104, 132, 108, 116, 166, 169, 167, 105, 109, 127, 110, 93, 73, 66, 28, 51, 101, 115, 90, 94, 139, 140, 159, 161, 105, 148, 124, 70, 104, 48, 52, 37, 70, 80, 52, 84, 103, 137, 123, 165, 155, 162, 166, 106, 96, 99, 91, 74, -3, 55, 51, 38, 101, 147, 128, 112, 187, 143, 163, 177, 172, 114, 86, 104, 50, 26, 68, 63, 62, 63, 66, 82, 120, 182, 165, 129, 182, 124, 135, 124, 115, 60, 3, 56, 22, 28, 91, 36, 57, 121, 137, 129, 176, 164, 155, 154, 105, 101, 115, 53, 45, 72, 28, 72, 69, 94, 128, 190]
5268A90o8K6J3J2m6k5K7p6rL7k0j8N1J3o4J02l8L8Mk0j9j5l5K1loK0m0K7J0M3
5299A32o5P5n4rQ0j3o9N4k6rL8jl4k4M1l3LK1%%j7lJ4kkK4L2m1J6oj2m4K4J1j4
5334H7K7j0j8mM1k3J6RNj3k8J2j9J8qJ1K3m8j8M1j1OnK4k4MJ6J8j2L2Kk8k6j7
5368H0L0o4M0ql1K5K4L7l4J4N3j9l6L9nj0n2M0l5J4j9J0j1m6N2J3RpK0K4l4L7
5400A50p6lJ9njqlj1OJ4J8M5l5mJ1M3n6Lk2K2m3J7NJ3k2K7k5k1O0K6k2k1J5k5
5434I1L8pKpm2Rkk3O6k6k7OK3J4lN2k4lk4Qj9J7j7l4J3K9k3j1K7M3m4pNj6N7m8
5470I3L0j5NJ7Qk9OJ7n6K4j3j9PM1k3J1rj0M9k3M3J2j3nj2k8Nm4j7J7L7l2L0M9
5504A53k0l0P3n7K9j7k3K7m5j8l1J1N0k4QPJ8QJ8MM2m7n1NRNjloQk0K4K1Qj7k
$$ y = [190, 122, 148, 161, 173, 127, 102, 129, 53, 44, 81, 61, 43, 94, 107, 43, 145, 107, 145, 149, 129, 110, 95, 60, 81, 78, 72, 92, 52, 79, 89, 132, 67, 142, 88, 79, 159, 146, 77, 131, 105, 96, 134, 133, 99, 75, 116, 83, 86, 107, 107, 107, 90, 87, 101, 99, 97, 121, 153, 112, 128, 122, 110, 66, 90, 101, 87, 114, 104, 86, 82, 123, 100, 116, 125, 130, 117, 89, 101, 82, 100, 92, 103, 126, 78, 60, 101, 90, 96, 91, 115, 91, 95, 111, 129, 117, 149, 151, 123, 97, 80, 110, 46, 86, 78, 47, 72, 96, 133, 99, 113, 166, 147, 111, 150, 145, 135, 83, 123, 88, 102, 83, 93, 82, 36, 88, 101, 110, 103, 123, 147, 113, 150, 74, 71, 90, 85, 84, 76, 73, 62, 68, 82, 100, 145, 110, 106, 117, 160, 104, 107, 85, 107, 64, 81, 86, 99, 77, 104, 79, 58, 118, 144, 122, 101, 116, 91, 129, 122, 124, 117, 75, 84, 82, 59, 125, 99, 72, 78, 101, 115, 112, 164, 140, 137, 113, 121, 102, 119, 102, 68, 81, 110, 87, 76, 103, 146, 102, 95, 100, 84, 141, 93, 123, 108, 113, 130, 138, 109, 115, 132, 76, 100, 87, 68, 75, 116, 93, 104, 95, 85, 134, 111, 154, 166, 153, 148, 136, 108, 113, 69, 52, 69, 106, 74, 104, 153, 133, 103, 176, 119, 148, 131, 108, 135, 90, 72, 41, 52, 102, 78, 86, 93, 111, 119, 137, 141, 183, 136, 85, 90, 99, 104, 103, 100, 94, 102, 82, 106, 127, 135, 118, 116]
5540A16j5j0J2l2L7k7K5K5pj2J9Nk7k1rnL2m2L3l5O5n5O0l7L2JL1m0K2Lp1J5q
5573H0Jk7mk2J4L3N8j7J0L9k8M3l5Ll8l0K1o2qNL7m0L7K0M3J6j1L6L1n1k1l8j7
5606G8po1J9J1J0K8MkM2L3J8pM4n5J1k6k5k4l3l5m5N7LK1J5K4O2K4pj3OJ6n4n8
5640G4jj1mj1LK1j2J5K1K0l3O0N6j8k5j3j0Kl9k2qJ4nJ6k6P1j9qRrJ9JN1m2nl7
5676I5K6m3K1l3k5K4J4m9M1J5jK4K9pL1Roo3k1L5k4l5n0N8l8J4K2O2k1M9KJ9%
5709A74J3n4k8K6m5n3QJ2Jl2R4L4m2L2J4L8rj7k1Pn9l8k2L0jQL4j6J1J6L1J8k1
5742A43oJ7m9J5k9Lm7MN1k3nM2J1J7J1j6l9J3j9lk2J3J1n7O0j2RK1%J0K7Rm0k9
5776I1j1Rolj4M3l1L6l4K3J9qnJ0j9Oj6j0j0%JK7roO1nK8k1k8j1k2N1m3l3M6n3
$$ y = [116, 101, 91, 103, 71, 108, 81, 106, 131, 124, 112, 131, 136, 109, 88, 79, 74, 106, 64, 97, 62, 127, 72, 132, 95, 127, 128, 159, 119, 141, 144, 73, 88, 80, 81, 54, 50, 28, 42, 75, 133, 116, 126, 165, 137, 180, 145, 148, 110, 80, 101, 39, 31, 36, 73, 33, 70, 90, 133, 149, 138, 174, 205, 154, 133, 95, 78, 71, 10, 29, 40, 50, 78, 82, 80, 122, 155, 173, 166, 210, 155, 166, 140, 115, 91, 58, 23, -22, 35, 38, 59, 74, 98, 160, 184, 177, 164, 170, 186, 132, 74, 73, 62, 58, 47, 50, 71, 59, 74, 95, 115, 82, 142, 198, 180, 155, 142, 132, 134, 95, 73, 65, 79, 74, 90, 64, 135, 116, 108, 117, 108, 127, 128, 179, 137, 132, 95, 121, 78, 99, 66, 41, 65, 79, 30, 71, 86, 85, 109, 138, 131, 162, 171, 165, 102, 81, 116, 92, 57, 7, 65, 27, 41, 63, 125, 104, 153, 155, 174, 174, 187, 133, 105, 131, 86, 33, 41, 53, 54, 22, 116, 150, 108, 140, 154, 192, 183, 166, 145, 152, 93, 55, 33, 63, 62, 70, 104, 88, 99, 115, 146, 164, 143, 137, 154, 105, 120, 91, 94, 47, 51, 102, 79, 74, 116, 127, 144, 155, 139, 100, 113, 94, 91, 69, 82, 93, 36, 96, 84, 93, 114, 114, 124, 151, 160, 120, 91, 80, 89, 83, 80, 66, 109, 78, 114, 80, 103, 122, 114, 109, 119, 100, 106, 90, 80, 70, 70, 71, 98, 89, 83, 144, 139, 167, 146, 118, 107, 85, 136, 93, 60, 106, 53]
5812E3pJ2M7QK9pK5k7L1l8k4K0rp2J8NoPmJ8L2J6mnK1k8j0k0Nnj5K0L1rl8NJ00
5849A75o2J1J7l9Qj1rKMk4M2Qj5j6N4l0rk1K9j8j2L5j5j1K6PPJ3lj7j9rK1k6k7
5884F6L6k4j5M7moJ9qlJ1L2j8Ql7K5j4o2K7l3L8J2m4K0N0j7L9oJ0Mm7K7m4O0o3
5918H6J1l4RL8j9m0Q8nJ2l6K3J8m3j0J3m0L1l0PJJ8n3L8k5P7j8L5m5M1m8rk2J8
5951H7kj6Rj1N1l1oJJ7J4l0J5Lj2K3kJ3k2K5k0lQJ2n2LJ0Qm0M6nm3J9M2lj7N7
5987A48l1Rk3J7qk1rnLK5j6pP6k8l5M7rrl4k5J3K2k2rJ1j0N2L6Nj3%pl3M5m3J
6023A13Ll7k4oL1J8J7k8j5L0M1m2j0M6Kpk5p6O8k6rM0l8PJL6L9k7k0L4Ml6ML3
6057A41o8L6m0J7J0j8J2MkM5Nl7J3L3j5j1j2l5K7j0%j7nM3J1m3nP5q7M4l1M1N
$$ y = [53, 46, 58, 105, 113, 142, 135, 160, 133, 164, 126, 102, 122, 113, 41, 59, 64, 58, 65, 61, 79, 111, 127, 123, 118, 139, 111, 101, 81, 86, 81, 66, 86, 117, 108, 70, 75, 175, 113, 124, 141, 102, 110, 99, 90, 92, 96, 72, 114, 122, 107, 91, 145, 115, 106, 85, 114, 96, 84, 119, 104, 93, 119, 126, 133, 146, 143, 126, 107, 98, 119, 93, 66, 102, 78, 63, 110, 106, 100, 119, 111, 108, 119, 151, 133, 141, 104, 129, 115, 53, 80, 47, 85, 97, 53, 73, 123, 106, 145, 139, 149, 153, 106, 133, 89, 149, 86, 97, 63, 72, 110, 91, 51, 139, 134, 146, 110, 133, 151, 108, 98, 111, 71, 102, 72, 79, 80, 98, 45, 83, 58, 135, 117, 152, 107, 148, 100, 91, 69, 87, 85, 69, 78, 67, 118, 87, 81, 82, 99, 113, 83, 98, 101, 89, 112, 110, 123, 101, 126, 106, 103, 111, 123, 71, 74, 84, 92, 52, 98, 93, 50, 69, 111, 108, 91, 148, 117, 126, 103, 120, 112, 91, 82, 77, 80, 105, 89, 82, 158, 130, 95, 142, 133, 124, 90, 65, 78, 100, 78, 69, 80, 70, 122, 158, 163, 150, 150, 143, 110, 155, 112, 113, 116, 79, 55, 49, 80, 98, 115, 87, 72, 102, 143, 101, 91, 137, 139, 132, 107, 31, 99, 73, 64, 104, 66, 73, 74, 110, 149, 122, 102, 136, 140, 104, 108, 141, 73, 109, 69, 86, 96, 78, 90, 94, 92, 137, 142, 105, 118, 151, 136, 125, 113, 78, 105, 95, 95, 78, 73, 116, 127, 84, 79, 154, 67, 111, 80, 121, 126]
6090A26l3kqL7l8LNkj%qP1m2L7m1J0L9m6PJl1mk8K3J5k1M0J4J1J0k8J6Mj2M3j02
6126F5J7j5J2k3N5l2mN4qK6k5J4k1j6L4m7J6k9l0L0J4j0K7k9LN7M1m7j4K8k6J0
6158A27ko0l8P4j4k6M5k1N1kj7M5o6M0m3jPK4k1j3Kk1j9N3Jj8K7K9l1j8j0L8j3
6191A09pL7m7k8N7j4pOkk7M9n3N9n7N9l7J2J0J3k5qL2l6j0J8J5l6K7ompN1km0
6225A01l1M9qJ5N0q0J6k9j7J2QJ5J5J0j4n0J09j4qk9M0m9ml7J6Pm6K1qK3N4j7
6257A20qN3Rl7rj1j9J8o2N9k9k3K4K2k4J8mN8Rm4K9oj5qm4jJ3n9K6L1qK6J8jk7
6292I4L0J8m1Nj6O2r1MJ2QJ8oJJ3MmmjL6m1l2O2m0OjK1l2J9k1K2LK3l0%K0K1m6
6329I6QML1n9K9M1o4J8pMj5J5j8J7rQqJ3K1k5OL0k3m1Q1o6OJ6m1O0n5J2J3J8J2
$$ y = [126, 93, 91, 83, 120, 82, 85, 90, 88, 87, 87, 79, 150, 108, 145, 104, 114, 153, 107, 114, 115, 84, 80, 52, 75, 90, 69, 109, 123, 134, 144, 116, 132, 136, 124, 167, 65, 82, 67, 79, 56, 111, 79, 75, 129, 121, 147, 122, 136, 115, 99, 133, 86, 102, 73, 43, 73, 87, 77, 104, 75, 78, 135, 176, 129, 115, 143, 117, 127, 125, 65, 27, 101, 87, 61, 106, 85, 136, 134, 117, 162, 96, 136, 93, 92, 99, 123, 102, 89, 91, 70, 51, 104, 105, 87, 114, 143, 112, 94, 84, 122, 109, 102, 139, 92, 64, 121, 107, 100, 106, 104, 77, 126, 73, 132, 75, 134, 97, 109, 119, 132, 107, 99, 131, 95, 85, 103, 118, 82, 109, 103, 99, 92, 143, 141, 101, 70, 119, 111, 126, 176, 96, 112, 83, 66, 78, 86, 101, 116, 126, 112, 62, 171, 157, 149, 120, 160, 111, 107, 70, 86, 93, 47, 68, 60, 83, 137, 120, 112, 165, 174, 137, 128, 117, 98, 116, 54, 113, 84, 61, 85, 107, 83, 101, 97, 155, 164, 120, 149, 143, 128, 120, 76, 75, 88, 29, 55, 86, 78, 104, 122, 121, 94, 124, 142, 101, 106, 90, 152, 61, 65, 77, 85, 103, 97, 98, 111, 115, 111, 107, 106, 142, 101, 69, 131, 91, 97, 96, 117, 85, 104, 83, 105, 108, 131, 101, 101, 121, 142, 96, 104, 108, 139, 80, 109, 150, 86, 104, 97, 101, 86, 101, 83, 100, 91, 99, 91, 104, 125, 100, 106, 136, 113, 72, 153, 87, 93, 109, 68, 128, 73, 85, 98, 116, 128]
6364A28JjK9K4n8pqj7%mom3j5M5L5k0O5K6n7OKJl7K0k6K5m6MK6k3PN2j3K1k2K6
6400A40lj3j4n9J2J1k4K3N3m0mM6jj0Jj0j8K2o2kJ7K5k3j5O8k8m8M8J5Rj4K1L9
6433A62o2rMj7k3L6Jl5L4Rj0M1Kk7M1o3K4QK0k4Nj9K0Jk1L1j1J1J6k9k1j3J9m
6467I7l5K9k4K8K0pk3K1K3o4L3M0n0k9L1K3J8k7%k5K6qO9n9l1qJ2qK9k5j7N3j0
6500A02J4L6J4nm1K2l1j6K6m9OK3n1K1K3k5M2M7oJ3n6K4%m6nJ9n4N4n6K5Nk6J03
6533A52j0nRk8J9m0O6r3m3N4k9O9l0j4j4M6K0PKN1n1Ql6K4k3j0j7kl4M7o4oQ5
6566A10K2j8o5N3N0o8N0Lk8mMrl5jK7nLk0j5L5%J4LM9Kqjj9j8m3OJ2m7L9j7K9
6602I0k9N5L5m0J7L2l6Rj5j3k6k4L9l6pQk3M9MM6k1K0K1k2qL0l8m2K9m8j0QJQ
$$ y = [128, 129, 128, 157, 181, 123, 116, 108, 91, 91, 87, 81, 38, 23, 68, 103, 83, 148, 174, 117, 123, 125, 126, 89, 109, 83, 108, 62, 66, 92, 69, 76, 128, 115, 136, 114, 140, 137, 124, 110, 51, 63, 74, 50, 73, 126, 86, 82, 128, 127, 117, 118, 108, 90, 112, 50, 48, 65, 90, 67, 52, 120, 92, 44, 92, 107, 116, 102, 123, 162, 100, 91, 95, 78, 55, 91, 92, 57, 91, 100, 90, 131, 133, 106, 147, 84, 108, 116, 136, 112, 117, 98, 118, 119, 98, 129, 118, 129, 145, 116, 95, 82, 101, 97, 62, 91, 67, 95, 115, 108, 85, 106, 129, 65, 98, 138, 88, 59, 90, 113, 131, 104, 104, 79, 105, 97, 166, 107, 76, 68, 80, 72, 101, 76, 59, 112, 102, 116, 152, 166, 161, 120, 142, 111, 95, 121, 72, 78, 101, 50, 71, 94, 69, 111, 158, 152, 165, 109, 133, 133, 87, 82, 101, 47, 101, 45, 70, 75, 49, 152, 142, 137, 146, 118, 137, 97, 163, 70, 27, 81, 52, 121, 91, 77, 63, 109, 129, 136, 138, 189, 138, 146, 110, 134, 111, 101, 84, 82, 48, 95, 31, 25, 110, 132, 114, 49, 102, 152, 84, 134, 137, 109, 105, 109, 100, 65, 64, 91, 86, 89, 69, 54, 89, 89, 103, 106, 155, 157, 149, 148, 129, 111, 68, 74, 86, 39, 78, 61, 90, 61, 116, 151, 111, 128, 160, 124, 133, 118, 105, 79, 55, 94, 58, 51, 59, 36, 85, 89, 135, 114, 134, 155, 133, 125, 155, 117, 75, 104, 56, 46, 54, 55, 63]
6636F3K3L8j3N1k7OJ8k2Rj1m3nj1m3N3l4N7k8K3J5JM7J2l1k2J9l2k2k2l2K1O6
6668A24q1K4PL5mK5J6Qk9p7O2Pn3K4jk3L0KL4j2jJ6LLLm5k7J1MMk8L5k6J3L0N
6704A18J1j3J8m6%K7o6P1k1k1n%M8k8mOMM3n5j6M7k6l3L3K2l6L4K1n0J8Pj5L4
6737A27Oj8j9l0L7k2KL8m2nJ6J4NOrJ2k3L1L2l9n7K2j6M5kj2JKj2K0Krl2MkK1
6773I4K1l4K3Om6N2pj5K6n0N2j8k1KlK5m5K2J1K0M4p5L2K3o3L4L8k1k7Ql1lk2
6806E2N6k7M3m1lK3NKk5L0k0j4k7J0O9l9K2l4J2%nOj8N3j0k0nM0n6Nk1K9MO8p8
6841H6k1N8j2k7qj6QK4k5K2K0lNJ3Jrjk8J1L4r0K3J9J2j5K1j8k0R2ql5M0m1L1
6875A43l4l5nJ0j9K0m2M2L3k6M8J0K0n2K4Rm3k2NJ7m1L3k4K7%L9J1j2l1M5on2
$$ y = [63, 86, 124, 111, 162, 135, 141, 159, 137, 146, 135, 92, 87, 76, 33, 86, 52, 109, 81, 104, 119, 120, 167, 179, 148, 126, 145, 113, 91, 69, 37, 58, 124, 43, 67, 74, 109, 105, 130, 146, 154, 125, 48, 110, 117, 64, 88, 87, 64, 94, 96, 130, 118, 117, 133, 136, 139, 142, 97, 70, 81, 85, 89, 61, 96, 70, 83, 113, 118, 129, 116, 134, 88, 88, 115, 49, 120, 99, 78, 73, 73, 121, 93, 89, 95, 99, 142, 87, 71, 118, 92, 59, 92, 114, 78, 112, 133, 83, 101, 108, 93, 127, 133, 115, 96, 66, 103, 81, 83, 121, 79, 74, 90, 104, 109, 115, 106, 118, 95, 126, 158, 119, 62, 84, 68, 113, 111, 99, 100, 102, 90, 110, 112, 103, 71, 75, 73, 94, 115, 81, 104, 110, 64, 116, 109, 94, 120, 70, 122, 104, 83, 85, 82, 107, 62, 84, 95, 115, 159, 84, 116, 139, 76, 110, 148, 127, 100, 108, 77, 74, 52, 108, 81, 124, 83, 80, 103, 108, 110, 85, 115, 95, 81, 54, 64, 133, 94, 116, 82, 94, 94, 89, 95, 77, 130, 120, 100, 95, 135, 79, 84, 63, 92, 96, 164, 86, 65, 123, 111, 84, 76, 60, 68, 92, 67, 89, 109, 106, 111, 124, 125, 116, 115, 87, 98, 132, 42, 65, 84, 96, 81, 102, 84, 64, 156, 148, 113, 153, 112, 143, 109, 74, 69, 79, 60, 80, 38, 80, 113, 87, 135, 145, 165, 113, 137, 146, 103, 81, 86, 103, 62, 95, 71, 98, 98, 137, 148, 136, 105, 150, 144, 92]
6907I2J3J5p1K2OJ7q2P8J3J2K4k8K7j0J2n6N7k0j5ll0J3l8RO5p1RO3j7oM9l1p
6940A11O4n6j4Oj7mOL0l2l4mN2L5n7J8K1PK1l8K0mp6N2k2Nj4rM2k5jK0RKNRlk9
6977I6L0m5M6pj5k4OL0j0Pn6R1p3L7pqrK9l2L0m0K6k2Kk3K8L1pK7o7j5O5k8J9
7011A12jK4n5l5O5J9m7J1J4j5K7l7J7J5Rj3lK7Ll0K3l7rJ9j1OpkM%nL7j4J1mj0
7047A08k3J8K1J3l4l0L3j1lK6l9K9j2K6k9M3Mm4L4j6l0K6J6k7nj1Qj5l2N6jJ5
7079A14Qo9Q1j5Km5K4l0M3j1J0jm6P6jm5K0k1M4m1k4NL4prM5l4l4K1lL8k4mJ3
7113A14J3l8j6Qk2J7JK3k6J0M2JRk4K6m3K5l9nj7L6KQk3%J2j6K6K8Lmk8J4k1k1
7148G5J1k1L%L7l3K7j5P6l6O6o3mPm3j6RJ7l4j1M5l3L0j1OK1J0Qj1j0L5j0%l1
$$ y = [92, 105, 120, 49, 71, 77, 94, 12, 90, 103, 115, 139, 111, 138, 128, 140, 84, 141, 121, 106, 103, 73, 86, 48, 57, 122, 51, 60, 123, 106, 100, 149, 118, 111, 175, 119, 105, 111, 94, 90, 96, 126, 94, 60, 56, 108, 143, 86, 104, 125, 132, 153, 115, 135, 131, 55, 107, 85, 90, 76, 67, 109, 84, 83, 103, 112, 114, 119, 128, 125, 96, 126, 81, 127, 120, 105, 81, 87, 117, 107, 114, 58, 149, 76, 113, 106, 98, 89, 118, 86, 116, 76, 102, 80, 82, 59, 87, 118, 111, 138, 71, 56, 121, 93, 112, 111, 135, 80, 45, 110, 129, 82, 93, 107, 92, 119, 82, 99, 114, 123, 110, 107, 134, 137, 107, 130, 93, 84, 103, 92, 98, 91, 89, 93, 93, 88, 125, 111, 122, 118, 108, 85, 103, 124, 137, 103, 73, 106, 95, 92, 118, 79, 108, 96, 122, 93, 136, 140, 96, 130, 114, 84, 110, 126, 99, 94, 83, 91, 76, 44, 100, 99, 114, 122, 53, 134, 119, 121, 76, 100, 70, 113, 102, 112, 111, 65, 141, 140, 95, 115, 94, 138, 97, 73, 78, 112, 105, 96, 141, 107, 73, 94, 91, 129, 105, 101, 114, 127, 89, 73, 81, 59, 76, 77, 100, 74, 84, 126, 127, 136, 112, 138, 95, 120, 81, 76, 59, 95, 97, 105, 82, 82, 94, 78, 104, 132, 135, 131, 103, 117, 96, 75, 86, 65, 68, 68, 105, 72, 99, 84, 160, 124, 190, 127, 123, 130, 87, 71, 80, 97, 63, 52, 97, 64, 94, 83, 89, 110, 120, 128, 117, 107, 142, 132, 132, 101]
7182A01j5K5o2N4%K0j8kM2k9LK8k9ok9K1k5K7oj7M0l1%M7n0K5j0oqQK1k2KL5m4
7217I0j5N0Pn1K9Pj5ok4nLNK8J2o2P7l9L1MJ4l7nMk7K1j9ROK2j8K2j4J9k9k1N2
7253A25Rj6j4K4k8%J2k2Lk5J4J2LOl9j0L9MKj8K7j8j9J6Mj9O0m2K6l9j3L7l6N8
7287A23m4J8Rj6K8%K8m7J4l1K6m1PJ5%m1N1o0O0NKKL2J3j8K7j6o3L2k2j1J5j7
7320H0k3K8kM4J1j2k5N1m9Rn9O1o2ppK4J4l0K0K9K8K0oJ6kK5o6K3m7j8M2m4j4
7353E2lM4k5K0L4K6J8k2K1j9n1L2m9j8qll0L9J5K2m5L8L4M6l2j0J1m0K6j1j4j2
7385H6Jn2O1l7N0K3Ll5L8K1j9jk0qpl1lKOoJK6J5Qj0nJ3l2J5M8p3J5J1qol0J2
7422G2KK1M0m1L3k6K0K5K1r7J3M3ql7K9k2kJ0qj2PJ3L9k8nJ8l7P9o3j6K8k7J5
$$ y = [101, 86, 111, 49, 103, 103, 123, 105, 103, 145, 116, 119, 147, 118, 112, 83, 104, 79, 106, 100, 83, 123, 92, 92, 139, 89, 114, 104, 98, 90, 98, 119, 97, 99, 134, 90, 75, 125, 132, 81, 110, 117, 102, 96, 72, 67, 70, 75, 103, 115, 53, 130, 91, 122, 126, 140, 103, 98, 102, 75, 96, 77, 86, 92, 114, 96, 118, 104, 123, 94, 73, 125, 134, 118, 104, 128, 100, 100, 112, 90, 93, 68, 82, 94, 97, 103, 64, 54, 93, 97, 99, 81, 108, 90, 71, 87, 91, 72, 132, 90, 116, 77, 64, 101, 65, 123, 79, 97, 106, 90, 118, 118, 146, 99, 113, 82, 108, 67, 74, 89, 89, 48, 99, 39, 99, 104, 106, 108, 140, 153, 135, 162, 146, 83, 115, 93, 82, 97, 80, 57, 85, 83, 127, 138, 126, 101, 152, 103, 112, 53, 114, 52, 45, 38, 62, 76, 46, 66, 95, 123, 143, 137, 153, 151, 176, 110, 133, 86, 68, 110, 66, 52, 49, 93, 68, 88, 122, 148, 166, 144, 165, 146, 95, 127, 78, 60, 52, 49, 19, 58, 73, 95, 50, 88, 122, 168, 136, 126, 137, 97, 123, 112, 98, 86, 87, 35, 96, 59, 109, 132, 135, 100, 138, 159, 140, 139, 119, 111, 104, 73, 70, 72, 78, 72, 73, 99, 114, 122, 112, 107, 120, 88, 103, 151, 78, 93, 104, 96, 90, 60, 72, 74, 95, 135, 94, 127, 101, 121, 146, 167, 70, 83, 126, 118, 81, 110, 88, 86, 96, 88, 76, 83, 96, 135, 107, 102, 120, 83, 162, 99, 83, 111, 84, 99]
7455I9mpJ6Ork3KJ5J0m3J7j6P2j7J6k0k8M7k2Jj8pJ0Nookk7M8m0M6k0M1j1Pl4
7491I8KK6k9j4K5Nl4K7l8N4mL2l9QK3m2oL4n2K7k5l6O9k6J9Nj6N7R%o3K0l7l4
7525D5K6L2j4oJ3l3M0oj3L5k5nO4n2J2j7j9P7p9K3K5rm1QK6j5J7L3l3n1L4j0M
7558H6J2K8j5K1J1o3M3j1J2l6j4kM8k1k0M1m5k4N9jl9J9QK3k8J3J0JMm2lK9J3
7591A17p7N4k6K0M8pl4L3nk4jqM1o5M4k7L0ppJ8lL0r5L0N8k6ll4L9j1Lom5M1N0
7626A45l2J0l1K8Kj7k3oM6n2L0K2j2mj1Ok6M9k9J5K4K1k8j6kL2n5M1k3K4llNJ
7660A28j1k6K8o1M5k6j6L2nj4J9J1k0L1K1o2N1%pl0%J6j7jJ1l3K4K3Qj8M1Oq1
7693F7P7k2k8L6o5J7K5qO0q3M0Kl9PM8Mm1K9j0k9J2J1j2K3kl2NJ4k2PK3pRn1L1
$$ y = [99, 95, 88, 104, 110, 101, 78, 80, 95, 105, 62, 79, 63, 135, 118, 134, 114, 86, 133, 111, 112, 94, 87, 97, 102, 96, 90, 88, 61, 109, 69, 115, 95, 136, 125, 132, 98, 100, 126, 97, 83, 108, 113, 79, 106, 68, 122, 118, 150, 111, 119, 142, 100, 94, 128, 76, 103, 78, 42, 111, 85, 104, 109, 93, 150, 159, 159, 96, 116, 79, 45, 71, 103, 89, 83, 96, 63, 103, 97, 84, 119, 94, 89, 153, 101, 113, 96, 77, 154, 75, 98, 123, 114, 73, 81, 107, 92, 109, 142, 109, 58, 92, 82, 86, 98, 126, 111, 132, 143, 80, 123, 112, 124, 88, 74, 72, 120, 99, 79, 120, 75, 51, 110, 109, 70, 89, 97, 120, 92, 105, 115, 116, 120, 78, 75, 104, 117, 40, 94, 68, 88, 136, 129, 95, 128, 123, 99, 98, 90, 131, 66, 110, 83, 113, 106, 99, 117, 114, 144, 49, 79, 137, 111, 108, 74, 113, 102, 105, 99, 54, 95, 145, 113, 123, 92, 120, 122, 105, 82, 76, 122, 70, 100, 122, 110, 106, 95, 101, 75, 124, 95, 110, 134, 155, 127, 111, 109, 141, 86, 127, 104, 128, 125, 122, 127, 128, 117, 91, 119, 58, 103, 77, 61, 93, 88, 74, 93, 104, 84, 115, 136, 74, 125, 125, 118, 88, 88, 104, 87, 86, 97, 64, 88, 111, 119, 101, 142, 148, 67, 144, 122, 94, 130, 65, 82, 107, 99, 159, 76, 116, 118, 79, 86, 134, 138, 97, 126, 116, 87, 99, 110, 98, 121, 119, 87, 92, 106, 84, 91, 114, 107, 116, 65, 96]
7728I6l8M8OOj7RK7k8j8L7lm2K2M6l0n3J0ljK9J7j6j7Mq%M8m2n1P2j6jqK1qK7
7764A25J8j8l7J4L4l5K4l8K3l1M4l2j8K4Oj2k9M8OL9o5N8m5ljk5K2JpJ5j5M2M
7797A36k4J9l0J9J4o1K5l1LK2j2K9qlk6O8k4jMk4oL5j7l0j6K1j4J7j5K8j7N6k6
7830A11Kr%%k5L5Nk2m0K1N1m4k5M0kk2O8j2l6N8l0Lm2O2o8K6n8M8k5L3Pj0%j8
7864H2L1MPJ1l1j7j0m5Q5j2n3J2L9Om5J1O7pJ6n9J1K3k3J6k6M0l9j6MK7k9K0O
7897A06L8k3Olk5J1K3k4m7K7j6m7L8N7m1K7J9j3K2l1j5K5k7J7k0n%jjMJ8Kk7N6
7931A30Ok8K3j6k1K3l3L3ln6L8jJ0rMJK3j1Mj9J9ploM1k2l0Nl0N8k1l7J6Om5M5
7967H7O3m3J3l7L9jj1Nj1j2L1l0K7pm9J1J7K1oK4Kk0mm8ML7j5L6mm3%K3j6L2J3
$$ y = [96, 58, 106, 112, 118, 101, 110, 137, 109, 91, 128, 125, 83, 105, 151, 121, 68, 78, 75, 74, 103, 120, 104, 87, 91, 83, 83, 131, 89, 38, 110, 94, 93, 85, 106, 98, 125, 143, 125, 88, 102, 136, 101, 125, 87, 110, 79, 123, 91, 73, 97, 103, 91, 62, 110, 116, 155, 90, 148, 103, 100, 99, 74, 96, 97, 90, 105, 90, 132, 136, 112, 131, 101, 120, 134, 73, 98, 67, 70, 92, 80, 109, 101, 98, 72, 140, 116, 115, 119, 95, 89, 124, 107, 77, 61, 82, 68, 85, 70, 98, 81, 137, 111, 113, 104, 104, 104, 79, 114, 119, 97, 57, 78, 129, 85, 60, 100, 98, 76, 144, 132, 96, 154, 124, 127, 85, 147, 79, 105, 47, 95, 70, 103, 110, 100, 100, 82, 113, 117, 124, 135, 104, 87, 77, 32, 117, 105, 52, 64, 103, 109, 64, 75, 142, 135, 151, 92, 103, 126, 103, 119, 93, 133, 94, 78, 82, 109, 80, 100, 106, 144, 121, 127, 124, 99, 110, 133, 109, 62, 89, 73, 26, 64, 121, 80, 107, 126, 113, 135, 104, 89, 114, 87, 104, 84, 79, 79, 78, 77, 81, 99, 101, 74, 130, 136, 108, 131, 115, 94, 117, 84, 117, 114, 58, 96, 95, 105, 96, 100, 101, 124, 113, 117, 98, 117, 110, 107, 101, 142, 120, 90, 95, 65, 123, 102, 65, 81, 87, 42, 87, 150, 107, 120, 83, 122, 121, 110, 115, 104, 92, 123, 93, 120, 113, 64, 75, 92, 113, 107, 131, 133, 113, 109, 61, 65, 102, 87, 123, 119, 76, 76, 99, 83, 115, 128]
8002A28l6J9mlKNlJ2l0Onj0l6J0mL6N6k2LOLmj5j1o8O7k7J8l9O9k8Rj0K5j0j7
8038I2K1m9M7k4J3JJ0k4l4L0L2j6J8L5n3L2k6J4n0J4K0m7K7kL9l4j2L5mo%K2k8
8071I3J6oj6mk0NJ6J7K3m6K8J5k4j2L0J5m0M2qk2j7K2Nk4K3mj7M2k5J1m8qM5m9
8105E8K2K0j3J3K4l5J1J5J8Jj1Lm3K4j9pl4K7J6l4M8k6qO6j5l%L1j7%rm4mj7N2
8140A10j0j4ONJ1jN1n3l8L2J6J0m8QL9m1l9K5K2nJ1J6J1njK2n7J8l1M1j3K4k0
8173A02k5N8k0K0m3Mj2J0K7l9K7J3j6lk1M2k9J2
$$ y = [128, 92, 111, 107, 104, 106, 111, 108, 120, 90, 96, 91, 81, 45, 55, 51, 87, 143, 121, 124, 130, 133, 129, 114, 103, 35, 102, 75, 93, 54, 123, 95, 104, 94, 119, 109, 92, 113, 64, 111, 87, 100, 101, 111, 87, 53, 83, 115, 99, 117, 152, 99, 131, 105, 119, 69, 83, 103, 56, 83, 81, 120, 86, 74, 109, 105, 99, 99, 121, 93, 109, 103, 87, 83, 63, 68, 84, 101, 124, 78, 106, 121, 97, 85, 115, 130, 90, 132, 124, 102, 85, 107, 112, 88, 111, 107, 90, 132, 107, 118, 70, 62, 107, 58, 80, 100, 87, 100, 124, 89, 100, 115, 133, 134, 123, 126, 83, 107, 88, 81, 47, 74, 90, 56, 104, 78, 70, 136, 121, 118, 118, 149, 132, 132, 123, 79, 75, 58, 110, 100, 86, 92, 97, 108, 107, 158, 105, 67, 99, 115, 125, 77, 85, 124, 83, 44, 69, 91, 86, 97, 113, 124, 119, 118, 140, 83, 101, 70, 111, 98, 122, 102, 77, 135, 115, 135, 92, 96, 84, 94, 121, 82, 109, 122, 106, 103, 82, 124, 95, 107]
8191A07
$$ Imaginary data points
##PAGE= N=2
##DATA TABLE= (X++(I..I)), XYDATA
0@%%%%%%%%%%%%%%%jKkKkLmMnOpQrJ0j1J3j5J7k0K3k5K8l2L6m0M4m9N5o1O7p4
46c9Q2r0R9j10J21j33J47j62J79j98K20k45K73l06L46l95M56n34O40p92J028j451
68h64K452r541r697N718K605O700N919O367L555K496j073k334m140n140o531m490
84g998k986j627j94K706L770M240M310L948K120J484L0j898l025k455k769k993
100c337j856n27k02P05J579J275J229J887J313K62L50O91j16m07k08m88p53n05
118H92q62j564r55k13q81p17P02J285J097J477J783J406J195O83o63j360r60j658
136F87k531j706m96m45nJ087J577J571J859J389L10L52K22j158j671p93p33j138
154a622l94K07J50N86Q80J61k9M96P8p31k16L72P0K26P70N91K21N70N8j058j022
$$ y = [0, 0, 0, 0, 0, 0, 0, 0, 0, 0, 0, 0, 0, 0, 0, 0, -1, 1, -1, 1, -1, 2, -2, 2, -3, 3, -4, 4, -5, 5, -6, 7, -8, 9, -11, 12, -13, 15, -17, 19, -21, 23, -26, 29, -32, 35, -39, 43, -47, 52, -58, 63, -70, 77, -85, 94, -104, 116, -129, 144, -162, 184, -211, 245, -289, 351, -441, 587, -864, 1588, -7953, -17650, -11932, -9327, -2627, 3292, 9659, 13214, 15710, 14637, 12303, 8163, 3023, -3508, -7998, -10984, -12611, -12805, -10099, -6329, -2089, 2221, 6169, 8289, 9773, 9803, 7905, 4880, 2425, -344, -3337, -5193, -5720, -5922, -5217, -3638, -2363, -1134, 753, 2066, 2328, 2678, 3369, 3253, 2846, 2638, 2150, 1397, 892, 30, -1534, -2489, -2702, -3583, -4300, -3598, -2313, -1216, 261, 2044, 3450, 4645, 5328, 4665, 3305, 2345, 687, -1844, -3550, -4046, -4491, -4496, -3409, -1832, -261, 1598, 2987, 3297, 3649, 3871, 2713, 1042, 249, -484, -1622, -2016, -1809, -1659, -1073, -193, -32, -61, 435, 513, -218, -434, -62, 8, 234, 1004, 1595, 1816, 2386, 2444, 1386, 364]
175C64o87j381j517m91J12L05J319J721J545J743J759L78o84o54j263k515k286
192b232j525j250m31P45J222J726K692K309J092Q59N40r84k114j990j954k025
208c320j249l88K35J279K215J778J441J839J041m57j027j050j818j851j193r57
224c482m56Q25J284R62J477J700Q03k8j9p10j384j134j001j173m27N20M40M62
242a341J259J317N51L92K67m83o60n54r87j156j63J53k89K24J015O58L20O29K71
261A423q8m6j56q50m93J63l29o29K07M41k1rM83L0J09L40p2l35L42K97n23j71
283A13M06j76m45L8j20l37N3K00k34Q0O52J83j60L64L65k45j49K7m66m14M5j97
305d17m60K57M76m1J40N64J49n0J75r4n09j5pn94l22L84J36j85L30M90Q2J69J78
$$ y = [364, -323, -1704, -3221, -3712, -3600, -3295, -1976, -255, 1290, 3033, 4792, 5170, 4486, 3832, 2569, 54, -2232, -3757, -5007, -5438, -4693, -3471, -1745, 947, 3256, 4348, 5207, 5747, 4763, 2649, 659, -1295, -3320, -4569, -4957, -4722, -3443, -1228, 550, 1991, 3830, 4871, 4414, 3387, 2337, 519, -1332, -2525, -3482, -3938, -3113, -1829, -867, 610, 2310, 3113, 3085, 3066, 2356, 972, -162, -1163, -2336, -2763, -2243, -1803, -1341, -82, 1235, 1786, 2178, 2445, 1962, 1302, 748, -239, -1395, -1558, -1405, -1694, -1470, -455, 203, 523, 1152, 1423, 1335, 1289, 1133, 283, -210, -47, -376, -1005, -798, -357, -378, -387, 96, 126, 235, 575, 503, 168, 510, 807, 284, 113, 519, 343, -102, -64, -184, -521, -468, -268, -502, -422, 230, 413, 253, 617, 982, 737, 588, 615, 149, -265, -220, -417, -877, -620, -144, -185, -45, 519, 668, 618, 793, 699, 190, 175, 168, -426, -748, -364, -228, -413, -83, 407, 489, 658, 836]
328H36k47k66J42l21p05N4K51l37j00N21K37J48M02K54j52K36J21o29m66P7l50
349b94o77l3K08r9K55O03K59L21P33K37k67L5o7p00o95l11n56n01Q6J61M1P02
371e59R35M12L97P27K40m92k68n31r01o64m05o61l33N73M51K31Q41J072M08K35
391A708L37k85m69l48o87r69l38k6l56j53O49N14J79N55N78P0J54J74l39l34J03
412G17k63o39j70J22l86k00J89o6q6L96K66O3M94O05J27O7K95j30n80l95m59q38
434h71m87j09k66m5P55P52N15Q31Q58K51l3l5p82r43o08p45r60k70M00K11M44
455a137J089Q97N30N92J53m22l77m39j042q31j26o8k19M11P54M45M24N07p9k97
475G65j05m84p59k50J83l1K22Q18O11K85L80J9n70o67o02j057r01j35M5K49R82
$$ y = [836, 589, 323, 465, 144, -561, -507, -256, -593, -693, -172, 65, 213, 615, 869, 717, 953, 1074, 445, -21, 56, -294, -971, -1004, -796, -895, -640, -37, 222, 543, 1276, 1513, 1246, 1281, 1214, 514, -181, -492, -1048, -1549, -1463, -1302, -1261, -559, 376, 788, 1185, 1912, 2152, 1660, 1392, 861, -40, -704, -1109, -1770, -2103, -1530, -1079, -848, -7, 1065, 1473, 1708, 2045, 1760, 1291, 943, 256, -713, -1051, -1077, -1433, -1586, -937, -423, -244, 311, 889, 959, 1113, 1287, 948, 614, 717, 454, -185, -355, -233, -619, -819, -630, -696, -782, -386, -120, -57, 437, 1042, 1169, 1236, 1531, 1401, 821, 426, -33, -871, -1358, -1467, -1733, -1778, -1023, -271, 244, 1075, 1933, 2184, 2151, 2116, 1334, 391, -217, -962, -1922, -2192, -1792, -1581, -1137, -48, 849, 1379, 1971, 2124, 1702, 1325, 886, -156, -987, -1113, -1181, -1400, -989, -235, 210, 634, 1141, 1062, 765, 660, 176, -583, -833, -650, -681, -459, 359, 970, 1255, 1635, 1654, 1084, 417, -185, -1242, -2143, -2278, -2233, -1984, -1002]
496a002J363J079J045R97J27n87o62j212j922j482r68q83j18R06J203J549K004
513A437J723R17O73J70j121j750j618j785j881j076l28J53J013J714J695J624
529A560J795J066J8k93o72j457j761j332j336r81k33K65M26J082J449J026R12
546A534J060N11j44j99l71j033q95o72r58q94k27j30j78M50Q56O63Q56J186Q35
565B250M50M75R6p15q55q85j368j415q30n37l44N30J018J076J513J723R93N14
583C689M12l38j224j412j344j542j223n63j47L45J252J489J167J308J292L17l31
600C147m53q79j405j158q79p78k02N20N32P22J180R19K83K40P8n40p91m97n12
619d73o03J32L18J62N05P66K29l6L4l78p55n60l36m90p8N67N77N82R59Q16J98
$$ y = [-1002, 361, 1440, 2485, 3482, 3609, 3022, 2360, 1148, -774, -2256, -3224, -4107, -4225, -3319, -2116, -567, 1437, 3160, 4077, 4750, 4920, 3799, 2049, 431, -1354, -3235, -4311, -4639, -4486, -3473, -1759, -64, 1560, 3355, 4421, 4439, 4146, 3474, 2017, 256, -1076, -2412, -3393, -3626, -3361, -2935, -1853, -404, 622, 1534, 2594, 3105, 2961, 2762, 2391, 1358, 463, -209, -1167, -2061, -2288, -2418, -2596, -2146, -1290, -627, 229, 1415, 2250, 2700, 3175, 3271, 2556, 1701, 816, -552, -1967, -2797, -3334, -3678, -3148, -2130, -1054, 459, 2182, 3175, 3689, 4101, 3763, 2539, 1127, -217, -1759, -2982, -3545, -3692, -3347, -2095, -606, 561, 1869, 3161, 3478, 3147, 2694, 1815, 410, -748, -1627, -2405, -2607, -2087, -1555, -833, 347, 1266, 1549, 1789, 1867, 1327, 536, 39, -473, -1076, -944, -626, -464, 41, 807, 1036, 1000, 1034, 656, -99, -659, -995, -1485, -1563, -996, -419, 163, 1122, 1938, 2136]
640B136N4k18q09r69q19r20q45j01L96L63Q80J364R85O28O52N7n40p12r17j236
660e71r82m50m02r4P14R52P53R51R40L79om3n35j000o11n80p98k95K88K52K64
681h74P16N60K56L92K31k60l00j46l58m45r4K5j70O9L10J5J1L17P2k45J04J97
703C83k09q5K13j8j29J23k1l13J9O2k98j42K98R2l7K99K73O5O4N3k98l32n2l46
727c36m40R4K82m0K82N96L35J34K47rl95l02m16o34n14lp6J7O34O55M50N62N91
750A714O9l03j91n75r29o03m42n00q9M74M51N61R81P50L44K78J12n20p62n26p99
771e05q20l71l3k8M73Q36N91N73Q44L53j58j47k61p33p82l82n61l59J47K54J68
792i01N61P39K67K56M16Lm21j67k40n57k98j12k84r8K81J82L5L02M63J0M9K59
$$ y = [2136, 2190, 1972, 1163, 194, -625, -1545, -2390, -2491, -2095, -1732, -852, 512, 1497, 2125, 2777, 2834, 2294, 1582, 665, -571, -1553, -2003, -2405, -2499, -1785, -833, -80, 871, 1811, 2190, 2184, 2141, 1606, 606, -5, -585, -1383, -1678, -1390, -1138, -874, -158, 402, 658, 1050, 1281, 1021, 721, 575, 217, -228, -322, -297, -467, -398, -88, -73, -62, 255, 327, 82, 186, 383, 174, 89, 302, 284, 155, 278, 257, -56, -37, 25, -273, -415, -117, -25, -62, 237, 510, 575, 639, 692, 394, 62, 10, -336, -776, -682, -400, -440, -158, 438, 773, 907, 1154, 1145, 750, 448, 32, -602, -1116, -1119, -1195, -1178, -544, 111, 561, 1123, 1714, 1783, 1480, 1289, 714, -215, -818, -1260, -1760, -1849, -1375, -924, -363, 618, 1368, 1712, 1990, 2102, 1582, 820, 294, -505, -1325, -1696, -1729, -1757, -1284, -448, 143, 716, 1560, 1913, 1755, 1608, 1347, 614, -168, -550, -1111, -1470, -1323, -1069, -901, -340, 399, 666, 922, 1338, 1341, 920, 753, 513, -44, -342, -454, -738, -836, -555, -373, -338, -36, 427, 437, 486, 745]
814G45n4k22O3q6l79q2K4k65j67J64K6j63K93J96p9J80L39o4n5J80K9l64l0n3
838A76l21j43L7j42m1K74J57r3K14L82m8l7J15j0k26m0j17k46r2R2j62j04K61
861a14J26j30K18K46j3mJ46r9j58R9r4k80n5J54j59j01J96Jq9K00J55j20M3K28
885C96j36j85J89m1j92O3P9k12l5K32p3j73J66O3j95K3J23o8o5K14O3o8J71J40
909D79k12k7J38k70k74M3m8k47Q5J69K3J47L42J34n9K36L6k55j26o5l21l54L7
932c89k0j37J73L00lL20L46ro6J80q4l69j66p1l08j27J83k8nK69K53n7N9K02p4
957C72j82J08j12k68J28L4j59k7L26n3j47J62L3k17J0P0j79o4K60m0J3J80K01
980D49j22m6J55k03k24M6j20k14R1J06j36J16L32J1l8J60M2j72l6J5k05j09J80
$$ y = [745, 691, 469, 532, 446, 67, -15, 9, -256, -423, -259, -233, -396, -103, 93, 14, 194, 533, 469, 414, 594, 623, 259, 229, 176, -145, -288, -251, -393, -434, -160, -3, -96, 118, 500, 452, 415, 530, 520, 294, 254, 137, -109, -201, -109, -271, -375, -114, 12, -118, 100, 346, 333, 329, 475, 376, 218, 317, 223, -57, -112, 42, -117, -218, -22, -21, -110, 90, 245, 125, 168, 396, 260, 75, 264, 223, 31, 94, 173, -39, -74, 158, 85, -88, 78, 141, -54, -31, 92, 24, -41, 173, 236, 168, 339, 479, 267, 240, 378, 108, -166, -123, -171, -418, -333, -164, -141, 6, 348, 482, 423, 659, 695, 440, 314, 249, -72, -426, -389, -409, -546, -373, -73, -76, 244, 590, 581, 515, 695, 611, 242, 76, 5, -303, -430, -247, -275, -280, -11, 242, 185, 244, 446, 372, 190, 298, 186, -82, 46, 80, -79, -106, 220, 167, 20, 182, 215, -2, 8, 78, -101, -165, 95, 55, 68, 248, 449, 327, 281, 436, 233, 9, 55, -65, -279, -188, -82, -218, -102, 230, 241, 203, 363, 405, 233, 197, 212, 7, -102, 78]
1003G8o8j07K12Q7j78N1J21j74j61J75o1j17J50J79l1J53K61qj68R0j30m30j63
1026b39m5k98r1K55J79J9M57M08P7J89J85k79l41q8m43n06j00m9j84J48M77K80
1048A1K52M53K73n1n3k2l92l74j36l38l36P8J49n2K71M22J29J54K35j2j79n7l8
1071C87l51j45J08j33j19K35R7j05O4J79j62o1J38o4j07Q9J14l2J10K22p4q8J31
1094D33j26l29p8K0k83j23K39M1K6L12K12nK00J79k27j12M3k07l96J5j9k30O2
1117c53J99M4Q0K66R3p6J28J00j88j28J33j03j88Q8l8j31L7J19k12o0J70n4j29
1140b03J53K23p2J35K61j4o1J40j29k58j07j03k93j69R3q4Q4K65K56N2K67L51
1162G87m5p7N0k04l87j21j72l14m7R1m0N4L74J87M0K63K73j02p3P1k03k33j33
$$ y = [78, 10, -97, 115, 202, 24, 75, 196, 22, -139, 36, -25, -142, 8, 187, 156, 309, 570, 562, 394, 484, 354, -76, -239, -284, -582, -673, -418, -239, -220, 237, 645, 722, 911, 1096, 817, 476, 388, -55, -561, -661, -710, -894, -746, -269, 11, 263, 716, 989, 938, 885, 863, 471, 97, -39, -377, -713, -635, -486, -538, -267, 155, 284, 438, 673, 661, 482, 425, 387, 36, -109, -1, -134, -253, -18, 79, -26, 38, 217, 55, -6, 132, 68, -39, 50, 164, 132, 242, 464, 390, 302, 433, 307, -22, -100, -80, -363, -486, -247, -206, -180, 132, 344, 339, 539, 718, 491, 379, 422, 215, -181, -166, -185, -415, -353, -154, -110, -30, 236, 329, 253, 381, 481, 293, 165, 298, 195, 7, 95, 57, -74, -37, 82, -130, -190, -20, -74, -203, -50, 173, 101, 236, 497, 483, 422, 562, 433, 175, 68, -35, -328, -497, -404, -488, -404, -139, 117, 169, 436, 787, 742, 665, 715, 511, 124, 3, -169, -483, -530, -439, -479, -425, -51, 136, 176, 439, 712, 610, 537, 608, 405, 172, 39]
1185C9j33k05m5J74j30k4K73O3q0K72K17p9M1J81j45j44J19j23l14NQk96o9J47
1209b48k5%K37J82N3J93K23m5q7N1j35l21l3p3l09o2J49o7j0K70K25OK03J98j06
1234D69m0N7j41k25k2p3k37j9J46j18k4J97J07l1J38J48p8nJ31j12j31J09J1k07
1258E0J3M7k00p7J32p4j10J62J10n2R1L13j11oK08m2k13Nk7k73j52Q6j52j09J94
1283a87J10j4K65J83j5J05J53j00j79Qj15l55j35J12j34j36K87O3K8K36K58j07
1305C31J34J74k35j68l1j12k73m1N6j02K7K23M9M8K47Q1j08J5Q2j77j91L4q5j40
1329a62M7J25p7R2K09l6K2J16n7j55l5m2j31j03J40m0j8J91J67p5J27J63j27j33
1353B08M4p9k88J6k2j66K6K55J3QK64J32l2O2O6j53j42K0k20k53L7kj35J00K17
$$ y = [39, -94, -299, -344, -170, -300, -324, -51, 12, -68, 204, 421, 342, 383, 564, 419, 275, 394, 271, -43, -38, -30, -326, -395, -248, -273, -273, -36, 146, 199, 392, 615, 570, 483, 534, 399, 78, 45, -28, -337, -399, -250, -317, -327, -57, 168, 174, 377, 575, 469, 429, 486, 345, 120, 98, 25, -212, -231, -85, -203, -227, -30, 77, 46, 184, 332, 254, 249, 380, 268, 137, 246, 257, 50, 63, 110, -90, -167, -35, -109, -219, -57, 53, 1, 92, 405, 294, 288, 496, 454, 241, 246, 219, -54, -206, -120, -272, -381, -187, -77, -91, 174, 357, 342, 447, 600, 500, 321, 329, 214, -141, -276, -164, -298, -434, -147, -84, -56, 180, 438, 331, 465, 639, 404, 236, 205, 93, -180, -221, -165, -267, -240, -17, 32, 80, 327, 408, 300, 315, 397, 220, 29, 63, -22, -162, -115, 10, -67, 25, 234, 198, 220, 336, 279, 124, 89, 47, -84, -187, -47, -87, -105, 86, 253, 178, 305, 468, 341, 208, 252, 173, -115, -99, -121, -287, -261, -6, 7, 15, 279, 411, 379, 441, 507, 354, 212, 232, 12, -241, -204, -206, -341, -241, -24]
1378b4J6J10K34P0pJ21Rk31j24P7k96k15O5l0j30Q9K57%O9K83Q5m2J48l4j85j00
1404B15l3j98k13O2n2j07J45J76OJ02K45K5n9J45o2j38m2m6k01r9P9o4j04J25
1428i3J78j25J27J65K3q4J59j03j38N4Qj65q5J35k9j29J64M8j29R5J12q2j01J79
1452A84n8j56J55R1j58J2J45j02m3J03Qj94Q5J11k11j7J25q4KQ4P7r4R2J64j41
1477A80j1J52j19j51N7J3k29K3P8j11n8J96J07r5J51J93p1%J16j07j45po8k46
1501a52j1Q7j11n3K53M6%J94J42o9RQ9j38j50J1q8k23K5Q6j23%J89%k3K05J08
1527C03j03J12M2r0q8N1o9j80J2J3j49j0J56r3j2J76O2j5J24J41j30K4J18j33
1551B62j68N7j13k10k4P6q8L9K25Q5j1J45J47r0j1P4j36j63j8q6j75L0J32j39
$$ y = [-24, -8, 102, 336, 406, 399, 520, 529, 298, 174, 251, -45, -260, -195, -225, -355, -266, -9, -9, 60, 343, 428, 386, 534, 500, 315, 215, 182, -16, -229, -167, -219, -326, -181, -5, 1, 103, 348, 373, 314, 459, 397, 259, 217, 171, -30, -129, -50, -114, -218, -93, 85, -40, 87, 252, 275, 191, 350, 247, 109, 163, 171, 6, -79, 56, 27, -102, 62, 110, -19, 76, 188, 106, 5, 184, 126, -30, 125, 216, 58, 70, 215, 113, 70, 173, 181, -13, 72, 183, -28, -45, 80, -4, -2, 82, 159, 65, 157, 321, 180, 169, 321, 202, 51, 108, 121, -108, -85, -7, -118, -176, 20, 127, 32, 183, 376, 305, 305, 421, 314, 169, 162, 94, -152, -163, -76, -187, -240, 13, 59, 59, 253, 395, 326, 335, 424, 286, 136, 147, 59, -164, -139, -53, -176, -176, 13, 13, -10, 195, 303, 200, 312, 354, 264, 176, 227, 158, -22, -10, 3, -146, -156, 0, -93, -105, 71, 133, 118, 242, 383, 253, 277, 395, 262, 94, 151, 38, -172, -196, -120, -208, -169, 56, 141, 130, 275, 422, 332, 321, 395, 259, 96, 78, -8, -183, -153, -21, -160]
1575a60R2K04nl2J55Oj74O5K2n3j27J40J6r6J44K9j29j9J8j12j14N4l1q7J48J64
1601A18P1J08K04O3j53M4o0l21j57q0k86m8J28L3J08L33L13Q8J56K07j42k77o1
1624C89k79l71j69m1j53R2K85J92J74L90K22j4M1k9l13l45j12k66k38j2J29L1
1646c97K18L92J87J22K40pj89r5j56l46k80n6j20n6J87K46J12K97K68N1K7N9j30
1669E74l39p3k09k51j87K6QML51J77J10L18K22K3q2O5k40k85j75k75l35r2R0n4
1693f29R7L58K95J95M33K89j8mn2l28m79k98l89l87j75O6P0L17N23L78M94M49
1715A205K95r3r2k70n68n76m21m88l72K6J74K48M94O41N21M15M44Q1k40k77m20
1736G27o74n41l21m22j48K33K98K85N22O25K89K44K42j44k71k90l39m31l35j18
$$ y = [-160, -68, 136, 131, 99, 254, 260, 86, 151, 173, 120, -7, 133, 149, 53, 197, 226, 97, 78, 96, -16, -130, -76, -107, -194, -46, 118, 189, 297, 501, 564, 411, 455, 395, 74, -83, -163, -449, -497, -369, -336, -228, 105, 418, 506, 662, 869, 727, 450, 389, 110, -261, -430, -471, -624, -532, -247, -55, 119, 509, 731, 717, 758, 729, 416, 71, -41, -307, -545, -557, -428, -397, -179, 213, 400, 522, 762, 755, 566, 471, 315, -31, -311, -367, -487, -543, -356, -110, 2, 299, 567, 618, 645, 704, 574, 235, 162, -47, -298, -485, -459, -451, -447, -96, 81, 191, 509, 731, 754, 672, 737, 497, 212, 37, -238, -573, -665, -575, -629, -532, -174, 121, 316, 749, 1038, 1020, 1016, 964, 636, 157, -141, -530, -917, -1092, -1026, -956, -639, -116, 262, 756, 1205, 1500, 1407, 1315, 1045, 477, -99, -520, -1008, -1380, -1354, -1180, -932, -438, 203, 724, 1139, 1583, 1664, 1424, 1147, 727, 53, -488, -809, -1231, -1379, -1146, -848, -563, -41, 584, 873, 1117, 1359, 1215, 944, 654, 315, -116, -451, -569]
1756e69j57p2K52J93O6L78K48N3J12J83j06q6J3j11j86n7J4k62r6Oj16j39Q6O5
1780b88l0J81L23J03J85K09J66n2Rj36l24l49k14l20k72J9M2O8K97M13L07L22
1802F59L16J73j11k9k07l94m23k27l64k82QJ7J28L26L71L15L09L70J43o6N9k06
1824H85l92l23l11l35l58n0j5K3L07L62K64L80M40J96P8K2j87l52l43l57m37l70
1846h73o1j02L8L78M21L15M56M38J46N9j6k81m04l61l99l97k38l3N5J09M25L83
1868E8L21L47L29m1r4o0l45m05k83k13k68k8J63P8K03M05K40M9K17L1j82j01j62
1891B59k15k31n2J1j03J41J97Q1J00K03K3j49Pnk37p3L6j25l7J88L6PJ95J01m0
1916C18j5K7j12j81l7p8j37M7Q6m3J30J95P8j1J32L5q4o9l6k18j56K1o5j01M8
$$ y = [-569, -726, -798, -546, -353, -287, 91, 339, 392, 504, 687, 581, 495, 508, 397, 211, 154, 168, -94, -190, -184, -300, -439, -353, -288, -318, -137, 186, 289, 474, 683, 849, 797, 806, 670, 346, -3, -217, -537, -809, -790, -748, -680, -383, 30, 337, 659, 975, 1148, 1037, 1008, 801, 407, -16, -243, -607, -889, -881, -864, -736, -410, -39, 276, 585, 955, 1098, 1032, 1091, 885, 493, 170, -141, -476, -834, -884, -899, -876, -569, -207, 57, 437, 877, 1073, 1151, 1173, 986, 634, 291, -66, -503, -873, -934, -1036, -998, -620, -199, 116, 572, 1010, 1156, 1215, 1199, 918, 514, 153, -246, -643, -881, -914, -859, -750, -325, 58, 379, 726, 1055, 1014, 920, 860, 515, 110, -173, -386, -654, -682, -519, -441, -238, 167, 407, 456, 673, 704, 522, 421, 259, 44, -187, -239, -228, -331, -190, 7, 88, 188, 391, 414, 265, 272, 267, 30, -43, -7, -132, -169, 19, 55, 62, 257, 358, 318, 303, 330, 218, 37, 0, -78, -215, -168, -82, -125, 5, 200, 278, 267, 399, 434, 350, 281, 245, 27, -129, -108, -173, -274, -226]
1941b26J87nJ47K39LJ3R4L2k33m2k4k72j34J5m8n3J80J17P0J59K14k4K3Lo3j80
1967A92j20n6k46k6O5l7M3K01J08N6J65J27o6j4p1q6k44k5o0j61J9J60j2L2K21
1992A65J03L4N7P7j04j16Rj68j67L6j6j21J8J97j6M2K07M4k2J18j0r7k2k3j56
2017F9j02oj04n8N2J07k9J08J37R6LJ51j6j02l1j0k37j40L5j88l7J00R6M0J81
2042A15J85O9O1J23o7j99q4m0k55j43L5q0l0J58J69O6J93J60k3oM6j44j85l6r0
2067bj61l0J27m3P7J79P0l3J13M4j78n6J9j07j00J40K8q0J15J52j32PJ20o9j61
2092C9j6j9j40j2J28k5O7K09M6M6Q3Oj32j00j1j51j36m1K6j02R8J90RJ21J65M8
2118C96j5K2%j77o5j6j35j54jl6o7L0J44J8R2J74J01O8J19O8j09n2k6k44k06j30
$$ y = [-226, -39, -44, 103, 342, 345, 358, 452, 484, 251, 209, 185, -87, -221, -206, -254, -307, -127, -10, 60, 219, 433, 409, 432, 435, 372, 192, 72, 16, -230, -256, -191, -228, -185, 16, 124, 180, 345, 472, 406, 392, 321, 235, -9, -34, -94, -255, -236, -76, -88, -56, 165, 268, 302, 359, 436, 332, 216, 225, 57, -110, -74, -90, -211, -193, 4, -12, 30, 237, 281, 259, 377, 367, 270, 248, 225, 69, -33, -39, -143, -201, -149, -42, -71, 37, 174, 270, 273, 424, 408, 306, 275, 265, 28, -112, -77, -265, -302, -202, -106, -66, 115, 300, 369, 430, 553, 486, 287, 203, 163, -92, -235, -200, -280, -310, -152, 17, 83, 276, 436, 413, 407, 453, 309, 124, 88, -2, -163, -193, -66, -109, -32, 147, 217, 184, 297, 341, 163, 107, 126, 19, -81, 59, 87, 7, 122, 274, 142, 149, 269, 200, 39, 23, 4, -136, -148, -20, -45, 22, 231, 277, 323, 406, 412, 280, 180, 169, 18, -118, -159, -133, -235, -137, 53, 62, 183, 348, 396, 381, 403, 403, 226, 161, 145, 10, -144, -145, -181, -248, -218, -74, -56, 36, 210, 311, 379, 498, 566, 457, 405, 379, 135, -71, -201]
2144b01j76j12j9R0M3K72L48K41J44L13O3k21r7k70m26l45k30k66j90J83K14L02
2166c40M59N33L00J83J94j17l03l81l85n79l83k29j03L4L70M43L56N79M28J83
2186A242P8j0l04m70m07m33m71j87l9M5J71M65L58L18M66K18L0n3p7l50l60k70
2208d0k67k97r3M6j7J93K63K36J55K99J56L9L7L7j81j71q8k55k82j29j44p6K5
2231e54J70R9J25L66K13J75J52J70j97n0j26k91l59k03j57k27MJ39R8J91M03K48
2253C89K15J78J19j19q4j30l09k96j67k07j89K3J07QK04K26K08J91K14J33k3k
2275F89l3j90j73j70k43k60j06k6j45N7K12J65K02L80L32R9K33O1j83k00k20m72
2297Im03k81j75k23P9L04K56M17N64M16J83K26%k81l29l85o33m87k92j70l9K15
$$ y = [-201, -377, -489, -508, -418, -375, -103, 245, 486, 630, 943, 1006, 785, 688, 418, -8, -353, -583, -849, -1039, -856, -642, -340, 119, 652, 952, 1135, 1329, 1212, 909, 528, 143, -436, -819, -1048, -1151, -1117, -747, -304, 52, 631, 1059, 1242, 1320, 1310, 1006, 536, 129, -304, -775, -962, -1001, -956, -785, -320, 38, 356, 822, 1040, 1070, 1017, 940, 590, 230, -40, -307, -604, -697, -651, -668, -475, -212, 24, 179, 478, 634, 673, 710, 747, 566, 395, 307, 52, -230, -359, -503, -579, -554, -384, -285, -160, 206, 419, 594, 746, 916, 719, 669, 543, 252, -107, -310, -467, -694, -690, -551, -453, -262, 141, 389, 604, 782, 901, 782, 698, 568, 259, -37, -204, -411, -600, -577, -470, -462, -258, -32, 176, 367, 581, 714, 691, 689, 656, 466, 293, 123, -120, -380, -486, -512, -657, -600, -388, -223, -21, 359, 691, 790, 1023, 1084, 901, 701, 481, 9, -394, -675, -850, -1073, -994, -690, -434, -17, 547, 963, 1146, 1372, 1372, 1091, 762, 377, -256, -743, -1035, -1205, -1244, -1029]
2319a029M28M24M88N69L43J31P3j84m22m27m18n31l72r6j7P2L46M22L49L90M06
2340I45J66p1k2k65l56l26k82l19j82L5M8R0L33L10J60K31K08K0r3Lj82k94j14
2363D3j38k13l8Q7r4Q0K25J25R1J13J62m6n3M0q7j58o3m1j55n5R5o2J0J82P5J7
2389A42P9O7r4j1J1o9j24L7K1q9O3O8K0N5J21r7k9rn0j57m3O6j04M8J08J44nJ55
2417C24J37j13M1n7j39j55p4j75r9QJ25QJ30K80J40O1J03K7j03j13r8k43k30l3
2441b48q1m7M2K47O9J84K25R7MJ26j04j58j28j69k06j27Nom4J37K10O8J32J91
2465D19M5k5P0r4j65j25q2j78l5J6o1J6J16R8L0J37J54J0j0O1o4j39Jq4j67j1
2491f7l7rk9J26L9M2R2J09NmP4j18q4K8p7j32jK1k8OJ32J4n6J20N2r3PR2o0n8
$$ y = [-1029, -601, -177, 311, 880, 1223, 1354, 1427, 1243, 821, 394, -24, -555, -927, -1023, -1040, -968, -622, -200, 149, 539, 945, 1111, 1040, 1018, 753, 397, 71, -211, -530, -712, -677, -629, -539, -206, 104, 264, 495, 703, 723, 630, 633, 451, 157, 43, -95, -308, -346, -259, -353, -273, -48, 77, 168, 281, 443, 397, 344, 384, 297, 139, 76, 35, -120, -175, -80, -142, -132, 50, 125, 142, 221, 288, 194, 183, 194, 125, 1, 38, 59, -30, 33, 101, 121, 176, 297, 200, 171, 162, 112, -45, -88, -22, -126, -78, 30, 174, 169, 324, 461, 348, 389, 332, 193, 38, -36, -211, -310, -302, -177, -169, -39, 241, 381, 442, 545, 572, 469, 356, 258, 15, -215, -248, -329, -376, -334, -87, -18, 166, 391, 488, 492, 618, 514, 356, 228, 59, -147, -274, -269, -275, -319, -182, 28, 96, 228, 419, 464, 439, 509, 415, 250, 125, 43, -135, -170, -154, -215, -199, -83, 15, 45, 182, 336, 346, 336, 397, 333, 194, 195, 111, -56, -67, -104, -113, -142, -16, 23, 65, 157, 266, 271, 267, 341, 223, 139, 167, 90, -42, -43, -22, -50, -44, 88, 102, 46, 166, 218, 125, 132, 224, 164, 106]
2521A06K8M9r0L2L2p0k8P6j10n9L5Ml6P2L6M6N9O6N7q5R9o0j33q2oq7j39Q6K1
2550h1j1Q4J30L7J03Q2j0p5K5o7j41l9p1q4o2P8M8k1J45N3O5M6Q5j2r8P0q5r2
2578A02n5jp6m7O4o1JO6P7J4J01O2L6l4Q2q3q2J0l7j57q9K2p7m1J43L2P4J60J26
2607C32K8K7M0n8j60p8j15k17m7L9kJ9J89J75O2J39J11p8k1q1j42j68o1r4j49
2632c10J14Q1K9J06K18J22jR6l9j29p5j01j13j47Jk0nJ18J43P2O1J25k2oKm0j75
2659A05l2o7j12%J8m4N0J62K8k2J09N8j4J3K2j6j31K5k2j43o1L7k7p9J12N9m9
2686b1J52J04J6P8J39j18j15K6j01j64j11n8p1NQ6R1Q4J37J49O0O9P4p8j28o1
2711B44j11k43p5M7j20QJ47J7Q5K13P9j7P9L7j01n4J6p7j31mj8j42rL9m0PN5J00
$$ y = [106, 134, 183, 93, 125, 157, 87, 59, 135, 25, -34, 1, 5, -31, 41, 77, 123, 182, 248, 305, 220, 319, 259, 126, 44, 38, -49, -188, -102, -81, -92, -8, 122, 159, 262, 344, 334, 259, 284, 217, 76, 37, -34, -118, -180, -102, -54, -75, 70, 123, 188, 234, 319, 307, 209, 279, 194, 102, 47, 46, -30, -77, -13, -74, -73, -7, 70, 84, 185, 247, 283, 249, 331, 248, 166, 176, 139, -18, -107, -85, -162, -203, -60, -28, 46, 206, 332, 360, 387, 427, 369, 209, 131, 16, -201, -248, -209, -211, -192, -3, 172, 234, 373, 484, 406, 385, 304, 162, -6, -67, -161, -310, -196, -115, -86, 20, 238, 360, 359, 455, 416, 287, 212, 111, -2, -149, -148, -168, -173, -55, 88, 160, 221, 346, 324, 318, 320, 280, 105, 73, 6, -106, -106, -88, -132, -82, 80, 108, 86, 195, 253, 239, 252, 274, 258, 127, 152, 130, -13, -74, -37, -64, -143, -31, 28, -21, 131, 235, 251, 329, 468, 350, 235, 261, 160, -4, -115, -173, -244, -239, -153, -62, 22, 159, 308, 368, 437, 511, 433, 305, 244, 133, -110, -185, -138, -258, -250, -103, -86, -1, 212, 291, 274, 353, 390, 289, 235, 251, 174, 43, 39, 21, -121, -130, -91, -131, -124, -69, 31]
2739C1K1J44O0K4J23O9kj39lj36j87j37j41j22n9J06P8J34K52K36J36J63J40q8
2763G03j43j28k44l35k26j58j51K9J05K10K15L62L22J19J72P3j34k22k01l00l52
2784b84j55j41j28J06K17J48K35L08K33J36O9Q2j82j57j98k39k58j47o1r5L8J37
2806c36J06K04K77J64R9J02K0q5j35j25j23k33j08n4j55M3R9MJ55J87J43O5J40
2829D54Q2r9m1n1j79j76l9j17q7L4N6RJ34J47Q2PJ06qo2ql7j25n1M7Lq2LO5K0
2858H7l5R3n4m7N4l8n9K3P3j2N1J08J3L4J7m4r4r0j8j86q0K1k8K3J00J70Q9J04
2886B75J40M9l7L3j18j97q2j09j58p6J3K6M4J27J27J32J23J42k9j4or4j86k6j05
2911fj38n7N6Mo9J62L2P5J02J27K1j7O5j9r9Kr2j13q6n1p8m3J10RJ8J81O3L1R5
$$ y = [31, 52, 196, 256, 280, 403, 472, 470, 331, 328, 192, 5, -132, -273, -395, -454, -348, -270, -136, 116, 352, 488, 651, 791, 703, 560, 432, 188, -147, -373, -531, -682, -653, -548, -338, -123, 239, 561, 680, 852, 925, 791, 569, 368, 68, -284, -439, -580, -708, -602, -385, -237, -2, 306, 539, 675, 744, 826, 644, 487, 289, 50, -208, -355, -416, -511, -473, -336, -230, -26, 251, 415, 514, 616, 636, 551, 416, 291, 168, -65, -173, -227, -382, -339, -240, -236, -81, 106, 249, 314, 454, 536, 437, 396, 345, 166, -10, -49, -166, -253, -219, -163, -154, -20, 127, 209, 216, 322, 314, 252, 244, 207, 82, 31, 78, 81, -1, 2, 67, 87, 52, 145, 91, 44, 98, 60, 1, 24, 97, 85, 136, 244, 257, 291, 308, 264, 170, 80, 62, -124, -204, -183, -211, -188, -88, 82, 171, 275, 415, 464, 427, 460, 342, 145, 63, -46, -204, -280, -267, -241, -197, -70, 57, 189, 312, 454, 425, 411, 405, 311, 125, 99, -6, -144, -201, -145, -141, -210, -48, -16, 59, 161, 288, 309, 292, 357, 338, 239, 241, 149, 36, -50, -101, -179, -222, -112, -103, -85, 96, 159, 190, 285]
2940B85R5j9p1N6q6j63l2r4j20Jk0j6K8J20J02N4J07J10J2l9J04m0j54o0o7j30
2966c7j21j5nk4J01M8J5J95J46k7O0R3l8m4q0j30j11j02n7q4p1J01O5L3J98J10
2992B19J11M6R6l0j13Oj20k37m8l7r1l3R0K7N6J60J31nJ06Q3n4r9l2n3j48q9R
3019d9o6k4J35j5NJ44L3MO8NK8n0J8p8j26N7o2p1K6P1q1J3R6M1J1M3K8l1M5k7
3049A91m4l6K2q1k0M4m3Pk4O5K8l6M3P3m1K5%q7L0m4j2o6Q3J1j2K9N4m4kL6k3
3080A26o9j7K7m3NO7k5j0J01j0PK5%Jj30R7p9m6J4j9k3N4M1j0j2J29l5l5LL2q2
3111H4k0K4k3n8J4N5n0L7J22q2j6Q4j4ok8J2m3J1L1n6JL5l6l0j5M8o0L7L4p%N0
3143A35P4k9kL1p2k6j4j9o3K1K6o0J2P8mM0O4km1MK9l8j12N2r8J4JQ6p2R8M8J2
$$ y = [285, 380, 361, 290, 346, 260, 97, 65, -29, -149, -148, -168, -184, -156, -36, 66, 120, 227, 337, 349, 310, 414, 374, 220, 160, 93, -37, -158, -173, -178, -202, -101, -53, -38, 157, 303, 276, 336, 429, 391, 347, 267, 137, 26, -76, -133, -217, -288, -187, -122, -89, 109, 219, 330, 376, 472, 442, 329, 335, 215, -22, -70, -107, -198, -231, -141, -114, -58, 102, 233, 228, 334, 417, 363, 264, 232, 179, 31, -58, -49, -115, -139, -4, -19, -14, 130, 163, 167, 235, 240, 268, 218, 236, 158, 32, 89, 27, -44, -18, 53, -28, -15, 81, 122, 133, 176, 204, 173, 218, 191, 147, 111, 133, 52, 32, 76, 33, 40, 16, 81, 109, 73, 116, 189, 148, 173, 173, 86, 116, 72, 60, -6, 77, 88, 76, 105, 159, 115, 113, 149, 126, 57, 40, 67, 24, 29, 96, 71, 61, 162, 152, 159, 184, 184, 185, 55, 152, 73, 27, 41, 22, -1, 53, 94, 84, 72, 201, 166, 131, 134, 166, 84, 64, 88, 65, 7, 21, 76, 26, 63, 185, 103, 87, 171, 157, 151, 123, 135, 92, 103, 134, 78, 79, 114, 78, 48, 33, 81, 21, 58, 92, 85, 85, 135, 209, 180, 178, 209, 137, 111, 97, 78, 15, 36, 62, 2, 14, 92, 88, 128, 192, 190, 149, 153, 182, 144, 32, 84, -14, 0, 1, 87, 15, 113, 161, 173]
3175A73m3Q1l4q2j4Ko7J8L6K4L1K8pj1J0Mr8L7m0m1L4mP7l4P6M1j1K1ol3q3kl4
3208D9r0JN6NNJ11K0K6M2J3l9l1Kl8j47M6o3j3K8N5nN5J01mj2J7L8r1m2K5p0o7
3240a7P8j0k5N1K7k1J9O8%p5O8Qn7m6N6o0j0J5jk5P4Qn6%N7J5p3O9k6j7M7L6q4
3273I3J0J3j7q1KP7l2N3J4n3k4J22n6l4K7K2n1J8Rk1j1J0Lj5J8K4j1l5P0n0k7
3304F7K1j2RJ3P7m7j7L7M1j04N7k8j30J5O3l8j4Q3J1K0N2K4L6p7L2l1j53N2n8
3333Ap2J8N8J7Q5N5L9K8K8K5q4l8l7m4j00L5l3o9N7K9N3N0J32Pj6L9l7j13m4j
3363F8o2n2N3l7o5J26R5j8N0K6J4Kk5jr5L4m6m8l4M7j7K9M5J6k1M4K7j7K0K0n4
3394A24NJ6ln8j1J5k1mLJ6l2QM0OJ0O9l3k2M1K6p6N5p4k5m1K1k5l5%P4l3L9R7
$$ y = [173, 130, 211, 177, 95, 81, 83, 16, 34, 70, 94, 125, 153, 146, 135, 145, 149, 51, 88, 48, 7, 41, 37, 114, 80, 156, 197, 186, 207, 201, 168, 85, 83, 49, -41, -40, 16, 21, 26, 137, 157, 183, 225, 238, 199, 168, 170, 132, -15, 31, -32, -45, -17, 38, 33, 88, 189, 185, 173, 190, 228, 137, 95, 120, 50, -17, 61, 51, 26, 77, 104, 83, 102, 170, 170, 95, 163, 171, 114, 68, 124, 64, 54, 69, 68, 43, 117, 125, 69, 69, 126, 141, 68, 137, 111, 94, 141, 177, 93, 103, 116, 99, 18, 20, 97, 65, 118, 132, 79, 55, 177, 121, 87, 114, 136, 85, 103, 112, 91, 80, 90, 93, 78, 96, 120, 109, 74, 144, 94, 67, 88, 76, 85, 98, 175, 128, 111, 148, 189, 85, 142, 114, -16, -1, 62, 24, 10, 93, 104, 124, 176, 200, 236, 159, 191, 160, 7, 59, 1, -71, -53, 5, 22, 107, 162, 201, 229, 257, 282, 198, 160, 123, 79, -21, 14, -19, -88, -31, -2, 51, 101, 233, 240, 224, 263, 226, 113, 69, 68, 6, -46, 7, -30, -95, 31, 126, 108, 158, 184, 198, 200, 175, 174, 79, 113, 67, 19, -15, 32, 15, 44, 89, 105, 84, 128, 155, 138, 158, 178, 124, 129, 145, 142, 84, 73, 88, 67, 63, 66, 82, 50, 58, 98, 104, 114, 183, 150, 128, 169, 195, 119, 174, 100, 75, 34, 55, 30, -5, -5, 69, 36, 75, 172]
3427A72l0L7L5M5q2j4J9j19m7n1j5rM7J1N8M0N6L1L7M7Kp7K1o4j22l4L3r9m4R8
3457a8K1J9J01O7K7L8Q0o9q2J1l8j29n8m6J1l6J26Qk6J21J44RjJ6p2l5mq5j42
3486d2k6J0j9K8Q0K8J9J04L3PN2j4p0r5K2j15l7J0Ol4K4J14jK2R7L9n6N8L0j03
3516A71r8qk7l1qNJJ4J00k2O4O4ln8J0j9r6jMn4L3j0N5k1N3j9M9l1N2k2r0P6k5
3549A08m1NN3k3KJ1k6KM5o7Qk6N4k7l2K4P3m6J4N1Jk2K0l0o7M6J8j11n8P1k1J7
3581B6O5K6NN6M8k4k5Rl4r4Ml8o9KR4l5J1J14L2l7O6J5n6Jk7p1m8jk0n0N3J02
3613A00k1J6Q9j6k8O2m0k8j7k1qp7N6k3lN5L7n4K2Q8l1rK7o4K3n1jL1n0qJ0LN6
3646A25l0k0L9M1n4K3K5n6j3J3K2n9J7M0Kl5O8J3l3K8Rr9j0P3m3j5pOl3K4O6J1
$$ y = [172, 142, 179, 214, 259, 177, 163, 182, 63, 16, -35, -50, -59, -12, -1, 57, 97, 153, 184, 221, 268, 270, 193, 214, 150, 28, -6, 27, -72, -116, -18, 3, 22, 123, 190, 217, 255, 335, 266, 184, 195, 157, 28, -30, -76, -65, -101, 25, 33, 7, 128, 272, 281, 280, 296, 224, 189, 185, 100, -42, -68, -58, -77, -49, 31, 59, 78, 182, 215, 222, 274, 260, 190, 95, 117, 2, -35, -25, -19, -53, -29, 85, 84, 106, 203, 242, 186, 244, 274, 171, 73, 65, 38, 7, -1, 4, 5, 19, 119, 97, 161, 225, 222, 164, 174, 155, 59, 58, 62, 8, 41, 31, 86, 65, 118, 99, 148, 117, 169, 147, 57, 133, 108, 67, 72, 125, 102, 104, 115, 89, 91, 136, 69, 77, 51, 105, 78, 46, 70, 143, 97, 111, 162, 163, 141, 161, 131, 64, 110, 128, 17, -41, 30, 9, 26, 91, 117, 122, 178, 226, 202, 177, 186, 152, 58, 62, 24, -45, -43, 51, 16, 27, 141, 173, 136, 202, 217, 161, 162, 135, 64, 16, 15, -5, -55, -2, 100, 79, 95, 184, 168, 140, 202, 162, 134, 117, 96, 88, 11, 67, 44, 41, 96, 133, 79, 101, 189, 158, 149, 176, 112, 135, 84, 83, 114, 64, 56, 66, 69, 125, 95, 75, 114, 155, 101, 124, 149, 93, 80, 93, 115, 56, 73, 113, 115, 80, 148, 161, 128, 156, 165, 66, 56, 129, 86, 71, 64, 70, 37, 61, 127, 138]
3678A38j6M4k5J2k9K9n4k9j7lp2L1L6j2R0L4nJ4N6j3p3Ln7r8N2j6m3kO4J3L5Q1
3710A68K0NK7m7lp9J7n8r7N7KL0J5O0J8kM3J7Jk2pq5l5K7m6o1K8Q8kM4J2jJ5J6
3744A65J4p4l8L4m6LK4l2M5L1k5nM4Lm7nJ2m7J4j8K1JJ0K8m4M4O8o0j1lK8o8R
3777G5O0n1j1L1rr3K0J09m9L5l4O5l6J8O4o9P9l6m9n7K6l8o2M6J9K2l3N4K8L9
3807A63J6O0n8j4Lr6o7M4o0m1L6O1l7N7O4L6L9K0Kk8L%j23m0k7l2j7rN5K2M7P2
3839A51j7J7R3J3q2M5k6r6k2j8Pj04K2L2k3N6P0k6P3J6M2l8K7mk7p3k6r5K0lm2
3870c8m0M7Q7j6O6Q3M9LN2L1j37l2K7j43m5k4o5l2Q1N0M1R2R9L1J7PJ6j38K6q5
3900A10p7m5m8l7K7M5J4N4O7P2PN3K2m3k8k7o2l9o3J2j10L3K5OL5K3R0M1P2K2
$$ y = [138, 122, 166, 141, 153, 124, 153, 99, 70, 53, 50, -22, 9, 45, 33, 123, 157, 152, 166, 222, 209, 136, 139, 82, -16, 36, 20, -23, -25, 39, 52, 87, 168, 188, 193, 220, 173, 170, 91, 108, 50, -47, 10, 12, 42, 57, 117, 135, 133, 176, 193, 194, 172, 165, 80, 45, 72, 26, -35, -7, 81, 79, 123, 135, 134, 149, 165, 179, 105, 67, 101, 55, 58, 82, 50, 95, 126, 101, 96, 140, 143, 96, 91, 103, 56, 70, 52, 73, 74, 84, 112, 68, 112, 180, 120, 109, 106, 134, 66, 75, 135, 84, 73, 104, 95, 2, 22, 131, 82, 117, 83, 148, 112, 130, 194, 125, 204, 168, 119, 62, 88, 50, -12, 34, 53, 75, 42, 96, 124, 163, 179, 239, 181, 167, 170, 74, 7, 51, -9, -50, -14, 47, 10, 67, 131, 167, 206, 226, 228, 200, 203, 203, 80, 40, 13, -19, -36, -45, 10, 32, 79, 151, 134, 151, 244, 257, 175, 220, 194, 98, 76, 58, 65, -39, -17, 15, -8, 48, 118, 92, 165, 181, 223, 185, 212, 208, 181, 108, 82, -13, 7, 4, -38, -78, -31, 56, 40, 106, 189, 238, 241, 293, 324, 187, 155, 182, 39, -6, -30, -95, -127, -46, 4, 45, 137, 236, 267, 284, 291, 307, 169, 195, 110, 33, -12, -60, -97, -70, -25, -11, 43, 110, 182, 189, 242, 264, 221, 193, 166, 104, 65, 2, 14, -96, -63, -38, -32, 3, 26, 116, 157, 229, 251]
3930B51j9Kk1l1q5l1o2m1ml0L1j2J06M8O2O2N8nm0j3o2p5m3q9l1k6PL7N3O3R5
3961A55L8N8M8k3o1K9r9j37Kl1o7j7Q0L9K2R9J3L1P0L1n1n2Rq7j05j6k7k4M7O7
3991D1rK0R3M8K3nJ6m2l3Mr6p2L6k5j6N4J6J2K8N1K8NM9m0j2KJ5j32oNn3j4K6
4024A7L9j0O2L4rK3P7j5p8on0j7oj7k0m2K8P3j8L7Q9l3M4J2o9l8L2k4k5n9K2k4
4056B9pP8j3j7N8L1Jk8M3n4mJPj5k1Om7K0M6m2j9K6rm0M0M4%J3M6l1J4nLj5m6
4091I3Np1l8MM8l8O6L7L7kM6M2k7j2j0q0l4jp7J2jn5L8O4K2R4L9M7ko3M7m8o7
4124A15m3k9r2oM0n%L6R8J1N5P9qj8k7n0k1m3m9r9O1k3J1L1J3R6oP6J4m4K0nj3
4157A75o8Kq0j4jOqK3O3KJ3PR0n7K5J5k5o6k2J5ql6J4k9M0k3J0qL7J2JJ9P2m5
$$ y = [251, 232, 234, 213, 182, 97, 66, 4, -37, -41, -71, -40, -52, 54, 102, 164, 226, 284, 279, 239, 226, 164, 89, 46, -43, -74, -100, -93, -56, -3, 60, 155, 193, 251, 299, 276, 215, 244, 145, 8, 10, -21, -88, -105, -25, 14, 36, 135, 148, 179, 249, 280, 229, 177, 186, 99, -6, -22, -49, -73, -26, 41, 32, 52, 145, 193, 216, 211, 227, 185, 152, 156, 60, -12, 24, -1, -17, 37, 53, 65, 93, 144, 172, 177, 226, 186, 174, 176, 191, 59, 53, 58, 5, -9, 17, 56, 46, 108, 142, 133, 156, 233, 218, 140, 134, 84, 67, 61, 44, 24, -18, 10, 83, 65, 102, 191, 158, 202, 214, 145, 107, 139, 115, 90, 31, 53, 29, 22, 100, 87, 70, 128, 159, 160, 132, 175, 121, 117, 118, 125, 110, 89, 95, 48, 68, 114, 72, 53, 79, 70, 30, 70, 114, 114, 127, 173, 142, 156, 151, 154, 139, 93, 98, 27, -11, -7, 41, 3, 69, 106, 143, 141, 187, 229, 202, 190, 180, 100, 66, 65, -12, 0, -1, -56, -18, 46, 68, 162, 201, 248, 246, 183, 230, 182, 115, 72, 43, -49, -55, -15, -20, -20, 16, 114, 125, 180, 259, 251, 233, 206, 156, 135, 92, 43, -56, 5, -18, -7, 24, 37, 133, 127, 203, 217, 173, 193, 188, 175, 107, 109, 29, 15, 14, 20, 12, 35, 98, 100, 113, 120, 210, 153, 178, 193, 168, 102, 80, 95, 87, 51, 65, 36, 76, 53, 63, 55, 92, 104, 105, 124, 196, 151]
4191A51l0L0K3p3rO1o8k0l7N8m7N7J1m6M0M4l0N0M1n9J6pk6k9q6J1m0J5J0LM2
4222E6NN7O5L1lkq%k7r0k6k7m6k7L5J0J7K8O3K0N3M1L0p5N0m3q2l9n3o4n4J08
4254Cj3N1L7M7mP4O8N2j20K9q0p0j6k6p7KN1jM1P0J6K7L5L9l5o9N3m1p0l4Lm9
4286gJ9O3k6J3Q4K3k6J2J3k0n1M8n8J6m0pj6nL8opL4k3K0K9Nj6QN5o2OJ4k2k2
4320H6L7rn4K3K9o9mP8J0n8K6Q8k2j8K5l8m4L4o1k8J4qj5LO4%J5N8Ol3L4O5m7
4353A87j19L7m9q4N0L5l4L9N3k7L7O1L9q2LK0l2p0J7m3m2J2rK5L0N0K4K1P8J5
4383B42l7J9k8p6l0o0p8j3j0R4l3R0L1Q0O7J5J4n2pq9n7j09k0o2K4NM3R6L7J14
4413B10P0L2K7m3m9o4p1j08o5l6k1k4R2L4O1J05R8J8J9lj6n0m4o3j06m2p4kK8
$$ y = [151, 121, 151, 174, 101, 92, 153, 85, 65, 28, 86, 39, 96, 107, 61, 101, 145, 115, 165, 206, 147, 163, 156, 130, 101, 15, 26, -14, 1, 11, 14, 56, 61, 118, 183, 214, 211, 209, 201, 201, 174, 84, 58, 31, -15, -42, -7, 3, 20, 48, 111, 131, 184, 225, 255, 180, 230, 187, 105, 66, 13, -51, -105, 3, -10, 41, 78, 125, 121, 195, 263, 315, 195, 224, 144, 74, 58, 32, -45, -43, 8, 7, 48, 118, 134, 161, 196, 235, 200, 131, 184, 143, 73, 39, 42, -7, 12, 75, 49, 62, 146, 169, 143, 155, 168, 148, 97, 145, 87, 103, 63, 56, 40, 35, 73, 67, 60, 94, 71, 91, 120, 125, 109, 117, 172, 110, 116, 130, 108, 86, 123, 114, 60, 83, 112, 43, 39, 117, 127, 69, 95, 183, 161, 143, 168, 130, 86, 120, 59, 31, 45, 37, 22, 25, 89, 89, 104, 162, 168, 135, 169, 234, 187, 68, 105, 56, -28, 22, 57, 23, 62, 115, 88, 125, 186, 225, 143, 146, 166, 134, 64, 81, 38, -4, 8, -1, 24, 54, 104, 128, 149, 227, 242, 205, 224, 196, 120, 90, 30, -48, -61, -71, 23, -10, 80, 111, 191, 258, 273, 287, 235, 228, 139, 82, -27, -47, -109, -85, -80, -37, 59, 96, 210, 280, 312, 339, 296, 247, 183, 112, 4, -61, -97, -118, -142, -50, -16, 45, 150, 248, 266, 285, 282, 266, 216, 172, 109, 3, -39, -113, -115, -87]
4442h7M1N9O7O0Q3j2Q5k7%n9l6m7r1On6p5j0P0J7k1J49J3P6M8J5j7Ql4l5j29J3
4473G4m9m1o4K6J3J8L9J30K0M9P6m7K4j4k8j25j3o4m5l8rlN9M1N0N1Q7L8m0M5
4503B60Ln4r4N8j45l0m1nJ8j1J21lL2P4K9J9k3O2p6nn2n3q2j4Lm4L1K6K6J9N2
4534A01R6mL5K8l9m1kp4o5l6j0j1RK1NO8M1L7RK0K5nJ0p5L1q5q7L9mK3o0M1rQ2
4568A14L5l3K5J4Pk7k2J4l7M0n9%J2J0l3M0j4j8j0O9j6J1J4M2n2L5Qk1j5j1j1
4599A11p8L9l0l4PL9J1pJ9O7K8m5O3k5Jj1k0m2n6L1o8K1Jm6Q3N4lK5LN4o0l2J1
4632A11M5o3k0K8q8J3NJ8QN1k3L1j3M1J7L6J5n6j3k1Op0k3Mj6oQ0l0M3L9J2L8
4664A99j1L3m7m9J2o0o7K5k9j4OM0kO9L9j5M7L8n5J7k0l9m0l5j4M4n2NN3l3M5
$$ y = [-87, -46, 13, 80, 140, 223, 211, 296, 269, 269, 210, 174, 127, 36, 42, -14, -89, -99, -29, -12, -33, 116, 129, 205, 253, 268, 251, 259, 225, 190, 61, 74, 25, -16, -80, -54, -41, -23, 16, 146, 166, 215, 291, 244, 268, 254, 226, 101, 88, 24, -21, -59, -68, -71, -12, 29, 79, 130, 217, 255, 215, 260, 263, 209, 115, 173, 28, -2, -43, -48, -30, -41, 80, 77, 109, 183, 212, 231, 208, 270, 194, 189, 137, 84, 2, -12, -9, -53, -22, 4, 30, 49, 101, 197, 193, 228, 256, 217, 176, 174, 100, 35, -1, -11, -22, -13, 8, 13, 81, 122, 159, 168, 188, 213, 208, 218, 143, 174, 89, 2, 41, 37, 60, 0, 41, 32, 114, 149, 116, 141, 155, 162, 135, 113, 127, 90, 130, 71, 71, 83, 93, 60, 100, 86, 68, 58, 127, 111, 122, 136, 178, 126, 161, 169, 148, 133, 122, 111, 33, 72, 42, 8, 15, 54, 65, 58, 77, 144, 172, 127, 190, 165, 166, 155, 135, 93, 37, 68, 0, 21, 22, -24, 59, 113, 110, 135, 138, 192, 132, 100, 111, 156, 93, 73, 101, 13, 26, 31, 49, 57, 108, 85, 116, 103, 144, 161, 197, 212, 156, 143, 122, 128, 58, 35, 39, 23, 17, 97, 67, 110, 149, 161, 199, 188, 221, 174, 125, 137, 77, 10, 35, 6, -8, -2, 38, 36, 105, 144, 129, 176, 214, 159, 176, 156, 117, 77, 42, 28, 72, 20, 25, 78, 45, 90]
4695I0M4Nj2L6L3n3oj7j9l6j0OqJ0j2ON5J6K2j3rL4mj5k0k5q2P1k4j6J2k8N2l8
4729D5N8jpM2jnn4K4l1N4l1k4knj8N3k5L6L3j4K4o9Pj2L4o5pL8j1k2M4O6k4L6
4763A66%l1J0l9L1n7ql9k2J4M9kM1j1J3J9QK7ml9K2m9j6k6L2n0K6K5j1NL8lMO4
4797A87k2m0p1P7r5M0M5o8K0K2J9l1NqL5J2Rn5K4pP8r2L2K3l3l8N8Kq4L5Mk1j3
4830D9K6K5LO1j9L5j6m7K6m0jp1K3l8nJ9kL3L2L9J8P3r0K7M1m4q7L2l2p0N4Jn5
4863@N6K7J6%P2K8k3k3k8K1k6m7j3j6Jl4K4qO2M1pN2L5j1j0Oo4l0k8k4m4j5LK
4897eP5O3j6J8K3J7J1Rm1j5m5j7l1k8j9N3k0%P0k9O2O9om6L7l8mm4m3k6Rl7M0
4930D6M9k1K2kN8l2K2rM1n2j5l2L3j3m5QK1J6m1K3L8l0K5nn0O8kj4k6O0l5J1j0
$$ y = [90, 134, 139, 127, 163, 196, 143, 137, 120, 101, 65, 55, 61, 53, 63, 51, 57, 112, 128, 150, 137, 128, 162, 158, 143, 123, 98, 16, 87, 63, 47, 59, 31, 83, 45, 103, 102, 95, 137, 136, 131, 77, 101, 70, 124, 93, 69, 67, 62, 44, 97, 72, 108, 141, 127, 151, 82, 89, 77, 111, 46, 39, 77, 66, 44, 88, 154, 130, 166, 166, 135, 145, 106, 137, 80, 72, 33, 11, 25, 74, 72, 113, 102, 115, 134, 142, 169, 165, 126, 148, 99, 83, 57, 89, 39, 65, 90, 79, 84, 122, 119, 123, 187, 165, 125, 54, 131, 36, 76, 121, 53, 73, 95, 114, 83, 88, 80, 115, 127, 136, 81, 105, 98, 176, 84, 116, 139, 106, 68, 126, 128, 44, 79, 83, 62, 49, 75, 100, 103, 164, 145, 180, 164, 117, 143, 103, 102, 31, 54, 16, 11, 30, 28, 61, 93, 132, 150, 223, 133, 160, 201, 157, 70, 102, 70, 0, 54, 55, 0, 56, 83, 99, 99, 171, 199, 176, 153, 125, 146, 120, 73, 60, 44, 45, 11, 35, 27, 89, 130, 123, 175, 210, 199, 189, 195, 131, 101, 73, 49, 5, -10, -7, -5, 70, 133, 117, 135, 158, 175, 186, 195, 154, 139, 94, 77, 46, 18, -1, 52, 32, 32, 102, 73, 135, 204, 198, 152, 189, 151, 147, 103, 60, 34, 43, 6, 46, 95, 74, 96, 94, 152, 120, 142, 133, 174, 122, 107, 75, 108, 95, 50, 58, 79, 95, 54, 77, 115, 85, 110, 105, 55, 123, 121, 107, 81, 141, 106, 117, 107]
4963A07Qk4k5j5JK1M3lm8P2noK6j7J7l6k5j8rM8n9l6Q5j9nO0J3K8o7K0N6p2K7
4996A43n3n0m1N5J6k6K8L9m1L8P0l8J8kl6k5rj1l1j3L0J2m2J24Ql7L5Jmo0K9m3
5028H4Lm5K2l3K4L4J6PM7j1J8J1o2L0p0K0k0l8jM4k9K6lL4RrM6l3K9K1p5j8l2
5061D6M4o7O0pQm%P4n6M2J8k6j2l5j2l2J5ok4O9m0L8N8Lj1NL6o5l5Mk6k1m8KP2
5096F7j1K1K1NJ12l0M4n6J3q7k0Mk9n5J3J7pL0O3O3KM5n8rO1o2o9l1l5Mo2O3M3
5129G0j8L9L7K6K9kJ0n9mJ7p1J4m7k9j0kP7j3L6K6%KN8j9j2j5j6l9p5N6k3M9j1
5162H1om7P4K4Ml8R5l2k5nmMl2j3Kj0j9K4m6R2l2j0K8O3j5j0K1k8Ll4J3r6L3j0
5196D9j0J0MJ8J2K7K0Ol8J01q6J9l0Om9%K0J7j2j5K3k7O9L4K0l1J0ln1QK2p7j3
$$ y = [107, 115, 91, 66, 51, 52, 73, 116, 113, 65, 137, 132, 126, 152, 135, 152, 116, 91, 73, 64, 112, 53, 17, 102, 83, 78, 138, 151, 179, 112, 132, 188, 116, 143, 90, 40, -1, 54, 70, 44, 72, 111, 70, 108, 178, 140, 158, 156, 120, 95, 86, 75, 44, 31, 61, 73, 31, 155, 163, 126, 161, 162, 158, 98, 127, 84, 87, 42, 64, 31, 55, 89, 105, 112, 159, 148, 166, 177, 115, 145, 75, 95, 75, 37, 36, 80, 51, 77, 74, 108, 117, 108, 154, 121, 150, 171, 96, 78, 46, 90, 23, 83, 76, 84, 80, 80, 154, 98, 140, 158, 132, 120, 85, 73, 41, 56, 50, 26, 95, 55, 93, 151, 154, 143, 148, 184, 119, 84, 88, 62, 41, -7, -5, 67, 56, 77, 98, 103, 215, 185, 229, 173, 186, 99, 79, 83, 54, -1, 12, 29, 22, 52, 115, 178, 180, 225, 167, 158, 219, 157, 88, 57, 22, 26, -36, 27, 70, 52, 91, 128, 154, 183, 181, 191, 132, 128, 145, 74, 88, 41, 12, 2, 0, 77, 64, 100, 126, 126, 128, 186, 167, 155, 140, 124, 85, 10, 66, 43, 92, 81, 75, 28, 102, 126, 130, 92, 187, 155, 130, 125, 121, 125, 93, 80, 82, 72, 53, 77, 31, 123, 91, 81, 109, 172, 157, 147, 168, 140, 143, 109, 122, 26, 59, 49, 39, 49, 53, 71, 83, 110, 130, 136, 98, 199, 113, 132, 102, 108, 59, 59, 79, 96, 84, 69, 92, 65, 134, 168, 188, 157, 167, 164, 113, 121, 143, 66, 53]
5229E3M7n0J1oL7l8LN3K8j1J3J2l2K3m5Jj2k3jl7L3k1L2j2O6OL7Nk2j5Oj9o3N5
5263A14n5k7L9l2RM1Mj5L3N2Rk6n3J3k0m0J5k5pK4M1l9O4JmOqQKk9L9l7kk3L1
5298A03o6L1L6K3m4J0k0K8J8rqmL2l8%J6L5m3mkn0K4j8M2k5K9J1K2k5mO2j4Lk0
5332A31n5N9j8m3M3m2kRk4O4k8K3M6n7krJ7J0Pj8k6N4k4j8j1K0n4PM9k0j5K8r
5365I2pM7K4J3q8N2l1j4oj6J6J4l3k2M5RK9rM6k1Rn7k3M9n3k3K9k6j0L8M1%L8
5398A52l4K8k3jJj4Pn4K2m1J9rK9L0j4K0K9K3p4QL1n0M4l6J8k2K6mp3M2mK2j9
5431G9j6J1J0rK7J1J9p0O0j7K1ml1L7o1K9J6k0j3M3mk0J5%Jpk3N5k7j3j2j2J9
5464I4Jk3K4J4m2M1k3L6j2jj6N4j5K2l4K8l3Ol0J7m9N1k6jJqj6L8J6K3K5p9O2
$$ y = [53, 100, 50, 61, 55, 92, 54, 57, 110, 138, 127, 140, 152, 120, 143, 98, 99, 87, 64, 63, 26, 59, 38, 70, 58, 124, 130, 167, 172, 150, 135, 141, 122, 59, 114, 59, 32, 71, 39, 48, 89, 93, 78, 111, 163, 172, 146, 93, 106, 86, 46, 61, 36, 29, 53, 94, 55, 119, 120, 116, 122, 114, 122, 124, 95, 134, 97, 95, 72, 103, 37, 68, 104, 127, 83, 93, 73, 101, 119, 110, 102, 98, 130, 92, 92, 108, 143, 100, 96, 94, 44, 68, 50, 92, 67, 96, 107, 129, 104, 100, 162, 148, 151, 131, 76, 135, 117, 74, 117, 75, 73, 82, 58, 122, 94, 117, 163, 106, 104, 95, 112, 122, 129, 111, 85, 139, 115, 97, 86, 106, 52, 59, 108, 88, 73, 101, 92, 85, 132, 156, 169, 81, 133, 102, 88, 82, 66, 82, 96, 63, 41, 86, 95, 124, 115, 161, 140, 149, 92, 69, 118, 65, 42, 71, 45, 35, 73, 114, 114, 152, 118, 146, 123, 122, 123, 109, 116, 62, 84, 43, 62, 53, 82, 112, 98, 118, 147, 170, 96, 104, 135, 85, 129, 93, 111, 89, 115, 111, 38, 80, 76, 98, 79, 63, 74, 84, 75, 102, 113, 132, 62, 122, 105, 126, 122, 91, 128, 67, 96, 112, 92, 79, 122, 118, 98, 113, 113, 114, 107, 84, 139, 112, 99, 87, 75, 94, 95, 72, 96, 110, 68, 109, 86, 122, 110, 109, 93, 147, 132, 154, 120, 148, 115, 121, 91, 108, 59, 110, 84, 83, 84, 76, 60, 98, 114, 137, 162, 83, 145]
5497A45l1l1LLn5M2l2J0K5K1k8N3J4l7J8Ppj3k6L9p7ML9k4RNJ0pN0Lj5k4L4mr
5532A14Mk6oK9nl1J9QJ5m0N8ko7L8j1J3l7K6Kk5K5K4l0J3O3m6l5LLm4L6PqPQJ8
5568A20M6k9K0l1K0Kn4jok8k9j1L5j4K0M3J6J4L9Nj4Mpl0l5K2p2j1oj4M2J9JN8
5602A34j7N7NJlm4j5k7Lo4l2J6K2L0k0oN9N3NJM2j9J8j01qnn5j9nJ5l9N9O1Jl
5637A00L7L2k5K0k8lm3k6K1l6K3l2j8J5L7J2L3L8k6Qk6PjJ8Ll7k0j2NNj7J3mr
5671F4K7jKN0oRJ1j8rLk3k4l6N8l1k0L6l4L0PnK8J2L1J0o1M2m3j0k2K1n5J0n6
5705cN8PM5L0l0N5Qkj2qm8k5Rl5J8l8K4K5J4qK2N3k1N0o2l5L5Jo3j2k3K8j5K0
5739F2jK2L1MLqK4l5j8K2M8r9K4n4Q2n3J1M0J8J5k3nPJ1J3j2n6L3k2j1%l5J9N4
$$ y = [145, 114, 83, 86, 89, 34, 76, 44, 54, 79, 100, 72, 125, 139, 102, 120, 127, 120, 107, 81, 120, 43, 47, 86, 62, 71, 76, 86, 79, 129, 132, 117, 93, 127, 123, 114, 118, 92, 86, 115, 110, 79, 98, 106, 121, 81, 139, 137, 70, 108, 97, 110, 73, 99, 101, 76, 101, 125, 95, 108, 171, 125, 90, 93, 96, 52, 88, 95, 87, 94, 102, 120, 166, 137, 157, 126, 146, 148, 94, 93, 87, 59, 30, 19, 54, 40, 60, 103, 119, 133, 172, 177, 163, 167, 160, 130, 95, 117, 45, 34, 28, 14, 56, 75, 76, 134, 117, 174, 179, 180, 177, 133, 118, 91, 94, 30, -2, 14, 36, 66, 46, 40, 99, 152, 157, 158, 200, 181, 199, 98, 90, 85, 30, 11, 6, 21, -18, 41, 102, 103, 100, 137, 169, 144, 164, 136, 133, 90, 64, 85, 49, 72, 40, 22, 37, 74, 86, 119, 157, 131, 139, 113, 120, 119, 137, 140, 103, 83, 71, 76, 81, 64, 77, 73, 64, 91, 90, 92, 142, 136, 145, 156, 138, 129, 132, 109, 85, 49, 107, 76, 56, 92, 58, 88, 95, 90, 118, 130, 161, 171, 110, 152, 109, 99, 77, 98, 43, 53, -3, 55, 62, 107, 137, 107, 162, 170, 168, 156, 148, 100, 75, 84, 49, 67, 29, 53, 78, 92, 84, 106, 159, 138, 188, 126, 91, 126, 127, 64, 52, 29, 57, 42, 62, 61, 83, 114, 118, 121, 113, 137, 102, 84, 106, 154, 55, 79, 25, 107, 54, 65, 105, 123, 138, 115, 110, 117, 128, 141, 129, 73, 106, 84, 73, 73, 38, 57, 111]
5773A11K5Nj7Qk2K0k4j9j5Jk8K1j6N7%J0K8l4RJ2mMk1kq3J3M3nl4N7k9K0K4J6
5807A31K7n1K8k5j3l4j0n0K7M1J5k3N0K3J8J0j8qnl4k9oj8L6qLl9L4KL6N7p1K1
5840A17K2p8M8%k3k1J3k7J2M1J6nl0M0m0J0QKj2qL0k1j7l3M6J7lk2K7k4L3K1o5
5873G4K7k0J1Ol2K7PM1J9n3%pJ0m1L2n6M5j1Qm4L4j0L3j8K3lNknMl3N6q3M1k3
5908F2L4k9QK1jk0O9j1lK5ml7j2L1p2L3j2l3J5O7n7L6l3Q1k5m1N7Jo8L3k3mk7
5941F1j0L7m6P1nJ7k9LM2m5N8n9oL0k2j9K1mK8l0K6j6mPJj8oK5qMj1M9m8O2j5
5976A41j3p4K9m0J5M5j3J3k3qM7OmK2l1Jj2l4OL7n4j5K8L1Nj1K7K0Jk7mprOj9
$$ y = [111, 136, 141, 124, 132, 110, 130, 106, 87, 72, 73, 45, 66, 50, 107, 107, 117, 145, 111, 120, 132, 128, 132, 111, 109, 26, 39, 82, 77, 43, 100, 71, 91, 115, 131, 158, 107, 135, 110, 97, 63, 53, 3, 30, 71, 86, 63, 113, 136, 154, 164, 146, 138, 133, 99, 70, 64, 46, 82, 74, 77, 38, 72, 74, 110, 167, 96, 117, 139, 61, 109, 109, 86, 65, 78, 51, 63, 104, 120, 115, 85, 125, 85, 95, 103, 105, 93, 85, 115, 94, 77, 44, 90, 107, 104, 82, 109, 85, 118, 139, 74, 101, 81, 92, 98, 66, 93, 100, 141, 160, 107, 107, 100, 110, 69, 101, 45, 90, 79, 87, 43, 77, 67, 100, 82, 105, 102, 107, 105, 100, 104, 71, 127, 44, 85, 62, 96, 67, 75, 96, 95, 75, 144, 133, 130, 155, 151, 114, 102, 133, 61, 94, 82, 49, 64, 131, 74, 110, 77, 158, 133, 92, 149, 150, 82, 115, 92, 88, 61, 51, 88, 42, 113, 108, 125, 96, 99, 141, 96, 154, 95, 89, 119, 97, 78, 99, 95, 123, 93, 119, 103, 99, 106, 107, 89, 83, 108, 100, 104, 93, 142, 94, 156, 141, 128, 54, 83, 43, 58, 103, 90, 103, 80, 72, 119, 125, 121, 143, 112, 113, 101, 67, 73, 110, 56, 41, 69, 100, 105, 94, 121, 141, 142, 115, 111, 104, 95, 101, 82]
$$ [...]
8191A40
##END NTUPLES=NMR FID
##END=
