##TITLE=H1
##JCAMPDX= 6.0         $$ Bruker NMR JCAMP-DX V2.0
##DATA TYPE= NMR SPECTRUM
##DATA CLASS= NTUPLES
##ORIGIN= UXNMR, Bruker Analytische Messtechnik GmbH
##OWNER= root
$$ XWIN-NMR		Version 3.5
$$ Mon Jan  4 10:01:50 2016 Russian Standard Time (UT+4h)  servis@DPX200
##.OBSERVE FREQUENCY= 200.131235884673
##.OBSERVE NUCLEUS= ^1H
##.ACQUISITION MODE= SIMULTANEOUS
##.ACQUISITION SCHEME= undefined
##.AVERAGES= 1
##.DIGITISER RES= 18
##SPECTROMETER/DATA SYSTEM= spect
##.PULSE SEQUENCE= zg
##.SOLVENT NAME= CDCl3
##.SHIFT REFERENCE= (INTERNAL, CDCl3, 0, 16.5164)
##AUDIT TRAIL= $$ (NUMBER, WHEN, WHO, WHERE, WHAT)
$$ ##TITLE= Audit trail, XWIN-NMR		Version 3.5
$$ ##JCAMPDX= 5.01
$$ ##ORIGIN= Bruker BioSpin GmbH
$$ ##OWNER= servis
$$ F:/spectra/data/servis-vadim/nmr/H1/1/pdata/1/auditp.txt
$$ ##AUDIT TRAIL=  $$ (NUMBER, WHEN, WHO, WHERE, WHAT)
(   1,<2016-01-04 09:58:15.62 +0400>,<servis>,<DPX200>,
      <created by zg, POWCHK disabled, PULCHK disabled
       configuration hash MD5:
       00 E9 B6 7A A2 85 ED C7 34 08 36 98 17 FE 4E 26
       data hash MD5: 16K
       B1 66 85 3B 35 6F 3C DA E5 9D 9D 1F 69 C1 48 FB>)
(   2,<2016-01-04 09:59:46.18 +0400>,<servis>,<DPX200>,
      <Start of raw data processing
       fp BC_mod = 2 FT_mod = 6 PKNL = 1 PHC0 = -104.5595 PHC1 = 3.843713 SI = 32K 
       data hash MD5: 32K
       BF 38 97 3D 7F 6B 0B 5A C3 B1 9E 05 C3 30 1C 05>)
$$ ##END=
$$ 
$$ hash MD5
$$ E0 AB A9 2E 00 E8 CC D0 B9 2E B7 E5 36 21 68 D9
##$RELAX= 
##$RELAX= 
##$RELAX= 
##$RELAX= 
##$RELAX= 
##$RELAX= 
$$ Bruker specific parameters
$$ --------------------------
##$DU= <F:/spectra>
##$EXPNO= 1
##$NAME= <H1>
##$PROCNO= 1
##$TYPE= <nmr>
##$USER= <servis-vadim>
##$AMP= (0..31)
100 100 100 100 100 100 100 100 100 100 100 100 100 100 100 100 100 100 
100 100 100 100 100 100 100 100 100 100 100 100 100 100 
##$AQSEQ= 0
##$AQ_mod= 1
##$AUNM= <au_zg>
##$AUTOPOS= <>
##$BF1= 200.13
##$BF2= 200.13
##$BF3= 200.13
##$BF4= 200.13
##$BF5= 500.13
##$BF6= 500.13
##$BF7= 500.13
##$BF8= 500.13
##$BYTORDA= 1
##$CFDGTYP= 0
##$CFRGTYP= 5
##$CHEMSTR= <none>
##$CNST= (0..31)
1 1 145 1 1 1 1 1 1 1 1 1 1 1 1 1 1 1 1 1 1 1 1 1 1 1 1 1 1 1 1 1 
##$CPDPRG= <>
##$CPDPRG1= <>
##$CPDPRG2= <>
##$CPDPRG3= <>
##$CPDPRG4= <mlev>
##$CPDPRG5= <mlev>
##$CPDPRG6= <mlev>
##$CPDPRG7= <mlev>
##$CPDPRG8= <mlev>
##$CPDPRGB= <>
##$CPDPRGT= <>
##$D= (0..31)
0 1 0 0 0 0 0 0 0 0.06 0 0 0 0 0 0 0.0002 0 0 0 0 0 0 0 0 0 0 0 0 0 0 
0 
##$DATE= 1451887095
##$DBL= (0..7)
120 120 120 120 120 120 120 120 
##$DBP= (0..7)
150 150 150 150 150 150 150 150 
##$DBP07= 0
##$DBPNAM0= <>
##$DBPNAM1= <>
##$DBPNAM2= <>
##$DBPNAM3= <>
##$DBPNAM4= <>
##$DBPNAM5= <>
##$DBPNAM6= <>
##$DBPNAM7= <>
##$DBPOAL= (0..7)
0.5 0.5 0.5 0.5 0.5 0.5 0.5 0.5 
##$DBPOFFS= (0..7)
0 0 0 0 0 0 0 0 
##$DE= 6
##$DECBNUC= <off>
##$DECIM= 32
##$DECNUC= <off>
##$DECSTAT= 4
##$DIGMOD= 1
##$DIGTYP= 9
##$DL= (0..7)
0 120 120 120 120 120 120 120 
##$DP= (0..7)
150 150 150 150 150 150 150 150 
##$DP07= 0
##$DPNAME0= <>
##$DPNAME1= <>
$$ [...]
##$SUBNAM3= <"">
##$SUBNAM4= <"">
##$SUBNAM5= <"">
##$SUBNAM6= <"">
##$SUBNAM7= <"">
##$SUBNAM8= <"">
##$SUBNAM9= <"">
##$SW= 20.6817932712277
##$SWIBOX= (0..15)
0 0 3 0 0 0 0 0 0 0 0 0 0 0 0 0 
##$SW_h= 4139.07284768212
##$TD= 16384
##$TD0= 1
##$TE= 0
##$TE2= 300
##$TE3= 300
##$TEG= 300
##$TL= (0..7)
0 120 120 120 120 120 120 120 
##$TP= (0..7)
150 150 150 150 150 150 150 150 
##$TP07= 0
##$TPNAME0= <>
##$TPNAME1= <>
##$TPNAME2= <>
##$TPNAME3= <>
##$TPNAME4= <>
##$TPNAME5= <>
##$TPNAME6= <>
##$TPNAME7= <>
##$TPOAL= (0..7)
0.5 0.5 0.5 0.5 0.5 0.5 0.5 0.5 
##$TPOFFS= (0..7)
0 0 0 0 0 0 0 0 
##$TUNHIN= 0
##$TUNHOUT= 0
##$TUNXOUT= 0
##$USERA1= <user>
##$USERA2= <user>
##$USERA3= <user>
##$USERA4= <user>
##$USERA5= <user>
##$V9= 5
##$VALIST= <valist>
##$VCLIST= <CCCCCCCCCCCCCCC>
##$VD= 0
##$VDLIST= <DDDDDDDDDDDDDDD>
##$VPLIST= <PPPPPPPPPPPPPPP>
##$VTLIST= <TTTTTTTTTTTTTTT>
##$WBST= 1024
##$WBSW= 4
##$XGAIN= (0..3)
0 0 0 0 
##$XL= 0
##$YL= 0
##$YMAX_a= 25471
##$YMIN_a= -28546
##$ZGOPTNS= <>
##$ZL1= 120
##$ZL2= 120
##$ZL3= 120
##$ZL4= 120
##$ABSF1= 0
##$ABSF2= 0
##$ABSG= 0
##$ABSL= 0
##$ALPHA= 0
##$AQORDER= 0
##$ASSFAC= 0
##$ASSFACI= 0
##$ASSFACX= 0
##$ASSWID= 0
##$AUNMP= <proc_1d>
##$AZFE= 0.1
##$AZFW= 0.1
##$BCFW= 0
##$BC_mod= 2
##$BYTORDP= 0
##$COROFFS= 0
##$CY= 18.4799938201904
##$DATMOD= 1
##$DC= 0
##$DFILT= <>
##$DTYPP= 0
##$F1P= 9.9274215381318
##$F2P= -0.165520771350173
##$FCOR= 1
##$FTSIZE= 32768
##$FT_mod= 6
##$GAMMA= 0
##$GB= 0
##$INTBC= 1
##$INTSCL= 1
##$ISEN= 128
##$LB= 0
##$LEV0= 0
##$LPBIN= 0
##$MAXI= 10000
##$MC2= 0
##$MEAN= 0
##$ME_mod= 0
##$MI= 50
##$NCOEF= 0
##$NC_proc= -10
##$NLEV= 6
##$NOISF1= 3.799351
##$NOISF2= 2.8
##$NSP= 0
##$NTH_PI= 0
##$NZP= 0
##$OFFSET= 16.51637
##$PC= 4
##$PHC0= -104.5595
##$PHC1= 3.843713
##$PH_mod= 1
##$PKNL= yes
##$PPARMOD= 0
##$PSCAL= 4
##$PSIGN= 0
##$REVERSE= no
##$SF= 200.13
##$SI= 32768
##$SIGF1= 3
##$SIGF2= 2
##$SINO= 400
##$SIOLD= 16384
##$SREGLST= <1H.CDCl3>
##$SSB= 0
##$STSI= 32768
##$STSR= 0
##$SW_p= 4139.07284768211
##$SYMM= 0
##$S_DEV= 0
##$TDeff= 16384
##$TDoff= 0
##$TI= <>
##$TILT= no
##$TM1= 0
##$TM2= 0
##$TOPLEV= 0
##$USERP1= <user>
##$USERP2= <user>
##$USERP3= <user>
##$USERP4= <user>
##$USERP5= <user>
##$WDW= 0
##$XDIM= 32768
##$YMAX_p= 438050303
##$YMIN_p= -4530886
$$ End of Bruker specific parameters
$$ ---------------------------------
##NTUPLES= NMR SPECTRUM
##VAR_NAME=  FREQUENCY,     SPECTRUM/REAL,   SPECTRUM/IMAG
##SYMBOL=    X,             R,               I
##VAR_TYPE=  INDEPENDENT,   DEPENDENT,       DEPENDENT
##VAR_FORM=  AFFN,          ASDF,            ASDF
##VAR_DIM=   32768,         32768,           32768
##UNITS=     HZ,            ARBITRARY UNITS, ARBITRARY UNITS
##FACTOR=    0.126318333923829, 1,           1
##FIRST=     3305.42128286362, 0,            0
##LAST=      -833.651564818493, 0,           0
##MIN=       -833.651564818493, -4530886,    0
##MAX=       3305.42128286362, 438050303,    0
$$ Real data points
##PAGE= N=1
##DATA TABLE= (X++(R..R)), XYDATA
$$ [...]
21064e78627M07452L18169k49428k06369M30064N63897j15334o40940l38058K45003
$$ -578627 -171175 146994 -102434 -308803 121261 685158 569824 -71116 -409174 -164171
21054a64171L70822J58112N1384l6614l77848o82253m22326K67676O51840L63167
$$ -164171 206651 364763 416147 379533 1685 -680568 -1102894 -835218 -183378 179789
21044A79789j90378m64110l65593o6152L28739O55119O11235J56461k82929l52530
$$ 179789 -10589 -474699 -840292 -906444 -577705 77414 688649 845110 562181 209651
21034B09651k32336j83745j9899L88024M77224k35311r80020n16622Q18800J205896
$$ 209651 -22685 -206430 -226329 161695 638919 403608 -576412 -1093034 -274234 931662
21024I31662j0517j153206o62257N55991O46548l03383o76498r6521K05243k18410
$$ 931662 921145 -232061 -894318 -338327 308221 4838 -671660 -768181 -562938 -781348
21014g81348k80666M99817R44956K09917p03236n71521J39544K72669q2307l3286
$$ -781348 -1062014 -562197 382759 592676 -110560 -682081 -542537 -269868 -352175 -385461
21004c85461M04013M52335M9085j40471Q596Q470j47754P272L09816L1646p73582
$$ -385461 18552 470887 519972 379501 388097 396567 248813 256085 565901 597547 -176035
20993a76035j082407l98062N07154P57385M60944J75020J2283j75199k82711j74339
$$ -176035 -1258442 -1656504 -1149350 -391965 68979 243999 256282 81083 -201628 -375967
20983c75967l2368m1960m9725J09624K72686K52792J58291J06363l8717l28044
$$ -375967 -408335 -450295 -500020 -390396 -117710 135082 293373 399736 361019 32975
20973C2975m70932k62124L8372J03492L3461Q8748J95800J24890m0188k6608J53710
$$ 32975 -437957 -700081 -661709 -558217 -524756 -436008 -240208 -115318 -155506 -182114 -28404
20962b8404K34257J30013J0601k5976o1405j40149j72052p1556J30774K84115
$$ -28404 205853 335866 346467 320491 259086 118937 -53115 -124671 6103 290218
20952B90218J79255k30024o02172m63239J51492N91275L74859j74476l91014j43692
$$ 290218 469473 239449 -362723 -825962 -674470 -83195 291664 117188 -273826 -417518
20942d17518J24878R7047q2407j41938k6567J22400J20976q6238k54692j4092
$$ -417518 -292640 -195593 -278000 -419938 -446505 -324105 -203129 -289367 -544059 -558151
20932e58151N48591P32312O4056q77363j018850j63546P42229Q36239L18484n2447
$$ -558151 -9560 722752 786808 -90555 -1109405 -1272951 -530722 305517 624001 571554
20922E71554K491J41043L2897k79664n71390o57360m29263P0812N48938O22337
$$ 571554 574045 715088 747985 468321 -103069 -760429 -1189692 -1118880 -569942 52395
20912E2395K17193k68002l35455M6731L73799K17064j93504k43293K09011N72502
$$ 52395 269588 1586 -333869 -287138 86661 303725 110221 -133072 75939 648441
20902F48441K88091m32362q87661o96676o9212N17498O39656J77851m24272m47631
$$ 648441 936532 504170 -383491 -1080167 -1149379 -631881 7775 185626 -238646 -686277
20892f86277J52896M65406j25841q18996m22869P44792J147430K90580n74289
$$ -686277 -533381 -67975 -193816 -1012812 -1435681 -690889 456541 747121 172832
20883A72832m31587P1264l5123m02633j94267K94532J79322l53806l24245L12475
$$ 172832 -258755 -187491 -222614 -625247 -819514 -524982 -345660 -699466 -1023711 -711236
20873g11236N71580J14755k67362p6605J79589P0375n1520R1728J23188j54872
$$ -711236 -139656 -24901 -292263 -368868 -189279 -118904 -170424 -78696 44492 -110380
20863a10380k47152J12687L71308J30415j15003P5290K29504j12121m17521r2630
$$ -110380 -357532 -244845 126463 256878 141875 217165 446669 334548 -82973 -175603
20853a75603L33266Q4338m15522k48832L18911K85973k49657k37785L87357N22349
$$ -175603 157663 242001 -173521 -422353 -103442 182531 -67126 -304911 82446 604795
20843F04795j26457m81740j3395L27059j40184n64376r0067N80664L72615l75493
$$ 604795 478338 -3402 -16797 310262 170078 -394298 -484365 96299 468914 93421
20833I3421n94325k09533J03771K72873O01883O92487N83q49288p42702R3427
$$ 93421 -500904 -710437 -606666 -333793 268090 960577 961160 111872 -630830 -537403
20823e37403L84088j07483l03783K08485M82716l9192n32066k46944K81494L06430
$$ -537403 -153315 -260798 -564581 -356096 126620 87428 -444638 -691582 -410088 -103658
20813a03658P7621J09261J79227l6162j63818J05023K29035k39206o50765k60270
$$ -103658 -26037 83224 262451 226289 62471 167494 396529 157323 -493442 -753712
20803g53712M14504L84403j80811l33827K6980J92361O3250K16475N93821M31334
$$ -753712 -339208 45195 -135616 -469443 -442463 -250102 -186852 29623 623444 1054778
20793A054778l33870p72754l79631K40350M04116J52714k37900o35332o99466
$$ 1054778 720908 -51846 -431477 -191127 212989 365703 127803 -507529 -1206995
20784a206995j04108O31657N46783k24312m38227L01621Q07555K20126n63341
$$ -1206995 -1311103 -679446 -132663 -356975 -795202 -493581 313974 534100 -29241
20775b9241l79454L20232L24715l31664n54384R957N94201N90992J86337k23821
$$ -29241 -408695 -88463 236252 -95412 -649796 -639839 -45638 545354 731691 507870
20765E07870m16666k47130J23604J34170l63771o08268n8098N10300J30582o15891
$$ 507870 91204 -155926 -32322 101848 -261923 -870191 -928289 -417989 -287407 -903298
20755i03298l94896O06345Q43567k8290n02097K93469J076353M24478r56100j295033
$$ -903298 -1298194 -691849 151718 123428 -378669 -85200 991153 1415631 459531 -835502
20745h35502l10581O42252O24450J01134j22990J4020Q4466p9266k27904j06772
$$ -835502 -1146083 -503831 120619 221753 98763 112783 197249 117983 -109921 -216693
20735b16693J63168K03667o9266k36103q054K23052J4057k60315M8M03328Q8029
$$ -216693 -53525 150142 80876 -155227 -163281 59771 73828 -186487 -186439 216889 304918
20724C04918n95926l76319O97098R52834k34247j175287m72019O95413N38338
$$ 304918 -291008 -667327 29771 982605 748358 -426929 -898948 -203535 334803
20715C34803m21562m53562L27501L59561l95836l80318O18323R21622j09099r04098
$$ 334803 -86759 -540321 -212820 146741 -249095 -629413 -11090 910532 801433 -102665
20705a02665l65477L71472R2726m21167j1351O73347L56356n78876p66399j22058
$$ -102665 -468142 -96670 -3944 -425111 -436462 236885 593241 14365 -752034 -874092
20695h74092K69368R6735N2569L36032M00077J51050Q1712J68468j42315p33290
$$ -874092 -604724 -507989 -455420 -119388 280689 431739 513451 681919 539604 -193686
20685a93686p58395j7888O36374N69894J48883n9037p1829j29086j96239j70303
$$ -193686 -952081 -969969 -333595 236299 385182 326145 254316 125230 -71009 -241312
20675b41312r1441N1776K90060L90751R8157l49499m70615k46544k1429J40172
$$ -241312 -332753 -280977 9083 399834 497991 148492 -322123 -568667 -590096 -449924
20665d49924L29116K70206k17440m86863J21271Q90808N00374p59815j092440
$$ -449924 -120808 149398 -68042 -554905 -433634 457174 957548 197733 -894707
20656h94707O9616J047804M69952o71610p23861J14839M71084R5620j18458R1442
$$ -894707 -825091 222713 692665 21055 -702806 -587967 -116883 -21263 -139721 -48279
20646d8279J29015j16007j10406J49599O8177l64906m53017M892M10623M05389
$$ -48279 80736 -35271 -145677 3922 72099 -292807 -745824 -740932 -330309 75080
20636G5080K61702J30577j46588l72507j35462K63635Q6467m76624l95022M42731
$$ 75080 336782 467359 320771 -51736 -187198 76437 162904 -313720 -708742 -266011
20626b66011Q31701J50908o06783m78617p633p1297l10876K7354N33653L25308
$$ -266011 565690 716598 109815 -368802 -376435 -447732 -758608 -731254 -197601 127707
20616A27707k76825k29296L95262N27835l3361l54515q7183J1489l46601l26398
$$ 127707 -149118 -378414 16848 544683 511322 156807 69624 81113 -265488 -591886
20606e91886M22646Q13443r227j069787q74235L32558R51831L88950k96565j86411
$$ -591886 -169240 644203 634976 -434811 -1309046 -976488 -24657 364293 67728 -118683
20596a18683K61678K23989j85639l11145o7366R2128M7043J35216M15236M24646
$$ -118683 142995 366984 181345 -129800 -197166 -105038 -57995 77221 492457 917103
20586I17103r8583o85440o90265j62053K31268J09329j82585j69277P5710J53277
$$ 917103 818520 133080 -557185 -719238 -487970 -378641 -561226 -730503 -654793 -501516
20576e01516J3680j2417J87823L08302J28316j43818k12389q1670R4456K59558
$$ -501516 -487836 -500253 -312430 -4128 124188 -19630 -232019 -313689 -219233 40325
20566D0325L25046J06820l04070m22878l3635L15876K1839n71498n47825K18953
$$ 40325 365371 472191 168121 -254757 -288392 27484 49323 -522175 -1070000 -851047
20556h51047P96015M75793l18842p34195n32248m6463M11723O38460M44557k7757
$$ -851047 -55032 420761 101919 -632276 -1164524 -1210987 -799264 -160804 283753 255996
20546B55996k41271J0231J90227j44295n32714l22101K14586L26724M9532J8295
$$ 255996 14725 24956 215183 70888 -461826 -783927 -569341 -242617 -193085 -174790
20536a74790J98869l1915n21065l60021M38153O53188j51255p23949j51421N25067
$$ -174790 24079 -7836 -528901 -888922 -450769 202419 51164 -672785 -824206 -299139
20526b99139N6944p52228k83154J081715J374333J47310q37510m07437L76720
$$ -299139 -242195 -994423 -1277577 -195862 1178471 1325781 488271 80834 457554
20517D57554J87367n13833n32015Q1547L74779J10540j48061j44672r3979j4458
$$ 457554 644921 131088 -400927 -319380 55399 165939 17878 -126794 -220773 -235231
20507b35231K13542L26605M122m46389m37884J754L18150K64211N8849j14970
$$ -235231 -21689 304916 309038 -137351 -575235 -573481 -255331 8880 67729 -47241
20497d7241k09681j10922J29437J27502k18731l30313J76150O62842L76562k43095
$$ -47241 -256922 -367844 -238407 -110905 -329636 -659949 -483799 179043 555605 312510
20487C12510k23906K78481K38963m08452n85998P6880N81551K26553l28162l29132
$$ 312510 88604 367085 606048 197596 -388402 -311522 270029 496582 168420 -160712
20477a60712j18783k36767l37370M1972M54499K94390r2058n1932J94708N6549
$$ -160712 -279495 -516262 -853632 -811660 -357161 -62771 -154829 -206761 -12053 44496
20467D4496k47559j05851K75234K12711j77042k09916M0414j17654n66561l92841
$$ 44496 -203063 -308914 -33680 179031 1989 -207927 -167513 -285167 -851728 -1244569
20457a244569M88443R97062N67913j9825m2054O1501k79635o14710k96589K79516
$$ -1244569 -756126 240936 808849 789024 746970 808471 528836 -85874 -382463 -102947
20447a02947K78651k17478m32551j57068J30651J98444K33693J95470j43920n15228
$$ -102947 175704 -41774 -474325 -631393 -500742 -302298 -68605 126865 -17055 -532283
20437e32283l40032K95891O25234L24555p1022j04164j6116r2565r4154J68717
$$ -532283 -872315 -576424 48810 373365 302343 198179 182063 89498 -4656 164061
20427A64061K95863o1218m80563l55911J34648L39389J74006J06734K21702R8630
$$ 164061 459924 398706 -81857 -437768 -303120 36269 210275 317009 538711 637341
20417F37341l17068n14339k93455r8850j66214q2202L49435N43509R4957l60186
$$ 637341 320273 -194066 -487521 -586371 -752585 -834787 -485352 58157 153114 -207072
20407b07072j09694L50129P8292o01501m60213N60195J033171K36270o72094m61675
$$ -207072 -316766 33363 111655 -489846 -950059 -389864 643307 879577 207483 -254192
20397b54192L17343L88917k01342m05054j5758K05132N0582J19413M59675L13358
$$ -254192 63151 452068 250726 -154328 -170086 35046 85628 205041 664716 978074
20387I78074m27657p62439j67148M66014K48869l02701k42990K04922J61529k99041
$$ 978074 550417 -212022 -379170 86844 335713 33012 -209978 -5056 156473 -142568
20377a42568k92119K91087N53098Q3592m04556k96581Q157m2606j57595J69531
$$ -142568 -434687 -143600 409498 493090 88534 -208047 -199890 -242496 -400091 -230560
20367b30560N62900K24639o60164r15757k5115R67571P70769l87605j053110n03730
$$ -230560 332340 556979 -103185 -1018942 -1044057 -76486 694283 306678 -746432 -1250162
20357a250162L91867N43531J12646l5387J86958J21481k89549k97324K71663N09694
$$ -1250162 -858295 -314764 -202118 -237505 -50547 70934 -218615 -515939 -244276 265418
20347B65418r4386o34743j68985O44332M96521m46385p78286j17685L70425K9025
$$ 265418 171032 -463711 -632696 11636 508157 61772 -716514 -834199 -463774 -434749
20337d34749k27322L25729P58804J8966j073776r00868M04903J124656N75035
$$ -434749 -662071 -336342 422462 441428 -632348 -1533216 -1128313 -3657 571378
20328E71378r1905j9995O4345n05219q72517j24689Q51350N81273n33635p39733
$$ 571378 479473 459478 523823 18604 -853913 -978602 -127252 454021 -79614 -819347
20318h19347K21881O73485j87291q87455j14419J025045P39101n43536q89827
$$ -819347 -597466 76019 -111272 -998727 -1113146 -88101 651000 107464 -782363
20309g82363L4218O01323K5155m72972P0577P13601L31258m33227l55523K50543
$$ -782363 -748145 -146822 -121667 -594639 -524062 189539 520797 87570 -267953 -17410
20299a7410J90803m52414m94733K34957O00116J28452k58606M7420K91410k17890
$$ -17410 173393 -279021 -773754 -538797 61319 189771 -68835 -21415 269995 52105
20289E2105p62906l24651P09721J034565K67075o54805q13171k81401K79056M10594
$$ 52105 -710801 -1035452 -325731 708834 975909 321104 -492067 -773468 -494412 -83818
20279h3818J40759j56566j14121K10089L47370L3080l91248m38852j18864J81720
$$ -83818 56941 -99625 -213746 -3657 343713 376793 -14455 -453307 -572171 -390451
20269c90451K48104J49986n914j17505o0218R5586O1253j98942k84762M776K35080
$$ -390451 -142347 7639 1725 -115780 -175998 -80412 -19159 -218101 -502863 -498087 -263007
20258b63007J2492k98793j68160J48356M3628l01938j72448L60624M32070j29061
$$ -263007 -250515 -549308 -717468 -569112 -525484 -827422 -999870 -639246 -207176 -336237
20248c36237m06071P2341M69924M2474n24861j91720O67713P56055j52129q83567
$$ -336237 -742308 -669967 -200043 -157569 -682430 -874150 -206437 549618 397489 -486078
20238d86078o01615J68982N43879M36369K55592J14427r6995k54935j49125J14233
$$ -486078 -1087693 -918711 -374832 61537 317129 431556 334561 79626 -69499 44734
20228D4734K35470J09698j45177l62024l52352l2677L00358J91519k35160k41879
$$ 44734 280204 389902 244725 -117299 -469651 -502328 -201970 -10451 -245611 -487490
20218d87490M08319Q45102K90936n85553n08936L97545O58654k75873j069226
$$ -487490 -79171 765931 1056867 471314 -37622 359923 1018577 742704 -326522
20209c26522n23533N33152N36526l71812o40382J85091P87915K31473n95673m59224
$$ -326522 -850055 -316903 219623 -152189 -792571 -607480 180435 411908 -183765 -642989
20199f42989L32360N64083J8974l78093r9465L34446L18634n1825l63831m04339
$$ -642989 -310629 253454 272428 -105665 -205130 129316 447950 396125 32294 -372045
20189c72045r4934M94104Q44616L35110p65488j256255m82434O41224P59672j07562
$$ -372045 -466979 27125 871741 1206851 441363 -814892 -1297326 -656102 103570 -3992
20179c992o86468k75347M31505N47249J96576J9975J02304Q8083r877J10029K93525
$$ -3992 -690460 -965807 -534302 12947 209523 229498 331802 419885 410008 520037 813562
20168H13562N1941n09399o46321j06551L97091K44468j91672k38639L4873J38177
$$ 813562 865503 356104 -290217 -396768 323 244791 53119 -185520 -150647 -12470
20158a2470P0779J34665J68852j48148m46930j05583N31349M68347k83015n47030
$$ -12470 58309 192974 361826 213678 -233252 -338835 192514 660861 377846 -169184
20148a69184J34155O77279K09970m88436l01238L97654M61426j30734m35707k35458
$$ -169184 -35029 642250 852220 363784 62546 460200 921626 790892 355185 119727
20138A19727j83335l80022j79385M43377O27627Q6483l38730q5992K22069o8508
$$ 119727 -63608 -443630 -623015 -179638 447989 534472 195742 109750 331819 263311
20128B63311n05514l53570J47000K29675j36921l00643k5600K25796J01123j37758
$$ 263311 -242203 -595773 -448773 -219098 -356019 -656662 -682262 -456466 -355343 -493101
20118d93101m6838L87664O92242L94984l86422r02053n61250K74342O67593K82047
$$ -493101 -539939 -152275 539967 934951 548529 -353524 -914774 -640432 27161 309208
20108C09208k87832m24354j77749J01594K51779J92823j18971l87755j86507L04136
$$ 309208 21376 -402978 -580727 -479133 -227354 -34531 -153502 -541257 -727764 -423628
20098d23628L96833j3149k08323J43260L81807J973m36616k80764R4405J7094
$$ -423628 -26795 -39944 -248267 -105007 276800 278773 -157843 -438607 -344202 -327108
20088c27108k67882j08205L19102L25517m4804j14093K40753M39294J92263j53249
$$ -327108 -594990 -703195 -384093 -58576 -103380 -217473 23280 462574 654837 501588
20078E01588k47391q7143J61040J86241l03445r33932p48931L63972J063422L66286
$$ 501588 254197 167054 328094 514335 210890 -723042 -1471973 -1108001 -44579 321707
20068C21707o86449n04094N50213P69401j46847p74249l77428J96075K93821L49255
$$ 321707 -364742 -868836 -318623 450778 303931 -470318 -847746 -651671 -357850 -8595
20058h595N28481K03806n68578o70519J86567P27183J62211n14187l06203J41949
$$ -8595 519886 723692 155114 -515405 -328838 398345 560556 46369 -259834 -117885
20048a17885r5120n13936k08579M37960M82860K4595j95536o1550J60937N25616
$$ -117885 -213005 -726941 -935520 -497560 -14700 9895 -185641 -247191 -86254 439362
20038D39362Q17332K63376j010667j400141j11553J177012O74975o57231o92727
$$ 439362 1256694 1520070 509403 -890738 -1002291 174721 849696 192465 -500262
20029e00262L77174O00488k59977m92281L69159P83351N7153n31118j94468P7352
$$ -500262 -123088 477400 217423 -274858 94301 877652 934805 403687 209219 286571
20019B86571l44074m50145L38723P87652l0003r13145m50703O18147O67421k35890
$$ 286571 -57503 -507648 -168925 618727 588724 -324421 -775124 -156977 510444 274554
20009B74554p12623l07617K27785L96549L15306L535m65274m85277K65237R25614
$$ 274554 -438069 -745686 -517901 -121352 193954 197489 -267785 -753062 -487825 437789
19999D37789N19330m47589o46585P6200N75379J92622m65593o13042k04288L46901
$$ 437789 957119 509530 -137055 -60855 514524 707146 241553 -371489 -575777 -228876
19989b28876O21378L27000l81169p81177l93933K64532L83795M0243q9016P9968
$$ -228876 392502 719502 338333 -442844 -836777 -572245 -188450 -148207 -237223 -157255
19979a57255M8238k04626j49237K64313M25137P9981k63618j78735J07498K12619
$$ -157255 -109017 -313643 -462880 -198567 226570 306551 42933 -135802 -28304 184315
19969A84315J14580k8107j17733o1894J32217K03842k5251k54590j01590K40330
$$ 184315 298895 270788 153055 91161 223378 427220 401969 147379 45789 286119
19959B86119K59973p9886l42147k80247M791L73778N90205K62220n21192q77591
$$ 286119 546092 466206 124059 -156188 -151397 222381 812586 1074806 553614 -323977
19949c23977k52612N37090L67849m22977n33844K06711O13237J27132l61996r3915
$$ -323977 -576589 -39499 328350 -94627 -628471 -421760 191477 318609 -43387 -137302
19939a37302M05422L51941j18274m31664m31963k20993J32895L30865M0072l63257
$$ -137302 268120 620061 501787 70123 -361840 -582833 -449938 -119073 -79001 -442258
19929d42258j33021N16424N12139k86562o67445k3081O07840L08597k14511j2775
$$ -442258 -575279 -58855 453284 166722 -500723 -523804 84036 392633 178122 165347
19919A65347M13331J46246m12157l24503J20618j2410n07766l55533M16444P86680
$$ 165347 578678 724924 312767 -11736 108882 96472 -411294 -766827 -350383 436297
19909D36297M50183O5019r9288l68169n75532j78449M96339M95403j63048m81107
$$ 436297 886480 951499 852211 484042 -91490 -269939 226400 721803 558755 77648
19899G7648j87684m0165k45900j11602L96476L50314l36690m44465M25806Q93717
$$ 77648 -110036 -150201 -396101 -507703 -111227 239087 -97603 -542068 -116262 777455
19889G77455O1137q13920l33219O71504N09249n87002r37788j43553N50081M44641
$$ 777455 838592 24672 -308547 362957 872206 285204 -652584 -796137 -246056 198585
19879A98585J68695J57303k568l75435l15656K15478L28826k11437l95347K87752
$$ 198585 367280 524583 522015 146580 -169076 46402 375228 163791 -231556 56196
19869E6196P79255J60317o78244m03641N32338N88234l52254q17386j52659N20211
$$ 56196 835451 995768 317524 -86117 446221 1034455 682201 -135185 -287844 232367
19859B32367K49192k67766l9117N00950L10772m31497o21537m6416L58969Q2954
$$ 232367 481559 213793 174676 675626 986398 554901 -66636 -113052 245917 328871
19849C28871l02535k81739j25464q6490J35483N62915N10803k57840p78287k29631
$$ 328871 26336 -255403 -380867 -467357 -331874 231041 741844 484004 -294283 -523914
19839e23914O49733O05606j78848m53377L7154K70443k00610n26315j10995L82612
$$ -523914 125819 731425 552577 99200 136354 406797 206187 -320128 -431123 -48511
19829d8511K49234j00499r140K67773J65594j15711p3966J01624n1892k88845
$$ -48511 200723 100224 91084 358857 524451 408740 334774 436398 384506 95661
19819I5661p0782L45576K53011k41729l30917J27255L75175M9830k55080n5597
$$ 95661 24879 370455 623466 381737 50820 178075 553250 603080 348000 292403
19809B92403K42809J08892k47087l16993j14807r697p4172r4629j9942J8973P651
$$ 292403 535212 644104 397017 80024 -34783 -44480 -118652 -213281 -233223 -214250 -206599
19798b06599M5602J42816K42067L25677L39378J80934q3710k05455j23437j11040
$$ -206599 -160997 -18181 223886 549563 888941 1069875 986165 780710 657273 546233
19788E46233l36452n22660l30164J12171L78663L31539K13415K01026J71049l8627
$$ 546233 209781 -312879 -643043 -530872 -152209 179330 392745 593771 764820 726193
19778G26193l42043m61557k02599L03452N93327K70863m44054p73405k83078M29471
$$ 726193 384150 -77407 -280006 23446 616773 887636 443582 -329823 -612901 -183430
19768a83430L96984l70372p60568o1534R34399R24383q6521p62816l15371M42535
$$ -183430 213554 -156818 -917386 -978920 -44521 879862 793341 30525 -284846 157689
19758A57689L92054k49799m21684N1950K79913j38411m56086q2017L95900J90913
$$ 157689 549743 299944 -121740 -69790 210123 71712 -384374 -466391 -70491 120422
19748A20422l73537m02150J51149N12369L38629N4064l5846j24650k82527k16919
$$ 120422 -253115 -655265 -504116 8253 346882 400946 365100 240450 -42077 -258996
19738b58996J13546K89509R6737j49991j78907j16742n6529J43223L61917J54684
$$ -258996 -145450 144059 240796 90805 -88102 -204844 -261373 -118150 243767 398451
19728C98451m30055o00509P6842Q59012P53430j16708p39734n61271L9890M68042
$$ 398451 -31604 -632113 -555271 303741 1057171 940463 200729 -360542 -320652 147390
19718A47390M81821J12154m05953n92418j33564N69439P04101M1392p24710q02769
$$ 147390 629211 741365 335412 -257006 -390570 178869 882970 924362 199652 -603117
19708f03117k10517L37715L16082l9227j07740K45755M43308M2729m84345l65119
$$ -603117 -813634 -475919 -159837 -199064 -306804 -61049 382259 424988 -59357 -424476
19698d24476K31958L66197j58526m13273Q6945M66429l7460o28275j81015P69383
$$ -424476 -192518 173679 15153 -398120 -311175 155254 117794 -510481 -691496 77887
19688G7887P49331k71187q21251k93179K53533L9286k34408J46614O08962M35037
$$ 77887 827218 556031 -265220 -558399 -304866 -265580 -499988 -353374 255588 690625
19678F90625P7166K10880L91691j09522q21537p32369P132L38279K0576j56307
$$ 690625 767791 978671 1370362 1260840 439303 -293066 -285934 52345 72921 -83386
19668h3386J60357L95969J52973k30398m08474m05244j38569M92784R21912L70023
$$ -83386 76971 472940 625913 395515 -12959 -418203 -556772 -63988 857924 1227947
19658A227947p48901j003893M608Q89257M69482n14556o31292J36129O48920M28844
$$ 1227947 479046 -524847 -520239 369018 838500 323944 -307348 -171219 477701 906545
19648I06545K6131j60040k92764l76584j44441K43598K68953n3040j59698N5481
$$ 906545 932676 772636 479872 103288 -41153 202445 471398 418358 258660 314141
19638C14141O5472k62770l37769R9949M15812Q7486m29048m32826k631L22140
$$ 314141 379613 116843 -220926 -120977 294835 382321 -46727 -479553 -482184 -160044
19628a60044L85931L17717N4836l53196l93385J93937P11298L74123l94900n11611
$$ -160044 225887 543604 598440 245244 -148141 45796 757094 1131217 736317 224706
19618B24706P7284L39232j36510n29103k32012J94136J19954p6365J50691M00204
$$ 224706 301990 641222 504712 -24391 -256403 -62267 57687 -18678 132013 532217
19608E32217N0517m75340k94146L85777M65719k85566p80774k19757P55923R91302
$$ 532217 582734 107394 -186752 199025 664744 379178 -401596 -621353 134570 1125872
19598A125872K72661o26343r26008m67378L18996P50956M60093j73540m27253
$$ 1125872 1398533 772190 -153818 -621196 -302200 448756 908849 735309 308056
19589C08056j69848L4413j22388k18707J03406M56540L25404r0555k35296n8874
$$ 308056 138208 172621 50233 -168474 -65068 391472 716876 626321 391025 332151
19579C32151Q0087J07464J94059K20318m1165l17093j23476L40599L38945k29816
$$ 332151 412238 519702 713761 934079 892914 575821 452345 792944 1131889 902073
19569I02073n65504j79896L29932K20175k55355k95784J89509M90919K01494k30644
$$ 902073 336569 156673 486605 706780 451425 155641 345150 836069 1037563 806919
19559H06919k18876J46025K89950m5192m80278m83241k1057L85854K68592k42458
$$ 806919 588043 734068 1024018 978826 498548 15307 -5750 380104 648696 406238
19549D06238n91080m39730M3252M90150O64091M69926l6467n19981n52905j29836
$$ 406238 -184842 -624572 -581320 -91170 572921 1042847 1006380 486399 -66506 -196342
19539a96342K56537K45377L3802m3005j5107l9146j1656J30111M9663m51611p90016
$$ -196342 60195 305572 339374 296369 281262 242116 230460 360571 410234 -41377 -831393
19528h31393k50088P91160J137409M20850l70416l59160N3232N8853k46550k27943
$$ -831393 -1081481 -290321 847088 1267938 897522 538362 591594 650447 403897 175954
19518A75954J17957K55620R7202J1532J572k29814m57241j48861M18070L20073
$$ 175954 293911 549531 646733 658265 659837 430023 -27218 -176079 241991 562064
19508E62064m35625o15177L45757J206510O56598o29061r26821j7166N97376M8591
$$ 562064 126439 -488738 -142981 1063529 1720127 1091066 164245 147079 744455 793046
19498G93046o68414l17319P53910J188147M58868o22611j041650o44463m4668
$$ 793046 124632 -192687 561223 1749370 2208238 1585627 543977 -100486 -145154
19489a45154J91782J11946J36184L47256L30588p9221l29719K7150M19832J4488
$$ -145154 46628 158574 294758 642014 972602 893381 563662 590812 1010644 1025132
19479A025132q00206p75510K39007R05616M16411k99307j59589L86017L41770
$$ 1025132 224926 -550584 -311577 594039 1010450 711143 551554 937571 1279341
19470A279341p8393k0891L15660N9516n79378m97522L47470O91155k4278p76036
$$ 1279341 1200948 1180057 1495717 1555233 975855 478333 825803 1516958 1492680 716644
19460G16644o10696M9124L76304L42599K43191k9144m66721n31666l0041L54337
$$ 716644 105948 155072 531376 873975 1117166 1088022 621301 89635 59594 413931
19450D13931J48992p5408K16936M62894L4336m59177j50225M40386J85963o10478
$$ 413931 562923 487515 704451 1167345 1201681 742504 592279 1032665 1218628 608150
19440F08150n63941M60670R93561K61181o53713n76435J07375L84658J83608P5204
$$ 608150 44209 504879 1498440 1759621 1105908 529473 636848 1021506 1205114 1280318
19430A280318J43956R6208R379J35595L01254K13536M9541Q9666J02873k12123
$$ 1280318 1424274 1520482 1529861 1665456 1966710 2180246 2229787 2319453 2422326 2210203
19420B210203m90185j88437L89382L98749k41076o71131l67501J61113K55766
$$ 2210203 1720018 1531581 1920963 2319712 2078636 1407505 1040004 1201117 1456883
19411A456883M4955L6103K20356J57379k18331m14388r4738L90701M32913l9784
$$ 1456883 1501838 1537941 1758297 1915676 1697345 1282957 1188219 1578920 2011833 1972049
19401A972049m84242m81400k41383j56040j33724J66991N69220M71241j62185
$$ 1972049 1487807 1006407 765024 608984 475260 642251 1211471 1682712 1520527
19392A520527n56592k36091K33387J56286j86905j05924K43527J35095l73671
$$ 1520527 963935 727844 961231 1117517 930612 824688 1068215 1203310 829639
19383H29639m42517R0533L54177o1769l25717K26127Q32123M55908m61580n99196
$$ 829639 387122 477655 831832 770063 444346 670473 1502596 1958504 1496924 897728
19373H97728J97071P22084L17085k42940j44820K42358J92783j51889j96537K4652
$$ 897728 1094799 1816883 2133968 1891028 1746208 1988566 2181349 2029460 1832923 1857575
19363A857575L9767j23185m7364J91822J04705k67233l12169J12112L92486J86137
$$ 1857575 1897342 1774157 1726793 1918615 2023320 1756087 1443918 1556030 1948516 2134653
19353B134653k4453J69601L40668k3938n37336m33974K09976N38998J41963m48953
$$ 2134653 2110200 2279801 2620469 2596531 2059195 1625221 1835197 2374195 2516158 2067205
19343B067205n66848j97092J86050J98874j47451m69707l43861J59278M17690
$$ 2067205 1500357 1303265 1489315 1688189 1540738 1071031 727170 886448 1304138
19334A304138N9576m11857k86451K72553M74393J23880j75699r6178l1165k38205
$$ 1304138 1363714 951857 665406 937959 1412352 1536232 1360533 1264355 1233190 994985
19324I94985l47256j11782R0042k3511j06332R3596J70635j36925k61161K63951
$$ 994985 647729 535947 625989 602478 496146 589742 760377 623452 362291 626242
19314F26242P75836L83352n07217o74217O0951N77314J70852m93129m91823R0216
$$ 626242 1402078 1785430 1278213 603996 664947 1242261 1413113 919984 428161 518377
19304E18377M75287K65557k07548l56436K5286M60388K54659m91622p42872N5602
$$ 518377 993664 1259221 1051673 695237 720523 1180911 1435570 943948 201076 256678
19294B56678R19396O09711m09156n71096L23633P48992r1179r77965o47796K87017
$$ 256678 1176074 1785785 1376629 805533 1129166 1878158 1786979 809014 161218 448235
19284D48235N18977J10757M5122L90606L23547l07230p11755m33926J23472M77664
$$ 448235 967212 1077969 1123091 1513697 1837244 1530014 818259 384333 507805 985469
19274I85469N25704K45288k72307n33457j63953L39889J83338m57969o11758J5722
$$ 985469 1511173 1756461 1484154 950697 786744 1126633 1309971 852002 240244 255966
19264B55966O31317N71970Q9236k98752m53700l62581K3036M14917L41798p6225
$$ 255966 887283 1459253 1548489 1249737 796037 433456 456492 871409 1213207 1136982
19254A136982k02941N1417N3135l71232m90196P9704N61606J96050m90635m67030
$$ 1136982 934041 985458 1038593 667361 177165 256869 818475 1014525 523890 56860
19244E6860K52048P24189M60805j17815m50086l60776P0075N60479O45055J73500
$$ 56860 308908 1033097 1493902 1376087 926001 565225 635300 1195779 1840834 2014334
19234B014334l31597l12027J3482K0183l29912n00435k79060R25J33386K88086
$$ 2014334 1682737 1370710 1384192 1404375 1074463 574028 294968 295893 429279 717365
19224G17365M95254M70887J31648j92368k37962j19175l0700M787m434p9112j16760
$$ 717365 1212619 1683506 1815154 1622786 1384824 1265649 1234949 1239736 1235302 1156190 1039430
19213A039430J0607J85394J86303O8319M9391R5059L0987l6577Q4901J77105p2642
$$ 1039430 1050037 1235431 1421734 1490053 1539444 1634503 1665490 1628913 1713814 1890919 1818277
19202A818277l56779j28961L11312Q5677p07365q14644K40788J141373O22034
$$ 1818277 1461498 1332537 1643849 1729526 1022161 207517 448305 1589678 2211712
19193B211712n49492o79297L15114R00256L34365l70338k18166L13721K80679
$$ 2211712 1662220 982923 1298037 2198293 2532658 2162320 1944154 2257875 2538554
19184B538554k15802l98367j11085J44162J62693J98981K78603J07412k63481
$$ 2538554 2322752 1924385 1813300 1957462 2120155 2319136 2597739 2705151 2441670
19175B441670l45576J0597L03778J49726j11894o032K40068L2442n41400o62997
$$ 2441670 2096094 2106691 2410469 2560195 2448301 2442269 2682337 2714779 2173379 1510382
19165A510382K1981P27111N19097l51425p57771k82087K28492j6193n28794l17839
$$ 1510382 1532363 2259474 2778571 2427146 1669375 1387288 1615780 1599587 1070793 752954
19155G52954M90021P27726l2587p13613k80256O65734P13749k76745r56406m34993
$$ 752954 1242975 1970701 1938114 1224501 944245 1609979 2323728 2046983 1090577 655584
19145F55584N24467P15613J19796l59814k69783Q4587M00459O14398N04287r1574
$$ 655584 1180051 1895664 2015460 1655646 1385863 1470450 1870909 2485307 2989594 2898020
19135B898020o34386l48046M98483O94995j44477q58330m22199N06258O51632
$$ 2898020 2263634 1915588 2414071 3109066 2964589 2106259 1684060 2190318 2841950
19126B841950O3327j60852K62829M78415L6438m16643k94379O5078J24476m3532
$$ 2841950 2905277 2744425 3007254 3485669 3522107 3105464 2811085 2876163 3000639 2957107
19116B957107j28720j28747j08618K7180J87680Q9904j38843l3912K75255P7786
$$ 2957107 2828387 2699640 2591022 2618202 2805882 2895786 2756943 2723031 2998286 3076072
19106C076072n80270o21254L10144R25197J89219q53784n84394N93394Q73179
$$ 3076072 2495802 1874548 2184692 3109889 3299108 2445324 1860930 2454324 3327503
19097C327503p4370p15069k57545K25464j48142o05872k69557K59609Q3782l28003
$$ 3327503 3253133 2538064 2280519 2505983 2357841 1751969 1482412 1742021 1825803 1497800
19087A497800l1651O17794N39800j72257l81553J88064N47843R8853n19932o02985
$$ 1497800 1466149 2083943 2623743 2451486 2069933 2257997 2805840 2904693 2384761 1781776
19077A781776l74532k96786k04177K30598P21009P08043J89674l00474l84186
$$ 1781776 1407244 1110458 906281 1136879 1857888 2565931 2755605 2455131 2070945
19068B070945j51232P8056L9005k77406n15465k52784M00950P70660M43040j43526
$$ 2070945 1919713 1997769 2036774 1759368 1243903 991119 1392069 2162729 2605769 2462243
19058B462243k84967M1449K61374J06588r2388o4985k6683k01255l39788j09766
$$ 2462243 2177276 2218725 2480099 2586687 2494299 2429314 2402631 2201376 1861588 1751822
19048A751822K95459L93168J51470J4410J55441K02734q5276l28577r6701L57466
$$ 1751822 2047281 2440449 2591919 2606329 2761770 2964504 2879228 2550651 2453950 2811416
19038B811416M32876P6042j99642j50078q1939j82123j35608K73430O25345L79020
$$ 2811416 3244292 3320334 3120692 2970614 2888675 2706552 2570944 2844374 3469719 3848739
19028C848739l05204o81778l11167M45171Q22344M16021l99195p90044l58919
$$ 3848739 3543535 2861757 2550590 2995761 3818105 4234126 3834931 3044887 2685968
19019B685968L21129L84079j47384l92751M5013M62169J97424k90822k02458K71886
$$ 2685968 3007097 3391176 3243792 2851041 2896054 3358223 3555647 3264825 3062367 3334253
19009C334253L16141r4771j72563K86232N01718R57n76804m65513R9191L29715
$$ 3334253 3650394 3555623 3383060 3669292 4171010 4171967 3595163 3129650 3228841 3558556
18999C558556L4119k75989k07489Q6748K52398J66562l059k4408J21398K06926
$$ 3558556 3592675 3316686 3109197 3195945 3448343 3614905 3611846 3587438 3708836 3915762
18989C915762R1812l6273K5484J19028K6281m1609K20985N28346L28218k09996
$$ 3915762 4007574 3971301 3996785 4115813 4142094 4100485 4321470 4849816 5178034 4968038
18979D968038l12134J72651M95625K31369q1571M8556K54066Q1604j95066k04471
$$ 4968038 4655904 4828555 5324180 5555549 5473978 5522534 5776600 5858204 5663138 5458667
18969E458667j91096l57806k31710M27879Q04646J89764o44582n01279K79699
$$ 5458667 5267571 4909765 4678055 5105934 5910580 6100344 5455762 4954483 5234182
18960E234182L66833l04324m49263K87968O66485k1667p16166l59970M03359M23450
$$ 5234182 5601015 5296691 4847428 5135396 5801881 5780214 5064048 4704078 5107437 5530887
18950E530887p8682j02327L44892L91071r5815l28477p909K20674n4416l08876
$$ 5530887 5452205 5349878 5694770 6085841 5990026 5661549 5653640 5874314 5819898 5511022
18940E511022J8765N75456N60607j57893q24766o72616J81840Q22376N78142j22733
$$ 5511022 5529787 6105243 6665850 6507957 5683191 5010575 5192415 6014791 6592933 6470200
18930F470200k67986L45876P71340K69357n61695o41157K5430M70017K84579P5816
$$ 6470200 6202214 6548090 7319430 7588787 7027092 6385935 6411365 6881382 7165961 7241777
18920G241777K68097L82967l2842n05554l30619K99375N92992L46299J00903J66500
$$ 7241777 7509874 7892841 7859999 7354445 7023826 7323201 7916193 8262492 8363395 8529895
18910H529895K13248P963j07762J39627L57520Q3291l57212k51474L53658O13786
$$ 8529895 8743143 8751106 8643344 8782971 9140491 9223782 8866570 8615096 8968754 9582540
18900I582540J14682n16797n32194l5643L75569M72617L92452J57254k30102m85567
$$ 9582540 9697222 9180425 8648231 8612588 8988157 9460774 9853226 10010480 9780378 9294811
18890I294811l95396k10780j55191Q4787O79028R12209J32440q69455p02214M59907
$$ 9294811 8899415 8688635 8533444 8618231 9297259 10209468 10341908 9472453 8770239 9230146
18880I230146R93302L35046k03230K66402P32047J81929n09833j13842P10046
$$ 9230146 10223448 10558494 10355264 10621666 11353713 11535642 11025809 10911967 11622013
18871A1622013N20271l40197l01511O67562R59937J03231m32992K32071R38759
$$ 11622013 12142284 11802087 11500576 12168138 13128075 13231306 12798314 13030385 13969144
18862A3969144N33982k18210n4545O53629O58554q492j59300N24173R67627M01838
$$ 13969144 14503126 14284916 14230371 14884000 15542554 15534062 15374762 15898935 16866562 17268400
18852A7268400m72710n02096L51187J017349P28436m6156k83545K01285N53881
$$ 17268400 16795690 16293594 16644781 17662130 18390566 18344410 18060865 18262150 18816031
18843A8816031K17024j72554J72232P96800O61356p8718k03150N66398J031708
$$ 18816031 19033055 18860501 19032733 19829533 20490889 20412171 20209021 20775419 21807127
18834B1807127M61514k12780N1397P59393Q25409L29344J68027N06697P28182
$$ 21807127 22268641 22055861 22107258 22866651 23692060 24021404 24189431 24696128 25424310
18825B5424310O09328N10776N77951O47340P82907J099920J257644R27510N47431
$$ 25424310 26033638 26544414 27122365 27769705 28552612 29652532 30910176 31837686 32385117
18816C2385117P76111J389135J582978J240265J023479J285294J718552K038259
$$ 32385117 33161228 34550363 36133341 37373606 38397085 39682379 41400931 43439190
18808D3439190K222604K156198J818237J695195K180172K751747K690516K393724
$$ 43439190 45661794 47817992 49636229 51331424 53511596 56263343 58953859 61347583
18800F1347583K832704L816644M128997L514060L138801L716005M523559M849200
$$ 61347583 64180287 67996931 72125928 75639988 78778789 82494794 87018353 91867553
18792I1867553N115871N822546O547279O898386P418457Q565516R728437J0312738
$$ 91867553 96983424 102805970 109353249 116251635 123670092 132235608 141964045 152276783
18784A52276783J0937248J2315637J3625755J3366752J1472223R247524P374775
$$ 152276783 163214031 175529668 189155423 202522175 213994398 223241922 230616697
18777B30616697N286219K616682J02451j326733j524678q82185K43293J563586
$$ 230616697 235902916 238519598 238622049 237295316 235770638 234888453 235131746 236695332
18769B36695332K786282L656179L744527K374180o38080m278831p115051q803165
$$ 236695332 239481614 243137793 246882320 249256500 248618420 244339589 237224538 228421373
18761B28421373j0112337j1426001j2107980j1634762j0504266r490855q639059
$$ 228421373 218309036 206883035 194775055 183140293 172636027 163145172 154506113
18754A54506113p601368o487523n690860n136759m372318l339311k490028k076054
$$ 154506113 146904745 140417222 134726362 129589603 125217285 121877974 119387946 117311892
18746A17311892j796236j310422p28995l42416j05964L06797J021736J795316
$$ 117311892 115515656 114205234 113476239 113133823 113027859 113334656 114356392 116151708
18738A16151708K332401K573108K654901K806077L297157M205956N135593N533506
$$ 116151708 118484109 121057217 123712118 126518195 129815352 134021308 139156901 144690407
18730A44690407N521005N998628P516222R415050J0683586J1367159J2330811
$$ 144690407 150211412 156210040 163726262 173141312 183824898 195192057 207522868
18723B07522868J3710079J4505704J3938506J2430746J0888369R635248Q423321
$$ 207522868 221232947 235738651 249677157 262107903 272996272 282631520 291054841
18716B91054841O960829N085712K881721Q93219k07199l01511K65563J305385
$$ 291054841 298015670 303101382 305983103 306876322 306669123 306367612 306633175 307938560
18708C07938560K524088K875318J437440j050476l060487m870303q315752j3279276
$$ 307938560 310462648 313337966 314775406 313724930 310664443 305794140 297478388 284199112
18700B84199112j6733499j6786312j5535460j5776662j6761133j5957953j3588731
$$ 284199112 267465613 250679301 235143841 219367179 202606046 186648093 173059362
18693A73059362j2114369j1894815j0843262q472779o898463p110394p353382
$$ 173059362 160944993 149050178 138206916 129734137 122835674 115725280 108371898
18686A08371898o326166n189700n034201m931234m086037l553911m054728m268991
$$ 108371898 102045732 96856032 91821831 86890597 82804560 79250649 75195921 70926930
18678G0926930l219956k295987k810168l486309k714658j544400j802846k718998
$$ 70926930 67706974 65410987 62600819 59114510 56399852 54855452 53052606 50333608
18670E0333608k299965r69271q01945j807229k036024j126599p36397j341397
$$ 50333608 48033643 47064372 46262427 44455198 42419174 41292575 40556178 39214781
18662C9214781j495926p03956l18001r15536j291837q69326p26253j289784j315778
$$ 39214781 37718855 37014899 36696898 35781362 34489525 33620199 32893946 31604162 30288384
18653C0288384k92493L48719k57528p87457j48670M41822l68778j510543j195779
$$ 30288384 29995891 30344610 30087082 29299625 29150955 29592777 29223999 27713456 26517677
18644B6517677R4092N09305j40496m29376O7499K67076l42948q98507o90545j25662
$$ 26517677 26611769 27121074 26980578 26551202 26618701 26885777 26542829 25644322 24953777 24828115
18634B4828115J65968J45741K9105p6780n4342R8025O6501l00436n46526k63943
$$ 24828115 24994083 25139824 25168929 25092149 25037807 25135832 25202333 24901897 24355371 24091428
18624B4091428J22562m1029n56750o96701l50778l0587O1969J40321J81904L103
$$ 24091428 24213990 24172961 23616211 22919510 22568732 22538145 22600114 22740435 22922339 22925442
18614B2925442j52577P4767L89207K23809k13676j99018K31454K52484l50709
$$ 22925442 22772865 22847632 23236839 23460648 23246972 23047954 23279408 23531892 23181183
18605B3181183p28719k73918M60192O59824M20511L94008O69945O83716J77287
$$ 23181183 22452464 22178546 22638738 23298562 23719073 24113081 24783026 25466742 25644029
18596B5644029k95190o2258P09545J118672O57265j06965k86204J82913O70806
$$ 25644029 25348839 25286581 25996126 27114798 27772063 27665098 27378894 27561807 28232613
18587B8232613R07265J141838J303105R38681K01919o6770L78411P88422P54575
$$ 28232613 29139878 30281716 31584821 32523502 32725421 32658651 33037062 33825484 34580059
18578C4580059Q67242J409867J582742R60194N60006J240341K073130J777556
$$ 34580059 35447301 36857168 38439910 39400104 39960110 41200451 43273581 45051137
18570D5051137R06063R35060J807086K173695J732786J510172J925589K332720
$$ 45051137 45957200 46892260 48699346 50873041 52605827 54115999 56041588 58374308
18562E8374308K531033L035811L673703L569830K838753K716148L613442M507915
$$ 58374308 60905341 63941152 67614855 71184685 74023438 76739586 80353028 84860943
18554H4860943M682939M678490N097588N804439O684820P927706R325184J0605064
$$ 84860943 89543882 94222372 99319960 105124399 111809219 119736925 129062109 139667173
18546A39667173J2396382J5156135J7255856J6405806J3181595J0470649Q820785
$$ 139667173 152063555 167219690 184475546 200881352 214062947 224533596 233354381
18539B33354381N496339m03504n196818n553031l439250k816388l360232j411234
$$ 233354381 238850720 238447216 233250398 227697367 224258117 221441729 218081497 216670263
18531B16670263L551358P307719O382453K240566j013947j220771L40938O51701
$$ 216670263 220221621 227529340 233911793 236152359 235138412 233917641 234258579 234910280
18523B34910280k331357p615624j1789138j2605862j1424519j0884207j1161601
$$ 234910280 232578923 224963299 213174161 200568299 189143780 178259573 167097972
18516A67097972j0512889q704999p292596o667381n542594l695547k609941k714943
$$ 167097972 156585083 147880084 140587488 133920107 128377513 124681966 122072025 119357082
18508A19357082k469583j141143j18997k43677j05143J408010K890524K692322
$$ 119357082 116887499 115746356 115627359 115383682 115278539 116686549 119577073 122269395
18500A22269395J806257K320976M057343M969407M422112M003731M984296O655015
$$ 122269395 124075652 126396628 130453971 135423378 139845490 143849221 148833517 155488532
18492A55488532P744462Q369527R753151J2384945J5295394J7565641J9937114
$$ 155488532 163232994 171602521 181355672 193740617 209036011 226601652 246538766
18485B46538766K3494511K6439563K4266391J5101883L445909m140151o329200
$$ 246538766 270033277 296472840 320739231 335841114 339287023 335146872 328817672
18478C28817672o964442q285143q326807n634494j983450J524986O633561J3134903
$$ 328817672 321853230 313568087 305241280 299606786 297623336 299148322 305781883 318916786
18470C18916786J6077371J2127001N443777J990730L60888n594831j5997810k3535693
$$ 318916786 334994157 347121158 352564935 354555665 354916553 349321722 333323912 309788219
18462C09788219k3818510k0970539k0428540k1430940k0267853j6961702j4389801
$$ 309788219 285969709 264999170 244570630 223139690 202871837 185910135 171520334
18455A71520334j3202497j1752170r782920q591820q157572p167867n617381m774900
$$ 171520334 158317837 146565667 136782747 128190927 120033355 112865488 107248107 102473207
18447A02473207m712250m203585l070085k474291k731058k787333k188331j796130
$$ 102473207 97760957 93557372 90487287 88012996 85281938 82494605 80306274 78510144
18439G8510144k091888k302631j807171j154740j060796j370700j583292j615291
$$ 78510144 76418256 74115625 72308454 71153714 70092918 68722218 67138926 65523635
18431F5523635j554968j295787q44566n16950n09841o25042n71527k55922K15083
$$ 65523635 63968667 62672880 61828314 61311364 60801523 60176481 59604954 59349032 59564115
18422E9564115N40718M16523N6277J78416R87772J619825J305573O52333Q25028
$$ 59564115 60104833 60521356 60577633 60756049 61743821 63363646 64669219 65321552 66146580
18413F6146580J755953K293715K064460J972859K627476L432810L745808L935238
$$ 66146580 67902533 70196248 72260708 74233567 76861043 80293853 84039661 87974899
18405H7974899M612071N622034O601266P837808R509315J0409101Q728678M468125
$$ 87974899 92586970 98209004 104810270 112648078 122157393 132566494 141295172 145763297
18397A45763297J02656j897482j674788j265763j640678j716321n08270J232807
$$ 145763297 145865953 143968471 142293683 141027920 139387242 137670921 137162651 138395458
18389A38395458K546017M082417O559696Q162638N997932M23869m546244o198956
$$ 138395458 140941475 145023892 151583588 159746226 165744158 166168027 161621783 155422827
18381A55422827o222158p303058q834587q473378o434767n193689n441714n309163
$$ 155422827 149200669 141897611 133063024 124589646 118154879 112961190 107519476 102210313
18373A02210313l789283k238383j803938j711242j072187m10189k98936j71762
$$ 102210313 98421030 96182647 94378709 92667467 91595280 91185091 90886155 90714393
18365I0714393M30234R28543J043527J571133K766117L461927L019941K689982
$$ 90714393 91144627 92073170 93116697 94687830 97453947 100915874 103935815 106625797
18357A06625797L624918M894050N058407M547547M742014N640167O248083O612776
$$ 106625797 110250715 115144765 120203172 124750719 129492733 135132900 141380983 147993759
18349A47993759P673845R481711J1175309J2544230J4362785J7387086K1698346
$$ 147993759 155667604 165149315 176324624 188868854 203231639 220618725 242317071
18342B42317071K6032073K6969376K0840258Q561881l164426q398677q516863
$$ 242317071 268349144 295318520 316158778 324720659 321556233 313157556 304640693
18335C04640693r069911j1377065j1635003q104775l891540j104019K558055Q280067
$$ 304640693 295570782 284193717 272558714 264453939 260562399 259458380 262016435 270296502
18327B70296502J1643275Q188364N72300m781059o540924q903716j3735982j7552300
$$ 270296502 281939777 290128141 290700441 285919382 279378458 270474742 256738760 239186460
18319B39186460j7369805j5049950j3685233j3077673j1388335q884515p321339
$$ 239186460 221816655 206766705 193081472 180003799 168615464 159730949 152409610
18312A52409610o948706o471350n268114l871061k759179k040890j817350j782834
$$ 152409610 145460904 138989554 133721440 129850379 127091200 125050310 123232960 121450126
18304A21450126j110204L16368J381608J423419J432664K402819L547917L628217
$$ 121450126 120339922 120656290 122037898 123461317 124893981 127296800 130844717 134472934
18296A34472934L118618L380642M390249N045787N179154N468710N873228O090210
$$ 134472934 137591552 140972194 145362443 150408230 155587384 161056094 166929322 173019532
18288A73019532P055519R721530J2744257J4133016J5096295J8732396K3954749
$$ 173019532 180075051 189796581 202540838 216673854 231770149 250502545 274457294
18281B74457294K4568564J6957401N761398j414719k957791l271766n186818o649674
$$ 274457294 299025858 315983259 321744657 320329938 317372147 314100381 308913563 302263889
18273C02263889n150666j468903K361946N885018R506789J3330268J8006900K4112757
$$ 302263889 297113223 295644320 298006266 303891284 313398073 326728341 344735241 368847998
18265C68847998K8857417K6292218J4052670j765524j2087920j4679195j5037714
$$ 368847998 397705415 423997633 438050303 436284779 424196859 409517664 394479950
18258C94479950j7552022j9870519j7770504j2042870p062552m227986q00309
$$ 394479950 376927928 357057409 339286905 327244035 320181483 315953497 315153188
18251C15153188M434838P770189M821496l569703j1917272j6092926j6827815
$$ 315153188 319588026 327358215 332179711 328610008 316692736 300599810 283771995
18244B83771995j7085663j7883570j7974446j6567710j4555112j2955007j1546307
$$ 283771995 266686332 248802762 230828316 214260606 199705494 186750487 175204180
18237A75204180r695597p652314o200252n486965m976782m358234l805149l375456
$$ 175204180 165508583 157856269 151656017 146169052 141192270 136834036 133028887 129653431
18229A29653431k767611j828070q92219m06584l82997l47056J96946J219496K111780
$$ 129653431 126885820 125057750 124165531 123758947 123375950 123028894 123225840 124445336 126557116
18220A26557116K350049K173537K287527K918481L643389M216279M937812N981879
$$ 126557116 128907165 131080702 133368229 136286710 139930099 144146378 149084190 155066069
18212A55066069P028722P931020R107293J0902282J3213932J5946507J8699071
$$ 155066069 162094791 170025811 179133104 190035386 203249318 219195825 237894896
18205B37894896J9575338J6005723Q138014M0539m315792n301558n939958p062706
$$ 237894896 257470234 273475957 281613971 281654510 277338718 272037160 266097202 259034496
18197B59034496o782220m226001p44047K688364O056220P691839M639163k687937
$$ 259034496 252252276 248026275 247282228 249970592 256026812 263718651 268357814 265669877
18189B65669877r363846j1783918j1981755j3540573j5814621j5671054j3067841
$$ 265669877 256306031 244522113 232540358 218999785 203185164 187514110 174446269
18182A74446269j0879865j0036246q754693o458253m744232m096382l036567j140570
$$ 174446269 163566404 153530158 144775465 138317212 133572980 129476598 126440031 125299461
18174A25299461L43765J512180L895330O461001N376057j71522n422985o137713
$$ 125299461 125643226 127155406 131050736 137511737 142887794 142716272 137293287 131155574
18166A31155574m283755m329133o334333o802309m934743l598913m193462m611875
$$ 131155574 126871819 122542686 116208353 109406044 104471301 100872388 96678926 92067051
18158I2067051l192947j377829r90176j376897r15812L66931J268824J402898
$$ 92067051 88874104 87496275 86506099 85129202 84213390 84580321 85849145 87252043
18150H7252043J449860K073745L345258M655303M854217L270453Q09861q93077
$$ 87252043 88701903 90775648 94120906 98776209 103630426 106900879 107710740 106817663
18142A06817663j530723k174465l171385l479710k534130j248163m64651J32332
$$ 106817663 105286940 103112475 99941090 96461380 93927250 92679087 92214436 92346768
18134I2346768P08815L60568j346332l191379l958977m191255m915178n656193
$$ 92346768 93055583 93416151 92069819 88878440 84919463 80728208 75813030 70156837
18126G0156837n337121m365371m032738m275929l844406k569508j697860j791214
$$ 70156837 64819716 60454345 56421607 52145678 48301272 45731764 44033904 42242690
18118D2242690j944326j522587j178962j468307j726789j205669l66213j25530
$$ 42242690 40298364 38775777 37596815 36128508 34401719 33196050 32829837 32704307
18110C2704307m78953p34333o45806n10467m37796k55807j6280k986k65888n71516
$$ 32704307 32225354 31491021 30845215 30334748 29896952 29641145 29624865 29621879 29355991 28784475
18100B8784475p80348r30125r85127q19308m73627k06601k27134m69816o60401
$$ 28784475 28004127 27074002 26088875 25269567 24795940 24589339 24362205 23892389 23231988
18091B3231988o03511m31809m89314q64549j186939j104812p96147o60671o64543
$$ 23231988 22628477 22196668 21707354 20842805 19655866 18551054 17754907 17094236 16429693
18082A6429693m92592k75900n02297j070797j161199m37608K67154P6269o15332
$$ 16429693 15937101 15661201 15158904 14088107 12926908 12489300 12756454 12832723 12217391
18073A2217391p24278j05339K96111m8381m79107k63322K39860K00157l08758
$$ 12217391 11493113 11387774 11683885 11635504 11156397 10893075 11132935 11333092 11024334
18064A1024334l89668K35645O89313K30248n54740n56385J90418N44932J8404
$$ 11024334 10634666 10870311 11559624 11789872 11235132 10678747 10869165 11414097 11432501
18055A1432501m71167r3473M93117J51717q31324j033592m2641Q79397O54240
$$ 11432501 10961334 10867861 11360978 11512695 10681371 9647779 9605138 10484535 11138775
18046A1138775j37584l36960O1012J96874j38839l41067j72266p4096j96942q8237
$$ 11138775 11001191 10664231 10725243 10922117 10783278 10442211 10269945 10195849 9998907 9910670
18036I910670L14696K79654n20462j136367n64861N79269O93960n08499j435615
$$ 9910670 10225366 10505020 9984558 8848191 8283330 8862599 9556559 9048060 7612445
18027G612445q07515N26181Q27780p9680p57538l93820J59464m1780n55435m59147
$$ 7612445 6804930 7331111 8158891 8079211 7321673 6927853 7087317 7045537 6490102 6030955
18017F030955O6126J15741l91778o47755l23941L2740P0509J16055L28189K83647
$$ 6030955 6097081 6212822 5821044 5173289 4849348 4882088 4952597 5068652 5396841 5680488
18007E680488j74928m76883k15316J83036K00760l4r6409k35923n06888m25800
$$ 5680488 5505560 5028677 4813361 4996397 5197157 5197123 5100714 4864791 4357903 3932103
17997C932103K57693Q05217M42729l65997n60675o5934K87366J84142O8394O1124
$$ 3932103 4189796 4995013 5437742 5071745 4511070 4445136 4732502 4916644 4985038 5046162
17987E046162k07031n96650m43544K10627M74016N1521k44417Q8688L93296Q0294
$$ 5046162 4839131 4242481 3798937 4009564 4483580 4535101 4290684 4379372 4772668 4852962
17977D852962l12089j42645J40521j48925o08380m16525J69720K05648l19347
$$ 4852962 4540873 4398228 4538749 4389824 3781444 3364919 3534639 3740287 3420940
17968C420940m78747L117L47887J09852j20159J79542N53284L53858j98458l70435
$$ 3420940 2942193 2945310 3293197 3403049 3282890 3462432 4015716 4369574 4171116 3800681
17958C800681K8276M60250L56602l13394j009686j018064j61261P77611P60513
$$ 3800681 3828957 4289207 4645809 4332415 3322729 2304665 2143404 2921015 3681528
17949C681528j79213q17631l15158N96034O16404k69186p79780k00631N99865
$$ 3681528 3502315 2684684 2369526 2965560 3581964 3312778 2532998 2332367 2932232
17940B932232M62372l82296o88313k6166O37993M17768k22990k87819K05954L91691
$$ 2932232 3394604 3012308 2323995 2297829 2935822 3353590 3130600 2842781 3048735 3440426
17930C440426N3400r6774J87079J20568o75230j156842k90755J148834J447790
$$ 3440426 3493826 3397052 3584131 3704699 3029469 1872627 1581872 2730706 4178496
17921D178496L50397o76015o09747m9232J17759L1391J75070L09189l6767n84455
$$ 4178496 4528893 3852878 3243131 3193899 3311658 3343049 3518119 3827308 3790541 3206086
17911C206086o54495j67273L71499O14785N41921J80528k82904m04293m6681K45856
$$ 3206086 2551591 2384318 2755817 3370602 3912523 4093051 3810147 3405854 3359173 3605029
17901C605029n824m21976l43553J16214L29198K03417J66486K60513J13623k36889
$$ 3605029 3599205 3177229 2833676 2949890 3279088 3482505 3648991 3909504 4023127 3786238
17891C786238l55272k48277l07456l76128J05240Q42557P34108l50418r81253
$$ 3786238 3430966 3182689 2875233 2499105 2604345 3446902 4181010 3830592 2849339
17882B849339j63845J051372J020807j35000q59199m71306J38746J27973j85984
$$ 2849339 2685494 3736866 4757673 4622673 3763474 3292168 3430914 3558887 3372903
17873C372903j70269R8258J80156L4244q6095j15307j22680l6559K09826M15598
$$ 3372903 3202634 3300892 3481048 3515292 3429197 3313890 3191210 3154651 3364477 3780075
17863C780075K99843j03897m32090l66607L2219L47416K06386k69514n36712k83665
$$ 3780075 4079918 3976021 3543931 3177324 3209543 3556959 3763345 3493831 2957119 2673454
17853B673454J66621L22769J68848J5577o1050j77578k20596k3682J43207r5634
$$ 2673454 2840075 3162844 3331692 3347269 3286219 3108641 2888045 2864363 3007570 2911936
17843B911936m37007j97254N04728P06664N2555n71471l84067R8920j6645n17016
$$ 2911936 2474929 2277675 2782403 3489067 3541622 2970151 2586084 2685004 2668359 2151343
17833B151343m69346K41166P50947N41554N4766j30653j8929J07624J49629J19601
$$ 2151343 1681997 1923163 2674110 3215664 3270430 3139777 3120848 3228472 3378101 3497702
17823C497702J0569j06858j45727j74130k36898j35796K17021M18239P9585m57312
$$ 3497702 3508271 3401413 3255686 3081556 2844658 2708862 2925883 3344122 3423707 2966395
17813B966395n44136k15783k6007k5748K01705N22060L23137k45228k56720M07160
$$ 2966395 2422259 2206476 2180469 2154721 2356426 2878486 3201623 2956395 2699675 3106835
17803C106835O61325q190n97532k65569K24311j06254o74076l91695L17749K41884
$$ 3106835 3768160 3759970 3162438 2896869 3121180 3014926 2340850 1949155 2266904 2508788
17793B508788l95387k72756O05036P39302l18039j081727m78490N21482N70060
$$ 2508788 2113401 1840645 2445681 3184983 2866944 1785217 1306727 1828209 2398269
17784B398269q0561l78404k10989j39869j43645J71399N72953M94928L4173k47377
$$ 2398269 2317708 1939304 1728315 1588446 1444801 1616200 2189153 2684081 2718254 2470877
17774B470877k49586k65708k84837j39775m5751k17342k75303J53436N94190L90389
$$ 2470877 2221291 1955583 1670746 1530971 1485220 1267878 992575 1146011 1740201 2130590
17764B130590j13640q7194L27407K35330l92520n69679M8554N62836K92634k36291
$$ 2130590 2016950 1929756 2257163 2492493 2099973 1530294 1578848 2141684 2434318 2198027
17754B198027l12043r7253k8031K8250K89385L97148K312m83222m39977K7654
$$ 2198027 1885984 1788731 1760700 1788950 2078335 2475483 2477795 1994573 1554596 1582250
17744A582250L47190L21834J39293j00468k79602o5146N38334Q07853K04635o54467
$$ 1582250 1929440 2251274 2390567 2290099 2010497 1945351 2483685 3291538 3496173 2841706
17734B841706p43978j19906K44663O082j85778K1318R7954k50328l71763K20634
$$ 2841706 2097728 1977822 2222485 2228567 2042789 2064107 2162061 1911733 1539970 1760604
17724A760604Q02767M28611n15167p79643j13432M12109R5374l99328k45044K07072
$$ 1760604 2563371 2991982 2476815 1697172 1583740 1995849 2091223 1691895 1446851 1653923
17714A653923J22122l37077k65202M11913P03800J07626n91232n60535j22413
$$ 1653923 1776045 1438968 1173766 1585679 2289479 2397105 1805873 1245338 1122925
17705A122925j6332j53537R07K92720J57497k13339o9700N54625P66434K45683
$$ 1122925 1106593 953056 953963 1246683 1404180 1190841 1121141 1675766 2442200 2687883
17695B687883k69161k32023m1542j11877j39117J30758K70121j1744j91632J80037
$$ 2687883 2418722 2186699 2145157 2033280 1894163 2024921 2295042 2283298 2091666 2271703
17685B271703O10996M71229J4457k17384l41898n81749m61528L35217R30388L81396
$$ 2271703 2882699 3353928 3368385 3151001 2809103 2227354 1765826 2101043 3031431 3412827
17675C412827o13954o03168K99036N80797j73999o62957j01096N56875L42848
$$ 3412827 2798873 2195705 2494741 3075538 2901539 2238582 2137486 2694361 3037209
17666C037209k04468j95208J01492j2613l13850j67243K23405J55334l59930o62907
$$ 3037209 2832741 2637533 2739025 2726412 2412562 2245319 2468724 2624058 2264128 1601221
17656A601221m91411j84550j8004M1271Q3335K20470N53911Q30049N51906k05310
$$ 1601221 1109810 925260 907256 948527 1031862 1252332 1806243 2636292 3188198 2982888
17646B982888o51430l91218j6080n6371j25637J64415K74978k75271p48853k48101
$$ 2982888 2331458 1940240 1924160 1867789 1742152 1906567 2181545 1906274 1157421 909320
17636I09320O33115O11180j89421m50208J38102M70376K3241l01625J43034O19852
$$ 909320 1542435 2153615 1964194 1513986 1652088 2122464 2145705 1844080 1987114 2606966
17626B606966L38762k16199k10707J58545J74228j27691j53660J42532K19337
$$ 2606966 2945728 2729529 2518822 2677367 2851595 2723904 2570244 2712776 2932113
17617B932113j21361m35607k78164K62031O64118M52503k80332q03138n32582
$$ 2932113 2810752 2375145 2096981 2359012 3023130 3475633 3195301 2392163 1859581
17608A859581J34058L13149m1905j02749L75972N48815o4424o11630k51451L69997
$$ 1859581 1993639 2306788 2264883 2162134 2538106 3086921 3022497 2410867 2159416 2529413
17598B529413J16874p15158p87644J43946Q14118L93299l36446l20986J62093
$$ 2529413 2646287 1931129 1143485 1287431 2101549 2494848 2158402 1837416 1999509
17589A999509Q1012o46147r49250j50608R89337J178251K39071o68078n33548
$$ 1999509 2080521 1434374 485124 334516 1323853 2502104 2741175 2073097 1539549
17580A539549K72547O25582J59588m40273n36224k28209J46354M86699O38303
$$ 1539549 1812096 2437678 2597266 2156993 1620769 1392560 1538914 2025613 2663916
17571B663916L11227l25398n89676k50064Q7623M252n9440K51293M05180k3850
$$ 2663916 2975143 2649745 2060069 1810005 1897628 1901880 1842440 2093733 2498913 2475063
17561B475063l48364J49676P79010M03027n99767q16980n1543M67793J80904r5313
$$ 2475063 2126699 2276375 3055385 3458412 2858645 2041665 1990122 2457915 2638819 2543506
17551B543506J30544J96348k55140m78849p8463J29302l47194n97398O4972O41187
$$ 2543506 2674050 2870398 2615258 2136409 2057946 2187248 1840054 1242656 1307628 1948815
17541A948815N9505q06296m58795O22973O53088m98863j044324j65339P48975
$$ 1948815 2008320 1202024 743229 1366202 2019290 1520427 476103 310764 1059739
17532A059739M03064m94110n87226Q7762N23539L56143K193k56183l85329k04892
$$ 1059739 1462803 968693 381467 469229 992768 1348911 1351104 1094921 709592 504700
17522E04700K95716N78838K46852k08629r5543L39244K85814l00689o24928k94734
$$ 504700 800416 1379254 1626106 1417477 1321934 1661178 1946992 1646303 1021375 726641
17512G26641J89614L16076J86839N5589q8206j95174j4090M00748N62066K62562
$$ 726641 916255 1232331 1419170 1474759 1386553 1191379 1177289 1578037 2140103 2402665
17502B402665p7448j19257j37815m01970n44012j55395L85620L86559r4577l72705
$$ 2402665 2325217 2205960 2068145 1666175 1122163 966768 1352388 1738947 1644370 1271665
17492A271665k01521J1129L6479J21393L18372K38539k37690o02041m23085O0680
$$ 1271665 1070144 1081273 1117752 1239145 1557517 1796056 1558366 956325 533240 593920
17482E93920L68414L64622J41251k20104m70763k83693J45213J43842l82506n91860
$$ 593920 962334 1326956 1468207 1248103 777340 493647 638860 782702 400196 -191664
17472a91664J9330O57923L85513l39840l43034L81223O72174P0270n24939l38552
$$ -191664 -172334 485589 871102 531262 188228 569451 1241625 1311895 786956 448404
17462D48404K00584L36614Q5283r5657p8176J9001J68060K53214L4090l54880
$$ 448404 648988 985602 1070885 975228 897052 916053 1084113 1337327 1371417 1016537
17452A016537l85150M2222L18035N0289l22530k82262p633R4995P5748J28950
$$ 1016537 631387 673609 991644 1041933 719403 437141 429508 524503 600251 729201
17442G29201J31519J6257N1202K29642M0531n43602o22622K50648J008626M89000
$$ 729201 860720 876977 928179 1157821 1198352 654750 32128 282776 1291402 1780402
17432A780402o86667r44195r5340N44599K69055j94397j48254P2309l2352k95822
$$ 1780402 1093735 149540 54200 598799 867854 673457 525203 597512 565160 269338
17422B69338l78549k82850m4465L49383N41904J26395m69021l54288L82032O61373
$$ 269338 -109211 -392061 -436526 -87143 454761 581156 112135 -242153 139879 801252
17412H01252J24734l11522n7077K29025l937j39605L57746P25871J18620q03487
$$ 801252 925986 614464 557387 786412 782475 642870 1000616 1726487 1845107 1041620
17402A041620p96905J6958M31181N3159l21514j24722L01795M82304L71049Q4349
$$ 1041620 244715 261673 692854 746013 424499 299777 601572 1083876 1454925 1539274
17392A539274k20911k44242O0184J74044k40843o08024k46331M28846M82855k9816
$$ 1539274 1318363 1074121 1134305 1308349 1067506 459482 213151 641997 1124852 1095036
17382A095036k34237M2427J24134j33583r5787L10512K90354l65767p41989l03058
$$ 1095036 860799 903226 1027360 893777 797990 1108502 1398856 1033089 291100 -11958
17372a1958J89950J3160l07221k7769M55241L50754r7122q3452K85860J89866
$$ -11958 177992 191152 -116069 -143838 311403 662157 565035 481583 767443 957309
17362I57309m18252o78175k48530J94457J61524J07455M79516P68999K58635o85863
$$ 957309 539057 -139118 -387648 -193191 -31667 75788 555304 1324303 1582938 897075
17352H97075r00977k1608R03049P36305k50995p70056k51930M72506M34372j61194
$$ 897075 -3902 -25510 877539 1613844 1362849 592793 340863 813369 1247741 1086547
17342A086547m17545j00461K31289K53400K08116J80490j10576n59203n24096
$$ 1086547 669002 568541 799830 1053230 1261346 1441836 1331260 772057 247961
17333B47961J33727N84589J84387n00902n19186P1728M10005J60059j66969j55560
$$ 247961 381688 966277 1150664 649762 130576 202304 612309 772368 605399 449839
17323D49839q372j9964j23049j51301j19844n7954J05324L21055L46551N8142
$$ 449839 441467 421503 298454 147153 27309 -30645 74679 395734 742285 800427
17313H00427l23732m50009k16568J26367K32594O3726k5218K21731M74145K09171
$$ 800427 476695 26686 -189882 -63515 169079 232805 207587 429318 903463 1112634
17303A112634l89053m88383J82265P79629M87173l01544n93617k13416J55032
$$ 1112634 723581 235198 417463 1197092 1684265 1382721 789104 575688 730720
17294G30720J23810k4290p9455k07629l75777k18792K53665M54864P6655l68846
$$ 730720 854530 830240 750785 543156 167379 -51413 202252 657116 733771 364925
17284C64925k61675K57409N35618K75575k00720m16951k16399J50039K79437M5161
$$ 364925 103250 360659 896277 1171852 971132 554181 337782 487821 767258 812419
17274H12419k24236j64054R4483J24099r7678j24589K15543M68577K00373l60342
$$ 812419 588183 424129 518612 642711 545033 420444 635987 1104564 1304937 944595
17264I44595o38922m31370r214L07030L90122K41239m1589k54282k34799l4461
$$ 944595 305673 -125697 -134911 172119 562241 803480 761891 507609 272810 238349
17254B38349J46085J73637Q5120L490j6469m9729j64365k46712j24468J08417
$$ 238349 384434 558071 643191 646681 630212 580483 416118 169406 44938 153355
17244A53355J50914j0297j0992K57222L37451o5415m56234k34900L09614M09305
$$ 153355 304269 293972 282980 540202 877653 812238 356004 121104 430718 840023
17234H40023J7188k15592q4819o4179l05134l22691N3118K78296M8049j42431
$$ 840023 857211 641619 556800 492621 187487 -135204 -82086 196210 244259 101828
17224A01828J09007L70341J24627l30578l79440l3809K37560K72132K30187J36691
$$ 101828 210835 581176 705803 375225 -4215 -38024 199536 471668 701855 838546
17214H38546o1215j96722r1295J17473J78662M9308j90613m34081m29234j3614
$$ 838546 777331 580609 489314 606787 785449 834757 644144 210063 -219171 -232785
17204b32785M32536L64316n953L7528M07691K36208m74843n47798L50260Q26036
$$ -232785 199751 564067 558114 595642 1003333 1239541 764698 216900 567160 1393196
17194A393196p995q43395k49646Q21635N58174o31148q36859O9956L68915l34744
$$ 1393196 1385201 541806 292160 1113795 1671969 1040821 203962 273918 642833 308089
17184C08089m58060N22824R08635k64934j340260o51650P63725Q87178j42524
$$ 308089 -149971 372853 1281488 1016554 -323706 -975356 -211631 675547 533023
17175E33023n54128J52428P13252K79563m94820o71584k02598L27221M20418L4731
$$ 533023 -21105 131323 844575 1124138 629318 -42266 -244864 82357 502775 537506
17165E37506l54019j95237L57806N27156O2761l18990p4671L33565L09296M2416
$$ 537506 183487 -11750 346056 873212 935973 616983 542312 875877 1185173 1227589
17155A227589j06079l16186o42757n16806J88837N19921o4041n18020J48179R94040
$$ 1227589 1121510 805324 162567 -354239 -165402 354519 290478 -227542 -79363 914677
17145I14677N56485o12396p46203K16162O13281o6819m59876J24790N08262j58810
$$ 914677 1471162 858766 112563 328725 942006 875187 415311 540101 1048363 889553
17135H89553q16345l00513O76675O94658j86847p10245l30839K67812L11182j99841
$$ 889553 73208 -227305 449370 1144028 957181 246936 -83903 183909 495091 295250
17125B95250o36255l72925M86042R50227K71859p99404q09491K68658R00167L23599
$$ 295250 -341005 -713930 -227888 722339 994198 194794 -614697 -346039 554128 877727
17115H77727l54583r7333M08959J14665n46786m95557J61100M88048L05325J24399
$$ 877727 523144 425811 834770 949435 402649 -92908 68192 556240 861565 985964
17105I85964M057k75335l40086J97076O65206J71746p69626q29866O3403O58727
$$ 985964 990021 714686 374600 571676 1236882 1408628 639002 -190864 -127461 531266
17095E31266L90560K2407Q1976O0383l79368o30584j92799M66383O76705M15057
$$ 531266 921826 944233 1026209 1086592 707224 76640 -116159 350224 1026929 1441986
17085A441986n0290n88038q77050m66063L82877O90303R2110n56857m20918J87359
$$ 1441986 1391696 803658 -73392 -539455 -156578 533725 625835 68978 -351940 -164581
17075a64581M74169K98833L5272j31677j72494K9832L33837K28716l87306p88526
$$ -164581 309588 608421 643693 512016 339522 369354 703191 931907 544601 -243925
17065b43925l53755M93567Q39056M29252k25649n75657m29021M1824L50036J30732
$$ -243925 -597680 -104113 734943 1164195 938546 362889 -66132 -24308 325728 456460
17055D56460k59993j59543K26135j0223p61254n92365R84153K166439J202359
$$ 456460 196467 36924 263059 252836 -508418 -1100783 -116630 2049809 3252168
17046C252168q69780j570860n21758L32340o0224n10465L6210P09573L55112n06806
$$ 3252168 2382388 811528 289770 622110 561886 51421 87631 797204 1152316 645510
17036F45510o65611j62216Q6128m6205Q5099N20865N66356K5994m32657l25978
$$ 645510 -20101 -182317 -96189 -142394 -57295 463570 1029926 1055920 623263 297285
17026B97285J897M3171j24827p0180L23320O76422N29966j16841o82775n67619
$$ 297285 299182 342353 217526 147346 470666 1147088 1677054 1560213 877438 309819
17016C09819J00469N41301K88840k44399m08203j68023M3297L0056n0772r0738
$$ 309819 410288 951589 1240429 996030 587827 419804 463101 493157 442385 351647
17006C51647j21321j16101m6082k033J8673K06186M97256L98223k62544p73596
$$ 351647 230326 114225 68143 66110 84783 290969 788225 1186448 923904 150308
16996A50308m15318L74240N43127P359k85094L9866J96169l15286p09898j68437
$$ 150308 -265010 109230 652357 659716 374622 414488 610657 295371 -414527 -582964
16986e82964O99399O83284j61011n95140p8155N20550L50115k17148l51117m1977
$$ -582964 116435 799719 638708 43568 -34587 485963 836078 618930 267813 225836
16976B25836J06047m0301m7437K07286L05409N4386j65402r4745n4489k85613
$$ 225836 331883 291582 244145 451431 756840 811226 645824 551079 496590 210977
16966B10977l59923J17246O18692L51691l88814n24783Q2319L46687k10010n52686
$$ 210977 -148946 -31700 586992 938683 549869 25086 107405 454092 244082 -308604
16956c08604J15037Q31873L97226m89204k99076O37954N57950o27438r08712M51342
$$ -308604 -193567 638306 1035532 546328 247252 885206 1443156 815718 -92994 358348
16946C58348J369280J73837j539349j298945L98581J046167J30396m56412J26327
$$ 358348 1727628 1901465 362116 -936829 -538248 507919 638315 181903 308230
16937C08230M78073k13582o38018J78560R69098L58245p37261o63036K16577L00110
$$ 308230 786303 572721 -65297 113263 1082361 1440606 703345 40309 256886 556996
16927E56996m57790n94570K63817Q23575L44031k89895k28322N9277j17642m36240
$$ 556996 99206 -495364 -231547 592028 936059 646164 417842 477119 359477 -76763
16917g6763k72806J62766K41874n7879k56722j53140O6755K38794L03351K02841
$$ -76763 -349569 -186803 55071 -2808 -259530 -412670 -345915 -107121 196230 399071
16907C99071J1314o8841m2258j33895l09550k16809J84352M23618K39920n326
$$ 399071 410385 341544 299286 165391 -144159 -360968 -176616 247002 486922 481596
16897D81596J6821N7824j52407l09311n6971L04285K61806n8306j24096J28187
$$ 481596 498417 556241 403834 94523 37552 341837 603643 545337 421241 549428
16887E49428K84280J76719M907j73893m47034n76561j87326M87528O84383J52814
$$ 549428 833708 1010427 1015334 841441 394407 -182154 -369480 118048 802431 955245
16877I55245m23735l62507J08011K74375k1963k47884k6172L07732J95974l11919
$$ 955245 531510 169003 277014 551389 529426 281542 255370 563102 759076 447157
16867D47157n55859j52154M38197N21223J19465j62548j13541j18297l02582k20413
$$ 447157 -108702 -260856 177341 698564 818029 655481 541940 423643 121061 -99352
16857i9352K69270N44691J84506k67425j88360P3560j19471m83803k99502K57402
$$ -99352 169918 714609 899115 631690 443330 516890 397419 -86384 -385886 -128484
16847a28484L85488N1335o6350P1757j40142n42967k16218P71891J070368J41543
$$ -128484 257004 308339 241989 313746 173604 -369363 -585581 186310 1256678 1398221
16837A398221p30623m35165K40081P1402n01453k42784O22099O85039l16555j009549
$$ 1398221 667598 232433 472514 543916 42463 -200321 421778 1106817 790262 -219287
16827b19287m42745O10402Q54329J22053o40812n55305L08240R83650N93749n05465
$$ -219287 -662032 -51630 802699 924752 283940 -271365 36875 1020525 1614274 1108809
16817A108809r63952k22392N92993L12303m71362m21208K98995L70168l27596
$$ 1108809 144857 -77535 515458 827761 356399 -64809 234186 604354 276758
16808B76758n02673K07333N32987j59783o68033l4242P49647M52344l11984k77796
$$ 276758 -225915 -18582 514405 354622 -313411 -347653 401994 854338 542354 264558
16798B64558K49637J25002m39644l10547L54846L10449m41156n21549L41521P02109
$$ 264558 514195 639197 199553 -110994 243852 554301 113145 -408404 -66883 635226
16788F35226q1170o36302L2887O96773l8897j214593r41226N40079J260962O13629
$$ 635226 554056 -82246 -49359 647414 608517 -606076 -1547302 -1007223 253739 867368
16778H67368k6638J37554J72599n55238j017332k99337O66026N16643l66520n79894
$$ 867368 840730 978284 1150883 595645 -421687 -721024 -54998 461645 95125 -484769
16768d84769M0238M17867K03441J59726N09823M30488l57746q50056l41449L68435
$$ -484769 -444531 -26664 176777 336503 846326 1276814 919068 69012 -272437 95998
16758I5998K78621k06525p8356M99418M69128l10637p62310k35264N52236N87834
$$ 95998 374619 168094 89738 589156 1058284 747647 -14663 -249927 302309 890143
16748H90143j21776p38854o67867q4477L94402L74657R5320J09990M61481N16308
$$ 890143 768367 29513 -638354 -722831 -328429 46228 141548 251538 713019 1229327
16738A229327n2709n83901l48878K56394L10308j21870j43338L67820N06781q0589
$$ 1229327 1176618 592717 243839 500233 810541 688671 545333 913153 1419934 1339345
16728A339345n61568l28024N4270n9676l43490k80223q7657o3138J22017N91172
$$ 1339345 777777 449753 504023 444347 100857 -179366 -267023 -330161 -208144 383028
16718C83028O14558j59233o91172m9717Q39968M79435p10695r45952O4696O98673
$$ 383028 997586 838353 147181 97464 937432 1416867 706172 -239780 -175084 523589
16708E23589R4470n93037k79956L30782J40929n01721n51359P200L58516K47363
$$ 523589 618059 25022 -254934 75848 216777 -284944 -836303 -829103 -470587 -223224
16698b23224J13688J62934J99869J88643K43480K28354j8260k41143j11850J67412
$$ -223224 -109536 53398 253267 441910 685390 913744 895484 654341 542491 709903
16688G09903J34428k11376m39154l11288K7375L42692M49974K39536j30996k84211
$$ 709903 844331 632955 193801 -117487 -90112 252580 702554 942090 811094 526883
16678E26883j18461L1516m1962r9803K0230N1090j56614k53595j1138K08192J05672
$$ 526883 408422 439938 397976 298173 318403 369493 212879 -40716 -51854 156338 262010
16667B62010p9J39487J02245l72173o07918j3833O94250M52768l78722n17969
$$ 262010 261931 401418 503663 131490 -476428 -490261 203989 656757 278035 -239934
16657b39934J66810N02055L437m07681o6384L69005J52292l22571k95531J56375
$$ -239934 -73124 428931 432368 24687 -41697 327308 479600 157029 -138502 17873
16647A7873M28300L11187K02l13750l97447n9834L42916J38893n37732o42274
$$ 17873 446173 757360 757562 443812 46365 -13469 329447 468340 -69392 -711666
16637g11666K34206J041243P15560k82275p22812l01503L04796N80317M73770
$$ -711666 -477460 563783 1279343 997068 274256 -27247 277549 857866 1331636
16628A331636k5436p11915r09110k71914M76440M80898N0880L8716L15345P7852
$$ 1331636 1306200 594285 -314825 -586739 -110299 370599 421479 460195 775540 853392
16618H53392n44755n68113J11847M54064M7176k13331K24812N32381m8173p88801
$$ 853392 308637 -259476 -147629 306435 353611 140280 365092 897473 849300 60499
16608F0499n77594L18060P05630K34206l41492m29058j84609R1087L18888L73405
$$ 60499 -517095 -199035 506595 740801 399309 -29749 -214358 -123271 195617 569022
16598E69022J27134j80292j79497J2017l7397k92765k63385J26019L30877R0865
$$ 569022 696156 515864 336367 348384 310987 18222 -245163 -119144 211733 302598
16588C02598q3431K45394O08222K62188n73691q28153n6089Q01237N94511m36102
$$ 302598 219167 464561 1072783 1334971 761280 -66873 -122962 678275 1272786 836684
16578H36684r10404j85585P27516N63766m28624q78456k24486O29446P05220J45694
$$ 836684 -73720 -259305 468211 1031977 603353 -275103 -499589 129857 835077 980771
16568I80771l46830n13804m27913j0048O32216Q51105K38123n46906n44342J00803
$$ 980771 633941 120137 -307776 -317824 314392 1165497 1403620 856714 312372 413175
16558D13175L68788o8533m44099j99244K16440K07233p2768j65784n5633L1990
$$ 413175 781963 713430 269331 70087 286527 493760 420992 255208 199575 231565
16548B31565R5820J54134J0651l07885l22686J62975N38060K31378k98306k08921
$$ 231565 327385 481519 492170 184285 -138401 24574 562634 794012 495706 286785
16538B86785L33253L49611l43710p24831j38881N97249L76920m91927o99575J12843
$$ 286785 620038 969649 625939 -98892 -237773 359476 736396 244469 -455106 -342263
16528c42263P91670L62799n14888m92040M87595J059610L71724p22197r00615
$$ -342263 449407 812206 297318 -194722 292873 1352483 1724207 1002010 101395
16519A01395j66432L76161J88954j85313k38900j60612j30565J12482N05483L44522
$$ 101395 -65037 311124 500078 314765 75865 -84747 -215312 -102830 402653 747175
16509G47175n20364r61920q4815J119519R34258m90168j166745j28014J177762
$$ 747175 226811 -735109 -819924 299595 1233853 743685 -423060 -551074 626688
16500F26688J042481j45992p65189l58107R8819k6627k56901j18499N6394j35886
$$ 626688 1669169 1523177 757988 399881 498700 472073 215172 96673 153067 17181
16490A7181l93326k20699K29633L82383J00461j61119m0415K70013L59785J55982
$$ 17181 -376145 -596844 -367211 15172 115633 -45486 -85901 184112 543897 699879
16480F99879n0559m2091O7346N0217j15572k60496k54957r8263J32764K81988
$$ 699879 649320 607229 674575 724792 609220 348724 93767 -4496 128268 410256
16470D10256J77849j13169k42168m2756J40964l3810k62025j8576M67265M06849
$$ 410256 588105 474936 232768 190012 330976 297166 35141 16565 483830 890679
16460H90679k70225o50658j95707M20951L78732q1800k12809M5578K08894J57120
$$ 890679 620454 -30204 -225911 195040 573772 491972 279163 324741 533635 690755
16450F90755J01922n844k49476k73324J37000L76850j17626o91335l10760O39882
$$ 690755 792677 786833 537357 264033 401033 777883 660257 -31078 -341838 298044
16440B98044P40631k52571r69328n04981L72771N95216J93285k51263m83503l25494
$$ 298044 1038675 786104 -183224 -688205 -315434 279782 473067 221804 -261699 -587193
16430e87193L93130J075816O67075o24151j153446k15476P49840M07977l94385
$$ -587193 -194063 881753 1548828 924677 -228769 -444245 305595 713572 319187
16421C19187k54032L60236J50042n01853j92926Q41342R46558j37531q06565k30855
$$ 319187 65155 425391 575433 73580 -119346 721996 1668554 1531023 724458 493603
16411D93603M69307K44756l75709n14424k73793r9351L9421K10065K31574K11948
$$ 493603 962910 1207666 831957 317533 43740 -55611 -16190 193875 425449 637397
16401F37397L97393L76049l51401j033410m91687O77496O88822m14551o74893
$$ 637397 1034790 1410839 1059438 26028 -465659 211837 900659 486108 -188785
16392a88785K87329M55428p63205r81216Q74338J811178n77402l335973k112578
$$ -188785 98544 553972 -209233 -1190449 -316111 1495067 917665 -2418308 -4530886
16383d530886J784048K995809K52672k019609r01966R97793O25722o42362j63497
$$ -4530886 -2746838 248971 501643 -1517966 -2419932 -1422139 -796417 -1438779 -1602276
16374a602276J161499Q11944o87161p20961Q16490J370085j023j272265q42481
$$ -1602276 -440777 371167 -315994 -1036955 -220465 1149620 1148597 -123668 -966149
16365i66149K65557M76548j8565j27751K83691M97318J55436m33508p67638m96989
$$ -966149 -700592 -224044 -242609 -370360 -86669 410649 566085 132577 -635061 -1132050
16355a132050K87313Q95418O66915j00566m17151N2018N26572K57997m42126p17116
$$ -1132050 -844737 50681 717596 617030 199879 251897 778469 1036466 594340 -122776
16345a22776l11705K27840L34083N5102j26981M1571K74651K04956k4088K309
$$ -122776 -434481 -206641 127442 182544 55563 97134 371785 576741 552653 554962
16335E54962K09939R4628l47629m52461L3761M47348K69185o4366n9057q2282
$$ 554962 764901 859529 511900 59439 93200 540548 809733 745367 686310 604028
16325F04028n20382p67330j57265O93474P16336R6466j83561j03007l79154p42634
$$ 604028 83646 -683684 -840949 -147475 568861 665327 481766 378759 -395 -743029
16315g43029k04599Q92365R71995j98695q89076j18369P91527M56386m10826m73111
$$ -743029 -947628 -55263 916732 718037 -171039 -289408 502119 958505 547679 74568
16305G4568j3502o4024l63112J1900O79042M68428m48283p24476n7378M34686
$$ 74568 61066 -2958 -366070 -354170 324872 793300 345017 -379459 -436837 -2151
16295b151J90681k5328K90453M70428l7954o45928n96267p9610K76089L15737
$$ -2151 188530 163202 453655 924083 886129 240201 -356066 -435676 -159587 156150
16285A56150J84478j09151m18751l38367J26503L20369j07385n42807k86482L67263
$$ 156150 340628 231477 -187274 -525641 -399138 -78769 -186154 -728961 -1015443 -648180
16275f48180N84326K08656j44918p3313J65352K20399J50853J53332J12419k34351
$$ -648180 -63854 144802 -116 -73429 91923 312322 463175 616507 728926 494575
16265D94575p05873o19953L09083J193201P93650o60762j335423j78865J342996
$$ 494575 -211298 -831251 -522168 671033 1464683 803921 -531502 -710367 632629
16256F32629J098785o31591j517967n70583O23857N71141q918J67036O78017L48915
$$ 632629 1731414 1099823 -418144 -988727 -364870 206271 197353 364389 1042406 1391321
16246A391321n32773o90572m6871K41247k12116n19477j33515L88250M89101L29007
$$ 1391321 858548 167976 121105 362352 150236 -369241 -502756 -114506 374595 703602
16236G03602J11640k64585o00898m26874Q4034J85493j91459k68605J94896M39994
$$ 703602 815242 550657 -50241 -477115 -393081 -207588 -399047 -667652 -472756 -32762
16226c2762O5417k66610o2309J64778k132l1264M26316O06998p8986p69027m19547
$$ -32762 32655 -233955 -296264 -131486 -133618 -164882 261434 868432 789446 20419 -399128
16215c99128M21814N20953K1727L8460N56564M43558m60491r47204m45509J20612
$$ -399128 22686 543639 565366 603826 1160390 1603948 1143457 196253 -249256 -128644
16205a28644J5612j77974J34788L72983j19586p39081m82030M60713R91869O46547
$$ -128644 -113032 -291006 -156218 216765 97179 -641902 -1123932 -663219 328650 975197
16195I75197j4665l41936k23969Q4803K28318k5260m45106m61832N8773N26326
$$ 975197 960532 618596 394627 479430 707748 682488 237382 -224450 -165677 360649
16185C60649M43514O5505j47907k23722l31299k80560M2493K40241N5668l9566
$$ 360649 804163 869668 721761 498039 166740 -113820 -71327 168914 224582 185016
16175A85016L50620O51748J28154p89210r84611k77980M04455M06782m657l30624
$$ 185016 535636 1187384 1315538 526328 -458283 -736263 -331808 74974 70317 -260307
16165b60307l42591N3164O48089P56403P1295n30648r9904P05925M09573q57955
$$ -260307 -602898 -549734 98355 854758 926053 395405 295501 1001426 1410999 553044
16155E53044j317231k57695Q52986O79312j09158k82636L170l2199j97674R3725
$$ 553044 -764187 -1021882 -168896 510416 401258 118622 121792 89593 -108081 -14356
16145a4356M59401J67643m47858n11920p9804J56175J66557L27653L37870k28269
$$ -14356 445045 612688 164830 -347090 -426894 -270719 -104162 223491 561361 333092
16135C33092o95848j46974P79254O12631n08313r07006n7384O37272K43651l25493
$$ 333092 -362756 -509730 269524 882155 373842 -533164 -590548 46724 290375 -35118
16125c5118j43442J90017o5925l16794J49109O46070K28733n57334n37082J42069
$$ -35118 -178560 11457 -54468 -371262 -222153 423917 652650 95316 -441766 -299697
16115b99697L88383L2712j41951M0611M773k52111r2622M07341L75954l09595
$$ -299697 88686 121398 -20553 20058 24831 -227280 -319902 87439 463393 153798
16105A53798o39795p5480N83465N10767N8685n1769O8449r2760l98351l08657
$$ 153798 -485997 -561477 21988 532755 591440 539671 608120 515360 117009 -191648
16095a91648J32350L36722R0431j89827j13183K25918M57117K98413k23001o69295
$$ -191648 -59298 277424 367855 178028 64845 290763 747880 1046293 823292 153997
16085A53997m91493K63855P81884M38192k83647m01848J48811M32497m0998n69300
$$ 153997 -337496 -73641 708243 1146435 862788 460940 609751 1042248 1001250 431950
16075D31950l85846J53620K19804j39194k06956O6708R31m51921m11325L86140
$$ 431950 46104 199724 419528 280334 73378 140086 141017 -310904 -722229 -336089
16065c36089Q29058Q6489q64066n64867O31770J021522J20650p17579m80356J52265
$$ -336089 492969 579458 -284608 -849475 -217705 803817 924467 206888 -273468 -121203
16055a21203K06462j04544j32190L640q1312j36120J47102L35519J3577k93575
$$ -121203 85259 -19285 -151475 -147835 -229147 -365267 -218165 117354 130931 -162644
16045a62644P462L85509M1847n48103k95688O00233Q50282J27205m89152k84010
$$ -162644 -155182 230327 272174 -275929 -571617 28616 878898 1006103 516951 232941
16035B32941J99426L40735K75856J52101k74697q09536o92428J31902O49812K83270
$$ 232941 432367 773102 1048958 1201059 926362 116826 -575602 -443700 206112 489382
16025D89382k43319j85310Q8494J0522j12882J48570L83641J08795k34682o8953
$$ 489382 246063 60753 149247 159769 46887 195457 579098 687893 453211 384258
16015C84258J93252j20026o42458n26352J22483M69235K92018N3761p5203k33203
$$ 384258 577510 457484 -184974 -711326 -588843 -119608 172410 226171 150968 -82235
16005h2235j94468K52851N30536O340p35712n98036K22621M94385J087j53929
$$ -82235 -276703 -23852 506684 513024 -222688 -820724 -598103 -103718 -102631 -256560
15995b56560M64175Q44465K95427l92980l42542K7343o7591m08615l37204L2167
$$ -256560 207615 1052080 1347507 954527 611985 639328 571737 163122 -174082 -141915
15985a41915J45803L3431Q9497K31682J09261j52575j57906N7582J64137J22535
$$ -141915 3888 37319 126816 358498 467759 315184 157278 214860 378997 501532
15975E01532P1583o0383k88950k83356R0017L47962J35378q4695J67808M06036
$$ 501532 573115 512732 223782 -59574 30443 378405 513783 429088 596896 1002932
15965A002932l5671o36673l26126O45550Q10102k89330j242755p66674M74726
$$ 1002932 967261 330588 4462 650012 1460114 1170784 -71971 -838645 -363919
15956c63919R11357K41428m17776k50968L11099M36501J549m29530m02765p1285
$$ -363919 547438 788866 371090 120122 431221 867722 869271 439741 36976 -34309
15946c4309O9040j70147l95178j34055M56318O84958K22583m06906m69539N5360
$$ -34309 34731 -135416 -530594 -664649 -208331 476627 699210 292304 -177235 -121875
15936a21875M89823L09727k77993o17468l02872M10656Q12811M21054m46422q93858
$$ -121875 367948 677675 399682 -217786 -520658 -110002 702809 1123863 677441 -216417
15926b16417m09904M88858Q13243K75711l86081l75185J63129M13870K9797m37354
$$ -216417 -626321 -137463 675780 951491 565410 190225 353354 767224 797021 359667
15916C59667l64658Q3321K84810J10383K4910K40820L28292n9943n24151m43483
$$ 359667 -4991 78330 363140 473523 498433 739253 1067545 1007602 483451 39968
15906C9968Q0494L48245R0527j70332M0310M03438K69825l65862p89956m85609
$$ 39968 120462 468707 559234 388902 429212 832650 1102475 736613 -53343 -538952
15896e38952K19545N94804L88070J0951r0403M8088J22905M4110l1493j9053j637
$$ -538952 -319407 275397 663467 674418 584015 632103 755008 799118 767625 748572 746935
15885G46935m9629j54384k91118l51427j35045L13001N19147J56175l29011k36562
$$ 746935 697306 542922 251804 -99623 -234668 78333 597480 753655 424644 188082
15875A88082K74737L26998k82323o63587k19884L78368K77423k03257j80368L24340
$$ 188082 462819 789817 507494 -156093 -375977 2391 279814 76557 -103811 220529
15865B20529N13654J43700k52185l50602l27194k13122J28029L94972J51608k54339
$$ 220529 734183 877883 625698 275096 -52098 -265220 -137191 257781 409389 155050
15855A55050q3162M31157K71015n86210q74706l6325P83460N36215j30189j30986
$$ 155050 71888 503045 774060 187850 -686856 -723181 60279 596494 466305 335319
15845C35319K40761O1959m51329l87934J33733J89358k32051k30206K89496L86371
$$ 335319 576080 638039 186710 -201224 -67491 121867 -110184 -340390 -50894 335477
15835C35477j90294m73336M2595M97527J40737m16648k89401K42290L37004l2084
$$ 335477 145183 -328153 -285558 211969 352706 -63942 -353343 -111053 225951 193867
15825A93867k70019k52849k93142l36197q1944K80043K75918j9117j03151P0525
$$ 193867 -76152 -329001 -622143 -958340 -1040284 -760241 -484323 -503440 -606591 -536066
15815e36066P7285j22010o1441L72978O56162M23482q140j81228j02551m8832
$$ -536066 -458781 -580791 -642232 -269254 386908 810390 802250 621022 518471 469639
15805D69639j29518k60781k98201r1113L09904N15509K63620n1363J13605M59274
$$ 469639 340121 79340 -218861 -309974 -70 515439 779059 727696 841301 1300575
15795A300575J52387p43667j095719l78743M38212L80237p5473p571K94001j1885
$$ 1300575 1452962 709295 -386424 -765167 -326955 53282 -22191 -29762 264239 252354
15785B52354n49029j95025Q10951R09603l10247j279695p81209K97758N18674
$$ 252354 -296675 -491700 319251 1228854 918607 -361088 -1142297 -844539 -325865
15776c25865R051j77520R6582J90040N0549J09157K04196r9552m08814k8362O12138
$$ -325865 -316814 -494334 -397752 -207712 -157163 -48006 156190 56638 -352176 -380538 231600
15765B31600M50251l47047n04036K18953N58501j13521p01327k12040O62443P81452
$$ 231600 681851 334804 -169232 49721 608222 494701 -206626 -418666 243777 1025229
15755A025229K67276j18040l80103q58454j086986l92089P47130J132329M92481
$$ 1025229 1292505 1174465 794362 -64092 -1151078 -1543167 -796037 336292 828773
15746H28773k78072m27373p0388K92969K96883j13332m99795k56450M16964M82306
$$ 828773 550701 123328 52940 345909 642792 529460 29665 -226785 190179 672485
15736F72485l68366r46048l00591O72028O19164j15826k98492k4373k43950o15898
$$ 672485 304119 -641929 -942520 -270492 348672 232846 -65646 -90019 -333969 -949867
15726i49867o6954P49383J22123j373261j036242J558565L168247J521889j185952
$$ -949867 -1016821 -267438 -145315 -1518576 -2554818 -996253 2171994 3693883 2507931
15717B507931j649358j92069N07414j37626m67062j5204k9567o89152o38416L66910
$$ 2507931 858573 666504 1173918 1036292 569230 554026 524459 -164693 -803109 -436199
15707d36199Q61250K90676o3537M50149O29539l04422j159269p75047Q1418K10733
$$ -436199 425051 715727 652190 1102339 1731878 1427456 268187 -506860 -425442 -214709
15697b14709n6539J34987M22566P1352m11770j40317M23582K45972l43467j95587
$$ -214709 -271248 -136261 286305 357657 -54113 -194430 229152 475124 131657 -63930
15687f3930N28959N45256k89605o59708l1306M49844o1807o77350k68650O78841
$$ -63930 465029 1010285 720680 60972 29666 479510 417703 -259647 -528297 150544
15677A50544Q31686O89p11301n13783J93401N45876K09617m36230p49875m10390
$$ 150544 982230 982919 271618 -242165 -48764 497112 706729 270499 -479376 -889766
15667h89766K61144O16603M12485L5053j06111q2794j24202j45062L2361K51542
$$ -889766 -628622 -12019 400466 435519 329408 246614 122412 -22650 9711 261253
15657B61253K44232R9422P1679O4413j93340n14108l70052K47832O38263L18693
$$ 261253 505485 604907 676586 740999 547659 33551 -336501 -88669 549594 868287
15647H68287l11351n74834l88797j10881J37005M36602N83423K80362k15161k95965
$$ 868287 556936 -17898 -406695 -517576 -380571 56031 639454 919816 704655 408690
15637D08690M8357J63845j68884l03556J52725N07267J8048p70629p04856K02271
$$ 408690 457047 620892 452008 148452 301177 808444 826492 55863 -648993 -446722
15627d46722P33747K80282l52085l02088J13079J38109j62705j60948K45821N52775
$$ -446722 287025 567307 215222 -86866 26213 164322 1617 -159331 86490 639265
15617F39265M57382J29589k01201m06625l31345J3208K59579J47954q638J56659
$$ 639265 1096647 1226236 1025035 618410 287065 300273 559852 707806 699168 855827
15607H55827L10264j16395q17704q13150R4637Q69245O23258k10990o02304l16877
$$ 855827 1166091 1049696 231992 -581158 -486521 382724 1005982 794992 192688 -124189
15597a24189O134r3896l57546k93917J76145O28982N49522j01988o86109m83163
$$ -124189 -118055 -211951 -569497 -863414 -687269 -58287 491235 389247 -296862 -780025
15587g80025L94617J011830P32401k2411m37628l52744j96150j69389q4200R3795
$$ -780025 -385408 626422 1358823 1336412 898784 546040 349890 180501 96301 190096
15577A90096J23747l9452j44023j02362j06440j72193l4042L07375L84094o3728
$$ 190096 313843 274391 130368 28006 -78434 -250627 -284669 22706 406800 343072
15567C43072n54735m20260K81947P93252N60245j66696o64386m91274J11349M85193
$$ 343072 -211663 -631923 -349976 443276 1003521 836825 172439 -318835 -207486 277707
15557B77707K34494l47160o17965l30284J60525M16979L51567R0033k12379k76006
$$ 277707 512201 165041 -452924 -783208 -622683 -205704 145863 235896 23517 -252489
15547b52489J31195O67479N67441k63651q30292l43846N34360N85276j74765o22618
$$ -252489 -121294 546185 1113626 849975 19683 -324163 210197 795473 620708 -1910
15537a910l06059Q4754J29499K85348O68936N16869l88211r26248k95835N46548
$$ -1910 -307969 -223215 -93716 191632 860568 1377437 989226 62978 -232857 313691
15527C13691L39194m35113m17906L07597M38301k56506n96328n7576M61524L08896
$$ 313691 652885 217772 -200134 107463 545764 289258 -307070 -364646 96878 405774
15517D05774k74k8735j40690l81450q4264O58324O23616m70501j046936j15369
$$ 405774 405500 376765 236075 -145375 -229639 428685 1052301 581800 -465136 -580505
15507e80505Q43663J63180j102844p35279R63640J503580J07241j171351p36157
$$ -580505 263158 426338 -676506 -1411785 -448145 1055435 1162676 -8675 -744832
15498g44832L47407M50424j25532j40263L61096L57150k71080n74867q3839N52033
$$ -744832 -397425 52999 -72533 -212796 148300 505450 234370 -340497 -424336 127697
15488A27697N69705N1435l27872j80740J59358J16459k58787k62816L24064O16735
$$ 127697 697402 748837 420965 240225 399583 516042 257255 -5561 318503 935238
15478I35238j09713j007146o71216O25842J145280K94880n01698j17644N82767
$$ 935238 825525 -181621 -852837 -226995 918285 1213165 711467 593823 1176590
15469A176590L23450n60298q85660m90683r1721O8857K47958L61408J88215P118
$$ 1176590 1500040 939742 54082 -436601 -528322 -459465 -211507 149901 338116 345234
15459C45234J02757J13121k47458m24901L1518M48091R6040m14639j53042L77640
$$ 345234 447991 561112 313654 -111247 -79729 368362 464402 49763 -103279 274361
15449B74361Q5077o27976m38028N04760P22638j2961k95164L63427O45650j69342
$$ 274361 359438 -268538 -706566 -201806 520832 507871 212707 576134 1221784 1052442
15439A052442q69271m36763K35111P1804k74329J99457Q25818L91533o06388o79110
$$ 1052442 183171 -253592 -18481 53323 -221006 -21549 804269 1195802 589414 -89696
15429h9696J80960N59575j1228m72107j84195J17516j99720n39392j48347O01916
$$ -89696 91264 650839 639611 167504 -16691 100825 -98895 -638287 -786634 -184718
15419a84718P96415K96773k18482k63708l8658K7068j52277k91676j60277P6840
$$ -184718 611697 908470 689988 426280 387622 414690 262413 -29263 -189540 -112700
15409a12700N3981k54332m14208j04276M04607N72056K54778j63035k29200J11438
$$ -112700 -58719 -313051 -727259 -831535 -426928 145128 399906 236871 7671 119109
15399A19109M39596K57326l81379p63948l72239L37687N41939K54026J40224K28089
$$ 119109 558705 816031 434652 -329296 -701535 -363848 178091 432117 572341 800430
15389H00430j19561p75562o74781L81102J029268L47689o24322n19029K50728
$$ 800430 680869 -94693 -769474 -388372 640896 988585 364263 -154766 95962
15380I5962M05739m4039j59642M1665j92627o14176k81579N15879N00758l16582
$$ 95962 501701 457662 298020 339685 147058 -467118 -748697 -232818 267940 -48642
15370d8642m97332L30400P54554L5705n83687o0936O32207K28131o62559o44549
$$ -48642 -545974 -215574 538980 574685 -9002 -69938 562269 790400 127841 -516708
15360e16708J72002N64671K53731M0182K29849L08280P0181j23779k05717m73810
$$ -516708 -344706 219965 473696 513878 743727 1052007 1122188 998409 792692 318882
$$ [...]
##END NTUPLES=NMR SPECTRUM
##END=
