##TITLE=H1
##JCAMPDX= 6.0         $$ Bruker NMR JCAMP-DX V2.0
##DATA TYPE= NMR FID
##DATA CLASS= NTUPLES
##ORIGIN= UXNMR, Bruker Analytische Messtechnik GmbH
##OWNER= root
$$ XWIN-NMR		Version 3.5
$$ Mon Jan  4 10:01:31 2016 Russian Standard Time (UT+4h)  servis@DPX200
##.OBSERVE FREQUENCY= 200.131235884673
##.OBSERVE NUCLEUS= ^1H
##.DELAY= (6, 6)
##.ACQUISITION MODE= SIMULTANEOUS
##.ACQUISITION SCHEME= undefined
##.AVERAGES= 1
##.DIGITISER RES= 18
##SPECTROMETER/DATA SYSTEM= spect
##.PULSE SEQUENCE= zg
##.SOLVENT NAME= CDCl3
##.SHIFT REFERENCE= (INTERNAL, CDCl3, 0, 16.5164)
##AUDIT TRAIL= $$ (NUMBER, WHEN, WHO, WHERE, WHAT)
$$ ##TITLE= Audit trail, XWIN-NMR		Version 3.5
$$ ##JCAMPDX= 5.01
$$ ##ORIGIN= Bruker BioSpin GmbH
$$ ##OWNER= servis
$$ F:/spectra/data/servis-vadim/nmr/H1/1/audita.txt
$$ ##AUDIT TRAIL=  $$ (NUMBER, WHEN, WHO, WHERE, WHAT)
(   1,<2016-01-04 09:58:15.62 +0400>,<servis>,<DPX200>,
      <created by zg, POWCHK disabled, PULCHK disabled
       configuration hash MD5:
       00 E9 B6 7A A2 85 ED C7 34 08 36 98 17 FE 4E 26
       data hash MD5: 16K
       B1 66 85 3B 35 6F 3C DA E5 9D 9D 1F 69 C1 48 FB>)
$$ ##END=
$$ 
$$ hash MD5
$$ F4 C1 C6 EC 7C 55 04 84 C6 10 E0 5E 5E BE A2 10
##$RELAX= 
##$RELAX= 
##$RELAX= 
##$RELAX= 
##$RELAX= 
##$RELAX= 
$$ Bruker specific parameters
$$ --------------------------
##$DU= <F:/spectra>
##$EXPNO= 1
##$NAME= <H1>
##$PROCNO= 1
##$TYPE= <nmr>
##$USER= <servis-vadim>
##$AMP= (0..31)
100 100 100 100 100 100 100 100 100 100 100 100 100 100 100 100 100 100 
100 100 100 100 100 100 100 100 100 100 100 100 100 100 
##$AQSEQ= 0
##$AQ_mod= 1
##$AUNM= <au_zg>
##$AUTOPOS= <>
##$BF1= 200.13
##$BF2= 200.13
##$BF3= 200.13
##$BF4= 200.13
##$BF5= 500.13
##$BF6= 500.13
##$BF7= 500.13
##$BF8= 500.13
##$BYTORDA= 1
##$CFDGTYP= 0
##$CFRGTYP= 5
##$CHEMSTR= <none>
##$CNST= (0..31)
1 1 145 1 1 1 1 1 1 1 1 1 1 1 1 1 1 1 1 1 1 1 1 1 1 1 1 1 1 1 1 1 
##$CPDPRG= <>
##$CPDPRG1= <>
##$CPDPRG2= <>
##$CPDPRG3= <>
##$CPDPRG4= <mlev>
##$CPDPRG5= <mlev>
##$CPDPRG6= <mlev>
##$CPDPRG7= <mlev>
##$CPDPRG8= <mlev>
##$CPDPRGB= <>
##$CPDPRGT= <>
##$D= (0..31)
0 1 0 0 0 0 0 0 0 0.06 0 0 0 0 0 0 0.0002 0 0 0 0 0 0 0 0 0 0 0 0 0 0 
0 
##$DATE= 1451887095
##$DBL= (0..7)
120 120 120 120 120 120 120 120 
##$DBP= (0..7)
150 150 150 150 150 150 150 150 
##$DBP07= 0
##$DBPNAM0= <>
##$DBPNAM1= <>
##$DBPNAM2= <>
##$DBPNAM3= <>
##$DBPNAM4= <>
##$DBPNAM5= <>
##$DBPNAM6= <>
##$DBPNAM7= <>
##$DBPOAL= (0..7)
0.5 0.5 0.5 0.5 0.5 0.5 0.5 0.5 
##$DBPOFFS= (0..7)
0 0 0 0 0 0 0 0 
##$DE= 6
##$DECBNUC= <off>
##$DECIM= 32
##$DECNUC= <off>
##$DECSTAT= 4
##$DIGMOD= 1
##$DIGTYP= 9
##$DL= (0..7)
0 120 120 120 120 120 120 120 
##$DP= (0..7)
150 150 150 150 150 150 150 150 
##$DP07= 0
##$DPNAME0= <>
##$DPNAME1= <>
##$DPNAME2= <>
##$DPNAME3= <>
##$DPNAME4= <>
##$DPNAME5= <>
##$DPNAME6= <>
##$DPNAME7= <>
##$DPOAL= (0..7)
0.5 0.5 0.5 0.5 0.5 0.5 0.5 0.5 
##$DPOFFS= (0..7)
0 0 0 0 0 0 0 0 
##$DQDMODE= 0
##$DR= 18
##$DS= 0
##$DSLIST= <SSSSSSSSSSSSSSS>
##$DSPFIRM= 0
$$ [...]
##$SUBNAM0= <"">
##$SUBNAM1= <"">
##$SUBNAM2= <"">
##$SUBNAM3= <"">
##$SUBNAM4= <"">
##$SUBNAM5= <"">
##$SUBNAM6= <"">
##$SUBNAM7= <"">
##$SUBNAM8= <"">
##$SUBNAM9= <"">
##$SW= 20.6817932712277
##$SWIBOX= (0..15)
0 0 3 0 0 0 0 0 0 0 0 0 0 0 0 0 
##$SW_h= 4139.07284768212
##$TD= 16384
##$TD0= 1
##$TE= 0
##$TE2= 300
##$TE3= 300
##$TEG= 300
##$TL= (0..7)
0 120 120 120 120 120 120 120 
##$TP= (0..7)
150 150 150 150 150 150 150 150 
##$TP07= 0
##$TPNAME0= <>
##$TPNAME1= <>
##$TPNAME2= <>
##$TPNAME3= <>
##$TPNAME4= <>
##$TPNAME5= <>
##$TPNAME6= <>
##$TPNAME7= <>
##$TPOAL= (0..7)
0.5 0.5 0.5 0.5 0.5 0.5 0.5 0.5 
##$TPOFFS= (0..7)
0 0 0 0 0 0 0 0 
##$TUNHIN= 0
##$TUNHOUT= 0
##$TUNXOUT= 0
##$USERA1= <user>
##$USERA2= <user>
##$USERA3= <user>
##$USERA4= <user>
##$USERA5= <user>
##$V9= 5
##$VALIST= <valist>
##$VCLIST= <CCCCCCCCCCCCCCC>
##$VD= 0
##$VDLIST= <DDDDDDDDDDDDDDD>
##$VPLIST= <PPPPPPPPPPPPPPP>
##$VTLIST= <TTTTTTTTTTTTTTT>
##$WBST= 1024
##$WBSW= 4
##$XGAIN= (0..3)
0 0 0 0 
##$XL= 0
##$YL= 0
##$YMAX_a= 25471
##$YMIN_a= -28546
##$ZGOPTNS= <>
##$ZL1= 120
##$ZL2= 120
##$ZL3= 120
##$ZL4= 120
##$ABSF1= 10
##$ABSF2= 0
##$ABSG= 5
##$ABSL= 3
##$ALPHA= 0
##$AQORDER= 0
##$ASSFAC= 0
##$ASSFACI= 0
##$ASSFACX= 0
##$ASSWID= 0
##$AUNMP= <proc_1d>
##$AZFE= 0.1
##$AZFW= 0.1
##$BCFW= 1
##$BC_mod= 2
##$BYTORDP= 0
##$COROFFS= 0
##$CY= 12.5
##$DATMOD= 1
##$DC= 2
##$DFILT= <>
##$DTYPP= 0
##$F1P= 11.0000006437302
##$F2P= -0.999999642372123
##$FCOR= 0.5
##$FTSIZE= 0
##$FT_mod= 4
##$GAMMA= 1
##$GB= 0
##$INTBC= 1
##$INTSCL= 1
##$ISEN= 128
##$LB= -0.5
##$LEV0= 0
##$LPBIN= 0
##$MAXI= 10000
##$MC2= 0
##$MEAN= 0
##$ME_mod= 0
##$MI= 0
##$NCOEF= 0
##$NC_proc= 0
##$NLEV= 6
##$NOISF1= 0
##$NOISF2= 0
##$NSP= 1
##$NTH_PI= 0
##$NZP= 0
##$OFFSET= 16.51637
##$PC= 1
##$PHC0= -104.5595
##$PHC1= 3.843713
##$PH_mod= 0
##$PKNL= yes
##$PPARMOD= 0
##$PSCAL= 4
##$PSIGN= 0
##$REVERSE= no
##$SF= 200.13
##$SI= 32768
##$SIGF1= 0
##$SIGF2= 0
##$SINO= 400
##$SIOLD= 32768
##$SREGLST= <1H.CDCl3>
##$SSB= 0
##$STSI= 0
##$STSR= 0
##$SW_p= 4139.07284768211
##$SYMM= 0
##$S_DEV= 0
##$TDeff= 0
##$TDoff= 0
##$TI= <>
##$TILT= no
##$TM1= 0
##$TM2= 0
##$TOPLEV= 0
##$USERP1= <user>
##$USERP2= <user>
##$USERP3= <user>
##$USERP4= <user>
##$USERP5= <user>
##$WDW= 1
##$XDIM= 8192
##$YMAX_p= 0
##$YMIN_p= 0
$$ End of Bruker specific parameters
$$ ---------------------------------
##NTUPLES= NMR FID
##VAR_NAME=  TIME,          FID/REAL,        FID/IMAG
##SYMBOL=    X,             R,               I
##VAR_TYPE=  INDEPENDENT,   DEPENDENT,       DEPENDENT
##VAR_FORM=  AFFN,          ASDF,            ASDF
##VAR_DIM=   8192,          8192,            8192
##UNITS=     SECONDS,       ARBITRARY UNITS, ARBITRARY UNITS
##FACTOR=    0.0002416,     1,               1
##FIRST=     0,             0,               0
##LAST=      1.9789456,     0,               0
##MIN=       0,             -28546,          0
##MAX=       1.9789456,     25471,           0
$$ Real data points
##PAGE= N=1
##DATA TABLE= (X++(R..R)), XYDATA
0@%%%%%%%%%%%%%%%%%%%%%jKkKkKkLmMmNoOpQrJ0j1J3j5J6j7J9k1K3k6K9l2L5
51A8l8M2m7N2n7O3p0P9q9J00j13J30j52J80k19K78l78N85j358M849J1246P014
73B2115L356q89l844p451q831r452q622o134k062O52L482O419Q099P451O548M897
89A5734J879j056k698m625o116n627m341l405j600N84J806K605L777L550K313
104B780J995J678K41q51p38j029j483j209j153j372r89m94j131j105J30N33K37
121c960J171K168J981J931K049J227R8l84j324k603k747k271k429j766j19P70
137f208J186K436L091K277J819J501L11j014j363j927k442j768r87r55j54J130
153c067J315Q66J223J148J64j54j65o41o82j0K4J7P65R68K01q1J9p83j631j291
$$ plain form
0 0 0 0 0 0 0 0 0 0 0 0 0 0 0 0 0 0 0 0 0 0 0 -1 1 -1 1 -1 1 -1 2 -2 2 -2 3 -3 3 -4 4 -5 5 -6 7 -8 8 -9 10 -11 12 -14 15 -17 18
51 18 -20 22 -25 27 -30 33 -37 42 -47 53 -60 70 -82 98 -121 157 -221 364 -994 3855 15101 22115
73 22115 25471 24582 20738 13287 4456 -4996 -13618 -19752 -21814 -21162 -17680 -11261 -3162 4289 10837 15734
89 15734 17613 16557 13859 9234 3118 -2509 -6850 -10255 -11855 -11271 -9465 -6860 -3083 467 2780
104 2780 4775 6453 6694 5843 5105 4076 2593 1384 231 -1141 -2130 -2624 -3755 -4860 -4730 -4197 -3960
121 -3960 -2789 -621 1360 3291 5340 6567 6665 6281 4957 2354 -393 -2664 -5093 -6859 -6978 -6208
137 -6208 -5022 -2586 505 2782 4601 6102 6413 5399 4036 2109 -333 -2101 -3088 -4043 -4197 -3067
153 -3067 -1752 -886 337 1485 1649 1495 1330 689 7 -3 21 38 803 1771 1972 1891 1910 1127 -504 -1795
173a795j097j228l75P34J109J702K494K175J395J195K01j511k127k226k896k810
189e060j514m33L20J745K848K842K799K654J291k20q41k005l166l153k297k036
205f226j046O64J744K122K929K864J975J205L69j110k105k133k339k498j426j53
221e164L14J161K081K215J728J483P97l55q77j214j942j793r52o76m08O63J387
238a552J119J255J368P10m5j94o64j336j009o81r41l87M73N37L95R82R87L95J51
257A563K77l26o67l52n39o47j84R8j22Q8N89K77j8L91K59k30m0J42j80j90J72
278C61p4k56J16J04m19k20K58j91k87K64K61J2K81N01pN1K24k42m31j35k32n77
300f38k31K74r1O8N23M76J16L49K84k07k06j36m55n39q3r4l34J85N14J77K08N82
$$ plain form
173 -1795 -2892 -4120 -4495 -3761 -2652 -950 1544 3719 5114 6309 6510 4999 2872 646 -2250 -5060
189 -5060 -6574 -7007 -6687 -4942 -2094 748 3547 6201 7492 7272 6431 4426 1260 -1893 -4190 -6226
205 -6226 -7272 -6608 -4864 -2742 187 3051 5026 6231 6600 5490 3385 1252 -1087 -3585 -5011 -5164
221 -5164 -4850 -3689 -1608 607 2335 3818 4615 4260 3383 2169 227 -1566 -2518 -3194 -3602 -2939 -1552
238 -1552 -433 822 2190 2900 2855 2661 1997 661 -348 -1029 -1970 -2357 -1884 -1347 -952 30 1017 1412 1563
257 1563 1840 1514 847 495 -44 -691 -875 -777 -899 -811 -222 55 37 428 687 457 417 559 379 189 361
278 361 287 31 147 251 -168 -388 -130 -321 -608 -344 -83 -71 210 711 704 755 979 737 306 171 -61 -638
300 -638 -869 -595 -686 -618 -95 381 497 846 1130 923 717 581 126 -413 -496 -590 -924 -739 -225 -48 160 742
322G42K65j25L8n7n11l88j70m14l64K48J19k6M30O46K14J73L91K2l33j23l37o47
344b07l34j76m28j28M04K60J54O84O82K19K46L01j73m89l46n63p71m77j93l53
364a688P1O23M80M23R50P27J94J87N8n21p73n39q08q01l35no4M49Q89O51N42P98
386A508N12r2j78k37p16q01m55n72m88O0K17Q3N14P48L60K16N19J94k87r0j10
407I05m19l35j20l77k83P5q8k66J27L11K9J40N61M13J56L93K88j17j85k11o69
428C28p33m23n20n45R5L20L89O81J021Q08N26M62P5n39o17p35j129r77m41l43
448b297q4O00R63P72R11R96M93m4j30n85r88p85p16p26k55L34L48M94Q71Q00K11
469A183J75Q1n29o23m66m10m14Q8L55L33O15P67L14o5l8n11r56q02o18m97j74
$$ plain form
322 742 1007 882 920 863 352 -36 -206 -620 -984 -736 -617 -643 -213 433 647 820 1211 1233 900 777 440 -207
344 -207 -541 -717 -1145 -1273 -869 -609 -455 229 911 1130 1376 1677 1504 1015 669 106 -665 -1142 -1335 -1688
364 -1688 -1617 -994 -514 -91 859 1586 1780 1967 2025 1504 731 192 -616 -1417 -1752 -1757 -1821 -1372 -483 168 710 1508
386 1508 2020 1928 1750 1513 797 -4 -459 -1031 -1519 -1459 -1242 -1159 -645 103 463 679 1198 1392 1105 1015 905
407 905 486 151 31 -346 -629 -554 -642 -908 -781 -470 -441 -301 260 673 829 1222 1510 1393 1208 997 328
428 328 -405 -828 -1348 -1893 -1798 -1478 -1089 -408 613 1421 1947 2409 2484 1945 1328 593 -536 -1513 -1954 -2297
448 -2297 -2381 -1781 -818 -46 865 1861 2354 2310 2180 1595 607 -178 -894 -1620 -1875 -1541 -1193 -699 172 972 1183
469 1183 1358 1439 910 287 -179 -589 -1003 -915 -560 -227 388 1155 1469 1404 1366 855 -101 -903 -1521 -2018 -2192
490b192N22P08R47J276J136N33K81o1r14j414j249j384j372o37P5M54J166J707
508d18J641J464J359O18l46p46j205j904j897j404j131o46L57J025J297J697J831
525A592J375R18N34k83r82j111j381j575j319p25m12p6O38J000R39J200J134P23
543B189M81L83j95o09n67p04j070r12n53o45m22R2K91M46R36J034Q91R47Q96L94
563C303j07k58p86j326j295j132j163q62n3L23P94J402J556J422J277R75J22m92
581C700p96j392j775j447j155q42j84O09R71J280J596J434Q75N67J08p15j050
598A784j101j201j187o36q8J17N57J008Q73Q20P27K73k45k90m84q18o43k30j98
617i62J5L96N74M06L38K97j46l44l74n07o17j75K3N8L93Q41O32N42M77J61l58
$$ plain form
490 -2192 -1670 -962 -15 1261 2397 2930 3211 3150 2236 822 -427 -1811 -3183 -3820 -3745 -3291 -2125 -418
508 -418 1223 2687 4046 4664 4318 3572 2367 463 -1434 -2838 -3969 -4615 -4258 -3233 -1936 -239 1592
525 1592 2967 3885 4419 4136 3154 2043 662 -913 -2232 -2957 -3369 -3445 -2807 -1807 -868 332 1466 2189
543 2189 2670 3053 2858 2249 1682 978 -92 -1004 -1557 -2202 -2624 -2532 -2241 -1795 -859 175 1066 2013 2909 3303
563 3303 3196 2938 2152 826 -469 -1601 -2764 -3626 -3679 -3356 -2562 -1160 396 1818 3095 4070 4192 3700
581 3700 2904 1512 -263 -1710 -2865 -3707 -3891 -3282 -2311 -1031 565 1999 2874 3441 3549 2834 1784
598 1784 683 -518 -1705 -2341 -2429 -2312 -1755 -747 126 946 1673 1946 1701 1411 927 109 -534 -764 -962
617 -962 -947 -551 23 429 767 1064 918 574 200 -307 -924 -1099 -1076 -1018 -625 216 848 1390 1867 2028 1670
638A670n32o83q93q38m30l31k6N55Q01P38Q70Q49L91N0j46n09r16p76p25o84l25
659a890K03K40M53Q15Q10L62M69K82j56m39l74n42o37k57j76j63J83M00K04K41
679B8M22J73m9k4J6k07k13l5m7j24J07N0j01O3J15j67j04J42j04r2J30J85M6N
703B15K06l3p6o3j02k75k4l9r2K6K70J74J06K10J28j30j09j39l21l17q2j52j5
726f34L18L68K27L89M10P2j02j50l39o44m65l39l25q9L18K91M67P63N64L15K46
747A661N9l75n99n47o82o56l66j00L9M09P06O39O70O26L79n5k13l67o41p59n12
768f84n28l32K6L06L50N98O83N04K93L16l5l28l25m24n61m47k15j60k3K72L14
789d00K14M31L95R3R2J18j80l01j30j97l20j56lq5m3J81J82L2K26K02m5R4J32
$$ plain form
638 1670 1138 455 -438 -1276 -1706 -2037 -2063 -1508 -707 31 901 1750 2141 2191 2045 1536 620 -156 -881 -1565 -1890
659 -1890 -1687 -1447 -994 -179 631 993 1462 1744 1588 1149 775 233 -404 -661 -837 -1000 -817 -417 -213 28
679 28 450 623 574 550 566 359 146 111 64 -60 47 97 -4 59 174 7 -97 45 -59 -151 -21 164 210 215
703 215 421 388 312 249 147 -128 -152 -191 -283 -257 13 187 293 503 631 501 392 253 -68 -385 -467 -619 -634
726 -634 -316 52 279 668 1078 1150 1048 898 559 -85 -550 -889 -1214 -1303 -985 -694 -227 536 1100 1415 1661
747 1661 1720 1345 746 199 -483 -1139 -1505 -1605 -1566 -1157 -451 188 858 1484 1863 1808 1595 1228 587 -172 -684
768 -684 -1212 -1544 -1518 -1212 -862 -264 419 923 1216 1532 1497 1169 844 420 -141 -588 -803 -963 -986 -714 -400
789 -400 -186 245 640 733 825 943 763 462 332 135 -185 -341 -344 -429 -472 -291 -109 -77 149 351 306 400 532
812E32j8j50l7m9j91j48o9j17o1Q5J3K0J84J81N7J05J55Pj24K9n7k58j35j1j70
837b27p2R5LO2K10J71k7J09J37o3j58N1r1j96k9l5r5j6R4N6j3K02M4n5J26L7j11
864B09l0M1n6j68K2O8j78M3J25r3K2J10M6j02J13Q1j18kJ4l5q4L7M3q1O5J05j05
891I2J9P7n4j18N6j7n7m2J06l9K9J17R0p6J02M4j36l6n1r5j72N8K2j01O3J84M5
918A10P3J72O1p6K3l8k32j24J9j79q0Q0Q3kJ62J51P4M9J17m8j19m8o2k13l8K4
944f1q6k5J38Q6j3J13R1j7k0L3r4m0M8k3r9P0L3n1k2L9j3m4L6j1j24N6P5m6K2
973E1K13J5o3L2J7j07j03N3j24o8L1j5N0J05R2J5RR6m2j53K0m4j17j7P4j9mJ55
1001A52J01n3O1L5r4j06q4q4j47R3L6LJ06K80K5O3J33q8j50l9j53k59j39%r6m
$$ plain form
812 532 514 364 327 278 87 -61 -130 -247 -308 -223 -210 -190 -6 175 232 337 492 499 375 404 347 89 -46 -57 -227
837 -227 -299 -204 -201 -139 71 242 215 324 461 398 240 291 200 4 -25 -60 -155 -171 -77 -21 -34 168 212 157 283 320 209
864 209 179 220 164 -4 18 86 -92 -49 76 -17 5 115 161 59 172 253 135 133 147 112 28 65 108 27 92 197 92
891 92 111 188 134 16 72 55 -2 -44 62 23 52 169 259 183 285 329 193 157 106 11 -161 -103 -81 -182 -119 65 110
918 110 183 355 416 340 363 325 93 -31 -12 -191 -271 -191 -108 -110 52 203 277 326 443 395 276 228 166 -47 -85 -61
944 -61 -147 -172 -34 52 39 152 243 226 206 239 145 105 153 130 31 101 134 83 61 100 87 43 79 68 -56 0 75 29 51
973 51 264 279 216 248 265 158 55 108 -16 -84 -53 -68 -18 87 179 194 203 299 257 104 124 80 -37 -54 20 1 -3 152
1001 152 253 200 261 296 202 96 12 -72 -219 -126 -90 -87 19 299 324 387 520 432 282 243 90 -169 -308 -308 -404 -408
1027d08K55K00J71K18J89K8j6o8k12k32j74k21j78k7O1O4K04K71K51M6J65Q2j56
1050E13r5j41k60j43k5j03j01J66J17Q6P4J98J3l0K5qj38Krj08m0R7Km7N6L8n7
1077H2m7L1p0l2N3L8j6J08J14K4j9Q0o4j45j9o1j46m9J1k4l5J48J11M4J57P4k1
1104C27m4K7j13r8l2r2q7P5N2n1M8Q6N1n4M4O5j82J17M5n7kJ20m6j6L1j3j06n4
1132D1k8p9o7J3L1l1J55J58L0J01J12L5r7q7l6k39p2j08q3o3P0J25M5J60J99O7
1158C52O6J20j08j14p1j26j61q1m2l9MJ01M6O1J52P7NN7R6p0p3Nn0j77N2l9j04
1185f1m2J03q0k3J00P8m0Q9J20pO7M8l4r1M2j25j23q7l5p7o2J40N2J3J70J07K9
1212B71Q8J14n1j28m6j26j76m5k9q2lJ38Q4JJ52J29PK1M3p0r9jo5j24k2Or7M8
$$ plain form
1027 -408 -153 47 218 436 625 653 637 569 357 125 -49 -270 -448 -475 -414 -350 -146 125 376 422 587 669 513
1050 513 418 277 17 -126 -151 -254 -355 -189 -72 14 88 286 299 269 294 286 148 150 141 33 -7 90 92 45 101 139 82
1077 82 35 66 -4 -36 17 55 39 147 261 285 266 346 282 137 118 57 -89 -138 -127 -151 -186 -38 73 117 274 348 327
1104 327 283 310 197 99 67 -25 -112 -37 15 -36 12 98 149 95 139 204 22 139 184 127 125 245 199 183 214 201 95 41
1132 41 13 -66 -133 -120 -89 -120 35 193 223 324 436 471 374 287 251 12 -60 -168 -251 -314 -244 -119 -74 86 285 352
1158 352 418 538 430 316 245 119 -42 -123 -165 -204 -200 -99 -53 8 160 237 242 299 395 325 252 257 207 30 82 43 -61
1185 -61 -103 0 -80 -103 -3 75 35 124 244 237 304 352 318 227 269 144 21 -66 -101 -178 -240 -100 -48 -35 135 242 271
1212 271 359 473 422 294 248 122 -54 -99 -128 -210 -213 -75 9 10 162 291 298 319 362 292 193 192 127 3 -19 -13 -110 -62
1240f2O8K1JJ12Jj0L7N8l4n7L2l5m1L9rr8L7M0q4l4L2L4n9L4Q1J9J5P8J4k2P7
1271B85k9j14n6j7o2j13M5K5o2O3J10kJ33O8K9JM7j18q4m8n4r6o7N3p2L3J08Q4
1299I0O4N4J33j1l6J0p7j40n3nr7m1N8rL7J06Q2l4J14N5m7o1J7q7o8m2J4m7pP4
1329D6J9k0J37M2m7O9J6j42k7Rj07n1K6M8l7P4R3J2K6O7J8j09j3Pj07n4j6l3k2
1358g6N4O5MP8Q4J3J4O3m2j06M3n4j21o7N4r7OR7K8L8J23L9M4j3N8r5n4o8o0j24
1388g2jpj0m9J42P1k3J97L7K6j1J0j02q5j2q2j40J1K1k4M6J30K1O2O0O0j8jj0
1417B47p8p5j8m9j14M7M6rM6N2M7OJ14l5n6J5j1p8j8m2%r4P6L5m7O6P3o1jP0j4
1448A40k6Pom0L0Mn8k5J09Pm7K3J0k9m7Q0p9oJ9L1m3LM7j1k0J05pk7N1k3n3p4
$$ plain form
1240 -62 6 27 28 140 141 131 168 226 192 135 167 132 91 130 121 23 60 100 16 -18 14 48 -11 23 104 123 138 216 230 208 285
1271 285 256 142 86 69 7 -106 -61 -36 -98 -35 75 73 206 274 303 304 351 233 149 101 47 -49 -116 -63 -135 -102 6 90
1299 90 154 208 341 330 294 304 227 87 34 29 -68 -109 -51 -60 -23 83 165 131 245 300 253 192 209 122 54 12 26 -21 -28 46
1329 46 65 45 182 224 177 246 262 120 93 102 -5 -56 -30 18 -19 55 148 160 186 253 271 162 149 156 49 -5 -21 -54 -76
1358 -76 -22 43 47 125 209 222 236 299 257 151 194 140 19 -48 6 -91 -85 12 40 78 201 240 284 271 329 234 180 112 52 -72
1388 -72 -73 -80 -90 -139 3 74 51 248 285 311 300 310 208 123 111 29 -111 -100 -79 -103 -57 73 94 156 216 276 258 257 247
1417 247 169 94 76 27 -87 -40 6 -3 43 95 142 148 262 227 171 186 175 97 79 37 37 -57 19 54 7 73 146 85 84 154 140
1448 140 114 121 115 75 105 109 51 26 135 142 95 118 128 99 52 132 53 47 66 97 54 57 104 93 73 178 171 144 195 172 119 45
1480D5N4q0K5J7pn1M7R0m9L9O1kl8K0J0j35N6k9o0o2O0Ln3Q7P0pM3N4j9k9K2R
1512A91o0m2k2n8j6K6lJK3M5k2M4J01k8k5O3pk6l7j0p6m4M8q9l0L7M4ON6J16j1
1543A95K0Q3l2j21K5o3p8o0K5j04M5L7O1N0Q3Q5j1OJ1p8o7nn6j22K0P8j9jQ8M9
1573A44MP9J8m4o1Lm4m6J7k1j6M9O0K6KK1l0p0M2n0j08l6O7j7O2J19%M7M1K7l5
1604B50j06N0j74r1J3m8k9R2M6Q4Q7J62j3j2L6m5j68r0k2j40m0O7j6M9J33Q6J01
1631B62L3Q2o6n1l2r1j67l9j4n4LP8O3Q7R4R7MJ7Mm0j14m1p8j24j3jl0K8P5J04
1661G6N2J76J5j9N7j6p8r0q5j34j47NKk7O2J60P6R9J92J26j1L8n6k13j66j13k11
1688b30j49p5K7R4J83K73J57K21J51R9n5o1j74l24k36k42j77j67Q0J10J97L08
$$ plain form
1480 45 99 19 44 61 54 3 50 140 91 130 191 189 151 171 181 46 102 73 13 -49 11 14 -39 48 118 111 154 208 189 160 182 191
1512 191 131 89 67 9 -7 19 16 17 40 85 63 107 208 180 155 218 211 185 148 138 62 18 66 -23 -53 -16 28 34 90 206 195
1543 195 215 298 266 145 170 107 29 -31 -6 -110 -65 -28 33 83 166 251 240 246 257 179 112 107 51 -71 -51 27 8 7 95 144
1573 144 148 227 245 201 140 143 99 53 70 49 33 82 142 168 170 191 161 91 133 83 -25 -61 6 -11 51 170 170 217 258 285 250
1604 250 144 194 20 -71 -58 -106 -135 -43 3 87 174 336 323 311 347 302 134 44 22 -118 -158 -91 -107 -58 75 161 262
1631 262 295 377 311 260 228 137 -30 -69 -83 -137 -134 -56 7 94 188 285 289 306 310 270 156 115 37 -87 -100 -101 -131 -103 -28 76
1661 76 128 304 319 300 357 341 263 173 88 -46 -193 -188 -186 -213 -151 9 85 184 376 502 491 529 473 260 94 -19 -230
1688 -230 -379 -454 -427 -333 -150 123 280 501 652 751 696 635 461 137 -99 -341 -518 -685 -605 -495 -298 10
1710A0K81K66K16J17l8j45j68l51l39k32j48j29J9J81J64K59L09K63J16J46Nr7
1732G05k50j82k33l02j84j0o1R9J88J49J72J94J86N4K1k0o8j31j02j74j44k2j09
1755b24m3M6M3N8R6J77N3O5P2M3Ok0k7r8r8m9j42p3n1m4L1M9O3R4P5J52J25J8
1783C97J3N1o5j52m8j23j40j20k0n1J7Q2J21N7J41P9O5P1N7j7p1l7r0k04n7m5
1809h9j39pM0k0M1J55J21J54R3J64K4rn1r4j72j12k01j87j07K0jN7K10J90J49
1834B29K30J60%rk5j88k23j80k19k01l4k7R1J51J99K79J66J56Q4J8q0j46j91k16
1858B4k04q1k00R5R2M5J93J78J39J28R0J6r1m7j44j49j49p9m3j0K6P1R7O9J60
1883B26M4K8Jj1o9m2p6r1rl6lM2M9N8j7R5Lj5k4rk2m0jnn7N4L3j3j2N8L6l9k0
$$ plain form
1710 10 291 557 773 890 852 707 539 188 -151 -383 -531 -660 -641 -460 -296 -37 272 535 651 797 802 705
1732 705 455 273 40 -262 -446 -456 -517 -418 -230 -81 91 285 471 525 546 526 458 327 225 51 -93 -115 -224
1755 -224 -267 -221 -178 -120 -24 153 206 271 343 386 392 372 345 247 149 100 -42 -115 -166 -210 -179 -130 -67 27 102 254 379 397
1783 397 410 461 396 244 196 73 -67 -187 -207 -258 -241 -159 -38 19 160 239 304 375 432 415 344 307 217 13 -44 -89
1809 -89 -228 -235 -195 -215 -174 -19 102 256 349 513 537 528 477 383 211 99 -102 -289 -396 -376 -377 -320 -110 80 229
1834 229 459 619 619 610 585 397 174 -6 -225 -426 -460 -487 -396 -245 -46 233 399 555 639 657 577 431 240 24
1858 24 -180 -261 -461 -366 -274 -229 -36 142 281 409 499 515 424 377 233 84 -65 -144 -187 -197 -171 -100 -3 66 226
1883 226 270 298 299 288 219 177 101 10 1 -35 -38 4 53 111 94 189 192 177 153 144 122 82 81 76 19 73 106 93 81 139 175 136 116
1916A16J9l7n6L0p1PJ8J0L7O3J1L8QM7l6k4p2rp5o2J7nk1O2M7N1P8L1N9k0k7j0
1948B24j25j8l5j03m4P1n9P2O0Q5OQ5L4KQm3q9n8mo5o9j8J8K8O7J10L5kQ8j0k0
1979B31k3K6j46l7m2n1k7K4J5N9J9J13K2qN4K3n3Kk4p3j03kj7n0K4L5J2O0O4P6
2009B03QJ4J3Rm2r7l6q2m4J0qPO5J0J07P7RK6L7n9m1q0l8j04J3j9k2L9L8O5J4
2040I2P1R3l8Nl1m3n5l4j0p7oL2N4QM2K9J0JL3m8L4l5l6nj2RjKK6j7pL7k9m8K1
2075F7j0L2NK3L8joRl2kk4l1l4k2kJ3L7NJ8O8mK6j5M9o9Kk3k1n4rjL6J4OK8o7
2111D9L3K3J3m1N3KLO3l1K6k1Jl6j12j7m6j7l4P9k2J25Q0J12J6P6j5r3n8j25j30
2141d4j24m8p8j6J33Q3J39J92J31J35M8m5q4j45j68j60j50j08n1mK3K42J42K23
$$ plain form
1916 116 135 98 42 72 1 8 26 36 73 136 147 185 193 240 204 180 108 99 24 -38 -21 -26 -47 15 62 113 191 222 281 261 234 224
1948 224 99 81 46 -57 -101 -30 -89 -17 43 128 134 219 253 255 263 220 131 73 69 4 -65 -83 -65 -37 30 140 175 173 261 251 231
1979 231 208 234 88 51 9 -42 -69 -45 -30 29 48 161 183 175 229 252 199 201 177 104 1 -1 -18 -68 -44 -9 3 63 127 203
2009 203 211 225 238 247 205 108 72 -10 -54 -44 -52 -45 20 30 137 214 223 249 286 227 186 106 68 -36 -23 -42 -64 -25 13 78 92
2040 92 163 256 218 223 192 149 94 60 50 -27 -33 -1 53 61 103 132 142 143 176 128 162 127 91 86 74 83 82 84 110 93 86 123 94 46 67
2075 67 57 89 94 117 155 154 148 157 125 123 99 68 34 12 10 23 60 65 83 151 147 173 158 207 138 140 117 96 42 33 32 68 82 88 116 49
2111 49 82 105 118 77 130 132 135 198 167 193 172 173 137 25 8 -38 -55 -89 -10 -32 93 173 285 301 377 362 269 211 86 -44
2141 -44 -168 -216 -294 -310 -177 -94 45 237 368 503 551 506 422 277 109 -51 -201 -309 -360 -364 -341 -99 43 266
2165B66J60J16N1n8m0j68k03j35j68j31k0l6O3J24J95J48J70J03P8J4o8k9j63
2188B69j51j65j16j26n5P3nR9J89J55P5J31Q8J7k0n0j14j55q2j70j08o9j6K0O3
2213b23J82J17R1K07J33N2k4o0j05j67j15j96j27m9o3M2Q8J67J67J17J24J33J9
2236E10k4o0j55j22q6j67j09kjk1J44P0J00J14R6M4Krro9o4m5n7j04J5k3o3KM8
2265d5m3N0N0O9O6J27M8J5J5km5p0j25j20j12j13l1l0R6J29Q6J74J23J58M6Qj3
2292E11j46j40j50k01j55j00J7KJ05J64J82J80J74J30k6n8j9j75j72j45j73j16
2314c11j5L8K5J65J29J49J49R4P0K4j17q9j56j04q1j12p0lJ9L3J27P9J25O6J27
2339C61k5pKq2j02j10m2n1p9JlP5O0Q8P5R0K0N0l5j1l2j31l8q4l9j5%K5O0P5P6
$$ plain form
2165 266 426 542 593 535 495 327 124 -11 -179 -310 -330 -366 -303 -179 16 164 334 437 515 529 461 432 269
2188 269 118 -47 -163 -289 -344 -271 -276 -177 12 167 242 373 461 478 458 408 294 139 57 -113 -221 -290 -306 -286 -223
2213 -223 -41 76 167 374 507 559 535 475 370 203 88 -108 -235 -284 -347 -305 -217 -50 117 234 358 491 510
2236 510 486 426 271 149 63 -104 -213 -215 -216 -237 -93 -23 77 191 287 331 333 324 315 246 182 137 80 -24 -9 -32 -95 -93 -45
2265 -45 -88 -38 12 81 147 274 322 337 352 350 305 235 110 -10 -122 -235 -266 -296 -200 -71 15 189 312 470 516 524 511
2292 511 365 225 75 -126 -281 -381 -364 -362 -257 -93 89 269 443 573 547 489 470 295 123 -22 -195 -311
2314 -311 -326 -288 -263 -98 31 180 329 423 493 517 400 311 155 51 -30 -142 -212 -215 -196 -163 -36 43 168 234 361
2339 361 336 329 331 249 147 37 -5 -56 -135 -134 -137 -62 -2 86 161 251 271 321 286 275 243 112 74 -10 -49 -64 -64 -39 21 96 172
2370A72J0N0qm2j3j2m0j15l3K7Mk1J02K6M4N0M4m8j8jj07o9m2Mj1N0K4P1O5N7
2400B20J9L7l9l5k8j10k5p1p3L5J5P6N6R1K6P3K9l7qm8j08n4m8l9k3rL3P4PJ64
2430B00k4M7Qkn9k2j7r2p7mL4j8J9M7L8K6L8M8J7qJ9m4k3l6p0J4k0j1o0N7M5M1
2462A11K4P2qK2nl6m3l1m1k8l3J0K4l4P1MK0L9M1j0j2L0p0J5p2rLm1M0QL2l5K4
2495H2O2qL1o9RN9l6l1nqkl5L2M6l3J9M8k3k7j8okJ0nL9k2J5l4MJ6K3o0K7m8J1
2530F1J5M4j7k4M5k1LNK2l2k3M1q5J0O8m6K7k6Q4p0L0M6m7K2l8M9k1Ll4j4K4o
2562I5k6K2K6n2jMO7l2K6MP9q8K0N1p3pn3l7l0M1l3kM3LQ8j2N2J0l0M7p0Rp8m2
2596B1j9l9O6K3L1K7J9J1L8L2J5j9m4p9m8k6nOk8O5K9%R2L7OL3k8p2k6k7No6m4
$$ plain form
2370 172 182 232 224 182 169 157 117 2 -31 -4 0 -21 81 107 151 201 245 197 179 178 71 2 -40 -36 -47 3 27 98 163 220
2400 220 239 276 237 202 174 64 39 -32 -105 -70 -55 21 77 168 194 267 296 259 251 203 95 41 -7 -46 -69 -78 -45 29 36 200
2430 200 176 223 231 229 170 148 131 39 -38 -42 -8 -26 -7 40 78 104 142 190 207 199 218 174 151 115 45 59 39 28 -32 25 70 111
2462 111 135 207 199 221 216 180 137 106 65 37 4 14 38 4 75 79 99 138 179 169 157 187 117 132 60 51 54 13 53 61 93 58 82
2495 82 144 136 167 98 107 166 130 99 94 86 84 49 81 127 94 113 161 138 111 93 87 85 95 90 129 107 122 88 92 108 131 71 98 50 61
2530 61 76 120 103 79 124 103 106 111 133 101 78 119 34 44 112 66 93 67 151 81 111 157 110 132 94 143 122 125 91 77 101 95
2562 95 69 91 117 65 64 68 135 103 129 133 212 124 144 195 122 115 62 25 -5 36 3 1 44 47 135 123 175 185 155 202 132 141 63 21
2596 21 2 -37 29 52 83 110 129 140 178 210 225 206 162 83 35 9 4 10 -18 47 76 76 168 205 211 244 216 144 118 91 96 30 -14
2629a4OL0QK9O2qJ9J6lkQJ3k6Lr6J4MMl4k1O0L0MK4N1l0L7j1Lm7j1m4l5Nk8j3
2665GKK3N8KQ0L9j4L8no0k3q7m5l9oM2o4P8P4K8K3L3K8L5m1j6j02J2o2l3m4L9
2697@L4k0M7K2L7L8L8j3kKj2o5Oo8K7l9M1ojQQk0nP2k4K8Nkj1L4l3%jn6l9m0O
2734dJ8n7M5M0O6L4M7L8n%j4k5m5j06j7m6ok5kM4R7K6P5O1J0J6k0j9m1l1q8p0
2766dm3NK9l7R1j3Q4L7M2K9O4k9o0k5k3l6p4n8k6Nm6N8O2KJ10M2J8M1Qk9n6%o5
2799A03l8r1J1k4k5L8J9P1P7N1L2J6%q6K7k3r7m7l9k4O0m0O0K0M2R5J0Kj3K7n7
2830A57o4mQn5k0kJ3j6R6L1%j4K7k3j5rn2j1K3K2l3Q3LrM2Nk2l3o5nj4l2M4l4
2864B2J6J8O1L3jN8k5j5Kn5k8Ql7j8m4J8oL4M1RL1L9K9m3L6K0m8m4m4k7k7J6J4
$$ plain form
2629 -14 -8 22 30 59 121 113 132 148 145 143 151 164 138 141 45 59 63 67 33 12 72 102 106 130 181 151 188 177 180 133 122 78 43 48 20 7
2665 7 9 32 90 92 172 211 197 235 230 170 147 60 15 -24 -30 12 -52 26 100 128 151 184 212 247 206 190 88 100 38 5 -39 0
2697 0 34 14 61 83 120 158 196 183 181 183 171 106 112 44 71 32 73 67 66 74 82 62 57 129 105 133 138 136 125 159 126 126 125 69 30 -10 -4
2734 -4 14 -43 2 42 108 142 189 227 222 222 208 183 138 32 15 -31 -37 -62 -64 -20 77 103 178 239 249 265 245 226 185 154 66 -4
2766 -4 -47 -42 -13 -50 41 28 112 149 191 220 284 255 195 170 147 111 37 -21 -47 -42 -88 -30 32 34 144 186 204 245 253 224 168 168 103
2799 103 65 -26 -15 -39 -64 -26 -7 64 141 192 224 240 240 154 181 158 61 14 -25 -49 11 -29 31 51 93 188 198 200 187 214 157
2830 157 93 89 97 42 22 20 33 17 113 144 144 130 157 134 119 110 58 47 70 92 59 142 145 136 178 183 161 128 63 58 44 12 56 22
2864 22 38 56 117 150 149 207 182 167 169 114 86 94 57 39 -5 13 7 41 82 91 122 161 190 147 183 203 155 111 67 40 13 29 43
2897D3m7J5P6L1RQ0Mm2K3Np9jpp3k0k2k6L5l9J14L3KNP7j4L5k4o0J9l4j01K6l2
2930A1oK6l6M6L2J2L2K4P6k4k2p5L9k9kj6k8Lko9L1N3j1K7N1K5j7J9K1k9k0Pq
2963A41o0On9j7Rj8J1O6J8ORM7K0J3j9l9j3kn5n0Pn8J9P0JJ3K2L7N3m1J6J0nn3
2997A05lo0J3k2PJrO1j8J6L8j7N2k1L1Jk7k2o5K8n5Pj2J6j0K6M2J7LK8j3K0l0
3030A28l1oRoj5j9j0J1j2L2J8qj5O5J8k3j8J2j4n0kK7k5PjOL1mRl7J6Rol0N1j9
3066I8j0J3J1jk3nJ7%m5Q2o4J1J4k0j3NN3nml2L9j3kK2o7M8J3m9K4j0J7Ol4L9
3100A15qNj2oj5lRJ0l8L2K5j7L8m8K8m5J9J9l6jKN6m0K7J1j1l0j3K8l3M3m9J1
3133G3pK3j1mL2L6KJ4j9pJm9J1jl1Qj7N9k0j8M0j1K0Nj5m6N9k3j8lJ5k6M4k8N2
$$ plain form
2897 43 -4 11 87 118 127 207 211 169 192 197 118 117 110 37 17 -5 -31 4 -35 79 112 114 119 196 182 217 193 133 152 118 17 43 11
2930 11 5 31 -5 41 73 85 117 141 217 193 171 96 135 106 104 88 60 63 61 -8 23 76 65 92 143 168 151 170 191 162 142 149 141
2963 141 81 87 28 11 20 2 13 79 97 103 112 159 179 192 173 134 121 119 64 14 21 -37 -18 52 53 66 88 125 178 137 153 163 158 105
2997 105 102 42 55 33 40 41 32 93 75 91 129 112 164 143 174 175 148 126 61 89 34 41 29 45 35 61 103 120 123 151 138 158 128
3030 128 97 91 100 94 79 60 50 61 49 81 99 91 76 141 159 136 118 130 116 66 64 91 66 73 72 78 109 105 114 77 93 102 96 66 117 98
3066 98 88 101 112 111 88 83 100 100 55 137 73 84 98 78 65 70 123 118 114 82 121 108 106 128 61 109 122 73 97 87 104 110 76 115
3100 115 107 112 100 94 79 76 85 95 57 89 114 97 135 87 115 70 89 108 72 71 73 129 89 116 127 116 86 73 101 68 111 62 73
3133 73 66 89 78 74 106 142 144 158 139 132 133 84 95 94 63 71 54 113 93 75 115 104 124 129 114 68 127 104 86 83 98 72 116 88 140
3168A40l7%Lj2J0k6oj2K3N1p2M8j0kJ5kK5n8j0rK5K4l9qK9L6m9QN0l7Nk2K5n2
3202E4QL1k8L5j2k6K4oJ7jNL9m5K0k0Nk5%N8n7J9l%j3kK0Pj5RK1jj7M5j8n0jK7
3239A04l1k2K4m4L8RK7J5J5J2k7oRLj5Qo1J9k5K0rOJ1M0OJ9l6J6l4J6k6kpl1L3
3274G4qjJ0N5k2l1N9J1l0j7M0pl1mk8N4n6K5L2k8J4l4%K3j9Ol9K6J4OrQ3l3k0
3308A15l1L4l3Qp6O3m6RQ9l5J0qN7l3j3K6pj4k4k2K4j5k0pJ3j4L4L9J2J3j2K5
3340A61l5k0M1m6rm3K1k6J6Nk1L6O1m8K6K2jk2J5j8O3r2Lm3K0k7k4P2k0M2k3J6
3372A02L8pjppm0pJ8k8j2lM9l3mM1K2J0j2K6jk9K8l6j2J6m3KJ6J8o2N0nk1NN3
3407A24j7j7K2K0jm1K9J0n2k3K9mj4J5nqL8j9L0jj8L5J0l7MmKml4Qj8k6L5KK6
$$ plain form
3168 140 103 103 106 94 104 78 72 60 83 134 62 110 100 98 113 111 136 78 68 59 84 108 69 61 90 126 77 85 135 98 103 81 106 54
3202 54 62 93 65 100 88 62 86 80 97 96 101 140 95 115 95 100 75 75 133 76 95 92 92 79 77 97 104 89 98 119 118 101 146 128 78 77 104
3239 104 73 51 75 31 69 78 105 120 135 147 120 114 123 126 111 119 58 77 52 72 63 69 80 120 126 145 109 125 91 107 81 79 72 41 74
3274 74 66 65 75 130 108 77 136 147 117 100 140 133 102 98 70 124 68 93 125 97 111 77 77 100 81 87 48 74 88 94 85 168 135 115
3308 115 84 118 85 93 17 80 34 43 132 97 107 99 156 123 110 136 129 115 91 69 93 78 58 51 64 50 84 123 135 148 136 161
3340 161 126 106 147 101 92 49 70 44 60 65 44 80 141 93 119 141 140 118 133 115 178 86 89 46 66 39 15 87 67 109 86 102
3372 102 140 133 132 125 118 78 71 89 61 49 46 95 62 58 99 121 131 119 145 144 115 143 107 95 111 68 70 86 104 42 92 87 66 71 124
3407 124 107 90 112 132 131 90 119 129 77 54 83 79 65 80 75 67 105 86 116 115 97 132 142 105 109 105 107 103 69 77 59 33 68 70 96
3442I6K6M0l3K5Qk4k3Ll7qkk0MM5k0j7OJ2L3lNM1ok3j5lp0MnON7k3L1lrQ0k5o1
3480I2K0j5pk1kOoP4n6k3N9l3K2K8K6qn1J9k4l2J4j3J1qL8j4jJ1LPkJ8r4M4L4
3515A16m4L5k0j8oK1J1L1J6j6j8L4Mj8o9j0N7k6nK6nj7M2m2nM4j3%k0K9k3Qk1
3548G8M0k1j0K9n0j6N9kj1N0n4Mj5j7L4JJK9p9L8J4j3j2J6NpJ2M2l6J9o9L5L8
3581A32j0o5M3k6M4j9L6j9Nm2N1p3O2n4P1l2k1K2RJ7pRoj9j5J0l6j0M2j0K3l1
3613H1J0M2j5J5l5jJ0l9J4K0m6K5n3M2jK7PM4n2J01j04J5K9k2j1k8Lj8JNJ9J7
3645A02N2j5qk0K7j2j4JQn1oN4l7Om8M3L9nK0l0K3m0Ll5J4J3j1j8K3K1k5L3pk3
3679G7K6QlMn6K2NPk3K4L4j3POQj6kj0l6Jj4M6l1J9K6l4L9j6K4j6l4L2k3J1rk
$$ plain form
3442 96 122 162 129 154 162 138 115 118 81 73 71 51 55 100 80 63 69 81 114 111 116 157 151 128 113 110 40 44 39 45 102 79 110 107 98 178 153 92
3480 92 112 97 90 69 67 73 67 141 85 62 121 88 110 138 164 156 105 124 100 68 82 69 80 72 110 96 95 106 109 116 114 132 38 82 116
3515 116 72 107 87 69 63 84 95 126 142 126 108 142 146 128 59 49 106 80 75 101 96 79 121 79 74 118 105 105 85 114 91 99 78
3548 78 118 97 87 116 66 50 109 107 96 146 92 96 81 64 98 99 100 129 50 88 102 89 77 93 98 91 103 145 109 128 59 94 132
3581 132 122 57 100 74 118 99 135 116 121 79 130 57 119 65 136 104 83 105 114 131 124 133 127 108 93 103 67 57 99 89 112 81
3613 81 91 133 118 133 98 97 107 68 82 102 56 81 28 70 69 96 103 147 95 196 92 107 136 114 103 75 78 60 61 66 85 102
3645 102 154 139 131 111 138 126 112 113 121 70 64 118 81 87 39 82 121 116 136 106 129 89 92 57 71 84 73 55 78 99 74 107 100 77
3679 77 103 111 108 112 56 78 83 90 67 91 125 112 119 125 133 117 115 105 69 70 56 102 71 90 116 82 121 105 129 113 79 111 88 99 90 88
3715H8l8K4M6kk8M7o2Oj6J9N1k2k5Mmj2k0K1J9Ll5J7J7j6K8K0j2l7K1PJ2m0J0
3748I1Mk4J7JoM5l1K3j9NK2k6j3Oj2l%k2M7k2pJ7%J9Lj3j7J1J6j6q%J9j9k1J4
3784H1L8j1K4ll9K1j0J8krJJ6m3ml7K0J1N2Oo2M4ML3J6n4Qk2mj7J0k4KL3lK3J6
3820A33j6l3L6j2K0K4p1LK9m6K0j1k3kO0j3rl2O1K1k8j4K3L5q4J5J6Jl6J7jj7
3852F6J5K4L0LK2j2K6k2J3p2M0l2k3m4LJ7j9L9pL2O1Nn0%J0k6j9J8k4k0J2k1j2
3885C3M0N7p0N5j4K1JL3l6K9p6O4r0K6L0k9j5NK2k2K9pN7pk6O8o9M7k0m0L0o0
3917F6j3n8M9N3k9j0M2J3JKN4o1M4j3m7k7K2p1Q8m9LM4l5M1j%M2J2Rm6Qk4m4M9
3951A14m8J4j9kjO2m1K1L2K4j9J3j1pm2K0m6K1m3m6P9jMNM6%L1l3J7L7m8l2n0
$$ plain form
3715 88 50 74 120 118 90 137 75 81 65 84 135 113 88 92 88 76 56 77 96 99 64 81 98 82 110 130 118 81 102 109 121 81 91
3748 91 95 71 88 89 83 128 97 120 101 106 128 102 89 95 83 80 80 58 105 83 76 93 93 112 115 102 85 96 112 96 88 88 107 88 67 81
3784 81 119 108 132 129 90 111 101 119 117 108 109 125 82 78 41 61 72 124 130 68 112 116 149 165 111 119 97 93 76 86 62 64 97 94 117 133
3820 133 117 84 120 108 128 152 81 84 113 67 87 76 53 51 111 98 89 57 118 139 111 97 120 155 71 86 102 103 67 84 83 66
3852 66 81 105 135 138 160 148 174 152 165 93 133 101 78 34 37 54 35 74 67 99 160 165 115 115 125 99 80 98 74 54 66 45 33
3885 33 73 130 60 115 101 122 123 156 120 149 73 137 47 73 103 74 59 64 86 64 93 86 143 136 110 178 109 156 136 96 126 66
3917 66 53 -5 44 97 68 58 100 113 114 116 170 109 153 140 93 66 88 17 105 56 59 103 68 109 108 108 150 162 171 125 133 109 65 114
3951 114 66 80 61 59 58 120 79 100 132 156 137 150 139 132 90 110 64 85 42 -4 75 74 78 83 129 129 160 127 144 181 133 101 51
3984E1P7m9LJ5mj2PK3KM4J7l0nj3J1k0n4OM7o5K9l0L3QM4l7NK0j3K1k1Pj5k2j7
4019F3M3l6j7O5%mm0K8jpj4K5k1OKMj9j1L6K3m2NL0l7K1kj9M0j7j5%k9O3l0j4
4054G9J8%j7N9rrpl8L3j6L5j5QQm5j5O5o0K4l9J3J4k6M4pJ0k2j5K1J1lK2K0n5
4088H6J6j7J8m4J3qK3kk0N9n4O7nl4J2L0l6QNl7kK2m8L7l7L6PK2m7L2j8O5Jn3
4122I7lj8jLlJ7k8N9q4L9K6L2jJJ4l9J4k1j2j7M9o3MK0k2M6OK7rQk5J7pml2pJ9
4159A02J8m8k0PN3k1Rk5LN3LJ6m7j0J0Mk7k4J1J0KJ4jpOLj8N6l7M0n3L1J7n3K1
4194I8oJ8j6pk6Q5n7L9k6k2J7K9m0J8k7J7K7k6j8k9L1mNj8j5O3n0M6l6K4N9j1
4226A42J0o8L2j1Nq3N0oK2KQkjK9l3O0j2j9qnkm7j4L8Rk5J2PNL3n1O6n0M7j2m4
$$ plain form
3984 51 128 79 82 97 93 81 88 111 113 157 174 144 139 126 137 117 63 69 116 51 80 50 83 91 135 98 103 123 110 131 110 117 102 80 63
4019 63 106 70 53 118 118 114 74 102 101 94 80 105 84 90 92 96 77 66 102 125 83 88 118 81 102 100 81 121 104 89 89 60 123 93 79
4054 79 97 97 80 139 130 121 114 76 109 93 128 113 121 129 84 69 134 74 98 59 72 86 60 104 97 107 85 70 91 102 99 121 141 86
4088 86 102 85 103 59 72 64 87 85 65 124 70 137 132 98 110 140 104 112 117 80 78 100 52 89 52 88 95 117 70 102 84 149 150 97
4122 97 94 76 75 78 75 92 64 123 39 78 104 136 135 136 150 111 125 104 92 75 124 61 65 85 63 109 115 142 133 141 116 133 126 122 90 83 102
4159 102 120 72 52 59 112 91 100 75 78 131 134 150 103 93 103 107 80 56 67 77 79 93 92 85 91 94 76 132 95 135 82 113 130 77 98
4194 98 92 110 94 87 61 146 89 128 102 80 97 126 86 104 77 94 121 95 77 48 79 75 80 62 47 110 60 106 70 94 153 142
4226 142 152 84 116 105 110 27 77 71 93 95 103 101 100 129 96 156 144 125 117 112 110 63 49 87 96 71 83 90 95 128 77 143 93 140 128 84
4262H4pJ9k5j7LK2J9n5K5K0M4n8J08n8JJ2k6Jm2jL7m5J6LmML5j1N9n4K8j1j1n
4296A10KJ7m7l1j7N5j7k5L6K4ql5M7l3K6j5Lk2QOlnJMRL8p7M6lJ1J6j6K3Ml0M6
4332A48j5l6J3pj3JK0l5JL0l1K2j0L2J4nk8J4j0k4K4k4l6K0l%PP3o6O3o3P8k8
4365A26J6m4Jj4o6M1j0j7L0K1MJ5J0j4Q5l6l0K2k7j9Jj2j7loL9l6L2K2J8jJ9j0
4398A40MLo6L1lk8j7L0Ln0K8L8j1K1j8J9L3Ok9j5J4q4J1j2OPJ7j0L5qLL3MOj3
4433A28J8ql2l1j0k9j9O4J3m7L2K2L7K8j9l0Kj1m0O4q8nJ7J7Nk9K6J3j5K9k1N5
4465A36kk8K9m6k8mL7l4rK6j0K6L0m6N7J3j8k3L5l2k3Oqk4J6J4J1k4j3PL3j0K9
4498A23Rm7M0n8K5J4J3j9m0M3k0MoK3j1M9ok8L1j7ORk5n0N9k9rj0MqM3Nk9qN0
$$ plain form
4262 84 77 96 71 54 57 79 98 43 68 88 132 74 182 124 125 137 111 112 70 69 106 61 77 80 76 80 115 104 163 109 137 126 115 110
4296 110 112 129 82 51 34 89 72 47 83 107 99 64 111 78 104 89 92 70 78 84 81 76 77 81 90 128 51 97 94 105 121 105 128 132 102 148
4332 148 133 97 110 103 90 91 111 76 77 107 76 98 88 120 134 129 101 115 105 81 105 81 45 65 62 62 69 142 76 139 76 154 126
4365 126 142 98 99 85 19 60 50 33 63 84 88 103 113 99 184 148 118 140 113 94 95 83 66 63 57 96 60 92 114 132 131 150 140
4398 140 144 147 81 112 109 81 64 94 97 47 75 113 102 123 105 124 157 163 134 119 133 49 60 48 54 61 78 68 103 95 98 131 135 141 128
4433 128 146 138 106 75 65 36 17 81 94 47 79 101 138 166 147 117 119 108 68 132 44 39 56 73 78 49 75 88 73 102 81 136
4465 136 134 106 135 89 61 57 94 60 51 77 67 93 123 77 134 147 129 106 141 109 86 92 84 60 76 90 101 77 64 71 104 94 123
4498 123 132 85 125 67 92 106 119 100 60 103 83 87 81 104 93 142 136 108 139 122 128 137 112 62 121 92 83 73 77 69 112 117 88 80 130
4533A30J0j0k6NjN0l9m4J9k1lL0qn5Q5k9pj0O6m8K2k9P6o4J7k1j6J0j1RjJ1J7
4566A14l6K7J5LJj3oLK4k1nl6M8poj8JJ6Jj7j1K0Mk0M9j1k0K7Rj0l5J8k2j0J0
4601H6pk0J3M5m6K2J7j5M3J3k9J1j1l4oj4k1L5kL3l7k6L5L4l2O0l7l1L1M3m1m3
4633F9K6k0lj0j3J7L1j4M4roL5j6k6Mk8K4l1j3K9j3m4N6mqjQ0o9J0J1L0l2j%k8
4668G7J6k3J0Qk4K6L1j6K9ppLK5l3K6j6l9K8n6J9Oj3NQ8p2j3L0j7M0j8J3k3J5
4701A18j2j5Ml0K6k9K2J1qM4j7oj9nJ6Kk5OK3o1M0pj4K2j5P5Pj9l0L1j5jJ0n7
4735G2N7p3K3k2L2K7mk3j1M6l7L9qk4Rjplj0J2k1j6J7qk7O2J3L2l9K8l5mk2RL8
4770A21j7Lk6K1M3m4NOK6n8J3rJ7l1RK0j9L0jJ3k5M6j2m0qOmj1M2n2NN4j9k9O2
$$ plain form
4533 130 140 130 104 109 108 158 119 75 94 73 70 100 92 37 122 93 86 76 142 94 116 87 163 99 116 95 79 89 78 87 86 97 114
4566 114 78 105 120 123 124 111 105 108 132 111 106 70 118 111 105 87 88 104 105 88 77 97 101 81 130 119 99 126 135 125 90 108 86 76 86
4601 86 79 59 72 117 71 93 110 95 138 151 122 133 122 88 82 68 47 82 80 113 76 50 85 119 87 147 110 79 110 153 112 69
4633 69 95 75 72 62 49 66 97 83 127 118 112 147 131 105 109 81 105 74 61 90 77 33 89 85 77 76 156 87 97 108 138 106 105 105 77
4668 77 93 70 80 88 64 90 121 105 134 127 120 123 148 115 141 125 86 114 58 77 83 70 75 163 91 78 108 91 131 113 126 103 118
4701 118 106 91 95 65 91 62 84 95 87 131 114 108 89 84 100 102 77 83 106 45 85 78 64 86 71 146 153 134 104 135 120 119 129 72
4735 72 129 56 79 57 89 116 112 89 78 124 87 126 118 94 103 102 95 92 82 94 73 57 74 66 39 101 114 146 107 135 100 96 74 83 121
4770 121 104 107 81 102 145 101 106 112 138 80 93 84 101 70 79 99 80 110 109 122 97 143 131 91 83 89 85 74 116 64 69 123 104 75 137
4805A37m8j4J7J1K7k0p4Q2l9kJ0k6LK0MjJ7j5K8k4L6k7J1j5k3%N6k0k%m0M2j2
4838I9rK2m1L5k6j5N3Jj1j8K6lNK1k2Qk7j4njj6K7l7N0l6L3j2N5n5K9qK1m5M5
4872A29j8l8kRpL2J1m3M4L4m7J8L2l2rk2j9j6MrN7Nl9J7mjL2jPKj9j4k0j0L1m3
4908E1qL0K5n3M2ML4J5K7n5J1k8l1K1M7m6j6J6j8J8J9J1J1mqrL1Jk0k2jk5L6k0
4942H6j4L4J8j7Nk6oK8qLl1M3k0Rl4K1l8O0n2J7kJ1J9j2PL1k2n0M4j0L1J9n8N
4976I1J2QJk1J9qqr%L6n3L9RKoLM5m9k6kJK6j2j0J7l1k6L5K5mJ3j9J0l7L4K5m5
5013H5J7Qj4j7K0J7m9N2k2J8Rk0J7j6j2j%m9N0j4J0j1J4lK9l6J3%Qkj1j5J8K3
5047A16n0J00n4K5o0J7J0o2M5NOk5L9l0OrO5m5M8k4lNQk3k9K7k1k1NM4l6N0l1
$$ plain form
4805 137 89 75 92 103 130 110 36 118 79 77 87 61 64 84 88 87 104 89 117 93 129 102 113 98 75 75 131 111 109 109 69 111 99
4838 99 90 112 71 106 80 65 118 119 108 90 116 113 118 139 117 125 98 84 79 78 62 89 52 102 66 99 87 142 87 116 108 129 84 129
4872 129 111 73 71 80 73 105 116 73 117 151 104 122 154 122 113 91 72 56 60 51 108 113 74 91 87 86 118 117 124 126 107 93 73 63 94 51
4908 51 43 73 98 45 87 91 125 140 167 112 123 95 64 85 132 86 70 86 68 86 105 116 127 123 115 106 137 138 118 96 95 70 106 86
4942 86 72 106 124 107 112 86 80 108 100 103 72 115 95 104 70 91 53 113 61 78 76 87 106 94 101 132 110 60 104 94 125 144 86 91
4976 91 103 111 112 91 110 102 94 85 85 121 68 107 116 118 112 115 160 111 85 83 84 110 98 88 105 74 48 83 108 104 117 98 108 71 105 130 85
5013 85 102 110 96 79 99 116 67 119 97 115 124 104 121 105 93 92 92 43 93 79 89 78 92 89 118 82 95 95 103 101 90 75 93 116
5047 116 66 166 112 137 77 94 104 42 87 92 98 73 112 82 88 79 144 99 147 123 120 125 133 110 81 108 87 66 71 115 79 129 98
5080I8kL0K0K3p6M3ll8j2j0Oj5J8j3M4j2J7kL1%Ll5J2J2p6J3j8K0j9PJ1l8N0J2
5114A01J2L5L6p7N2j1o8J2jm4QrJ9qJ1O2kj0J6k6K1j4k1J7j1j5k5L2l7RoJ3L3
5147A04lj6M0j5qMQk7Ol5J0j0nLM5K4k0PK8k7KJ3n1M4j7k9O4o8J6K2k3Qoj7K7
5182I8OK4n0Prj6J3K8l2L6k6k6M3j7j0J0l1L9K6l6M8j2M2p8M4k3l8PN3j3j5jJ0
5215A01j6K4k4M5k9j3J2j6M4k1j0Om0j4K5oJ3J0lL1k0JK5k1K2k1rJ1k1K8l6M1
5247A19j8l6L0k9L1nMRL1l3j9K2m3QlM0Rj0m2M5l8L5K9lpl4Kj4K2j0k0J3Qj3J8
5282I8j0K8ok2J2oM0j1j5kk7j1K3R%k1N1m6L6ojj2j2QK3m4j0L9j5J4k7L0j8Mk3
5317G0M6KOJj3mj9oPRnKJ8j6qOM6l9Rl3J5M8l5pMj6Rj2J0J6j6jJ3RQLm4rMM5n9
$$ plain form
5080 98 96 126 146 169 93 136 133 95 83 73 79 64 82 69 113 101 118 116 147 147 150 115 127 139 63 76 58 78 59 66 77 39 89 101
5114 101 113 148 184 107 159 148 80 92 91 47 55 46 65 57 68 130 128 118 134 108 129 115 94 111 100 85 60 92 55 64 58 71 104
5147 104 101 85 125 110 102 106 114 87 93 58 68 58 53 56 101 125 105 112 140 113 115 128 77 121 104 75 139 71 87 109 86 94 88 71 98
5182 98 104 128 78 85 76 60 73 101 69 105 79 53 96 79 69 79 48 87 113 77 125 113 155 77 121 98 60 67 120 107 92 91 101
5215 101 85 109 85 130 101 88 100 84 128 107 97 103 63 49 74 68 81 91 88 119 99 100 125 104 126 105 96 107 86 114 78 119
5247 119 101 65 95 66 97 92 96 105 136 103 84 106 63 71 68 108 117 107 65 110 72 107 136 133 126 92 94 80 102 92 72 85 93 80 98
5282 98 88 116 110 88 100 94 134 123 108 106 79 68 91 100 100 79 130 84 120 114 113 101 89 97 120 76 66 105 90 104 77 107 89 93 70
5317 70 116 118 124 125 112 108 89 83 90 99 94 96 114 98 90 96 142 103 112 79 94 142 107 100 104 88 97 85 95 111 95 94 107 116 124 127 83 74 78 123 64
5358F4L2jNJ2jj1J8pPl7oO4l6K7l4J6j4pK4l1J9LK0oLl6Q%Ok1K5Rl7QL9m1k7o
5396E0Q3l3j1K3l6L7l1K9Jl4K0%Pm5J6N3m7K8Lo7Q0Nm9m8L9rQ4r2J7oJ3K3%pJ0
5431A06ml3N3j5lj8L9l8kRj7L0lm1R0l4J9m0rQj3PRrk1J9K2rJ8k4N8q0J5mK1Q
5467A14K2l1mMl5M5J1m3K5%l2J5J3Nk5m3J21n7j9J4Kj0L8n0mK1j8J4J4Ll2K8k0
5500H6Qj2K9k6M6m8l0N9J3J2o0K4lrRJJ7n5J7M9l1j5M3k6KK3l0J2j7K9rj7k7L2
5534I6pKJ6J9j7k6pOl8N1j3kkM3k4m7K5O1l6lj4K9%l2M7o8J6L5k7K4l6J3J7O0
5568A61l5k0K4qNj0jl4J4jj5L2k5l9O4lLM3k4Joj0Lk5p%l5N3L7n5L1LK1k4lK0
5604A35j1P0r9J3Lm8l6N8L2l3j8M6j1L2N1p6Q4n1rl4j3k2L4l6N0l1J6K0j9j7K3
$$ plain form
5358 64 96 95 100 112 111 100 118 111 118 81 75 139 103 130 96 112 98 91 115 84 103 106 126 120 123 87 95 95 101 80 105 114 77 85 124 83 56 50
5396 50 133 100 89 112 76 113 82 111 112 78 98 98 105 60 76 129 82 110 113 46 126 131 82 34 73 64 148 56 73 67 80 103 103 96 106
5431 106 102 69 122 107 104 86 125 87 85 94 77 107 104 63 153 119 138 98 89 97 84 91 100 91 70 89 111 102 120 96 154 74 89 85 106 114
5467 114 136 105 101 105 70 115 126 83 108 108 76 91 104 109 84 41 162 105 86 100 102 92 130 80 76 97 79 93 107 110 78 106 86
5500 86 94 82 111 85 131 83 53 112 125 137 77 101 98 89 98 99 116 61 78 127 96 81 124 98 100 123 93 105 88 117 108 91 64 96
5534 96 89 91 107 126 109 83 76 82 44 95 82 80 78 121 97 50 75 136 100 97 83 112 112 80 127 59 75 110 83 107 71 84 101 161
5568 161 126 106 130 122 127 117 116 82 96 95 80 112 87 48 112 109 112 155 131 132 126 116 119 94 87 87 52 105 142 87 118 121 142 118 115 135
5604 135 124 194 95 108 111 63 27 85 117 84 66 112 101 133 184 108 192 141 132 98 85 63 97 61 111 80 96 116 97 80 103
5635A03K5qK0m9PQNl1K4j3l7J8jJ2O6m3m6N8K8l9Lj6M1m4Km3L9j6OK8n6N6pk3
5669G7j9P5rlk4L4j0l0Mk5K1j5K4J5j4J4p8M6Rj6K4j9K9k6R%m0%L4lrMPkLk4K9
5706I2j3K9j4K8l4N5n1K0k6J8m2J3j8N8p6K0L5K1j1J7MMk1k4KJ1j4Mkk7L5J4m3
5739F4lO9l4JoM6l0l1MLj3rKM9mMl5OM6l5Rnj4K7j3M9l8k1nojL1j1L7k8mRkk1
5778H7Rj4Nk5N9k5PokJ6j2M4m7LL3k6j2j1j9M6o3N3oJ5%l0j3P2l3k5N8m6K2j4
5812A00K2n0N8j4J2l4Qk5P2n8K7m4M3j2lNj0l9K3K1J5l1%j8P5q4M4nl9Q0Oq4K9
5845I0J2j3Lk5JL0NPJ0k2Nj9M6o7L3n4O3j2l9Q2o7O0n5M5l4j2L3pK6j2K4m2pM
5879I2K1L1l4qj9N3r1Q6m6lj0M3rk6K8k4JJN2o8O4l0k7j5Q5o8nPl3M2K1j0L2j1
$$ plain form
5635 103 128 120 140 91 98 106 111 80 104 91 54 72 71 83 149 106 60 118 146 107 110 94 135 91 93 50 89 73 79 107 51 107 100 77
5669 77 58 133 124 121 97 131 121 91 95 70 91 76 100 115 101 115 37 83 92 76 100 81 110 84 93 93 53 53 87 84 75 79 86 84 87 63 92
5706 92 79 108 94 122 88 143 92 112 86 104 62 75 57 115 39 59 94 115 104 121 125 129 108 84 86 97 83 87 85 58 93 107 64
5739 64 61 130 96 97 91 137 107 76 80 83 70 61 63 112 108 112 77 83 129 94 103 98 84 111 98 147 109 88 83 77 76 107 96 133 105 101 110 108 87
5778 87 96 82 87 62 121 96 103 97 95 111 99 143 96 99 132 106 94 83 64 110 47 100 94 109 109 79 66 138 105 80 138 92 114 100
5812 100 122 72 130 116 128 94 102 77 149 91 118 74 117 105 102 107 97 58 81 102 117 86 86 68 143 59 103 98 59 139 145 61 90
5845 90 102 89 92 67 68 98 103 110 120 98 103 84 130 63 96 42 105 93 54 136 69 129 74 119 85 73 106 99 125 113 137 95 88 92
5879 92 113 144 110 102 83 136 45 131 85 82 72 115 106 80 108 84 85 86 138 70 134 104 77 62 147 79 74 81 48 90 111 101 133 122
5913A22jj8J4j6Oj5Rj2j0MlK1j2M8m6K6J7JK4m6K2m9M2j02L4lK2K6p7L6j2K8N3
5946A33n6N1J0n1jJ7KLk5M8o7L3k1k5P7k7LK9l0K4j7J7l9pJ0k9P1m1j4j0L4l5
5978F7K1J7J8n1O7nm3J9oK0qk9rK1j6M4m5K3j1J8j0j9J2J1j6J6Pm4Rj9j1L3MJ2
6012I7j1qK3j1m3P5O2p2QJ3n2J9oj5L1j1Rj4l0j3M0J6L5Kk3k1MK5k6l8RLmK2l1
6047F4KORJ7Jk6M4koj7Mjj3j8L9l3J8k1J7L3k4kL4JK7l6Pm1N0om4oL3k6pL9m9
6084F7rN6Kj5%K1kj0Mp6O1%J7n6L0kK7j2KM1%k7J6l4J1JOj0j6KJ1ppJ3m4M8L2
6121A41qk2LK5Oj1n5L3k2k8K5k4J1M2l5L1mjQk6L6l7K8j3Ol7QOk6L0J2KJ9Kj4
6156A11OJ9l9J1QpJ1lk1j2QK1j2J7L4Kr2O2lp3O4m0K9rpk0M2j3J8l3j0M2J1Rl0
$$ plain form
5913 122 121 103 117 101 107 92 101 89 79 83 80 101 89 137 91 117 134 135 159 113 135 86 128 26 60 57 79 105 28 64 52 80 133
5946 133 77 128 138 87 86 103 105 108 83 131 64 97 76 51 128 101 104 133 103 127 110 127 88 81 91 62 133 92 78 68 102 67
5978 67 88 105 123 72 139 134 91 110 104 124 116 87 78 99 83 127 82 105 94 112 102 83 95 106 90 106 113 69 78 59 48 81 85 97
6012 97 86 78 101 90 47 122 184 112 120 133 81 100 94 79 110 99 108 94 64 51 91 107 142 144 121 100 104 129 103 65 74 77 73 95 64
6047 64 66 72 81 98 99 73 117 115 109 92 96 95 82 64 103 70 88 67 84 117 93 91 125 126 153 117 124 83 133 127 83 77 110 84 77 116 67
6084 67 58 114 116 101 101 122 120 110 114 38 99 99 116 60 90 88 115 103 105 146 146 119 135 101 112 113 119 109 93 95 106 99 92 105 61 109 141
6121 141 133 111 114 139 145 134 79 112 90 62 87 63 74 116 81 112 108 107 115 89 125 88 116 103 109 72 80 86 60 90 102 104 123 125 111
6156 111 117 136 97 108 116 109 120 117 96 84 92 113 101 118 152 154 62 124 121 48 112 72 101 92 85 65 107 94 112 79 69 111 122 131 101
6191A01l9L2kQ%l6M7n0JM9kj8qqL0mJ9olqKj6K4k8N8m5L5l9Kk2L1k3L1m4K5J2
6227A06Kj1J0k4J3j7L9j7l5Rk6J9jK9OJJ6J6k5J2K3k8k4lMK3m2l5O3k7L4Rn0O5
6261A34k2J9jk3L6m9qJ4k6QLl1M3Kk5M7j7K5J6n1L1o7J8j1K6l2M6qqK4j2pmO2
6295A52n1qL4l2Qj2nk9K3pK3K9n8M0kKqK0J3k1j3K0k1j5pRPkJ0J3K9k8j6j0pL2
6331A12k8L7jl2MK2l9j8L4Rj7K7K2l5J6j2k7M6j4mmJK2k9kj5J3jK0m3M4KPK8n9
6366H6L6j6K4l4K6m4J7J6m1RJk7L4J3j0M2k0mK3j6j0K7Nn6nJ7j3l8M9jj0L8k7
6399I1L9j3J3j3J2jrj6Pm3jK3pL2jJ4jJ2m5k3MJk3K5M5j3l1Nl1L8Qq4P1k0O1l7
6435H9klJ4L2n3L5m4qM2m9L5oL8k8J4l1pJ2mN9j7kk1K1p5O4pm9M3j2L1Nk5oJ2
$$ plain form
6191 101 62 94 92 100 100 64 111 61 62 111 109 91 83 75 105 101 120 114 111 103 105 89 113 85 143 98 133 94 96 74 105 82 113 69 94 106
6227 106 108 97 107 83 96 79 118 101 66 75 49 68 67 96 102 103 119 135 110 122 145 117 93 90 94 117 75 40 103 76 110 119 69 134
6261 134 112 131 130 107 143 94 86 100 74 82 85 54 97 99 74 121 104 129 145 94 125 58 76 65 91 59 105 97 89 113 101 94 90 152
6295 152 101 93 127 95 103 91 86 57 80 73 96 125 67 107 105 107 99 119 132 111 98 118 97 82 75 84 91 89 99 112 141 113 97 87 80 112
6331 112 84 121 120 88 92 114 75 57 91 100 83 110 132 97 113 101 74 120 106 102 98 99 121 92 90 75 88 87 107 64 108 110 117 145 86
6366 86 122 106 130 96 122 78 95 111 70 79 80 53 87 100 90 132 112 108 131 115 105 132 137 81 76 93 80 42 91 90 80 118 91
6399 91 130 117 130 117 129 128 119 103 110 67 66 89 82 114 113 127 126 138 93 70 74 75 52 77 122 109 78 83 52 90 98 14 85 65 126 89
6435 89 87 84 98 130 77 112 68 60 102 53 88 82 120 92 106 75 68 80 76 135 118 116 95 116 41 105 98 49 92 80 111 116 91 85 97
6470I7J9rOK0rm0K8m2M0k5rJ4K9k5pK7On7M2rJ3j8K3l4L0k6j5JJ8nRL2m1K5K5
6505A33n8L2qJ2l6J6K7m4j8L6nJ3k0J0J2j2JKK1l7%%K9Jk1l3P0k3Nk9N4k1K4k9
6539A04Nk2RLJ8p8N5J4o4M4j1J7l4R3n2j0j7Q8q5L8m4M9Lj8m6K4L%L1m5L3JML1
6573A41j9l8J8m2L8QJ0k9J4Nj6Qk3K9k6L3K2ok5o2L4J0J9k0%KJ8j5Mk7J4RL1J
6607A20l9N3l6jj1J5k0j0N1l1Qk1%MkM0J5k0pJ0oRm6P4o8K2k2j8N1k3JL3n3M3
6641A15J6rlj8K7j6l2K4j2J6p1O4k8pL4oK0OJ2n5O3j1j3J7l6J4l1qN5m0K0k5M0
6674A22j1J7m2L0lj2j0l9N5o0N5j9J9L0k8RJ8j2m0J0J2Ql8j0J0NK5Lm%OJ5k3K9
6708A27k8j2OJj4j0K6kLK2Nm2N2n2k8NJ0M7o5K8m4M0J1M0m3K7Kj3j0J6L4l3k1
$$ plain form
6470 97 116 107 113 133 124 84 112 70 110 85 76 90 119 94 87 114 120 63 105 96 109 91 114 80 110 84 69 70 88 83 92 124 83 108 133
6505 133 75 107 99 111 75 91 118 74 56 92 87 100 80 90 102 90 91 93 114 77 77 77 106 107 86 53 123 100 105 76 130 109 133 104
6539 104 109 87 96 99 117 39 94 108 44 88 77 94 60 153 101 91 74 162 77 115 71 120 123 105 59 83 86 86 117 72 105 106 110 141
6573 141 122 84 102 60 98 106 116 87 101 106 90 98 75 104 78 111 133 127 102 40 74 84 103 83 83 85 103 88 92 65 79 88 119 120
6607 120 81 134 98 97 86 101 81 71 122 91 99 78 78 82 80 120 135 115 108 118 112 121 75 149 81 103 81 63 114 91 92 125 72 115
6641 115 131 122 119 101 128 112 80 104 92 108 37 101 73 66 100 94 114 120 132 77 140 129 116 133 97 111 80 72 127 87 107 82 122
6674 122 111 128 86 116 113 101 91 52 107 47 102 83 102 132 104 113 131 119 79 89 101 109 71 61 71 76 101 104 100 100 106 121 98 127
6708 127 99 87 93 94 80 70 96 94 97 119 124 82 134 82 54 59 69 116 51 79 35 75 86 126 83 110 112 99 89 105 139 106 85
6741H5Rj5%J1Pj7RPK6k6L6l8J1oj5QK2qj0k3K8Kl0%j1L7Mj2K2j9rL3Ql9J1J0n7
6778E1N5n0N6j5Pj4K4K6l7j1J7pL8l0j1mJ8Ol3m4L9pM6L8l9rj2Q%l4L7jpM1q8
6813E4M7l8k4M7j5M0k9oQL4j9mJ5J0k8j3J3pJ0oLl2L5KLJjj8J2M5k3Ok6J1n8J3
6849F2O2j1j4m1N2J7Pm0M6l8J3rj7J6J0qn3M2qoL9m0k0M4PJ7l9%mK0l1Olj3J7
6884H2j3J9L2K4p3M6j4oK2l5J3j3J9%Rm5M9l2MK6k1K2J0l9j1M0k0K6k3lJ8L4l8
6917A09k0j1K7j6L0l1k7JN7rK4l4J8k7j1J1mN9l8J9k0m0L4L0k4J8m6K8mj9NJ1
6949A00jmK0%j8M6k1qn5P7m4J6L9o7N3pk7k5J6pnLL4lOm1K4pN6l0m3K0k5%J6M
6985I2j9J2K9J8j7k0J1l0RM5k0l6M7kl6MNPL2l9qK3rO4k5p2M2k1N1mk3j8MOk5
$$ plain form
6741 85 94 79 79 90 97 80 89 96 122 96 132 94 105 99 84 92 114 106 96 73 101 103 73 73 62 99 103 91 113 94 85 118 126 87 98 108 51
6778 51 106 56 112 97 104 90 114 140 103 92 109 102 140 110 99 95 113 119 86 42 81 74 120 158 119 110 98 106 106 72 109 108 101 142 54
6813 54 101 63 39 86 71 111 82 76 84 118 99 95 110 120 92 79 92 85 95 89 92 60 95 97 100 101 100 82 94 139 116 122 96 107 49 62
6849 62 124 113 99 58 110 127 134 94 140 102 115 106 89 105 115 107 54 96 88 82 121 81 61 105 112 129 90 90 86 106 75 81 78 65 82
6884 82 69 88 120 144 71 117 103 97 119 84 97 84 103 103 112 67 116 84 88 114 93 115 125 86 75 115 95 121 98 95 113 147 109
6917 109 89 78 105 89 119 88 61 62 119 110 134 100 118 91 80 91 87 146 108 127 107 67 101 131 107 125 79 107 103 84 89 100
6949 100 99 95 115 115 97 143 122 114 59 136 92 108 147 80 133 126 99 74 90 83 78 81 115 112 118 77 101 94 150 120 77 97 72 72 88 92
6985 92 73 85 114 132 115 95 106 76 85 130 110 74 121 119 83 87 92 99 131 92 84 107 98 162 137 65 107 86 137 133 110 92 96 102 77
7020G7K2j5NJ0%Qk4Rk0K3m3M0%qQj0j3K8J9n1M5J4pm0J5K1j9Ll1M1J9p0M0j4N5
7055A37n5j5J2m3O8n7K2QK2L2p1L3L8l1LNpl2J4RjPmk6mK9j7O9l3m0%P9k9k3k4
7090G5J8j4K0k5PM6l0J4Rlk3K7n0M8Jl8N0l3k7OjO1j8j9mj5J3Pk7OJ8l0L0mj9
7125G6N1qk5OjNk7J3j9KMmnM4l5K9k2M8n3N6J2J2n0nj4L2l2L0k6%j5L7m4N6j8
7160A10K3mn3J3rJ9pk1j3L2kpM0k0K3nk9J8mj6nNK8Kjk2L1n0Nj8L3L9l9J3k5O1
7196A45l7jk%p%l1K5J1nJ6k7M8k2J6j8j2Nlj2k5lK1K0J4%o9M8L0j7JJ8l8K4l1
7231H2N0j9l4P%K1J0L1o6L5k7NJ5J4m5J3kQjj8LJK0KnL2m3J4J8n6kN6l3mJ7nK4
7268A18l1l0N2j7Ql3jL9j5l3O5M0m0nl4k5M0K5k5l6M0j5lL4l0J9m3M2k5j3M6k2
$$ plain form
7020 77 99 84 89 99 99 107 83 92 72 95 52 92 92 84 92 82 69 97 116 65 110 124 117 77 92 113 94 97 66 107 126 56 96 82 137
7055 137 82 67 79 36 104 47 69 77 99 131 60 93 131 100 103 108 101 69 83 92 91 98 94 68 64 93 76 145 112 72 72 151 122 99 75
7090 75 93 79 99 74 81 127 97 111 120 117 94 121 71 119 120 82 132 99 72 78 77 138 120 101 97 82 95 102 75 81 99 69 99 95 76
7125 76 127 119 94 100 99 104 77 90 71 73 77 73 68 112 77 106 84 132 79 135 147 159 109 104 90 122 90 120 94 94 79 116 72 128 110
7160 110 133 129 76 89 80 99 92 71 58 90 88 81 121 101 124 119 90 108 104 88 83 88 116 118 117 95 126 76 81 63 96 135 96 109 84 145
7196 145 108 107 105 105 98 98 67 92 103 98 114 87 135 113 129 111 99 104 101 89 64 61 82 102 116 116 47 95 125 108 109 127 89 113 82
7231 82 132 113 79 86 86 107 117 148 82 117 90 95 110 124 79 92 90 98 97 79 82 83 103 105 100 132 89 103 121 65 63 119 86 82 99 94 118
7268 118 87 57 109 92 100 67 66 105 90 57 122 162 122 117 83 58 98 123 98 62 102 87 84 118 88 107 64 106 81 68 114 92
7300I2L1l3Qj9J4k8N1n3M1j3O6o5mOK0K8j7j5rj9JRJ8k4mK0k0K6kj9L2polj3l1
7336E9K4j5LLL7l1l5N7k3L8PK1l9J3oj7Ol2L6Rn1J3n4M3K6L8k2J4j1L0l7J9o2
7369F1J4L7k8N3q9PK8J8j3RJ8MJ1J3k5k6J4k7RK6k3m0K7J5K1k7j9R0m1J1j7%r
7402A02mlk7L4l1J1QQJ0j9jOL5J3k8l1j8J4J6k1j5J0Pl1M3j3L1j0nJJ0j6k0K9
7436I5LJ1QJ7jm9M6Mn4P3m0j1K4k9P%l0O1k8Poj4MK5k7mK6k3K8o1K7K0k5NK7j1
7472A05k9K0J3j7J1KJ4j7nj4%J6l6N9o6N3K4k9k3L1j3J3k0L3n0j8L1J5Oj4Lk2
7504G6N7j8kJ2j4k8M5l1kKj5k0J2L5k1L6l8J0Qj6n0P4Nj7kK8n4K3k9pN5n4L8J9
7538A17l0K6J1o3K7j0PlM1n7K3pJ7K3j2J5j8Nj2nL1k4%K1j0l2Lj3J5K9j7j2j1
$$ plain form
7300 92 123 90 98 79 93 65 116 63 104 91 157 92 88 94 114 142 125 110 101 82 83 92 110 86 82 102 82 108 106 87 119 112 106 103 90 59
7336 59 83 68 71 74 111 80 45 102 79 117 124 145 106 119 113 96 102 70 106 115 64 77 23 66 92 130 108 122 111 141 104 123 61
7369 61 75 112 84 137 48 55 83 101 88 97 115 119 130 143 118 92 106 79 88 114 91 51 78 93 114 87 68 158 117 128 111 111 102
7402 102 98 95 68 102 71 82 90 98 108 89 88 94 129 142 114 83 65 79 95 74 59 69 76 45 88 75 106 96 91 92 102 86 66 95
7436 95 98 109 117 134 133 84 130 134 80 153 113 102 126 97 104 104 74 135 107 114 108 94 98 123 96 92 118 95 123 62 89 109 84 89 116 105
7472 105 76 96 109 92 103 105 119 102 97 83 83 99 63 122 56 109 133 104 81 112 99 112 92 125 75 57 88 103 109 95 98 76
7504 76 133 115 113 125 111 83 128 97 95 97 82 62 74 109 88 124 86 96 104 88 38 112 117 100 98 126 72 95 66 59 114 60 98 117
7538 117 87 113 124 61 88 78 85 82 123 66 89 82 99 122 110 125 107 112 100 95 126 102 102 123 113 81 84 71 86 115 98 86 75
7571G5L2ll4K0J8j0m2J6rM3j3J7j3m0K5Pj2jK4k8J6mNK1K8l7oJ5%l6jPqP2k7k7
7607I0Nkk6M9m9L5Kl3J7K0l5L0kJ9k0Pj4rj3K9j7L4j2k1oM2Kk7J7j8LJ0ooL2m5
7643H2K0qqL1j3l4K7J1k4lnK4j1OmoK3J9k1QNnJ4l8MqM2n0j2K5K7J7n7QN8n6J0
7680I8j7L2jlj8k9K6k5M8Llj4M8o2L3L4m1oljM3r1N7k5K2oj1JM2n0L2Okk4M5l6
7716A02pM7q6P7l7Mj0L0ok8L0k2J5qJ7n2j0K5K2J2jnj4M2l1PMMkn3K0OQPm8K9
7752H8lK8J6l6k9M0k3M2m0rP6q0L8J5k5J4K1o4K8k2M1l3rK5l1L6j8J3J6kJ9j5
7784A17j%j8M0l1j5pK2pj4K3qKjk1RL5m0N1k7J8Qm8%j3L4j6qK5J4k5J5Lm9L9k8
7820G8L7j3kj1r%j7QMjN7rnk1O6n7%K8j6J1k3k8J3j2mJ8%j6M9J1l3J8m0K1PN3
$$ plain form
7571 75 107 104 70 90 108 98 56 72 63 106 93 110 97 57 82 89 77 76 100 72 88 84 89 110 138 101 95 110 110 74 73 80 72 144 117 90
7607 90 95 93 67 116 67 102 104 71 88 108 73 103 101 120 100 107 93 84 71 100 83 117 105 84 78 120 122 95 112 94 97 107 101 95 127 82
7643 82 102 94 86 117 104 70 97 108 84 81 76 100 89 95 91 85 108 127 106 114 119 114 128 90 94 86 128 78 66 91 118 135 78 86 144 88 98
7680 98 81 113 112 109 91 62 88 63 111 114 111 97 145 83 116 150 109 103 100 99 142 51 108 83 105 99 88 89 131 81 113 119 117 93 138 102
7716 102 95 142 56 133 96 100 90 120 114 86 116 94 109 101 118 66 56 81 103 115 114 109 95 137 106 113 117 121 119 66 86 92 100 107 59 88
7752 88 85 113 129 93 64 104 81 123 83 74 150 70 108 123 98 112 133 69 97 75 116 83 74 99 68 104 86 99 115 113 132 117
7784 117 116 116 98 138 107 92 85 107 100 86 109 101 103 102 81 90 125 85 136 109 127 135 87 87 74 108 92 84 109 123 98 113 116 67 106 78
7820 78 115 102 100 89 80 80 63 71 75 74 131 122 117 96 162 105 105 133 117 128 105 77 90 78 74 92 92 76 125 136 103 121 81 102 109 162
7856A62p3rjL8pNm5M3k8LL9n4K8nJ0%jk8nJ2K0k7M3m3M9n1K2k6J7J3M7l8kpJ5
7891A16jj5k9JN1j5lj2PKkm2K7j2O0o0L6Kjk1K3l0k9K0J0N0l1l5N7k9lj4K4j0
7925I2K0l9M1k7k0N5k2k8N4knN4q4L8o1N1j5j8K4J5K1m0J5ok0N7j7m1l5L9K7k6
7957I7j5K4Rk3lk0M2jkj3M2n0K2k5j3J3oj8K9M2l9QN1o6rJ8Ljkj9J6jj0J0RK1
7993A20m1k8K2j4O6k2kJ4j4J0MOn4L0j0Pjj0j3ON7l8J4m0K5%l6M9J5Nm0m1M1K4
8027A11j3nJ0Kl0J4j1LK5ql7O7k3Oj4K7k4J0j7MJ5j0lJ3km3PL2J8j1j1oKJL8q6
8063E1nM1j7L4L1l3l4J9j3K3J6jj4rk4M5o4O0L6p0J4L1j8K9k3J7j2M2l0k6J5R
8095A20k8%KMj0pJ3k7N6l2j2M1J7n6K3pJ8j3m8M6k5J2L5o3K5K2%K5j7j9m%j6K8
$$ plain form
7856 162 89 80 79 117 110 115 70 113 85 88 127 73 101 96 106 106 105 77 72 84 104 77 120 77 126 75 97 71 88 101 148 110 108 101 116
7891 116 115 100 71 72 123 108 105 93 100 102 100 58 85 73 133 73 109 111 110 89 112 82 53 73 83 133 102 67 124 95 92 78 102 92
7925 92 112 73 114 87 67 122 100 72 126 124 119 173 89 127 66 117 102 84 108 123 144 104 119 113 93 150 133 92 57 96 123 97
7957 97 82 106 115 92 89 69 111 110 108 95 137 87 109 84 71 84 78 60 89 131 92 100 151 85 76 94 97 96 94 75 91 90 80 90 99 120
7993 120 79 51 73 59 125 103 101 115 101 111 115 121 67 97 87 94 93 83 70 76 133 95 109 69 94 94 58 107 122 127 87 46 87 111
8027 111 98 93 103 105 75 89 78 81 106 98 61 128 105 111 97 124 100 110 93 97 112 102 99 112 110 67 74 106 124 113 102 96 98 99 137 51
8063 51 46 87 70 104 135 102 68 87 74 97 113 112 98 89 65 110 46 106 142 72 86 117 99 128 105 122 110 152 122 96 111 120
8095 120 92 92 94 98 88 81 94 67 123 91 79 120 137 81 104 97 115 102 54 100 75 87 122 59 84 106 106 131 114 95 91 91 75 103
8129A03qkllmJ4J9J4m2J9OL0r4K6L4k5J0j1L3k1J2rqJ6nkmJ4l3j3K8l0L1M3m2
8164I3j4O2l1l3K2J5l3J9l3N2Ll3kL3k2m3O5j7pJ0J5k6nKMK8k6
$$ plain form
8129 103 95 93 90 87 83 97 116 130 88 107 113 143 49 75 109 84 94 83 116 95 107 98 90 106 101 99 95 109 76 63 91 61 92 135 93
8164 93 79 141 110 77 99 114 81 100 67 119 122 89 87 120 98 55 120 103 96 106 121 95 90 92 96 124 98
8191I8
$$ Imaginary data points
##PAGE= N=2
##DATA TABLE= (X++(I..I)), XYDATA
0@%%%%%%%%%%%%%jKkKkLmMnOpRj1J2j3J6j9K1k4K8l1L5m0M5n0N5o2P0p8Q6r5J05
45E5j16J28j41J56j72J89k08K29k53K80l10L44l82M26m79N42o18P13q36J002j239
66f90J609k274L849j5006j6034Q799M591J0910R290J0190N711L970j503l796o947
81A2669q091r786p280n157k366K10M154N519O621O866O290L421J785k07k487m351
97G810m294m600m058k562j042m62J074K467K393J780K228K018J003O22M40k35
113D582k40o3r75j414r92j026k058j815q52p56m96R10J614J870K549K774J899
130E511J280Q15q04j979k129k595l183k232r55n35M00J979K446K185K375J983
146D562O54Q5m66j612k049j371j274j354k35O19N96O77J067O53Q0Q6k60q63k95
$$ plain form
0 0 0 0 0 0 0 0 0 0 0 0 0 0 0 -1 1 -1 1 -1 2 -2 2 -3 3 -4 5 -6 6 -7 9 -10 11 -13 15 -16 19 -21 24 -26 29 -33 37 -41 45 -50 55
45 55 -61 67 -74 82 -90 99 -109 120 -133 147 -163 181 -201 225 -254 288 -330 383 -453 549 -690
66 -690 919 -1355 2494 -12512 -28546 -19747 -15156 -4246 5044 15234 20945 24915 23412 19616 12669
81 12669 4578 -5208 -12488 -17645 -20011 -19801 -15647 -10128 -3507 3359 9649 13070 14855 14648 12161 7810
97 7810 3516 -1084 -5142 -7704 -8746 -9208 -8134 -5667 -3274 -1494 734 2752 3755 4377 4817 4582
113 4582 4342 4279 3304 1890 898 -128 -2186 -4001 -4853 -5609 -6105 -5195 -3581 -1711 838 3612 5511
130 5511 6791 7606 6802 4823 2694 99 -3084 -5316 -6271 -6806 -6406 -4427 -1981 204 2579 4562
146 4562 5216 5301 4835 3223 1174 -197 -1471 -2825 -3060 -2441 -1845 -1168 -101 552 632 718 458 -405 -700
165g00K11n0L69J271J076M79N08J45r20j503j492j832j755q11r6M69J802K514
183c15K227K180K148Q50p32j311j995l162l000k154j668n32J078K040K410L279
199A343L078J816R52K28j407k672k773k692k675j561k23N18J696K767K624K113
215C132K032J031n09j271j581k353k559j578q56m29Q06J650J671J838J886R56
231C866Q0j14r34j799j584j027j171o48L81P87Q79J305J350P28M92K23n74j030
249A210o84q73j101m63K16K5L06R80P19L78N73L05k85k01j72o14n81p1j20m07
269h60J94M23q6J10L59P7j10J95O1j42J29L12k65r2K70j28n13n8J7m14j96K46
291d71ON1M83L69O3L70K49k87k34K8m88o27j06k8k79J89M27K56K25N95J91p7O5
$$ plain form
165 -700 -489 -539 -170 1101 2177 2656 3164 3309 2389 886 -606 -2438 -4193 -5004 -5100 -4631 -2829 -315
183 -315 1912 4092 6240 7090 6358 5047 3052 -110 -3110 -5264 -6932 -7464 -6386 -4346 -1936 1343
199 1343 4421 6237 7189 7417 6010 3338 565 -2127 -4802 -6363 -6586 -6068 -4372 -1605 1019 3132
215 3132 5164 6195 5686 4415 2834 481 -2078 -3656 -4512 -4941 -4135 -2485 -814 1024 2910 3866
231 3866 3946 3832 2898 1099 -485 -1512 -2683 -3331 -2950 -2163 -1284 21 1371 2099 2591 2814 2240 1210
249 1210 526 -347 -1448 -1911 -1695 -1670 -1364 -384 335 713 1286 1591 1306 1105 933 319 -262 -333 -453 -860
269 -860 -666 -243 -329 -219 140 217 107 302 363 221 350 662 397 305 575 447 -66 -124 -107 -521 -717 -471
291 -471 -465 -414 69 438 501 871 1120 833 599 627 139 -488 -594 -622 -901 -712 -285 -29 196 791 982 905 970
314I70j36n50l73j05m06m01K46K61R1L86N68J52J80K90j95m15j09k82o97k74J10
335f89k09m0M92M38J31M62N80Jj9Q8m15n80k05m42o80j27J73m2J15P13N19L62
357F26N97M11l3k5j78p22p75l93o09o40l2K97K56M77R16P32M68N90K18l29l52
378A500n17r53q15m18m50l73L20O13M08O55R43M81K68K59j34n76m79m25q28m91
398a012j3k05j37M56M70K29M08M74J41O1K45j01k69m0j10m37k30m3l51m35O7k4
420h56j67K58M54K62M60O99L55J05K24j48o35n89n17r09p39j74k3O2O48J036P51
441E57Q52Q11L14j78k15p66j138q97o89p79l22L80N27O62J072R84N56L93J87n37
461A774p05n63q41q82k22M5J06M45Q04O00L18L83Qm49m63m88o39l97K85J87L25
$$ plain form
314 970 834 284 -89 -194 -600 -1001 -755 -494 -403 -17 551 703 883 1173 978 563 454 172 -525 -799 -689
335 -689 -898 -938 -446 -8 123 585 1165 1166 1147 1235 820 240 35 -407 -1087 -1214 -1041 -1083 -968 -255 264 626
357 626 1223 1634 1601 1576 1398 676 -99 -492 -1101 -1741 -1773 -1476 -1220 -743 173 905 1373 1963 2181 1852 1500
378 1500 983 30 -785 -1203 -1653 -2026 -1706 -1093 -685 -30 913 1394 1662 1921 1787 1211 732 307 -521 -1012
398 -1012 -1025 -1230 -1367 -911 -441 -212 196 670 811 872 1117 1016 747 707 597 160 -70 -113 -464 -899 -832 -856
420 -856 -1023 -765 -311 -49 411 1110 1465 1570 1794 1646 1011 422 -95 -1004 -1743 -1917 -1940 -1878 -1230 -194 557
441 557 1409 2220 2534 2356 2141 1375 237 -660 -1349 -2128 -2450 -2070 -1543 -881 191 1175 1731 2124 2311 1774
461 1774 1069 506 -335 -1217 -1439 -1394 -1288 -843 -39 561 879 1262 1270 821 358 -130 -769 -1166 -881 -694 -369
482c69Q56P68L54K09Q3o59q64q67r43r22k80K41L72J028J498J205R61R35K44o37
502C213r98j276j676j601j116o40q7Q52J324J502J832J785J054L79Mq57j597j720
520C77j657j676j065k97K06Q24J438J664J433J440J087K26k72n18j086j459j249
537e84j059r85m52Q7K48O39J021J003Q21R01P81J78Q7j8m90q63p97q09j050p12
557b053m53l67J00O12P72R03J307J248Q18N36K98l72j001j110j394j553j177p17
575c603m15M27J066J311J453J657J383O06K32k89j072j526j443j492j251o05K4
592c537M56R85J478J313J061J056M23k82o03q15j162j104p30n49j73L92O87O07
610d97Q40P25L12M1j03m38o89m86k94k55L1M30M15M18N30K08j62k02l72p45o13
$$ plain form
482 -369 487 1255 1609 1818 1901 1242 378 -489 -1432 -2354 -2634 -2393 -2021 -993 505 1710 2671 3606 3850 3213
502 3213 2215 939 -737 -2338 -3454 -4094 -4181 -3329 -2005 -503 1329 3114 4168 4547 4551 3694 2097 377
520 377 -1280 -2956 -4021 -4318 -4112 -3288 -1850 -186 1247 2687 3774 4000 3728 3210 2124 665 -584
537 -584 -1643 -2628 -3080 -2993 -2745 -2106 -1085 -82 739 1640 2421 2599 2686 2668 2178 1315 518 -291 -1341 -2053
557 -2053 -2506 -2873 -2773 -2161 -1389 -486 821 2069 2887 3423 3721 3349 2348 1238 -156 -1709 -2886 -3603
575 -3603 -4018 -3591 -2525 -1214 239 1896 3279 3885 4117 3828 2756 1230 -213 -1705 -2956 -3561 -3537
592 -3537 -3081 -2096 -618 695 1756 2812 3235 2953 2350 1535 373 -731 -1461 -2010 -2183 -1791 -1104 -497
610 -497 343 1068 1380 1421 1318 880 191 -295 -589 -844 -813 -383 32 450 980 1188 1026 824 452 -293 -906
631i06l26k10l8M70P27O06P85P17K62n8k56o47r63p70o80p02k06L79M41O37R90
652B52Q93N84L58J33l73n64o38q67p53m91j30k9K90O94N31N73N73L43k7k3k63
673A066n27m54k55l16k57J06J54Q3K98L25N4L4Q3J4k06l8M2j30nJ18j4o4J34l8
697B07k02o7O5j81k0J75O2Q3K01Q9p7O2k4k11k44n8j02j49J15K70N1J95L28J54
721G22r5m8j96l71l22j82k99n5K91K41L15N07M77J98Q2Ol93n30m30n99n00j90
743a371L8J61M48P30O03N23M63K53k09l20n08p56p15m60m20k38K93M73N04P05
763A97Q17M36K22J61j92n93n21n87o83m58j38l3J60N32N74M06M88M74J11r5j40
784A138l48n53l64k58l80j23J54N8J60M01L23J43K41K45j36r8o4j79k82p0j22
$$ plain form
631 -906 -1232 -1442 -1480 -1010 -283 323 1108 1825 2087 2029 1773 1126 163 -607 -1287 -1989 -2195 -1816 -1375 -738 252
652 252 1145 1729 2087 2220 1847 1283 645 -222 -975 -1466 -1596 -1625 -1335 -641 -110 463 1036 1379 1352 1329 1066
673 1066 539 85 -170 -486 -743 -637 -483 -400 -102 223 277 311 394 408 202 164 206 76 71 189 175 111 245 207
697 207 5 -62 3 -178 -198 -23 39 122 323 412 335 397 373 162 -82 -140 -242 -391 -276 -6 45 240 568 722
721 722 627 579 383 12 -310 -492 -791 -846 -555 -314 1 508 985 1183 1265 1271 878 348 -82 -681 -1181 -1371
743 -1371 -1333 -1172 -724 6 609 1132 1595 1848 1639 1319 811 55 -660 -1120 -1540 -1778 -1485 -1012 -508 197
763 197 1014 1450 1672 1833 1641 1048 527 -60 -743 -1201 -1339 -1372 -1212 -680 -106 300 788 1262 1373 1278 1138
784 1138 790 237 -127 -385 -765 -888 -734 -676 -516 -115 208 351 592 837 701 603 539 360 78 8 -114
805a14k26l1J14o1Q4K29O4P2J06K42p8JJ17j29j54o9r1k08p3j1p4KJ86R8L7K13
831B46J58m5M9Q4j30j49m5j52k01rK9r3M0K06OQ3J92J02n6K4N7j66j38J3j02j14
857a11J3N0j21Q4J61l3O2J53L5j22K9J01j51n1O2j28q8J10M6j14K9J00l2J6R4
882A94Pj27O7N2j18lN1n7m3J36k8o4N4R3j10o2P1p8n1mJ6k9N8J20J8K7J23K3j05
911B31M3l8k28r4J4j46j9J34R0k7J77J61L3KJ49p8j86j6j37j76j15O9p1P8J55
936EQ1N2J31J09m8j2K4j60j61N3m6j19MJ17p7P7R8K7m7R6lj07pO4r4j7P6L8q1
965G3O6N8j38OK8r9j7L2N2p5R0J27l7P5P0nj30mp7j22l1M3q2J8J47P8j9J33Nm5
995B20p5M1j36j08J7J0rL4J60K8P4R5n4r2j5p2k47o8Mq4O3K08J33J14K11J16p
$$ plain form
805 -114 -340 -371 -257 -318 -234 -5 59 131 237 479 401 402 519 390 236 167 76 -132 -205 -216 -290 -288 -102 -4 33 246
831 246 404 359 408 492 362 213 168 16 -185 -194 -165 -258 -218 -12 -6 77 269 371 315 339 396 230 92 105 3 -111
857 -111 -98 -48 -169 -85 76 43 105 258 293 171 200 301 150 99 161 33 -55 55 101 -13 16 116 84 100 194
882 194 201 74 141 193 75 72 123 66 23 159 131 67 121 214 104 42 113 35 -16 -20 -4 -33 25 145 163 190 313 336 231
911 231 274 236 8 -86 -72 -218 -237 -103 -13 -40 137 298 331 333 482 404 218 202 65 -111 -226 -157 -228 -150 5
936 5 86 138 269 378 330 318 342 182 21 74 28 -91 -87 30 -47 30 128 155 108 204 201 94 87 151 57 40 116 154 73
965 73 139 197 59 65 93 -6 -23 9 61 -14 76 203 166 241 311 306 176 172 95 -27 -58 -15 -97 -79 68 146 127 260 265 220
995 220 145 186 50 -58 -41 -31 -40 -6 154 182 256 351 297 205 190 118 -129 -197 -193 -277 -214 -6 127 241 452 568 561
1022E61o2p9j89l03j37j01j52K0J23R4K12K99K04Q4J13k2j84j58j47l52j78k3
1044c77m2l0J59K70J29J30K12R8n0K3j38j94j42r4j39o0N1J13n6J96J40l0K2J09
1068C00o9j50O2j9p4N2L9j8K2M8k2j11j4K1j14p3P2m9R3Q3P1O3J02Q7j15k9K6
1095B84j38j62o7qq5M4N3M8P9J69K1LN6Np0m7Nj27q1K0J8o3O4O3j0j4Q4p5o0R7
1125A06mn6P8J27n5N4QJ9j32on9j45o2qo1J3J09J09P6J30J94k5M8Nj45j24j07
1152H7j53j29o9jnJ12J10J41P6J61J24p9M6l0j20j73n9r9r2l1N0m0P0J59L0J9
1178A05J15R1q1M7L3r1m6J1p8j27L4j6j18k3J09l9mR5J11J9J16P7J3k3Pq5j54
1205I8n5n7j66m3J10m2j6J57R5R6J34R0q9L6Jj14j36n9n3j32qL3n2J01J18Q3k
$$ plain form
1022 561 499 420 231 -72 -209 -310 -462 -442 -319 -225 -13 286 490 574 687 665 481 323 176 -176 -354 -377
1044 -377 -419 -449 -290 -20 109 239 451 549 499 522 384 190 48 -46 -185 -245 -194 -81 -137 59 199 169 191 300
1068 300 231 81 143 124 50 102 141 123 145 193 171 60 46 67 -47 -120 -48 -97 -4 79 150 213 315 402 287 258 284
1095 284 146 -16 -83 -91 -176 -132 -79 -31 48 217 238 241 297 302 232 185 190 63 -18 2 20 -43 21 84 74 60 144 69 9 106
1125 106 102 46 124 251 196 250 258 277 145 139 80 -65 -127 -135 -196 -183 -74 35 111 241 435 410 458 463 318 194 87
1152 87 -66 -195 -264 -265 -270 -158 -48 93 169 330 454 375 421 391 271 98 39 -60 -152 -183 -133 -173 -103 56 86 105
1178 105 220 311 230 277 310 219 173 184 106 -21 13 -3 -121 -144 -35 -74 -78 17 128 147 263 340 353 330 337 252 98
1205 98 43 -14 -180 -223 -113 -155 -171 -14 81 177 311 401 312 348 349 235 99 40 -13 -145 -153 -120 -172 -71 47 130 128
1232A28J35O9p2L4m8r3p6K3p1q3N3J3n9M8R0j3m3P6M1r1P8J2j6j3O9l3o1M0mj13
1262B0J1K1q5mK2L2KQ1J27k8M5M6rj06L8qj62m4l3j07nR3K7kJ49O4N6J4J01l2
1292C24q1n4q1j43j4Lq4M1M1J7O5J33J03o1J14K8r8p4k5q3j23J3J7m5M2M9L2O3
1320A19J43k6k1jJ2j02n5M5j05m2J4N2o1J30Q7o6L2J15m0j01L7l5j05l0Mj8oO4
1348D0M7JJ09P2q2j3O6m7r6j9m3o9n0Q0k2RR2O2N4O3Qk3Kj0j00o9n1n0j01K5P3
1379d2j0N7R5N0N5N4N4o3m6L9j15j07l2m9q3K6O6J3M3J59P2L9J3K6m2l1n4j26
1407F1j05On1k9kJ10N5L4J23Pj7Q7kr5ol8p7r9rL7k2K7O9k5Q6Q4l3l0O9l5p8K4
1439A26j1o6%L0j0n6Q3j0nK8L7k7l9P8q8k1Q5m7kn5M3J5j0M6k4j5N8Jp3k3O9o3
$$ plain form
1232 128 263 332 260 294 246 153 77 100 29 -54 -1 12 -47 1 91 78 35 111 152 61 139 151 135 122 191 158 97 137 133 20
1262 20 31 52 -33 -37 -15 17 19 100 227 199 244 290 281 175 213 205 43 -1 -34 -141 -146 -53 -26 -28 121 185 241 255 356 324
1292 324 243 189 108 -35 -49 -46 -130 -89 -48 -31 34 167 270 209 323 351 253 179 154 71 -52 -39 -22 -67 -25 24 56 119
1320 119 262 236 215 214 226 124 69 114 9 -33 -19 33 -28 102 189 123 155 270 230 129 166 131 26 -4 0 -18 -24 40
1348 40 87 88 197 269 187 174 240 193 97 78 35 -34 -84 -4 -26 -17 75 137 191 254 262 239 241 231 131 62 11 -39 -140 -115 -42
1379 -42 -52 5 100 150 205 259 313 250 204 243 128 21 -11 -60 -143 -117 -51 -38 5 164 236 275 288 314 272 241 187 61
1407 61 -44 -38 -89 -118 -120 -10 45 79 202 209 192 279 277 182 176 138 61 -38 -47 -10 -32 -5 64 39 125 209 176 146 215 180 102 126
1439 126 115 49 49 79 69 13 96 86 81 109 146 119 80 158 70 49 134 87 85 30 73 88 78 124 100 85 143 144 71 48 117 54
1471E4p2Q3npK4P4j0pL4k4jk2j1r6L1L8r6RN5K1J9N5M5k7J6K0m1n2J2j1r9j5R
1504Cn5%J05j9N6N7L2k3L1J1k1m2L8q0pnj6m4o7J03k1l6R9k2L9L1Q8j7j2qn2p0
1536G6M1%j28k9mMMO2R0L6P0M4m9J7k2m2q8o0l9m8k6N1mQJ63P0nO7K9p8k9k7j01
1569E3o6J6ll5pJ02K5jJ06l1k0M4o9p4K2m4Mk9J19K8k0R3K3p2n8M6q3r7K2n0j4
1600g0P8K7O7R5J10k8j7Om8j43m6o3j09K8M8N2J6J50J45l5J06J8o2j15j5j42j40
1627h7l5j7j3M6J00J40J0J28J24p2On9j01p7n7p8j15K2L7K1P6J20O7OJ09K0l6
1654B85m5n1q3j12k0o1j05O1O9K8P1J20Q0K8J27J7p7n0o7j34j47o4j24k7J8J16
1680a47P7J56J68J24R1J39n2j40m6k07k36k19j34o3NJ13J68K12L07K39J38J20
$$ plain form
1471 54 -18 65 60 53 77 151 141 134 168 144 143 121 110 14 45 83 -13 -4 51 72 91 146 191 164 180 200 159 107 119 108 9 -6 3
1504 3 -52 -52 53 34 90 147 179 156 187 198 177 135 173 93 86 81 65 21 -46 57 36 0 99 77 116 147 235 218 206 198 146 76
1536 76 117 117 -11 -40 -44 -40 -36 26 116 152 222 266 217 234 212 170 82 22 -17 -65 -91 -40 -44 -36 127 197 192 259 288 210 181 154 53
1569 53 -13 3 0 -35 -42 60 85 84 190 159 139 183 114 40 62 18 22 -7 112 140 120 213 236 164 106 152 69 -28 -6 -56 -70
1600 -70 8 35 102 197 307 279 262 268 220 77 31 -32 -141 -113 -65 -13 3 153 298 263 369 387 325 210 195 53 -87
1627 -87 -122 -139 -152 -106 -6 134 144 272 396 324 330 271 170 93 36 -42 -157 -135 -98 -77 -1 119 186 192 301 321 285
1654 285 240 189 106 -6 -26 -87 -192 -131 -62 -34 37 157 237 265 392 409 332 282 215 81 -66 -130 -254 -281 -263 -147
1680 -147 -70 86 254 378 469 608 556 416 370 163 -73 -292 -426 -489 -484 -371 -203 9 316 555 693 813
1702H13j1j63k22k51k29l34j81o7L8O5L06K61K54L17J81R4pj36k21l01k87k72
1724c53k26m5N5Q6J63K48K98K13K25J08p0r1j20k24k67j64j83j15M5O7O6J64J97
1747G7J43J23J47Oo1mq2j45q2j18j31l5o3K3j6N2J18J3J32J58J6O2R3m7%j15l7
1774B27j49r1mj30r1k7L8N1J06J21J50J19N9R3n3o2m9j09j46o8o4j33k4oK0J02
1800a20J21R4J9J46R5M7K2j0r3o6j01j04j15j42Jj13O9N5M7J64K00J28J24O4M7
1825E79q0j19r8j69k46j14j12j38N9J43Q5J73L22J55J11K02n9j06j38k46k46j89
1847b31j39p7o1J21J53J68K26K66J15M9K5m3j84j56j66j80j96n1K9rJ24K09J34
1870A26J24J77P2o2kq6j31j36o5j39m4j1O9%J34R4K0N0R2n7J1l3r7k8j4l5k2J8
$$ plain form
1702 813 802 639 417 166 -63 -397 -578 -645 -607 -542 -236 25 279 596 777 871 864 728 507 206 -81 -353
1724 -353 -579 -624 -569 -483 -320 -72 226 439 664 772 702 611 491 267 0 -164 -347 -462 -417 -350 -284 -120 77
1747 77 220 343 490 496 435 431 349 204 122 4 -127 -162 -225 -202 -218 -166 -48 -35 97 255 271 333 426 379 379 264 227
1774 227 78 -13 -17 -147 -238 -265 -227 -176 -70 51 201 320 379 472 419 357 308 199 53 -15 -79 -212 -236 -242 -222 -120
1800 -120 1 95 114 260 355 402 424 414 321 255 154 50 -65 -207 -206 -319 -250 -195 -148 16 216 344 468 532 579
1825 579 499 380 282 113 -133 -247 -359 -497 -438 -295 -210 -37 285 440 551 753 694 588 450 204 -42 -231
1847 -231 -370 -447 -508 -387 -234 -66 160 426 541 590 615 572 388 232 66 -114 -310 -361 -332 -341 -217 -8 126
1870 126 250 427 499 437 435 349 218 82 17 -122 -166 -177 -108 -108 26 120 140 190 282 225 236 203 106 78 64 29 7 25
1898B5l4N4M5Q0m5nQRj9q5O6k8l0M6J5l2N9K2k9N6pl1j8l7l2k9l9N4k2J3L5P9
1930A44J7L2K7j3L2m1n4p8o9j8r6L4K4M8M8R0N7rJ27k1n9k6j6j00r6j9n9J0lQ6
1960aJ9K2J61J6N6J2%p0j02J2q7j13K9L8r9N2J09K9J8Q8M3K6m7L8j08j9k9p4m4
1989b5m2N5j5L6K8L6O7Q4Oj2Jj8l6p2m5l0o4K7rnP7KO4N3P8KOM5p2j23qo6q7o3
2023a25J02j4L6R0M7K5L7Q8m7n2Nq1m2q3J0n1K8K7L5k2J13N3K1J4j7k5o4K7o9
2052F6m1nk1K3K5N3K7m1O7k0k3K7J2n7mK2j0r4P6K8l7%kJ3j2J9o0pM9L7j5L8M9
2085A82j6Qk1qj02m0N2m7j3PM7J7N7m0M9J3J9Jn0L0l0n7nJ0oJ8J9Mq0N7j4o1N5
2118E5J0N9j5J19j9OK9l6q8l4l9j09o1kJ0J7R6N6J38J01J07j7OKj55j53j27j49
$$ plain form
1898 25 -9 45 90 170 125 120 128 137 118 33 99 71 41 87 102 70 129 151 122 178 171 140 122 85 53 24 -15 39 17 30 65 144
1930 144 161 193 220 207 239 198 144 66 -3 -21 -117 -83 -59 -11 37 127 184 175 302 281 222 196 180 80 -16 -35 -94 -84 -87 -1
1960 -1 18 40 201 217 273 285 285 215 113 125 38 -75 -46 -8 -107 -55 54 83 101 189 232 258 211 249 141 122 93 19 -25
1989 -25 -67 -12 -27 9 37 73 140 224 230 218 219 201 165 93 48 18 -46 -19 -28 -33 44 46 110 163 241 243 249 294 222 99 91 25 -62 -125
2023 -125 -23 -37 -1 89 136 161 198 286 239 187 192 111 69 -14 -4 -55 -27 0 35 13 126 179 200 214 197 172 108 135 66
2052 66 25 20 -1 22 47 100 127 86 153 133 110 137 149 92 88 110 100 6 82 110 73 73 71 84 72 91 31 24 73 110 95 133 182
2085 182 166 174 153 145 43 3 55 8 -5 2 49 66 123 83 132 145 164 165 115 145 115 58 53 63 57 75 94 98 18 75 61 0 55
2118 55 65 124 109 228 209 215 244 208 120 86 47 -62 -123 -125 -115 -98 -2 54 192 293 400 383 389 391 236 83 -44 -193
2146a93p1p6N0O1J48J66J51J63Q5R0m5p7j57j84j93j31j09j03M9J42R8J78K06
2169B48J73J15M7j3j16j16j77j70j93p7q1m5J03J21J51J37K16O6P2P8j6j41j32
2192B50r6j37j90o9l4m0M6J29P5J25J50J18J34N0l7m2p6j17j63j07j65p3q1J9
2216c31R7Q9J32K33R8J42M4K2l5j37p6k09j63j48m6q5P2Q5J43J48J48J08O9Q3
2240D83l4r5l8j32j27j46j1q2Lj0J31k5J16J10K4Q7NL5k4J9o6l4p4k9n2o1m2o3
2268a32k5M4J8P7Q3P4R5P1Q5J3j2k8p3j66j49q8r2j27j0J31O3J21K18J04J57R8
2294E50k0Pj51j39j93j71j56r3m8P5J01J81J48J78J12J52K1m4p4j38j18k18j20
2317a58j03n4MO1J05J37J24J77P0O5Kk8r7r9r7j06j10n7n6k2J44J0J10J21R6M4
$$ plain form
2146 -193 -264 -340 -290 -229 -81 85 236 399 484 574 529 452 295 111 -82 -213 -322 -425 -376 -234 -136 42 248
2169 248 421 536 583 570 454 338 161 -9 -202 -279 -360 -405 -302 -181 -30 107 323 389 461 539 523 382 250
2192 250 154 17 -173 -242 -276 -316 -270 -141 -66 59 209 327 461 511 474 432 356 239 76 -31 -196 -269 -350 -331
2216 -331 -234 -145 -13 220 318 460 504 526 491 354 278 69 -94 -242 -288 -373 -301 -216 -73 75 223 331 400 483
2240 483 449 354 316 184 57 -89 -100 -182 -179 -189 -58 -83 33 143 167 254 259 294 270 289 223 189 115 86 34 -27 -69 -132
2268 -132 -157 -113 -95 -18 65 139 234 305 390 403 391 363 290 124 -25 -113 -205 -332 -342 -211 -148 -27 191 295 452 550
2294 550 530 537 386 247 54 -117 -273 -366 -414 -339 -238 -57 91 269 381 533 554 510 436 298 180 -38 -158
2317 -158 -261 -315 -311 -250 -145 -8 116 293 363 428 430 402 305 206 109 3 -107 -164 -220 -242 -98 -88 22 143 239 283
2343B83O2L7o7o9j9j08j16l5n5m1QP2L8N8R7P4O0j3L1m5j02k3l1j23l3Kj2N9P8
2372F7M4L7N0N3m2k7o8k1o7l6Nj2L7O9QN2N8KJ6l5k5n7p0l1q2mJ6O3lJ43QM9L9
2405B36L8n2p8k1q0o1l0l1m7M2J21J0Q3J07J7K5m3Kn5p3n8p6l2mPqQ4Q3M7K9M6
2436B28L7o2j6J4r5m9n1k0j6J7l2L3L2J23J4K6R2o5oj2l5l0r7K7p2qN1om1J18
2466I9M0pN2%%n2K3l7p6l8K0pk6M3L3j3O4K7k9O4Rq0J4ol8k4pj2j2RP7m0J3J7
2500A00N8l4%L8p2L8j6l6j0Qk1J2jK4oJJ2K1o2L9j8L2K2mk4n7R7k7m8M7k0Pn9
2533D1kM1k1K2P0k2qM6m9rJ6K2r3J3K6j2o5Q4oL1m5K8NkM0j1l2K6pj3Pm6K8p0
2567C3lj7kJ9L1JM6Nk2R1jj9n1j7Km4m4Lj7K2lL7K5Q3N8Rj0Ql2o0n3m2k2K3m8
$$ plain form
2343 283 345 382 315 246 227 119 3 -32 -87 -128 -120 -48 -10 48 145 219 279 266 297 252 150 127 96 -27 -60 -58 -70 -11 67
2372 67 111 148 198 251 209 182 114 93 26 -10 -5 -17 20 89 97 149 207 209 225 190 165 108 38 7 -75 -79 -63 0 -3 140 148 197 236
2405 236 274 222 144 123 43 -18 -48 -79 -126 -84 37 47 130 237 254 279 236 238 183 110 52 -24 -56 -60 -53 -61 23 106 153 182 228
2436 228 265 203 187 201 106 57 6 -14 -30 -13 -45 -12 20 143 157 183 275 210 204 192 157 127 30 57 -15 -23 28 22 -19 99
2466 99 139 132 184 184 184 132 155 118 42 4 24 17 -9 34 67 54 118 145 116 180 189 109 123 117 79 55 48 36 24 33 110 70 83 100
2500 100 158 124 124 162 90 128 112 76 66 74 53 65 64 88 82 83 95 116 54 93 75 107 129 125 101 44 141 114 66 113 93 100 41
2533 41 39 80 59 81 151 129 121 167 118 109 125 147 54 67 93 81 16 100 94 125 80 108 113 111 151 140 108 134 127 114 121 75 103 33
2567 33 30 13 11 30 61 62 108 113 91 182 181 162 111 94 96 52 8 11 -6 16 13 50 75 158 216 225 215 223 191 131 78 36 14 37 -11
2602a1K6M4J7L6L5L6N2n8j5J1n0o2m7KKpm7O1K8O1N8QN7m9j7J8n6m9n2M9o1j9
2634AkL7L8m0N2P0l8K5J1k7jpj5J9l8p9L1k2KL0QLN3J2M6K8j2l0J8m1p3Nn1o1
2668d8J5J2K7Q9L9lK5M7J0n1j5J5r5l7m2n0K4M7l3Q2N7L1L7J3K0j2n5k1p6M6j05
2699gJ5Mj7O0J8OM1L9n7O7k5pl5O5j04j2L6l5J3J0j8Pl7L4lK4k4P9K6m2O7kPn6
2733A37J3r6J3o4m1RJk6M6L2J09M8K3O3m0qn1J9j06n8l3k9n8P8K9J1J11L2L7K0
2763B21M7j9k4o8K8j22n6k1o9N6J1K2jP4P2M5O2JKm8nl0n6m5j00j7k7Q4k9jQ9
2794G6O8RO1L8K6j1p5Pj15k7p0k8k1J7rM7O7R2O5j1O0Lq5k1n6l8l1k9p8N6JM0
2826B8L8O2L9l5O7%m3o8K2l6n8k6K4M1L1mK0J0k1P0m7oj8l2L3n1J6j7L3M8kJ1
$$ plain form
2602 -11 15 59 76 112 147 183 235 177 162 173 123 61 14 16 18 11 -36 25 53 114 172 180 237 188 171 189 133 84 32 81 20 1
2634 1 -1 36 74 34 86 156 118 143 154 127 126 119 104 123 85 6 37 15 17 47 55 58 111 123 169 197 185 155 173 132 59 64 13 -48
2668 -48 -33 -21 6 95 134 131 156 203 213 162 147 162 67 30 -12 -62 -38 9 -24 58 115 146 183 196 216 204 149 128 52 98 -7
2699 -7 8 12 -5 55 73 79 120 159 102 169 144 137 102 167 63 51 87 52 65 75 57 64 27 61 58 82 58 137 163 121 188 186 193 137
2733 137 150 54 67 3 -38 -29 -28 -54 -8 24 133 181 204 267 227 219 168 187 81 23 -10 -39 -97 -19 10 21 132 164 201 221
2763 221 268 249 225 157 185 63 7 -14 -83 -27 -16 6 5 79 151 196 258 259 261 213 208 178 122 77 -23 -40 -67 17 -12 -13 76
2794 76 144 153 214 252 278 267 192 199 84 57 -13 -41 -62 -45 -54 -7 60 152 217 206 266 269 184 163 107 69 38 9 -69 -13 -12 28
2826 28 66 128 167 132 199 199 156 88 110 74 16 -10 14 55 86 82 102 112 91 161 114 108 90 58 91 40 56 39 72 120 118 129
2858A29M3k7mpm7m1j1k3mJ0J4O8j3O1j2L8JQj6l2l9l2n7L7k0k6K1M9lRP2J2L7
2891A95k0N4p8ol7k8m5JJ4n9J4M2NKN8N2MM1J8l5m3n6j5k2l3o3K4L1rJ9L1Q5K
2924A43j4N9K0k1k0k9n9J2q4Ljj4K1l6R2N6k4M9MK1Jjk7n3J4j6q2P3o3J3qk0N8
2957F7L8jPN1pN3l1j4l8m0k7rj8mp7O3PM8JK3K5O6J7j8Jl1l5k6k6pj0n1nL5mO0
2993H3QL4L4M1l1j4k5ql6J2q8JNML7j5L9J7M2J8L5k3o0K2Mn9M4n1k6k5%K2j8K4
3027D7L6M1OLJ2jlk0J2n8K0k8JJJ7k7L8M2n0J4K2qL7m8MMk4pKJ8j2Ok8N1n3O5
3063A32j6J0m1MkL3m1K0j6J0nPK1j8K4m8J2k6%J0OJ8kK1j1L5n4N2K2p9j5nKL4
3097I4Mn%J6J8j7Onm2OJ2j2K1oJ7J4k9lK3l4K7j7L6n2lK8l3L0K9m0K6J9Lk6L9
$$ plain form
2858 129 172 145 141 134 87 46 35 12 8 18 32 100 87 148 136 174 175 183 167 135 96 64 7 44 24 -2 19 68 65 74 146 158 195
2891 195 175 229 151 145 108 80 35 36 50 -9 5 47 52 54 112 164 168 209 227 192 149 93 78 56 23 -40 -16 15 6 25 56 141 143
2924 143 129 188 208 187 167 138 79 91 7 10 9 -5 16 -20 72 128 104 153 157 178 179 178 151 98 112 96 14 87 24 37 29 9 67
2957 67 105 104 111 162 155 208 177 163 125 85 58 49 31 27 -50 13 20 68 69 92 117 183 200 182 183 152 117 91 65 58 48 -3 -8 27 23 83
2993 83 91 125 159 200 169 155 130 122 86 98 10 11 16 20 57 42 81 98 140 158 193 170 110 132 136 77 121 70 44 19 19 41 23 47
3027 47 83 124 130 133 145 144 141 121 133 75 95 67 68 69 86 59 97 139 89 103 125 117 154 106 110 114 90 83 85 103 91 97 69 120 67 132
3063 132 116 126 85 89 87 120 79 99 83 93 88 95 116 98 122 74 86 60 60 70 76 94 92 113 102 137 83 135 157 78 63 58 60 94
3097 94 98 93 93 109 127 110 116 111 69 75 87 75 96 90 107 121 92 89 112 78 105 88 124 72 69 97 64 94 123 83 109 128 131 105 144
3132A44m4l9J3J5o0QQ2l9K8J9mkJ4k8lm0J5L3k4l2nk7R2l2L6j2rkL6mk2m0K2k4
3166F5Om4L8O3p4L8Mj0K1mL6q3N0Jj7qJ1k1L1j6K4Pl9jL0m9j1J9K7k3lJ4N1j3
3200A20K1n0K9jj2k0K0lk9K2l5J7K1J3k9K7QNnRl8l3K4Jj1M6k8J7j1qk6L4M9m6
3234I8RkK9j9LNl9j2PJ0k7Pj3J9NJ4j6M5j1J4J4qK3l3p3M1m2J9k2K4K5J5j3J8
3268A14j3K0N5p6nqN0o2%K7n6M0M4l5lL8oqJ3oMm7PJ9%kjk4j2N1l1Oj6k6M8pk9
3305F3K1K8J5j8L5j0m3J7j5J2m3J1j3J8l9N5j8KO8j3k4N2l3J0j0m5L3m5N2q3k7
3336A3N5kK4jK6L2k8L0K2m4j4rnk1k1J6j1l0P4k6m1J09Pn%l0j2L4Jk8j9j8j8k0
3370D0J0mPO9k9J8K1K1l4O5l2n2Kj7jJ6m3k3K2L4l1K6M4j1lK1j1l0K5k6J1o%k4
$$ plain form
3132 144 100 61 74 89 29 37 119 80 108 127 123 121 135 107 104 64 79 112 88 56 51 24 116 84 120 108 99 97 133 129 107 67 89 65
3166 65 71 27 65 128 54 92 96 86 107 103 139 56 106 107 90 82 93 72 103 87 111 118 79 78 108 59 48 67 94 71 68 82 133 120
3200 120 141 91 120 119 107 87 107 104 75 97 62 79 100 113 84 111 119 124 119 128 90 57 81 82 71 117 89 106 95 87 61 95 144 98
3234 98 107 105 134 115 118 123 84 72 79 89 62 69 56 75 80 94 78 123 112 126 140 132 155 122 49 90 48 67 45 69 94 109 96 114
3268 114 101 121 176 100 95 87 137 75 75 102 46 86 130 95 92 130 124 116 129 123 127 80 87 106 106 104 103 79 67 118 87 93 77 51 99 92 63
3305 63 84 112 127 109 144 134 91 108 93 105 62 73 60 78 39 94 76 78 146 133 109 161 128 138 128 83 116 71 123 40 13
3336 13 68 66 90 89 115 147 119 149 171 127 113 104 99 78 57 73 62 32 106 80 39 148 155 150 150 120 108 142 143 115 96 78 60 40
3370 40 50 46 53 122 93 111 132 153 119 184 152 100 102 85 84 100 57 34 56 90 59 85 129 118 115 136 125 95 120 94 105 99 99 75
3404G5j7J5mj2pM4j5KJ7J1K4k6MmJ8K1q5N1m7Qm0PM6J6Jl0O3lL2l6RJ3n1J4m9
3439F5k0j0K3rj7N1L2k5N3nqmL4jm9m8Rk3J2K7j3L5n1O6j0pM5jn1M2k4k9n0J2
3473E1J8j2n0Q2k4L7j3rO5j9J5m0m0L0J6j7m0RK6K1k0j1J6M2L0l3J9l7Rl7K0l2
3505G2j8J9l%J3J8L2j1J6J1q2J0L0Nl3mnj0QjQK6O9j00L4j5K5mLk2k2j0RJ3J1
3540I2Rk3LNpQP3l4j9k6ML1j0j0K2l6q%L4%K9l2M1m3j7J2J8l4oK0rK4j7j8K5J0
3576A11k3L1l4j2J1K9j7k8L2qnk0K7J9k2J3nnk3RK3J6n5J5j2P0l3j4J2PQmj8n4
3610D1J7K1rK6k4M8m1J3N7j9l9j6L4rl2J7k4K6j5K3o6L0M8nJ6K4o4N1l7J5k4K2
3642A05j2jk9mJ4KRl3Q5Nl5j3Loj6K3On4J5L8k1K7j2mj0j9J2L2Ll0Mk4J7kj4M8
$$ plain form
3404 75 58 73 69 57 50 94 79 81 98 109 133 107 111 107 125 146 61 112 65 73 33 40 86 102 103 73 136 133 165 129 138 151 100 114 65
3439 65 45 35 58 49 32 83 115 90 143 138 130 126 160 159 110 62 71 48 60 87 74 109 58 124 114 107 152 151 100 142 118 89 39 51
3473 51 69 57 7 89 65 102 89 80 145 126 141 101 61 91 107 90 50 59 85 106 86 75 91 133 163 130 149 112 121 84 104 72
3505 72 54 73 70 70 83 101 133 122 138 149 67 77 107 112 79 75 70 60 68 67 75 101 170 70 104 89 114 110 113 91 69 59 68 81 92
3540 92 101 78 81 86 79 87 160 126 107 81 85 116 106 96 118 82 74 74 108 108 137 105 146 103 86 98 116 82 76 96 87 111 94 76 101 111
3576 111 88 119 85 73 84 113 96 68 100 92 87 67 94 113 91 104 99 94 71 80 103 119 64 79 67 137 104 90 102 109 117 113 95 41
3610 41 58 79 70 96 72 120 79 92 149 130 91 75 109 100 68 85 61 87 72 95 29 59 107 102 118 142 78 129 92 107 83 105
3642 105 93 92 63 59 73 75 84 51 136 141 106 93 96 90 74 97 103 49 64 102 81 108 96 92 82 63 75 107 110 80 84 60 77 75 61 109
3678A09j9%l4N0N%k9L2l8L2J0Joj3J2lk0JK9o0K9j9J2Mj0M7l2j1L8Rj9J1Kk5K3
3713A18J3l4k8K6n0L4M4m5%J7j9j1J9N1n1L1k9M4l0m8N5K1j2k3qj2N4m9OJ6J7
3744A17k0N3nol8K1n6J4K2k8kKL7l9K7kJ5k5M5j3k0J7m6L7k7j8N4n9K8NqO6n1
3777I7J1j0L3nn1j5K2L0lm8M2pj0K5jJ2J8m7L7j0k6kj6l1J5J7J2OJ8pJ9j9J1j9
3811I8L9m1J5k2j2k3J9qJ8k3J7j3JK4K3j3K8j0j8L0l8J9n8M1l4%K5kl7O6l4QL2
3844A17K4Lm7O3p8L8l8m4L3k1NM1j7oPPL2k4N4%l6j5j4Jpj8j4J7K3m0N0K8Krj1
3879A06O6o1J3l8K8j8%l8L6l2qk2K3O5m4N5MqPj3K7ql6J0n3k6K4J5j8J5jRK0K8
3913A27K3m7N8m4Qk2jj6mm1OrJ7k5O1K6J2Pl3R6q0Lj5l6L5qm6j6NoJ3J5J03k1
$$ plain form
3678 109 90 90 56 106 111 111 82 114 76 108 118 119 113 100 112 109 89 90 119 59 88 69 81 85 75 122 90 79 117 126 107 118 120 95 118
3713 118 131 97 69 95 45 79 123 78 78 95 76 65 84 135 84 115 86 130 100 52 107 128 116 93 85 73 127 78 84 100 117
3744 117 97 150 145 139 101 122 66 80 102 74 72 74 111 72 99 97 112 87 132 119 99 116 70 107 80 62 116 57 85 90 82 148 97
3777 97 108 98 131 126 75 60 82 112 109 61 103 96 86 111 110 122 140 93 130 120 94 92 76 45 60 77 89 95 113 106 125 106 117 98
3811 98 137 96 111 89 77 54 73 65 83 60 77 64 65 89 112 99 127 117 99 129 91 110 52 93 59 59 84 82 45 111 77 85 117
3844 117 141 144 97 160 82 120 82 38 71 50 55 96 79 73 80 87 119 95 149 149 113 98 84 85 78 60 46 63 86 46 96 124 126 117 106
3879 106 172 111 124 86 114 96 96 58 94 62 54 32 55 120 76 131 135 127 134 121 148 140 104 114 61 35 59 74 56 71 70 79 99 127
3913 127 150 103 161 117 125 103 102 86 82 41 47 38 55 30 91 117 129 136 103 199 119 122 107 71 106 98 52 36 41 35 48 63 166 145
3947A45k7J9J2qk5K2n0krK0o2Ok3N6J6L6J0j1j8J6J5o8L1lk8k9J7l4pN5pJ0K3
3980I8J1rK2opK4K0o8l7K3mk0kN6pm6P8%lqL2n4K0jJ8k0o8%pM0NJ9rM0Pj6J8k
4018A37j3j2j8o2J1M0jj1J5mlL0J7l5L4n6K7l9K3M9q3N1L2p2lO2%j6j9K0J0%k1
4051I0j1j3J6K6L2j3m4l1O5j2k1PJ6k6J0LpK5m3N2l8L0k7O7q5NRk6NJ4k4M1l3
4084E9K2kqN0Kqk8QJPl0K2J7n6O7j5lm5P3k7M3m7j2K0l6J1J3K3j6p5L8L7j9k1
4118F5j2K2M2l9K9M4o8RpM5m0pm6L2nPJ7L4m7O0k2Pomj3j9K4qk4OOOm2O7j7lJ7
4155A10mJK2l3J3k2j1j0K0j4l4K8O3m8OL0Rl7M5k2j3k4K3lmLj7K4j5K4J5Km7J8
4189I8JLM5m9k8J8J8Qm8jJN7J8n3L4m7L2j6l6k2R9l5l4P2k0NqK8m6qJjj5j8M3
$$ plain form
3947 145 118 137 149 141 116 138 88 86 77 97 35 41 18 74 90 126 136 125 107 123 138 70 101 98 70 41 58 24 17 72 65 75 98
3980 98 109 100 122 116 109 133 153 85 48 71 67 47 45 101 94 48 126 126 123 115 147 93 113 112 130 110 42 42 35 75 80 99 90 130 137 121 139 137
4018 137 124 112 94 32 43 83 82 71 86 82 79 109 126 91 125 69 96 57 80 129 46 97 129 57 54 116 116 100 81 101 111 111 90
4051 90 79 66 82 108 140 127 83 52 117 105 84 91 107 81 91 94 87 112 69 121 83 113 86 153 68 73 82 56 61 75 51 92 59
4084 59 81 79 71 121 123 115 87 95 96 103 73 95 112 56 123 108 105 60 133 106 149 102 90 110 74 85 98 121 105 30 68 105 86 65
4118 65 53 75 117 78 107 151 83 92 85 130 90 83 37 69 64 71 88 122 75 135 113 120 114 110 97 78 102 94 70 76 82 88 46 113 96 93 110
4155 110 106 107 129 96 109 87 76 66 86 72 38 66 129 81 87 117 126 89 134 112 99 75 98 95 91 94 77 101 86 110 125 127 80 98
4189 98 99 102 147 98 70 88 106 114 66 65 66 123 141 88 122 75 107 91 55 33 132 97 63 135 115 120 112 140 94 86 87 86 71 53 96
4224I6KJJ7L2o7mK3J9k3qqj8K8o0M4j6K7j8J7N6mj3M4n3K1m1j8L8m9k4mMK5j0
4258E6K0K6j8N4k6J3j3%l0Kj3j4mM3Nk9K3j1J5N9o4M8j6l5L1k9m0LM5m0KJ1j2
4291F2L1k2L4K3K5q0N3Qj1ml6j4OORj7K6j3k8P1l2N7l1j0j9J9k6J3Qk0k0M6m7
4324F7qJ0mK7j8J9k8N4No0M5kj1Qmn5NN4o8M5j1K8Lj5NL2j1L7k1l2L7l0L3k2o4
4359E0M9l6M6j5l6N3NJ8j9j3L4rk6qj9j0J5l7j5K5J1K3K3j7JK9K1jk0k2j3km7
4392C8pK1J1J5KmN6jK9k8k3J5j7K2o1l4k3P0m2L8j5J2L9L5nj5Ml4JJ9j8m1J5j0
4426F4k8Q1k5nlN1l0N9j8m0N3k1m8j0J4K8p6RQj9M0K5j4J7kM9Rj1m7Rl7oj7l8
4460B1N8l3M3K0n8O9n0M1J3J9on4J6K5m3K9m1jL6n2K1j4N8l7M9J1o2M8J6k0Pk8
$$ plain form
4224 96 98 99 116 148 81 77 100 119 96 88 80 62 90 30 74 58 85 67 84 140 136 123 167 114 135 94 76 114 65 41 37 41 66 56
4258 56 76 102 84 138 112 125 112 112 82 84 71 57 53 96 101 72 95 84 99 158 94 142 126 91 122 93 53 56 101 61 63 74 62
4291 62 93 71 105 128 153 73 126 134 123 119 83 69 75 81 90 73 99 86 58 129 97 154 123 113 94 113 87 100 108 88 68 114 67
4324 67 59 69 65 92 74 93 65 119 124 64 109 107 96 104 100 45 50 104 36 81 70 98 101 86 91 123 112 149 128 96 133 103 136 114 50
4359 50 99 63 109 94 58 111 116 134 115 102 136 127 101 93 74 64 79 42 27 52 63 86 109 92 93 122 143 142 122 100 87 85 38
4392 38 31 52 63 78 80 76 132 131 160 132 109 124 107 129 68 34 11 81 39 77 62 74 113 148 143 128 132 98 99 118 100 59 74 64
4426 64 36 117 92 87 84 135 105 164 146 106 159 138 90 80 94 122 46 55 63 44 84 109 95 112 110 159 168 157 110 119 82 76 59 21
4460 21 79 46 89 109 51 120 70 111 124 143 137 83 99 124 81 110 69 68 104 52 73 59 117 80 129 140 78 126 142 122 129 101
4492A01m7K4qpK5m2QK9J5N7l5PLk9OK8j7Kj5j8k8NL1k2J5J2J2oL2l0rJ1k5L1l3
4527H3LL1o4K6K1J1m4N9k6K4j9J8l1K0j1j5J8K3l2m0M2oj0J4Ql7K1l6L7O0l1j8
4559I9J7k7J3M7p7K2%k2k1L8j9K7jpJ9k8L4J7rj4KorJ6J1j9j9k7kJ0Qj7KO9j1
4594A16%k7M1k5lj2L6m1M8p9j%pM0m0M4Qk6PQ3o5L7k0J1j1l7L6J9n2pj3l5N7L2
4628A14%j6J9k4K3j4jj0LJ4k5l4L3kk6M2rj8J6N7l6L7l8k0kk5NK8j3m3M4J4j6
4661G7l1N8LjK9mk%krk5Pj7oj6J4j1K4J9j9k6O2Oj2K3k9jrk9j3rJ2j5%L9Pj5J4
4699I3O1l3Jm3N1j2Qn0oj3j1K1J1K3k2l1L4L0J0M1l8l9K0pJ3qk2K7mm0K0k3P1
4732A33k4j8OkL0k8j2PRl3j3L5rM1k7l4K5J3j8O3l4j9K1J4l9j3LJNj1K9J4nm5
$$ plain form
4492 101 54 78 70 63 88 46 54 83 98 155 120 127 130 101 107 135 118 120 105 87 59 64 95 73 88 100 112 106 138 108 99 110 85 116 83
4527 83 86 117 53 79 100 111 67 126 100 124 105 123 92 112 101 86 104 127 95 55 97 91 81 95 103 66 87 51 88 148 117 99
4559 99 116 89 102 149 72 94 94 72 51 89 70 97 96 89 108 80 114 131 122 108 110 104 95 111 122 103 84 57 55 65 73 56 58 127 116
4594 116 116 89 130 105 102 90 126 85 133 54 53 53 46 86 46 90 98 72 79 162 97 134 114 125 114 77 113 132 80 73 60 25 82 114
4628 114 114 98 117 93 116 102 101 91 94 108 83 49 82 80 54 96 87 69 85 142 106 143 105 85 83 58 63 91 78 35 79 93 77
4661 77 46 104 107 106 135 131 129 129 127 118 93 100 83 77 61 75 64 88 107 88 62 124 130 118 141 112 111 102 73 60 51 63 48 48 87 94 79 93
4699 93 154 121 122 79 130 118 126 76 70 57 46 67 78 101 79 48 82 112 122 163 125 86 106 99 112 104 82 109 105 65 85 62 133
4732 133 109 91 97 95 125 97 85 92 101 68 55 90 81 122 95 61 86 99 81 144 110 91 112 126 87 74 77 78 83 72 101 115 110 65
4766F5J2N0j4mK7%m0OK1Jj5rkk1M9l8J0mO1m3l0j7K5j5kJ6m5M5J8j7J3j2j2L0
4800A09K0k5j0j8OL6nk5mLK1J9rj2k3J6k9J9QNk6J9j3K9m9L2J5l3L9j5m6K4M0
4833A18KKj9K2k6L8m5L7J3k4j7porJ7mk4j8K2N2j6lL4m1M4m3J1on7O6k8nPK2K2
4868A31j6n1N7mLl4L9l7jj0K0pk8L2J6RnJ0K%Rm5J0Njj8m3K0K6km9P1K1j3n%M8
4905A60l1k1K7o4K7k6kj9J2%K4QKj1N1m2L1mo1Q0m2J8l6QOk9j2N6J0j2l1M0N1
4938A68q7O1k6J5pl9K5k5J4j3jj3K4K8kj4j0J5m4kM7rN7n2Ok6J2j1j3j4PJ4N2
4971A37m8qJ0QnJ5J0%k3K0J9o2K1QK4j5m3L3Jl8K9K5j0K6o7M6k9L3k4M7jn2L2
5004A19j4j1j7L1Pj3j7L6k3Pk1k3M2rNL3n6j7L5M2rn9P1l6K0l5KJ7k4L%k7K8M5
$$ plain form
4766 65 77 127 113 109 136 136 96 102 123 124 109 100 98 77 126 88 98 94 155 112 82 65 90 75 73 89 44 89 107 90 103 91 79 109
4800 109 129 104 94 76 82 118 113 88 84 87 108 127 118 106 83 99 70 89 97 102 76 95 82 111 62 94 109 76 115 100 54 78 118
4833 118 120 122 103 125 99 137 92 129 142 118 101 94 88 79 96 92 68 50 72 124 108 105 139 98 142 99 110 104 47 113 85 80 87 109 131
4868 131 115 64 121 117 120 86 125 88 87 77 97 90 62 94 110 119 114 124 126 126 135 90 100 105 104 86 43 63 89 87 38 109 130 117 112 112 160
4905 160 129 108 135 71 98 72 70 51 63 63 87 95 97 86 137 95 126 122 61 141 99 117 81 89 95 66 54 110 120 108 77 117 168
4938 168 81 142 116 131 124 85 110 85 99 86 85 72 96 124 122 108 98 113 69 67 114 105 162 110 116 90 102 91 78 64 71 85 137
4971 137 89 81 91 99 94 109 119 119 96 116 135 73 94 102 126 111 68 101 102 64 93 118 108 134 67 113 84 117 93 140 139 87 119
5004 119 105 94 77 108 115 102 85 121 98 105 84 61 103 94 99 132 76 59 94 136 127 68 139 103 123 88 90 107 83 86 86 59 87 132
5038A32l9K1nqJ4K0o0LJ4K6m1j1J1N9nl3L6k4k0K6j9On0K3k9J3M3J1lj0OJ4lj0
5072A08RQk2pJ3n5M7l3K4j4L8j8n1Q4JL1l8qj2j2Ll1pk4N1j2O1m0nJ0k0P4j1O
5106A48k7J8m1n4NmL0pllL1mK6j3PRM7m9rQo0J7l9J3NK3K9K3m8O1j1J6l8N1n8
5141I9J4ql3K7p6J7L5k1L4oQJ1j3N1k9L9o5M3n6MJj0J3J2k4L2K1q%kj3rK8jj7
5176I8qjk8J9J7jk7k0L3J9K2l2rK3%l7j%N4l1K9Njm9K4l0NoOK4Lj0K2lj7K6Nk0
5214A03k1J0M6m6k9N2l7N2l9J6J1l6K5J1k9L2k9PjKl2L4j3RNk7M6n0L2ORJ7m4
5247I2Km1N0l2LL1j2LK0m4K2K3n0K8J3n1L1Ql1O0m8K5roj6pL0QL1k1k2nJ6l4M9
5282A16oj8k5L1k8J8J9oK1k1Nk5l3O5j4j9j5KK1K6lj9J6K2Pn2J3k0MN3l7k7L9
$$ plain form
5038 132 93 114 109 101 115 135 75 78 92 118 77 66 77 136 131 98 134 110 90 116 97 103 53 76 47 60 103 114 111 101 107 121 118 108
5072 108 117 125 103 96 109 54 101 68 92 78 116 98 47 131 132 163 125 117 105 93 96 65 58 34 85 73 134 94 89 99 79 153 142 148
5106 148 121 139 98 44 49 45 75 68 65 62 93 89 115 102 109 118 165 116 107 115 55 72 33 46 51 74 103 126 78 139 128 144 106 157 99
5141 99 113 105 72 99 23 40 75 54 88 82 90 101 88 139 110 149 84 127 71 75 76 66 79 91 67 99 120 112 112 110 97 88 116 115 98
5176 98 90 89 61 80 97 96 69 49 82 101 123 91 82 105 105 68 67 67 121 90 119 124 123 74 98 68 73 67 73 97 100 90 112 109 92 118 123 103
5214 103 82 92 138 92 63 115 78 130 91 107 118 82 107 118 89 121 92 99 98 100 68 102 89 98 103 76 122 72 104 110 119 136 92
5247 92 94 53 103 71 74 105 93 96 116 72 94 117 67 95 108 57 88 96 65 125 77 102 93 87 71 64 94 102 133 112 90 85 101 67 116
5282 116 110 92 67 98 70 88 107 101 122 101 106 81 48 113 99 80 65 67 88 114 111 92 108 130 137 85 98 78 82 135 98 71 110
5315A10Ll3K1L7n7J2K9j4lK5Qp9M5k3JK5j5MkQJ1k3lL7k0Ln9M5l3J6L2j0M1k1
5349A18j1j6l5R0j4j6l1lK6j4rJ2Mj9K0k0N1k0j2k4L2J1l9%L6o0P6l5jlj4j0J7
5382H7J6Ln0L6rK3k5J8k3J9k2l2N6oJ9k2j2K1J1jl6%QJ8lprJ2LPm4K4L5l0J4P
5418A06j1j7O8p4K6j9K7m1J5kM8k8J5m1L7k2NkQMoL1l5J6l5k8N3k7j2L9j9K0L9
5451A38ro2O6l7RJ2n7M0mk1LRM7Jj5k1k6Q8n2m9Nk5M3M1m7J9j7M6m4M0l6j1M5
5484A19jk1k5PK0rk3L7m3L4oK0j0j4LK5l4L7j8K1l0n0M1M8mn5L6j8K6Oj9NpQj3
5519I3K7l5M6k1j4J1p6Q4J0Qk9j8Lj4J1NJ4mPl1PJ8J3l6j1J4MJ4J4l6j4J3j3R2
5553A56p7J1Pj8P2j6k3K7k2%n5K6n9Q2n8K6k3lK2N6j4k8J0J9j4Rk5K1j6n0J1K3
$$ plain form
5315 110 113 80 101 138 81 93 122 108 105 130 138 59 104 81 82 107 92 96 94 102 113 90 87 124 104 107 48 93 60 76 108 98 139 118
5349 118 107 91 56 146 132 116 85 82 108 94 85 97 101 82 102 82 133 113 101 77 109 120 81 81 117 57 133 98 97 94 80 70 87
5382 87 103 106 56 92 83 106 81 99 76 95 73 41 97 91 110 88 76 97 108 107 71 71 79 97 94 87 78 90 93 100 56 80 115 85 99 106
5418 106 95 78 146 72 98 79 106 65 80 78 126 98 113 72 109 87 92 90 98 102 96 127 92 108 73 45 98 71 59 98 79 99 138
5451 138 129 67 133 96 105 117 60 100 96 75 78 87 134 135 120 99 73 161 109 60 65 40 83 124 77 96 79 125 81 121 85 74 119
5484 119 118 97 72 79 99 90 67 104 61 95 89 109 99 85 88 113 79 116 98 119 89 39 80 128 124 69 105 87 113 119 100 105 98 106 93
5519 93 120 85 131 110 96 107 31 115 125 133 104 86 89 75 86 91 105 101 108 77 84 102 115 79 68 82 86 100 114 78 64 77 64 156
5553 156 79 90 97 79 151 135 112 139 117 117 62 88 29 111 53 79 56 53 75 131 117 89 99 118 104 113 88 109 93 43 54 77
5585G7J7j2Q3o7k2P4k6j1k5J3OKm0j8L0j2J7J1J8NL8m0M0j7Pn8rJ4Lm6M2ok8K6
5619H6j2M2j8%N1l7%l2L7k9k2pJ8K2l7j2M4MJ1J1j3K8k4Rj4n6M4kNj0Pj4LN4m3
5654I4K3m4M7m9Q5k5J6q7L8j0J6k2j4L5Mk5L8j8jRoNk8J5l0K0%JK0j3m2M1K1k4
5688I0j2j9L5j2L0j5MMj1K9l4O6o9K0j0K0l5K8l9K4K3mM5p9M2k4L9l4kNJ7l9m5
5721C8N4j8J9o1N4j4O3k9RNj9OJ3k5k8k1N0K8o0Oj0J8J2K2oj7J8mlqL6n4N4l1
5755I7JJl6O4lJ7m0J0j1K1m3K3%rj7k2N9l2J4L3j1L4o5L3%k9j1j4LJ7J8kJ1J1
5789A22m9N0mnj1M1j3n8L0lNj6K5m3j4L2j0K7n8N3J0lJ8m5L0j6J2n6J9K4m7L2
5821G9jN7j0j6J7kk8J1m0M1j5k4L8k2qJ3PNJ5qK2p2M3l1J4l5O1K1n0k5K9J5K2
$$ plain form
5585 77 94 82 165 98 76 150 124 113 88 101 107 109 69 51 81 69 86 97 115 120 158 118 158 141 148 90 81 95 98 52 94 88 60 86
5619 86 74 116 98 98 149 112 112 80 117 88 66 59 77 99 62 50 94 98 109 120 107 135 111 120 106 50 94 92 97 87 94 80 83 137 94
5654 94 117 73 120 71 156 131 147 60 98 88 104 82 68 103 107 82 120 102 101 110 104 109 81 96 66 86 86 87 107 94 52 93 114 90
5688 90 78 59 94 82 112 97 101 105 94 123 89 155 86 106 96 116 81 109 70 94 117 113 158 79 121 97 136 102 100 105 122 83 38
5721 38 92 74 93 32 86 72 135 106 115 120 101 107 120 95 67 46 96 124 64 70 60 78 90 112 106 89 107 103 100 92 128 74 128 97
5755 97 98 99 63 127 124 141 101 111 100 121 78 101 101 92 75 53 112 80 94 127 116 150 85 118 118 89 78 64 67 84 102 100 111 122
5789 122 73 123 119 114 103 144 131 73 103 100 105 89 114 71 57 89 79 106 48 101 111 108 126 81 111 95 107 51 70 94 47 79
5821 79 78 135 125 109 126 124 96 107 67 108 93 69 107 85 77 90 97 102 117 109 131 59 102 71 85 50 111 132 82 57 86 101 123
5854A23j0m8N6m2NN5l6j8P3p8K1K3Pk7ML1Kl5JJ8J9n2J4Pm7j4M6j4L1%oj4L1l3
5888I3L7o7jRK6oJ1j5nL6M1m9mj9L2j8%J6m3L7p0J3M3Ok8O2k5J1J7k2l0KJ6nj9
5923H2J9l4PM0Nnl2J5J2k2J5j8L6Mn1pJ2Rj1k0J4K2Ql4j2O7m2J0J8K7k5%J9k3
5957A05l0K7j3kk3M5k0k9L2J8pmL6o1K5j1pJ2m6P3m1jLkJK1qmrJ0M3l2%M0m4m5
5993E2Q0m5K5k4RJ6k2m7M5QJ0nj5J1lJ6kl5j9L3KKk5RJ0k0K5L7Ml0%k0JL8nl7
6029G9L0k2l8K0k7K2M7l2JM8j2K7l9j9j5JL0m9O5l5j0j1O1o0J5J6nK5Kj2K4m9
6061G8L8k0K4l4MK5rRl6J3LpJK7qJ8k6K8n9L8qk1kNJ4j1nKK4J5J2k5l8Q3n3k0
6097G9j0K5rn9M0jj7pK1K0M4J1j5k8L6k7lm1K9j8pM9l0kOK0l2j9P1k5Jj5K7lK9
$$ plain form
5854 123 113 65 121 79 84 139 103 85 158 80 101 124 131 104 108 139 141 106 107 125 144 92 106 113 66 52 98 84 115 115 109 95 126 93
5888 93 130 63 62 71 97 91 102 87 82 118 159 110 106 87 119 101 101 117 74 111 41 54 97 103 75 137 112 123 140 118 88 90 106 101 82
5923 82 101 67 74 114 119 114 82 97 109 87 102 84 120 124 73 66 78 87 76 56 70 92 100 66 54 121 79 89 107 134 109 109 128 105
5957 105 75 102 89 87 64 109 89 60 92 110 103 99 135 74 99 88 81 93 47 120 79 78 81 79 80 101 93 89 80 90 133 101 101 141 97 52
5993 52 132 87 112 88 97 113 91 44 89 97 107 102 87 98 95 111 109 74 55 88 90 92 67 76 86 66 91 128 132 102 102 82 83 121 116 79
6029 79 109 87 49 69 42 64 111 79 80 128 116 143 104 85 70 71 101 52 117 82 72 61 122 62 77 93 88 113 115 103 127 78
6061 78 116 96 120 86 90 115 106 115 79 92 95 88 89 116 108 126 100 128 69 107 99 78 76 81 95 84 79 81 105 120 132 107 69 152 99 79
6097 79 69 94 85 26 66 65 48 41 62 82 126 137 122 94 130 103 100 59 88 70 63 112 82 80 86 106 74 55 126 101 102 87 114 111 140
6132A40p8J0oK2K0k7j0mJ7K5K5k6j1K6J2k3Lj3j2%j3Qj3L3Jj6N4j01Q1k0Qk3m9
6165D0P2j9Qr%K1orM3n2J5%OkkRj4n8N7JJ6k0K6l6j0J2J0pj4K7j1L0m1L5m3M3
6201A18k3kJ2l3N8mk7J0K%J0m1kM3kKpk7%Qk5N5n6Pk1L6N5r6M4%J3oJ6km1L6o
6238A04J1m3L7k8k0L2Pnj4M2p1N4k1K3Nn3J2M0l5l1K2J4J0j8L4L1l3k4J0J2J0
6269A14k8kJ1qrJ9m1J3QK0J9KL2m3qK3Jk0l0K1n1M3Lk4nJ9J6N2m1J8k6J2L3o4
6303G9m7L7K0l3N8l6J4OK0j9M1J2m3k5K3l6K3m0M2Qk1L6l1nJ1j8%L3j2Kj8NK5
6336A11J1J1l2k0K1nl5L0j2k4M7j6J9j5m3K4J6oK3Pj1lL3l9J1l1O5l5K3l4l1K6
6368H6K7L7l8QPk1O0n6m8RJ3j3pM6k0PoK6j8J9j9MqJ0K0k7K6k4J0j7nK7n6J5L6
$$ plain form
6132 140 62 72 66 88 108 81 71 67 84 109 134 108 97 123 135 112 115 102 90 90 77 85 72 105 106 90 144 43 124 104 112 89 40
6165 40 112 93 101 92 92 113 107 98 141 89 104 104 110 108 106 115 101 43 100 101 117 97 123 87 77 89 99 92 78 105 94 124 83 118 75 118
6201 118 95 93 105 72 130 126 99 109 111 111 121 80 78 121 119 121 114 87 87 95 70 125 69 76 55 91 146 50 94 94 107 101 117 115 74 110 104
6238 104 115 72 109 81 61 93 100 95 81 123 52 106 85 108 113 60 72 112 77 46 68 82 92 74 108 139 106 82 92 104 114
6269 114 86 84 95 87 78 97 56 69 77 97 116 118 150 107 99 122 123 103 73 94 43 86 89 65 60 79 95 147 106 124 98 110 143 79
6303 79 32 69 89 56 114 78 92 98 118 99 140 152 109 84 107 71 94 54 96 104 83 119 88 83 94 76 76 109 97 99 81 86 111
6336 111 122 133 101 81 102 97 62 92 80 56 103 87 106 91 48 72 88 82 105 112 101 98 131 92 103 72 137 102 125 91 60 86
6368 86 113 150 112 120 127 106 166 110 62 71 84 71 64 110 90 97 91 117 99 118 99 103 95 105 125 98 124 100 110 93 88 115 59 74 110
6403A10pL6Rm0M1m5k3oj8rK1oJ7l5O5qnK5Jl1L6o4N0n2N5m6O3l2n2L4poK1k3R
6438G8K5j8jrL6Jk5l3O5l7J9j4M1m5L1l5O1m9j3J0K6j8m1M1j7K3j8Pl1M2o6L8
6470G4LM0l1j9j6M1J3J0l0LM6o1J3K3l9J2k5M0k5J1K9n9L8K0kL3p7L1l3L7jk4
6502G5N0m3oJ7pj5N2l5K4%L2n2J2l6M9m4j1K6l2L2K0j6NJ6Rol8J8N1o0j9J7J8
6535A03k8OLM6n1RJK8l8L0l6K9qJ5n5Q6o7lJ6Lm2L7j3lJ2k1O1J0n7K2Rm5L1J0
6569A00K1m7K9moj3K2k0J3L1k2k9N3m1L3j8qKkMj2kL1j7J6k4M4j2n7M4k0j7mK2
6603I0k9K2JK5oJ8l1J5j%mk2k3L2Qk1J3Rj5LkJ8l2J8k6O8k4L0ml0j1qqK8l7j2
6639E2M0Jj5K1%k2OL0N0m8k9L5l6J2j3K1l4NL3J1Ml9J5%K0%J7J0om1k0K4j9j7
$$ plain form
6403 110 103 139 148 108 149 104 81 75 57 48 69 63 80 45 110 102 97 122 123 92 128 64 114 62 117 71 134 102 50 84 77 71 92 69 78
6438 78 103 85 84 75 111 112 87 54 119 82 101 87 128 83 114 79 140 91 78 88 114 96 55 96 79 102 84 91 60 102 36 74
6470 74 77 117 86 67 51 92 105 115 85 88 134 73 86 109 70 82 57 97 72 83 112 53 91 111 109 142 65 96 63 100 99 75
6502 75 125 82 76 93 86 71 123 88 112 112 144 92 104 68 117 73 62 88 56 88 108 92 97 113 122 116 78 96 147 87 68 85 103
6535 103 75 81 84 130 79 88 89 117 79 109 73 102 94 109 54 140 73 70 86 89 47 84 71 68 80 59 120 130 73 95 104 59 90 100
6569 100 121 74 103 99 93 80 102 82 95 126 104 75 128 87 120 102 94 96 94 98 86 84 115 98 114 90 134 122 65 109 89 72 68 90
6603 90 61 83 84 109 103 121 90 105 104 104 100 78 55 87 95 74 87 96 81 84 82 100 68 86 60 128 104 134 130 100 89 81 73 101 64 52
6639 52 92 93 78 99 99 77 83 113 163 115 86 121 85 97 84 105 71 76 109 120 124 85 100 100 120 120 137 147 141 100 80 104 85 68
6673F8M1J4j6j5K9l0J0J0k7NJ7k9j2nN6o6N8k4j7rkL9jM0p8kO6k0k0J9J1ll5N4
6707A26l9M0k3J8j8k5Oj5J5%kj3J8j7KJ6J9j3K1l3L9l4l1K5J2j3pJ8Mk7M7k6r
6740H1K2RQl1j0PMlpL9n2L4K6m6K7j0K2Kk2qpJj1M5m8L3l4K8j9J8L6m7J3knK2
6776A15PQMn4K2j9L4k3o1M0jJ2RN1p2K1J9J0pl5M7k9J3mk3J6K0j7qk1K9K8k2K8
6810A37p0N2n0N3k2j0J7J5j4l3J6Pnk3J6L3n2K3K8j7pK9l3K6n3K7J0j3J1Nl0K3
6842I6j1M5j0ol6M8lm0Qj7M7l6j9M6l6QJ2J1OL3m9J1L3l4k3lrMJ3J5j6JOm2N2
6877A05J9j5L2j5k5K4jm5L3m7L4j2RL1k4rl1N2j5qK4l5K1J1JQo3K6pK7m0M8k6
6910H7QL6j6k1M8q5M4k0rK5kk6K2K2k7K1Kj2%K3n2J7N7m4L1m0ork3M8Lj4pMK5
$$ plain form
6673 68 109 123 107 92 121 91 101 111 84 89 106 77 65 60 116 50 108 84 67 58 56 95 94 134 56 54 120 100 80 99 110 107 72 126
6707 126 87 127 104 122 104 79 85 70 85 85 83 70 88 71 73 89 108 95 116 83 122 88 57 82 94 81 74 92 96 69 116 90 81
6740 81 103 112 120 89 79 86 90 87 80 119 67 101 127 81 108 98 120 122 100 92 85 86 75 120 72 105 71 99 80 98 134 87 100 98 93 115
6776 115 122 130 134 80 102 83 117 94 33 73 72 84 93 144 72 93 112 122 115 80 127 98 111 107 84 100 120 103 95 74 103 131 109 137
6810 137 67 119 69 122 100 90 107 122 108 75 91 98 93 70 86 119 67 90 118 101 94 123 90 116 63 90 100 87 98 103 73 96
6842 96 85 130 120 114 78 126 123 83 91 74 121 85 66 112 76 84 96 107 113 146 97 108 141 107 84 81 72 76 89 104 88 89 95 53 105
6877 105 124 109 141 126 101 125 124 79 112 65 99 87 96 127 103 94 63 115 100 92 116 81 102 113 114 122 59 85 78 105 65 113 87
6910 87 95 131 115 94 142 57 101 81 72 97 95 69 91 113 86 107 109 97 97 120 68 85 142 98 129 89 83 74 51 99 102 88 81 85 110
$$ [...]
8191E9
##END NTUPLES=NMR FID
##END=
