##TITLE=F19
##JCAMPDX= 6.0         $$ Bruker NMR JCAMP-DX V2.0
##DATA TYPE= NMR FID
##DATA CLASS= NTUPLES
##ORIGIN= UXNMR, Bruker Analytische Messtechnik GmbH
##OWNER= root
$$ XWIN-NMR		Version 3.5
$$ Mon Feb 22 10:43:27 2016 Russian Standard Time (UT+4h)  servis@DPX200
##.OBSERVE FREQUENCY= 188.287591
##.OBSERVE NUCLEUS= ^19F
##.DELAY= (6, 6)
##.ACQUISITION MODE= SIMULTANEOUS
##.ACQUISITION SCHEME= undefined
##.AVERAGES= 16
##.DIGITISER RES= 16
##SPECTROMETER/DATA SYSTEM= spect
##.PULSE SEQUENCE= zg
##.SOLVENT NAME= CDCl3
##.SHIFT REFERENCE= (INTERNAL, CDCl3, 0, 78.8432)
##AUDIT TRAIL= $$ (NUMBER, WHEN, WHO, WHERE, WHAT)
$$ ##TITLE= Audit trail, XWIN-NMR		Version 3.5
$$ ##JCAMPDX= 5.01
$$ ##ORIGIN= Bruker BioSpin GmbH
$$ ##OWNER= servis
$$ F:/spectra/data/servis-vadim/nmr/F19/1/audita.txt
$$ ##AUDIT TRAIL=  $$ (NUMBER, WHEN, WHO, WHERE, WHAT)
(   1,<2016-02-22 10:42:47.75 +0400>,<servis>,<DPX200>,
      <created by zg, POWCHK disabled, PULCHK disabled
       configuration hash MD5:
       00 E9 B6 7A A2 85 ED C7 34 08 36 98 17 FE 4E 26
       data hash MD5: 128K
       9D 76 DF 32 02 C3 4A BF 76 93 F5 29 DB 24 37 D6>)
$$ ##END=
$$ 
$$ hash MD5
$$ 8B F7 8F 35 1F 52 F4 33 65 B5 A5 69 68 11 BD 08
##$RELAX= 
##$RELAX= 
##$RELAX= 
##$RELAX= 
##$RELAX= 
##$RELAX= 
$$ Bruker specific parameters
$$ --------------------------
##$DU= <F:/spectra>
##$EXPNO= 1
##$NAME= <F19>
##$PROCNO= 1
##$TYPE= <nmr>
##$USER= <servis-vadim>
##$AMP= (0..31)
100 100 100 100 100 100 100 100 100 100 100 100 100 100 100 100 100 100 
100 100 100 100 100 100 100 100 100 100 100 100 100 100 
##$AQSEQ= 0
##$AQ_mod= 1
##$AUNM= <au_zg>
##$AUTOPOS= <>
##$BF1= 188.310338
##$BF2= 200.13
##$BF3= 200.13
##$BF4= 200.13
##$BF5= 200.13
##$BF6= 200.13
##$BF7= 200.13
##$BF8= 200.13
##$BYTORDA= 1
##$CFDGTYP= 0
##$CFRGTYP= 5
##$CHEMSTR= <none>
##$CNST= (0..31)
1 1 145 1 1 1 1 1 1 1 1 1 1 1 1 1 1 1 1 1 1 1 1 1 1 1 1 1 1 1 1 1 
##$CPDPRG= <>
##$CPDPRG1= <>
##$CPDPRG2= <>
##$CPDPRG3= <>
##$CPDPRG4= <mlev>
##$CPDPRG5= <mlev>
##$CPDPRG6= <mlev>
##$CPDPRG7= <mlev>
##$CPDPRG8= <mlev>
##$CPDPRGB= <>
##$CPDPRGT= <>
##$D= (0..31)
0 1 0 0 0 0 0 0 0 0.06 0 0 2e-05 0 0 0 0.0002 0 0 0 0 0 0 0 0 0 0 0 0 
0 0 0 
##$DATE= 1456123367
##$DBL= (0..7)
120 120 120 120 120 120 120 120 
##$DBP= (0..7)
150 150 150 150 150 150 150 150 
##$DBP07= 0
##$DBPNAM0= <>
##$DBPNAM1= <>
##$DBPNAM2= <>
##$DBPNAM3= <>
##$DBPNAM4= <>
##$DBPNAM5= <>
##$DBPNAM6= <>
##$DBPNAM7= <>
##$DBPOAL= (0..7)
0.5 0.5 0.5 0.5 0.5 0.5 0.5 0.5 
##$DBPOFFS= (0..7)
0 0 0 0 0 0 0 0 
##$DE= 6
##$DECBNUC= <off>
##$DECIM= 2
##$DECNUC= <off>
##$DECSTAT= 4
##$DIGMOD= 1
##$DIGTYP= 9
##$DL= (0..7)
120 120 120 120 120 120 120 120 
##$DP= (0..7)
150 150 150 150 150 150 150 150 
##$DP07= 0
##$DPNAME0= <>
##$DPNAME1= <>
##$DPNAME2= <>
##$DPNAME3= <>
##$DPNAME4= <>
##$DPNAME5= <>
##$DPNAME6= <>
##$DPNAME7= <>
##$DPOAL= (0..7)
0.5 0.5 0.5 0.5 0.5 0.5 0.5 0.5 
##$DPOFFS= (0..7)
0 0 0 0 0 0 0 0 
##$DQDMODE= 0
##$DR= 16
##$DS= 2
##$DSLIST= <SSSSSSSSSSSSSSS>
$$ [...]
##$SUBNAM0= <"">
##$SUBNAM1= <"">
##$SUBNAM2= <"">
##$SUBNAM3= <"">
##$SUBNAM4= <"">
##$SUBNAM5= <"">
##$SUBNAM6= <"">
##$SUBNAM7= <"">
##$SUBNAM8= <"">
##$SUBNAM9= <"">
##$SW= 399.325146843118
##$SWIBOX= (0..15)
0 1 0 0 0 0 0 0 0 0 0 0 0 0 0 0 
##$SW_h= 75187.969924812
##$TD= 131072
##$TD0= 1
##$TE= 0
##$TE2= 300
##$TE3= 300
##$TEG= 300
##$TL= (0..7)
120 120 120 120 120 120 120 120 
##$TP= (0..7)
150 150 150 150 150 150 150 150 
##$TP07= 0
##$TPNAME0= <>
##$TPNAME1= <>
##$TPNAME2= <>
##$TPNAME3= <>
##$TPNAME4= <>
##$TPNAME5= <>
##$TPNAME6= <>
##$TPNAME7= <>
##$TPOAL= (0..7)
0.5 0.5 0.5 0.5 0.5 0.5 0.5 0.5 
##$TPOFFS= (0..7)
0 0 0 0 0 0 0 0 
##$TUNHIN= 0
##$TUNHOUT= 0
##$TUNXOUT= 0
##$USERA1= <user>
##$USERA2= <user>
##$USERA3= <user>
##$USERA4= <user>
##$USERA5= <user>
##$V9= 5
##$VALIST= <valist>
##$VCLIST= <CCCCCCCCCCCCCCC>
##$VD= 0
##$VDLIST= <DDDDDDDDDDDDDDD>
##$VPLIST= <PPPPPPPPPPPPPPP>
##$VTLIST= <TTTTTTTTTTTTTTT>
##$WBST= 1024
##$WBSW= 4
##$XGAIN= (0..3)
0 0 0 0 
##$XL= 0
##$YL= 0
##$YMAX_a= 192246
##$YMIN_a= -131175
##$ZGOPTNS= <>
##$ZL1= 120
##$ZL2= 120
##$ZL3= 120
##$ZL4= 120
##$ABSF1= 1000
##$ABSF2= -1000
##$ABSG= 5
##$ABSL= 3
##$ALPHA= 0
##$AQORDER= 0
##$ASSFAC= 0
##$ASSFACI= 0
##$ASSFACX= 0
##$ASSWID= 0
##$AUNMP= <proc_1dapks>
##$AZFE= 0.1
##$AZFW= 5
##$BCFW= 1
##$BC_mod= 2
##$BYTORDP= 0
##$COROFFS= 0
##$CY= 12.5
##$DATMOD= 1
##$DC= 2
##$DFILT= <>
##$DTYPP= 0
##$F1P= 0
##$F2P= -199.999997019768
##$FCOR= 0.5
##$FTSIZE= 0
##$FT_mod= 4
##$GAMMA= 1
##$GB= 0.05
##$INTBC= 1
##$INTSCL= 1
##$ISEN= 128
##$LB= 0.3
##$LEV0= 0
##$LPBIN= 0
##$MAXI= 10000
##$MC2= 0
##$MEAN= 0
##$ME_mod= 0
##$MI= 0
##$NCOEF= 0
##$NC_proc= 0
##$NLEV= 6
##$NOISF1= -64
##$NOISF2= -76
##$NSP= 1
##$NTH_PI= 0
##$NZP= 0
##$OFFSET= 78.84318
##$PC= 1
##$PHC0= 849.9305
##$PHC1= 26.2648
##$PH_mod= 0
##$PKNL= yes
##$PPARMOD= 0
##$PSCAL= 0
##$PSIGN= 0
##$REVERSE= no
##$SF= 188.310338
##$SI= 131072
##$SIGF1= -61
##$SIGF2= -64
##$SINO= 16
##$SIOLD= 131072
##$SREGLST= <19F.C6D6>
##$SSB= 5
##$STSI= 0
##$STSR= 0
##$SW_p= 75187.9699248119
##$SYMM= 0
##$S_DEV= 0
##$TDeff= 0
##$TDoff= 0
##$TI= <>
##$TILT= no
##$TM1= 0.2
##$TM2= 0.7
##$TOPLEV= 0
##$USERP1= <user>
##$USERP2= <user>
##$USERP3= <user>
##$USERP4= <user>
##$USERP5= <user>
##$WDW= 1
##$XDIM= 8192
##$YMAX_p= 0
##$YMIN_p= 0
$$ End of Bruker specific parameters
$$ ---------------------------------
##NTUPLES= NMR FID
##VAR_NAME=  TIME,          FID/REAL,        FID/IMAG
##SYMBOL=    X,             R,               I
##VAR_TYPE=  INDEPENDENT,   DEPENDENT,       DEPENDENT
##VAR_FORM=  AFFN,          ASDF,            ASDF
##VAR_DIM=   65536,         65536,           65536
##UNITS=     SECONDS,       ARBITRARY UNITS, ARBITRARY UNITS
##FACTOR=    1.33e-05,      1,               1
##FIRST=     0,             0,               0
##LAST=      0.8716155,     0,               0
##MIN=       0,             -131175,         0
##MAX=       0.8716155,     192246,          0
$$ Real data points
##PAGE= N=1
##DATA TABLE= (X++(R..R)), XYDATA
$$ [...]
55820 385 106 61 164 557 291 -313 -785 45 807 -621 -534 -156 -626 -387 6 -419 612 -1591 -140
55839 -140 -374 129 -438 -840 497 -395 240 67 269 974 546 392 305 -870 -160 1118 366 1147 -514
55858 -514 -115 1090 -8 -2 -474 395 -3 -1036 -625 -3 270 625 -548 835 7 -66 170 -898 732
55877 732 511 251 467 -454 103 181 751 63 315 -181 -305 -124 -484 -986 -428 259 -207 978 582 -602
55897 -602 -213 478 -248 -197 119 -140 -61 1315 473 -350 -251 -307 -117 -234 -730 -472 98 492 1184 -610
55917 -610 632 -185 -88 -515 942 332 -39 0 -97 827 551 228 467 741 478 -264 -846 -1 43 226
55937 226 -217 -246 662 363 775 520 -463 876 -298 84 -1094 95 -484 -248 12 6 -32 125 361 142
55957 142 -211 469 699 -173 -106 331 -14 612 -59 240 993 -162 1186 -271 -110 -542 1046 198 70
55976 70 168 -810 -96 -308 25 323 476 1367 -90 -422 -394 -867 -350 -451 -917 601 658 -312 -341 361 -416
55997 -416 -976 53 599 311 -777 273 343 -910 -564 -66 19 873 19 309 -68 -424 1449 72
56015 72 -196 605 382 241 -414 303 -540 -432 1166 437 -748 503 1008 196 210 527 136 -287 62
56034 62 485 558 372 179 -409 -559 544 -404 -117 -531 132 332 879 -165 -324 -746 -125 -532 620
56053 620 -344 -124 -629 27 -414 -323 550 557 -99 -553 -233 -408 -613 -371 677 -851 516 165 -525 -491
56073 -491 -40 616 1022 -249 -410 379 -732 -93 1257 -415 190 -426 920 109 -364 350 -27 -966
56091 -966 220 -65 798 -44 439 978 79 -96 -45 883 -854 447 -446 891 1210 334 -344 313 -140
56110 -140 584 1237 -794 -114 -412 1211 -174 -263 -401 -430 -94 -114 -1231 1242 -553 -301 316 -462 657
56129 657 -390 -164 93 -273 412 274 -120 605 -71 113 -636 226 182 405 157 1144 532 133 1091 -610
56149 -610 -259 388 -615 799 -100 -78 162 -76 376 -233 148 -696 -22 -410 -110 -37 -108 -454 -771 491
56169 491 -789 541 1200 683 -559 -110 480 280 84 -287 775 449 981 135 -205 35 -165 -497
56187 -497 -320 -92 346 772 -948 -392 426 321 165 -653 625 119 585 139 996 109 -424 581 -530
56206 -530 -310 -211 -1010 -96 -865 42 15 59 513 -569 -1023 65 -400 -356 542 -1175 554 -660 -301
56225 -301 -109 -353 -374 274 58 -708 92 -318 -638 398 186 -377 304 61 690 -311 -242 -388 726
56244 726 310 407 -258 1016 -395 -143 -168 390 -217 325 -527 662 316 -284 51 -1083 125 -676 -471
56263 -471 766 975 851 -27 156 -241 340 -21 -255 102 -1349 -695 -21 -301 3 615 -243 -15 -780
56282 -780 -684 -1147 163 -138 245 -44 -377 -104 -687 378 -339 18 973 -879 412 91 -1471 -263
56300 -263 1073 -489 641 407 295 152 -58 208 273 -255 35 170 -340 247 271 655 -456 -762 133
56319 133 -117 82 -183 6 -811 -65 -216 -581 -737 -237 -1132 -181 527 -94 -464 441 17 -46 -223 -616
56339 -616 399 51 -308 239 31 188 -456 -545 -228 -9 79 -267 45 376 263 -769 685 833 229
56358 229 -368 -146 171 718 -509 -925 43 -117 69 -234 -142 21 -236 79 -855 -390 11 -209 -702 -115
56378 -115 -437 76 -242 945 -998 1084 -205 -100 -495 -591 681 851 382 -959 657 -52 -737 -524
56396 -524 274 315 692 -230 -1599 777 -560 -379 -626 -465 -625 -548 -143 108 276 -507 -232 -72 -958
56415 -958 312 -196 309 -125 173 181 -230 -457 503 337 505 372 -461 -64 -422 739 -293 -52 -1274
56434 -1274 -78 444 -85 -1191 136 -5 211 -242 -624 -127 -468 -67 -237 -109 -253 506 -102 289
56452 289 436 -371 -329 -31 -1640 -345 221 -103 245 252 -772 57 327 1013 261 -709 204 -408 -631 304
56472 304 -282 -357 500 -462 -689 522 538 73 463 -509 293 542 -98 254 451 288 868 -395 -260 -619
56492 -619 325 469 -162 363 646 465 425 -79 -89 -393 -651 -260 -15 137 -119 203 -426 297 -474 376
56512 376 521 -455 200 -420 -513 380 130 571 -268 521 1028 765 262 199 1203 -3 120 -599 967
56531 967 684 407 24 -222 -350 278 103 -1 -421 661 -102 256 -158 497 265 460 1277 462 11
56550 11 -104 227 -790 -8 -377 677 -493 -368 293 677 124 147 687 284 -156 84 285 835 -18
56569 -18 358 -39 -414 -140 304 596 -460 -223 -596 -353 504 338 -487 665 -328 -292 -498 -314 989
56588 989 584 -679 337 331 -57 -368 -759 -343 352 -258 -265 400 163 -885 -220 148 -140 -852 391 13
56608 13 -295 -53 251 -145 593 479 880 412 25 -640 609 -257 -570 -769 973 307 -688 -582 261
56627 261 125 -480 687 389 276 -433 603 -408 274 -64 -482 178 593 -580 -60 -804 -743 123 -200
56646 -200 -694 -308 222 -228 669 705 -389 155 -221 -230 964 -778 -614 454 552 225 604 343 -636 -1038
56666 -1038 587 36 176 291 -630 -334 9 319 201 -709 -531 179 -157 -180 -212 -214 678 -1277 109 285
56686 285 -30 339 -42 -529 84 13 125 -198 210 716 138 -63 -610 -7 -356 -124 -29 399 -335 489
56706 489 -32 -352 669 530 590 407 -828 170 643 760 743 -218 -76 -186 154 1448 593 0 -184
56725 -184 -152 270 360 793 -728 259 -221 -609 406 85 56 531 -227 567 379 628 695 -55 -592 -211
56745 -211 -499 -285 -434 168 133 -900 96 -48 -493 -577 -180 -30 318 -510 421 -588 -85 191 -916
56764 -916 449 68 865 -286 -760 -350 625 -83 211 -882 -631 664 331 426 -115 -190 209 -837 -168
56783 -168 -915 -172 165 -426 -114 -161 -337 -441 215 -32 -320 -1131 -22 -229 -713 193 331 732 -661
56802 -661 -646 1350 -138 -416 492 94 -415 -865 19 -1105 -275 302 -1191 -695 88 1414 -662 158
56820 158 -404 596 925 -98 -292 -380 -268 -269 -155 -1074 307 708 999 390 -411 -19 -155 -166 -286 135
56840 135 400 16 -230 -425 -763 -237 923 -423 -3 -250 -490 200 -775 -112 -376 -284 -333 -584 -309 542
56860 542 995 -859 409 -35 1215 -456 515 430 986 279 463 -597 -105 560 -646 671 393 320
56878 320 -1011 1336 580 66 -95 -185 -405 505 -303 -506 969 -634 -381 -297 -451 204 835 -631 -96
56897 -96 -367 1046 -417 13 417 -611 -526 90 -309 -641 1015 869 16 -130 -799 -1590 367 -278 -381
56916 -381 -354 -195 -315 627 -1225 -108 -63 -936 182 -602 -688 16 -116 -96 -921 249 -481 520 -135
56935 -135 -697 75 13 297 -1156 -25 -272 514 -1135 257 31 -543 -280 -422 13 -279 83 -616 -348
56954 -348 573 -820 543 -750 422 -394 -954 223 47 -868 292 -34 -1082 114 312 62 188
56971 188 273 -647 891 -381 -75 -167 -458 -537 -263 671 275 300 358 62 -240 -204 -634 506 580 122 338
56992 338 703 -838 173 663 593 151 -56 317 -588 604 -710 -755 -610 469 -547 335 0 506
57010 506 -377 371 269 473 -480 6 -80 -530 -425 73 -61 -3 1380 -234 -79 -327 303 -30 -386 -502
57030 -502 -893 -610 542 -241 29 -269 -394 66 -59 114 564 268 -929 160 -491 -1442 831 336
57048 336 17 352 -658 -849 -404 -350 -212 -156 -871 326 1217 -108 -273 -165 80 848 431 -389 -410 -285
57068 -285 -83 18 329 356 -916 -855 -204 -60 146 374 395 -72 -606 280 1581 1319 -613 494 15
57087 15 -115 -682 200 -404 59 84 -178 183 -475 23 -46 -577 107 182 -91 414 -319 878 37 5 48
57108 48 607 103 -216 259 105 -531 204 -56 -1128 -1199 1178 346 -629 -134 -757 936 605 -84 742
57127 742 592 -833 585 -661 803 1184 -150 543 -52 205 522 477 -258 -542 720 -598 348 -343
57145 -343 -425 337 -200 -145 510 -312 200 -507 -148 1264 -652 175 -152 143 -456 -179 628 372 -857
57164 -857 -403 -132 -38 -215 -83 405 569 -156 -106 481 -30 -477 771 969 -343 -824 1240 -149 -109
57183 -109 209 134 -309 -270 63 44 -877 111 -13 655 -70 -44 395 -302 665 105 -81 -488 260 -677 -28
57204 -28 -354 128 -415 -49 -96 382 -61 -644 -151 -235 173 -205 807 411 -325 -98 401 332 -8 201 -918
57225 -918 -510 507 -612 -270 1027 93 -318 -112 -815 -248 37 -963 64 889 845 -314 81 -787
57243 -787 96 304 629 -82 -702 -18 -460 86 145 1023 -1 1075 185 342 -442 -264 437 -159 956
57262 956 240 -574 -184 873 135 -222 669 -214 420 445 241 -259 256 -540 37 -51 -392 20 -244 76
57282 76 -24 229 189 276 -543 64 800 -3 -930 286 320 -269 43 -285 72 394 161 -173 -95 -292 183
57303 183 -919 1127 -548 -724 122 183 -271 -340 -206 119 656 302 -497 398 -41 -791 969 -382 -151
57322 -151 -702 744 1071 -81 304 205 36 536 -19 -23 -296 168 -193 583 475 325 99 -325 120 -1118
57342 -1118 -204 -140 67 129 861 704 150 113 -737 -470 -139 -224 170 259 96 -1454 294 474 346 969
57362 969 -339 -200 -382 -586 204 -145 784 -60 0 -67 -49 -248 472 261 36 451 288 107 794 193
57382 193 139 -399 -754 216 -195 -281 364 -150 -53 -188 -300 730 -558 509 366 -305 -201 715 -274 1138
57402 1138 -244 155 -19 1077 -234 -429 391 -617 328 -264 -45 -485 -85 -732 -195 -2 -714 -135
57420 -135 -699 -45 -265 -525 488 -771 54 417 701 -358 213 634 459 -354 362 -66 -106 248 1049
57439 1049 -34 -346 -593 -184 280 496 -233 759 599 373 -395 -405 -285 -74 703 -391 502 1203 566
57458 566 707 -624 345 563 -369 126 127 374 571 153 582 330 -357 -332 -191 466 980 76 -249 -785
57478 -785 290 -160 -286 -378 -17 585 77 695 -1003 -199 45 326 372 237 -1051 142 -726 628 407
57497 407 458 212 1043 896 -369 686 -8 873 495 605 135 -408 407 -695 -343 54 -294 387 -415
57516 -415 290 557 29 -109 181 -262 441 297 232 178 -1118 -179 90 -695 176 -392 -33 507 -191 277
57536 277 -283 -97 -598 -1 589 -70 -277 536 -476 45 -370 656 272 -586 -294 378 -108 -678 211
57555 211 -158 -468 -155 -940 271 348 490 -333 -293 683 370 417 750 -246 -10 569 357 -469 -849 146
57575 146 1078 -591 196 508 -244 676 -90 87 148 -441 -153 -148 -147 -117 -86 1797 -414 163 -101 73 -572
57596 -572 684 653 -475 825 150 209 -291 97 769 -156 609 178 -961 669 55 176 998 968 -533
57615 -533 -154 586 1333 96 -419 -117 -189 1060 -1273 -627 -756 -551 -41 -19 1017 -67 -139 -65 276
57634 276 -366 -838 -562 -292 -606 487 101 -613 -509 70 370 351 443 -356 635 1178 -553 -300 -703 768
57654 768 420 -401 -327 -399 1336 881 -215 -294 499 1121 445 126 576 357 -319 -432 -914 -5 -58 -6 -521
57675 -521 1105 34 584 -7 -119 -475 -113 -167 -795 503 1195 -341 300 -55 436 373 -413 -1381 -197
57694 -197 789 -25 -7 -884 321 -54 -476 172 493 -120 121 -152 -311 380 1392 -493 -92 -947 -795
57713 -795 841 646 418 -975 183 1038 108 191 -709 -159 -408 336 611 204 -1053 -177 343 454 99
57732 99 393 53 975 238 323 -478 -142 -621 -784 -152 -328 -368 -692 178 38 -205 -162 734 -738 -1041 -238
57753 -238 -150 128 -35 -515 46 -28 -675 -595 -378 254 99 -961 196 -110 306 25 -999 -496 684
57772 684 235 -215 -478 -144 639 -849 -303 315 -337 716 -560 1383 -25 47 331 841 1197 34
57790 34 298 -41 980 862 83 -385 331 -30 105 -785 430 -557 448 -87 -360 -273 -522 285 213 -531
57810 -531 315 -155 1253 345 -301 -110 -150 123 320 421 717 70 -203 1045 -767 -197 -245 -561 744
57829 744 230 -292 769 -654 -605 -142 138 204 -1723 240 170 1126 -8 -180 -357 -101 -377 -748 377
57848 377 -106 -492 -435 395 303 -141 145 -272 375 -244 -144 558 -123 -390 -354 -67 410 212 146 869 -344
57869 -344 -318 367 -556 -607 127 -34 1045 496 750 -383 -1143 1053 -789 -522 -437 -69 -954 -715 1051
57888 1051 -837 -1309 22 -92 -156 -102 -766 455 128 -224 316 -9 -713 805 -587 395 -496 -912
57906 -912 -541 392 806 -502 644 746 -498 62 707 467 -75 -61 -412 248 -208 485 -808 -706 -120
57925 -120 993 895 71 275 -272 -709 -593 357 452 -297 235 -93 -882 283 -513 103 -778 857 479
57944 479 555 365 750 103 -506 300 -441 465 1226 -70 105 -83 -1288 -175 272 -19 445 60 63 333
57964 333 -332 548 -97 -1104 -748 251 -96 -35 -738 -249 -1070 364 -359 134 -153 78 540 -154 -213 -75
57984 -75 -128 -1036 -61 -500 -662 582 -215 -896 -558 -208 23 -270 -162 -518 45 -456 -49 -570 -181 -1058
58004 -1058 -647 -43 -525 -234 161 -244 -62 -396 -114 301 -503 86 -678 -627 1050 -97 -53 932 -195
58023 -195 112 25 258 353 -86 -820 -1176 518 -230 260 -383 587 -490 -1091 743 -782 517 -323 143
58042 143 20 1044 -662 64 691 -321 -600 850 -1332 -398 -302 20 565 23 161 -714 471 546
58060 546 122 75 -208 328 -311 -801 696 830 734 -350 -19 -299 -418 1495 1281 215 -627 -531 -457 -176
58080 -176 -202 -1097 413 613 259 -231 335 -588 617 1408 530 138 -100 48 442 112 515 281 -823
58099 -823 -114 -60 754 667 872 134 329 305 133 132 315 -110 563 649 -213 319 -605 -176 491 -275 -478 434
58121 434 546 59 -380 -609 -1038 483 269 -334 568 -477 216 567 39 -708 802 -533 1009 1259
58139 1259 1087 602 78 7 590 -588 -36 592 -92 21 430 -503 -51 301 -261 79 192 512 -381
58158 -381 -570 525 193 -172 -1000 187 -139 -239 -355 -320 -183 9 -33 -379 -285 432 -398 516 -284 -405
58178 -405 -73 -59 165 -510 -261 -334 -549 -758 -303 -827 -258 -401 -392 -999 600 -980 149 -295 -55 -427
58198 -427 109 1910 268 342 -296 348 -416 -404 -357 151 -811 -37 390 -103 358 -242 -799 13 523 -97
58218 -97 -394 257 505 548 -747 834 -486 -143 -362 -78 250 -103 135 -536 -25 339 -487 57 299
58237 299 304 222 -67 -467 644 230 89 -216 -336 824 272 327 -449 -220 -489 -67 501 -697 -200 -31
58257 -31 712 -44 -532 29 490 31 -299 652 -418 -333 -749 124 -119 -460 -33 359 485 56 618 102
58277 102 162 -429 -593 612 279 495 398 472 -579 -92 433 -183 204 344 -304 -383 -220 609 -82 -23 126
58298 126 189 709 87 -848 321 -18 -211 -473 897 945 -703 -402 383 148 233 -862 493 770 -500
58317 -500 148 -935 334 -470 774 314 27 70 -631 -108 -68 544 188 1 836 551 578 244 179 219
58337 219 -26 -939 397 -24 -145 51 -157 -54 513 -284 1127 187 387 557 229 -614 -273 -434 387
58356 387 407 -81 10 -1018 -957 264 -516 751 -293 -38 424 -742 402 650 60 -947 731 479
58374 479 258 816 950 -759 -414 -874 -655 86 -133 576 -28 -12 117 -737 488 484 -550 596 763
58393 763 347 887 -175 -361 -721 -21 858 -292 118 -145 -400 222 146 183 -467 712 851 -336 -149
58412 -149 566 303 -943 401 -304 -2 732 -170 -302 142 481 -251 402 -450 540 375 101 -9 277
58431 277 115 -899 -443 -353 -404 -659 657 297 404 424 1252 398 -273 -518 386 408 260 -1219 154 30
58451 30 273 301 23 -203 357 -654 -151 481 -232 -350 -485 -833 -330 -332 -732 -634 1273 299 -89 909 2
58472 2 33 156 -260 -466 245 666 -64 -434 229 -22 -914 -516 119 -536 -988 169 184 851 -258 438
58492 438 -845 -28 -676 785 388 297 -513 273 -337 567 91 261 180 -78 -121 -213 -450 75 -583 -240
58512 -240 219 33 -124 -676 234 26 416 633 171 -111 234 -37 -186 -692 301 163 886 -698 801
58531 801 -122 -386 690 210 -478 -342 630 -154 0 -509 5 999 129 -30 386 -384 336 379 -948
58550 -948 157 -127 407 308 -521 -298 701 188 -343 -216 492 -32 -409 178 -28 -1395 -198 71 -354
58569 -354 776 128 -948 -414 -251 474 -511 628 -308 -412 231 444 1006 -411 249 -76 687 -97
58587 -97 104 84 97 483 101 -107 62 -500 511 -193 19 -56 77 761 -202 106 1509 529 133 -417
58607 -417 -742 -258 -966 -1073 600 -622 268 -806 -190 -338 192 84 337 58 -174 299 -1166 617
58625 617 172 515 380 86 -57 643 -148 -227 174 412 -132 678 -351 920 -798 71 -13 -94 810 -263
58645 -263 1130 -894 -152 -182 -395 -124 523 -933 -137 -267 260 679 401 430 -150 1388 273 -35 -717
58664 -717 1257 -493 -452 445 -509 1132 283 355 -511 -588 7 -140 -350 -531 -203 964 -648 -857 122
58683 122 -878 -1034 -940 -193 -83 807 518 91 -189 -1001 -201 758 219 -617 -141 40 224 220 -40 -535
58703 -535 -409 -197 -948 77 -331 1024 199 282 -481 310 636 220 347 299 419 -848 546 336 559
58722 559 -275 -4 -1 774 323 319 108 -12 154 -632 -237 -70 -640 351 -109 -950 47 -20 950 -295 -371
58743 -371 -657 -132 -733 304 -590 -770 41 -386 -598 -4 485 287 -707 477 678 -693 -528 -698 -348
58762 -348 558 -674 226 -459 111 125 -521 214 562 790 -84 87 762 -780 -843 569 -421 -500 529
58781 529 -659 -64 -125 -118 -1045 -178 380 518 84 20 -73 -86 -1078 209 123 -693 -211 180 -303 125 -800
58802 -800 -172 302 -210 -235 6 -335 -820 -411 -858 -255 21 -34 -140 -63 253 356 -395 453 -218 400 -346
58823 -346 -354 329 165 514 -922 -420 389 -435 -10 -56 -721 -193 -779 -413 -1073 -511 -517 126 -47 -304 91
58844 91 -162 -107 -113 -1200 432 550 -104 -1026 -146 94 -399 19 558 235 -409 -198 424 -27 656 575 -494
58865 -494 -461 208 203 -1207 512 -458 213 499 54 589 184 912 -98 581 -521 -690 -484 952 -3
58884 -3 373 -384 -2 -385 670 594 -22 256 117 -50 808 -589 183 569 248 -933 -957 241 -501 145
58904 145 618 166 -84 74 -99 210 -345 86 -26 -419 -452 -133 245 679 -381 141 762 461 1030 -596
58924 -596 -264 563 -268 378 691 -20 273 84 -440 -35 -430 222 240 420 146 -196 -366 59 218 -2
58944 -2 -96 31 -89 -20 -61 -227 255 294 -355 -751 -232 -344 -178 -761 -528 924 -92 193 -444 -357 -163
58965 -163 -37 343 -119 861 3 925 -148 752 306 406 -100 -658 -335 -340 -860 -337 713 -120 -37 -327
58985 -327 184 -429 -90 -166 409 -92 1006 650 -741 593 -546 215 332 -636 -573 376 976 -511 -617
59004 -617 -795 1215 -249 -107 452 285 -240 37 225 701 391 159 449 236 330 -32 122 -524 -207
59023 -207 -81 708 306 195 -420 -44 516 112 630 -409 859 -17 -75 -89 -166 102 376 353 -387 -458 -136
59044 -136 -1353 -681 -57 261 479 274 -267 75 -284 -155 -506 713 660 1060 -611 -112 -404 -248 -600
59063 -600 357 -267 -472 -42 290 -233 181 889 48 91 109 253 -366 -170 -974 -652 129 201 -936 303
59083 303 155 -452 -480 363 357 -1082 -163 -273 207 -250 -144 118 -882 334 1008 3 -523 -1101 374
59102 374 126 28 -1 266 648 -496 379 -402 318 171 -315 -545 -56 -903 -323 -55 220 -269 -95 31
59122 31 575 349 -213 -736 94 212 -139 -404 -1148 -387 -399 -214 1123 -155 -716 58 206 -506 446 212
59142 212 637 232 -151 -1400 928 69 784 332 -990 -184 -259 -78 -70 -484 429 90 -678 -43 -952 -27
59162 -27 -747 470 -426 -477 842 -367 265 577 22 573 -809 679 -766 -234 371 -595 -293 559
59180 559 -311 99 -455 -191 -17 357 8 -1398 -296 -471 490 254 -219 -77 -177 224 319 494 -1521
59199 -1521 561 -286 -86 321 -388 986 28 868 287 -591 386 -491 -842 871 -571 -632 728 937
59217 937 589 -265 -1003 -424 137 -568 -68 -55 -137 837 -1002 -461 25 -777 781 27 -377 -464 -595 -161
59237 -161 -13 -226 706 405 483 -1029 -834 304 -544 -74 591 159 281 -552 -93 213 -27 281 163
59256 163 -310 244 983 570 -173 474 337 884 275 -497 753 106 563 -12 51 664 -114 186 931 1179
59276 1179 23 148 205 234 -336 87 32 379 101 -50 -1047 -85 232 214 694 -143 326 -44 955 -50
59296 -50 398 -175 -224 -138 420 -322 -334 1145 352 -104 -1234 -84 539 -952 440 -241 -6 810 -522
59315 -522 194 133 256 341 -646 -101 907 -237 388 396 -78 -7 -884 1051 -139 -141 282 -67 637 270 -420
59336 -420 125 19 160 140 -759 338 -213 -1498 419 395 -639 148 44 -34 129 593 8 -219 90
59355 90 436 -662 77 183 413 14 -174 -8 -101 22 -762 -385 853 -184 404 546 -489 123 257
59374 257 469 -308 57 -260 -390 967 173 -210 1984 67 -498 407 -151 -69 582 -131 26 693 -1193
59393 -1193 478 -713 -273 -1056 -947 -291 38 -263 -278 1124 -248 -30 -745 254 -720 29 688 211
59411 211 193 58 570 361 -524 -699 506 34 117 -195 -209 -28 63 307 -306 466 -562 131 35 -139 -369
59432 -369 371 187 -76 736 386 337 -120 -497 20 26 229 -76 -328 141 -304 -467 279 -755 714 238
59452 238 -322 182 832 169 1305 641 -381 377 -692 -344 604 -152 -335 24 245 296 -755 255
59470 255 -318 384 -225 579 -390 1209 261 -926 430 -30 48 -661 -173 689 692 -408 -185 469 -770
59489 -770 893 959 331 -702 888 -44 -237 -329 -522 -26 121 217 -1317 -613 1097 300 -464 359 950
59508 950 -107 -503 296 -701 331 -282 -293 -391 -309 -191 353 460 629 -674 404 -318 -346 1460 736
59527 736 -234 -303 -773 56 -677 -132 -788 29 665 281 950 -547 360 -122 -33 -192 -169 -529 188 1240
59547 1240 972 685 684 787 -843 699 -443 -687 -244 860 287 -1026 197 19 -108 362 -900 -217
59565 -217 -585 1984 -212 -773 -24 -564 -262 129 -606 191 724 473 464 -22 -776 433 -1259 -407 -353
59584 -353 513 552 613 778 790 326 215 16 -238 -918 363 308 -563 -456 138 493 343 -594 -147 409 74
59605 74 373 282 -522 130 481 -145 784 638 -332 -144 -742 325 1476 353 275 -855 509 217 -883
59624 -883 766 -1260 471 1130 53 -453 -422 -705 -1006 917 -178 409 -960 -41 378 25 -1165
59641 -1165 -462 63 -610 -518 210 -313 -411 -724 -838 -379 -212 -246 138 232 -144 548 50 731 292 -169 -1
59662 -1 299 355 905 -880 202 -419 -54 -638 338 781 -777 285 -33 599 -391 39 -179 -224 -669 403
59682 403 722 -45 -150 -970 442 -84 617 -110 -254 -937 834 494 335 576 -202 -191 -514 757 824
59701 824 -308 181 39 -52 -73 -252 -131 -36 511 46 -513 -421 410 -188 -419 269 272 134 265 555 -94
59722 -94 -284 27 128 708 -451 -325 702 -358 -71 -140 423 -738 1041 -96 132 -229 -645 749
59740 749 -525 -658 550 -455 161 -746 -189 486 -713 -565 -415 -400 -711 1608 148 -77 -427 70
59758 70 522 135 -209 135 -616 1289 757 -918 -969 1292 602 112 232 -533 -16 891 541 21 1425
59777 1425 -415 424 89 -449 -475 205 -463 -1376 669 444 -193 -274 136 45 565 -515 407 1090 568
59796 568 -179 611 319 -519 358 -835 179 135 489 -373 708 655 152 -199 -1477 -148 -269 -160 -531
59815 -531 620 -235 -263 563 791 365 1029 129 -606 -181 22 -61 732 553 -412 -192 792 529 760 583
59835 583 -546 -543 -399 63 257 198 601 -391 -813 463 -759 641 1293 1231 841 -813 -492 -107 -26 -79
59855 -79 157 78 215 -555 233 -190 -300 -90 591 907 -378 227 493 518 105 -467 -359 -391 177 -378 331
59876 331 242 403 449 -423 -524 428 1000 -46 -179 -1150 1475 789 -152 593 -369 -144 513 -543 445
59895 445 343 -752 797 -261 -148 312 425 -50 324 -17 -25 68 718 686 -297 -548 362 974 724 257
59915 257 -231 608 61 273 471 -590 -639 -450 91 440 188 -238 348 -452 -705 547 314 977 149
59934 149 986 240 322 212 529 275 -584 157 301 -444 340 -408 1015 237 -24 -494 353 392 366 523
59954 523 -577 -9 545 -401 -120 178 -612 674 -161 401 -472 931 506 -585 -823 58 934 54
59972 54 279 -1011 -165 -501 250 316 228 72 -845 217 119 377 79 238 -100 -654 92 917 759 -208
59992 -208 -39 773 -87 1356 10 -509 -83 -1018 -644 -353 -462 -235 -269 -605 -385 900 180 -57 569
60011 569 -740 287 -1024 -475 188 -330 -369 -175 -24 545 -280 -576 453 -624 -125 -398 -542 50
60029 50 58 456 108 -46 263 -193 347 -1172 -91 188 -1291 467 -57 -19 28 -75 -377 -631 -334 1159
60049 1159 -317 63 921 -928 467 -378 -8 -121 -645 907 898 -188 -681 -897 -789 -605 -328 263
60067 263 226 -294 -82 235 92 619 -390 534 -882 -545 930 819 -610 657 -218 -207 490 -279 259
60086 259 -115 129 -107 -124 642 597 -40 -231 75 214 225 268 -179 -1088 108 502 217 577 -869 206
60106 206 -133 -1019 -741 551 -663 -1248 -114 -387 -782 434 -334 368 538 -366 234 224 21 546 -2
60125 -2 114 277 468 836 97 -219 -224 486 487 429 -116 -510 1911 -289 1079 -295 -394 616 513 411 975
60146 975 269 -456 -346 -934 -393 -489 532 26 -605 -776 623 320 -104 700 -618 187 -107 26 -330
60165 -330 -143 -613 -480 -209 365 -487 308 110 -579 -53 653 -323 -463 -837 -310 -155 -121 -27 487 1442
60185 1442 -1041 99 -807 -171 656 476 985 207 863 933 -24 -897 -16 624 418 -1321 290 137
60203 137 -108 -9 -90 743 521 -767 -291 -176 -88 -391 765 -162 -1148 74 -230 -375 325 -614 -242 587
60223 587 178 538 1265 102 -150 239 364 -534 151 -533 -806 334 502 -361 -518 36 574 -191 -571
60242 -571 -446 -456 -411 -417 222 581 -425 -394 3 -523 587 -896 755 413 259 1191 -160 742 351 512
60262 512 727 511 30 -1061 966 300 750 416 16 885 -684 496 -1194 44 310 278 -92 384
60280 384 -740 -145 765 195 -174 369 775 -441 -1525 -285 -193 251 -68 -549 -172 -73 359 -538 488
60299 488 -115 -230 68 -775 -11 662 -605 -311 50 852 -2 -927 482 -439 586 -387 172 489 527
60318 527 -243 575 78 -1001 52 1024 -48 490 345 -568 515 -165 130 413 776 538 -59 742
60336 742 335 -524 680 789 662 -509 -217 181 -119 41 16 397 233 101 216 -132 111 -2 -234
60355 -234 1020 -59 -305 -112 -178 -473 -1134 429 349 -73 -727 49 832 -281 -241 -13 25 195 -564 1186
60375 1186 608 -111 93 -819 383 57 686 148 83 476 -200 -43 -304 383 -447 609 257 -63 42
60394 42 -756 482 -377 -89 316 -35 -41 288 142 286 -967 -701 -227 294 169 -88 175 732 203 1023
60414 1023 -166 -221 258 82 196 542 500 778 408 -89 328 -240 -133 396 -252 379 -193 -288 79 -210
60434 -210 -138 -354 -372 -344 -316 257 -174 -357 302 846 215 -134 -19 -1332 -339 -301 -112 1105 610 249 273
60455 273 491 -274 -568 -349 189 -188 973 147 540 -862 -173 -457 1348 -1031 105 -186 -233 -49
60473 -49 59 324 -38 -720 752 -441 -776 -37 -713 -20 -437 -413 -566 -253 -1343 -769 207 -850 216
60492 216 -700 -109 -148 420 -74 297 -6 -494 -160 -91 993 1398 -1305 1071 -496 -320 598 792 438
60511 438 -450 541 -595 -1066 650 243 -84 794 -657 -634 67 605 63 730 447 -477 227 -213 12
60530 12 179 -64 -353 -287 96 408 -382 -626 -558 -4 420 -157 365 446 -319 -543 -91 146 652 284 -32
60551 -32 543 163 189 -267 -133 -654 -46 1123 372 112 590 302 788 796 -148 1211 366 381 -289 468 -276
60572 -276 -818 -332 -17 -458 853 -129 -142 -383 357 -396 68 318 -994 1099 793 -701 -817 125 35
60591 35 -304 101 -1 -744 57 248 214 -115 -34 244 1032 -223 -382 -251 -362 -354 -561 662 -602 -1182
60611 -1182 213 584 662 -116 -379 -169 -768 -414 433 674 -131 -313 273 408 707 273 374 340 -662
60630 -662 166 871 712 608 -484 -574 341 -154 -29 -115 452 -76 -420 -568 341 -575 -550 596 -743 -178
60650 -178 -282 -472 -499 328 -711 -162 170 309 -95 75 655 -275 16 295 -287 25 740 394 -79 420
60670 420 -658 198 -167 -201 182 -1775 39 8 -491 519 -260 609 -3 -18 -1038 -815 176 286 -1
60689 -1 -165 -1208 -772 648 355 -277 -454 237 -806 273 96 -404 11 772 -966 372 -519 636
60707 636 -167 -355 -644 -487 -314 107 -687 -871 506 80 94 -1174 138 222 -197 3 -1029 -32 289
60726 289 789 -286 -333 -1085 -709 -172 -911 -329 -588 374 -982 -17 87 71 165 -362 -689 -554 -210 -18
60746 -18 315 590 -67 -346 -264 -259 -305 373 47 399 -195 -671 892 220 -634 -226 -173 541 -1047 380 80
60767 80 -355 248 351 -215 397 -156 -632 -49 -33 225 -43 -16 105 607 1058 -253 -121 46 1493 -220
60787 -220 -315 -99 176 -244 225 -196 73 339 -853 -25 -917 -286 -474 501 59 -742 599 489 1059
60806 1059 -158 461 679 228 334 -41 -723 -366 -108 -695 478 -73 -460 -453 155 -521 525 446 310
60825 310 -183 460 -576 38 -737 441 -473 -852 -111 -595 -187 396 11 268 -598 589 19 857 703
60844 703 -469 644 242 -1752 -396 831 -163 381 -78 1173 1055 -730 -48 -1218 605 130 71
60861 71 -678 -1158 940 -363 334 408 -82 -660 -237 104 -318 141 479 420 -78 -465 202 1577 -8
60880 -8 791 288 -40 -1101 -608 299 -282 -223 -458 -176 -217 -60 -449 414 -273 458 -43 -292 -128 -77 -533
60901 -533 -169 -105 -414 -166 409 68 578 -45 -461 -198 -609 -625 312 -340 601 113 661 437 -180 -1327
60921 -1327 212 -5 -305 166 -301 -379 171 -283 573 -64 297 -121 -17 -3 -89 -788 -297 198 -159 -750
60941 -750 -1039 -304 -557 469 -266 -600 715 57 -570 310 340 446 -403 607 539 114 58 539 -439 160
60961 160 314 208 -1051 8 -109 672 -263 185 630 18 554 -8 176 -35 -798 -879 -704 395 216
60980 216 -363 164 -157 188 1392 671 -237 -740 357 577 -417 -277 100 926 219 -467 1514 -743
60998 -743 -868 373 21 110 84 -604 -14 731 728 398 433 0 -211 54 366 -494 -2 -88 -452 339 -310
61019 -310 -10 -447 398 -39 -1110 -679 -962 -562 536 13 445 331 -117 406 -434 -319 85 630 205
61038 205 -410 -311 734 -476 58 -335 115 -131 -301 390 287 -83 -272 -67 461 220 -383 -532 -209
61057 -209 -525 226 -38 -8 834 -421 -609 -278 -148 63 -59 -193 563 309 -324 916 -12 -134 43
61076 43 863 -96 128 403 -989 -215 -543 -108 -432 -253 -929 821 -844 115 -11 170 -489 -539 -648
61095 -648 -1103 -194 -789 -530 -1 -229 472 -29 -236 -8 -958 -104 -319 -324 -151 20 57 -817 63 675 -270
61116 -270 447 381 -106 381 -17 -30 -665 -558 239 803 -521 -915 567 -646 -66 744 -1123 -433 -321
61135 -321 -303 -217 281 -868 -929 762 132 980 363 -313 -585 -234 515 32 426 617 55 632 -28 -26 -275
61156 -275 65 456 684 628 -631 -458 -448 619 -518 -387 303 64 155 602 257 641 40 -874 241
61175 241 -937 824 -878 -508 -148 -783 95 43 -364 143 121 -751 -80 -188 -24 327 -255 -1096 -481
61194 -481 32 -692 -1484 505 43 721 1355 -659 -339 586 -852 -265 -672 66 322 -198 1700 -653
61212 -653 -566 -8 -426 -930 -425 19 154 -100 -225 -787 19 -80 -272 -936 -291 42 -526 645 1019 -428
61232 -428 -1287 -540 -91 0 -326 388 458 -36 399 534 -742 -119 -37 171 -164 -11 -978 214 299 671
61252 671 -7 -272 346 134 393 -819 -450 -438 -254 36 486 -77 -125 -34 -627 391 -57 -623 -624 104 -568
61273 -568 133 -195 179 -163 337 398 -952 780 837 437 -811 385 202 -731 -1087 7 703 202 189
61292 189 -176 657 -209 -417 -787 321 -162 -277 -308 87 226 533 -531 -123 -180 601 -408 -388 322 172
61312 172 -597 291 -196 -1001 963 153 -468 497 -85 -276 -662 -409 -511 -880 -1 -650 332 -85 264
61331 264 -209 -306 -499 778 281 -829 -794 -334 493 307 155 -513 -229 352 -439 594 0 -24 -1112
61350 -1112 810 387 -1181 -238 89 -951 -372 83 -303 -496 -539 -434 19 136 459 178 941 -61
61368 -61 -625 -53 -227 -236 -345 -1332 -316 -76 -1128 -23 198 958 169 -82 -268 -211 389 168 417 -60
61388 -60 265 146 -450 -25 23 58 222 -793 242 799 843 -125 -263 671 307 135 616 1101 -554 408
61408 408 -124 256 -570 -328 -524 215 106 240 103 246 -945 -262 807 225 -231 173 -323 1088 -190
61427 -190 119 108 -602 392 736 -258 -696 481 -825 190 469 -284 362 -701 -4 9 -424 -288 416
61446 416 -99 -29 -22 187 -385 -1044 -209 465 542 -482 529 61 201 286 -76 -86 1153 377 163 335 91
61467 91 479 186 -154 51 595 741 -223 -462 116 -466 -225 849 417 607 -599 12 1210 32 -133
61486 -133 72 -424 -315 -434 -877 403 -598 -200 -300 -443 240 -435 -219 104 1068 -756 194 -247 -758
61505 -758 656 19 673 638 -458 448 14 369 227 215 166 75 -62 -227 257 136 -19 -435 -109 386
61525 386 -565 -49 -860 -360 216 -229 515 552 -748 60 416 -1078 -129 -86 -174 -1108 713 205 -194 -394
61545 -394 220 -377 158 36 -652 -476 -566 -69 509 -560 -398 280 365 44 427 -475 -353 -572 180 373
61565 373 -603 246 430 333 376 506 138 56 136 744 333 267 500 593 -716 -902 -8 649 356 112 68 98
61587 98 -123 -165 307 -178 4 149 -498 380 -867 606 -404 300 -684 -45 75 -473 -141 -582 -150
61606 -150 780 -159 607 -81 -39 731 672 -284 -385 -349 -599 -95 255 -323 425 595 -238 -298 199 115 550
61627 550 728 726 -121 808 -3 538 -136 -65 809 -700 183 -349 685 -191 131 -281 -1359 328 -533
61646 -533 275 -1 325 -567 -170 -145 -524 -448 481 -474 260 1381 -391 211 446 -508 1138 522 -331
61665 -331 117 -356 -91 -660 -691 -388 100 421 -463 -459 320 -206 -940 -815 471 719 -546 87 993 358
61685 358 -44 292 577 575 44 -157 1216 -557 1009 -1013 -215 -632 656 -207 100 760 489 -520
61703 -520 99 -959 -92 -397 276 667 -456 550 -30 -751 -504 693 -89 518 208 146 206 -353 -1300
61722 -1300 -33 -13 166 -683 99 -429 -53 -698 356 181 -196 -536 -111 -464 -103 -333 356 188 67
61741 67 437 131 658 -878 -322 191 109 -1532 -633 -109 -241 -655 -665 192 -460 -397 -340 1014 -103 -751
61761 -751 -330 -625 -581 -101 678 243 -136 -917 1167 -408 -237 -220 -472 -369 -695 262 -477 97 11 520
61781 520 -211 446 -220 -194 -919 1048 1098 -322 450 -73 -258 -189 318 -150 578 7 112 -19 -250 -387
61801 -387 -407 87 384 -585 -379 97 -768 -10 -160 -990 23 -419 269 677 541 -531 548 628 87
61820 87 762 -597 155 -940 285 1302 -270 -1109 -56 318 101 388 -717 -842 382 -58 -324
61837 -324 -398 703 974 -216 -118 1552 -384 -531 -708 -608 -493 1013 696 11 536 -68 533 -994
61855 -994 -363 -419 -26 -400 101 515 -99 -223 479 -637 -1044 -28 455 -454 -793 48 1227 197 -121
61874 -121 -579 -1410 -53 -660 1002 -284 231 1103 501 52 193 -356 36 -577 110 221 399 -206 -363
61893 -363 -542 199 193 -540 -225 38 705 -599 1030 296 -112 -418 814 52 219 80 1462 374 -575
61912 -575 603 505 -242 153 -1137 8 278 -286 303 419 -209 303 -345 795 -1074 -186 -709 -116
61930 -116 -261 297 -78 -588 514 135 1014 -432 1018 426 231 201 -654 756 883 73 -267 -316 -502
61949 -502 -1040 562 333 -776 -382 -395 549 1054 -200 706 88 -392 187 -826 -83 -777 503 494 169
61968 169 174 -360 18 458 1030 -732 -6 -219 59 -1141 -488 205 521 -1061 -44 808 10 -200 57
61987 57 217 -109 618 109 63 -13 481 323 702 689 -55 309 174 397 -273 -354 30 -102 69 604 -128
62008 -128 117 -664 252 826 133 -845 -530 207 -89 40 -77 -119 19 -189 137 -322 553 -90 -148 -415
62028 -415 -19 541 -1193 -453 -143 336 -489 596 -264 -982 -803 794 -162 26 -134 101 444 -6 73
62047 73 -317 -638 839 145 252 -570 117 -95 -638 -832 436 -641 -363 304 -279 -129 469 152 95
62066 95 662 651 241 534 731 -986 452 -454 -115 243 -171 -129 -481 -459 277 -579 -293 -199 -90 -149 -358
62087 -358 -412 -290 850 -108 -343 314 329 290 -356 -95 600 697 379 -70 -833 -569 2 -451 453 395 -791
62108 -791 -31 489 155 -357 182 -570 572 830 195 -178 426 425 -367 329 268 645 218 553 -54 221
62128 221 1152 -382 -1112 -26 -876 -863 36 -1167 -213 -137 -455 -760 590 518 5 84 -87 202 -466 102
62148 102 -426 462 158 265 355 -533 -248 -584 529 -222 -367 72 226 -310 58 456 152 65 -252 -391
62168 -391 -212 -705 -125 -371 730 244 -192 289 -176 -183 -137 449 298 518 -272 -446 -620 -711 37 168 56
62189 56 -246 266 -989 -584 239 464 154 210 392 352 -2 842 754 177 484 125 666 494 -434 -864 292
62210 292 -496 -81 601 1010 403 -332 360 42 1108 -879 648 1046 820 -172 -59 -343 798 421
62228 421 -350 303 -310 142 -302 169 -1062 -24 246 -423 -377 -82 -117 960 140 -674 -895 -88 34
62247 34 159 154 -136 -460 761 998 729 -220 819 -197 -386 -456 551 744 -470 205 -45 -37 389 8
62267 8 -638 -167 -305 586 391 178 1480 383 -828 -805 304 -98 120 347 34 467 201 87 831
62286 831 51 771 254 -165 -118 -447 474 -392 619 1115 527 973 961 -165 -52 89 201 1160 -193
62305 -193 288 161 -546 264 -278 -783 -438 11 -455 -48 -512 411 394 -162 950 -187 -386 -80 -822
62324 -822 436 52 226 -71 335 -335 49 -907 -477 543 53 18 1002 713 -166 207 543 -514 -156
62343 -156 351 -386 -1055 305 319 44 -626 -384 15 162 251 -404 771 -723 -471 212 -297 841 995
62362 995 142 -226 338 -283 1156 635 -588 702 314 430 329 -50 72 -219 -328 175 299 241 -722
62381 -722 31 -293 -158 191 207 145 795 -64 12 -690 172 -298 423 538 1167 160 -343 217 227 -12 208
62402 208 -5 1069 245 -778 -418 -525 202 -729 114 265 -739 -633 87 -125 407 -617 -812 329
62420 329 374 125 549 -180 -1025 -410 -697 11 411 230 413 256 -440 -375 -248 -713 -966 -439 2 -52 184
62441 184 -566 -98 213 565 -60 98 1065 343 -135 74 -1523 315 -290 -548 -357 -545 825 198 91
62460 91 -805 1365 937 -104 -438 -23 -681 -257 475 -186 497 466 -518 -140 -187 -90 172 -434 -306 -395 132
62481 132 -389 -501 -124 -253 -16 -328 405 183 -74 393 -1008 698 222 125 374 283 387 161 -309 -343
62501 -343 262 536 355 552 -1382 132 -566 -307 -254 875 -357 -31 396 -463 -138 -488 -792 695
62519 695 256 754 -292 312 294 290 730 -964 -308 256 -102 -7 -113 190 249 -168 -729 -44 -673 -266 -310
62540 -310 -1735 255 -168 -171 -80 325 -603 677 -1275 79 278 -1255 -641 -298 -360 793 -669 474
62558 474 405 475 639 227 -111 -374 -206 546 383 295 -416 -907 207 -222 225 -412 423 -974 582 -41
62578 -41 561 -350 -139 311 -390 -74 -4 95 -1425 841 -399 106 -655 0 834 105 12 -1104 -436 -645
62598 -645 231 77 377 315 468 -750 70 550 -26 -204 354 404 -807 15 -611 -387 -384 -8 455 458 693
62619 693 -333 -659 -190 158 -1057 -40 -290 -661 424 106 -429 395 197 -98 527 -1007 337 676
62637 676 -3 210 -1292 529 -2 -490 -304 -492 75 615 -481 -774 -125 -199 864 -845 -157 855
62655 855 293 -363 -176 -315 -183 -685 681 305 -829 -562 890 279 517 481 205 -58 -98 -76 223 195
62675 195 312 824 615 1059 164 131 590 1037 637 1071 194 -387 -117 -197 -96 -656 71 -762 -548 504
62695 504 258 -400 304 257 -514 202 -359 -748 290 -155 540 -731 -9 228 -233 -680 63 -395 274
62714 274 766 -713 311 -437 399 315 71 243 -277 1070 -186 1022 1022 -139 136 98 276 -671 -157
62733 -157 -122 491 -580 -196 8 508 756 -1360 530 -3 -326 252 234 163 -350 740 320 120 548
62752 548 92 283 55 -1007 176 -250 730 -1099 638 -747 144 734 32 -21 -181 563 699 -338
62770 -338 626 -127 79 -233 32 555 -231 618 -181 -314 -358 -230 217 -414 399 632 -414 -2 282 -659
62790 -659 -699 427 -594 -184 -535 492 -409 195 62 167 -382 513 551 -709 -63 53 -261 -618 -348
62809 -348 -269 -73 479 -227 -338 1232 -127 617 953 -454 -353 -592 534 159 -473 -230 146 -1165
62827 -1165 1 425 1339 433 211 569 -193 -160 154 -471 -320 1417 -52 -445 542 559 182 290 -552
62846 -552 352 509 572 1173 550 -74 387 231 657 165 685 504 -209 -291 573 -750 53 662 275 -767
62866 -767 -238 783 -154 145 118 -6 351 73 166 309 -344 -41 614 -204 254 300 -180 93 -197 152
62886 152 652 -608 -104 -115 -919 1127 -470 -678 -934 -407 -946 0 227 131 -90 916 96 -383 552
62905 552 -291 250 -804 -750 689 -422 -199 24 -279 -1393 3 917 607 -422 -523 -689 303 581
62923 581 -154 -784 -706 -745 88 -628 -104 315 231 92 1 95 576 674 320 355 452 -205 -631 249 -678 -758 -587
62946 -587 747 -269 130 -1042 505 -100 -106 -399 57 -540 427 -152 -222 571 52 713 -303 -407 351
62965 351 402 -240 472 -394 819 261 741 633 -84 243 406 218 -198 183 709 66 370 166 -90 -494
62985 -494 472 -793 277 -790 175 865 -135 -70 -1073 447 1036 10 391 643 -299 110 593 296
63003 296 403 258 -518 246 683 -969 -561 -227 794 989 -759 -219 463 750 -62 65 -410 -470 -869
63022 -869 797 -94 996 610 -486 -284 -247 219 -357 292 -825 -1069 -1212 188 -1095 354 -116 365
63040 365 -378 -1129 556 -1960 155 298 170 -77 5 -88 93 954 -463 294 -477 425 187 -106 243
63059 243 -222 682 -618 -1073 -9 504 863 -82 -495 -1223 -275 307 -739 -34 -43 -17 791 146 -443 405
63079 405 -386 82 -126 583 -457 11 -239 -114 381 -42 -705 94 -649 469 -367 646 652 608 93 202
63099 202 134 -340 616 -199 903 -507 -291 -606 21 277 -343 -65 -265 -883 694 -73 -162 1352 -369
63118 -369 -334 169 -567 254 -442 -930 768 332 428 -314 23 -39 -587 201 -916 141 1126 373 674 -18
63138 -18 175 -1056 -1055 -381 -298 164 317 581 180 1042 293 341 -495 533 177 542 -600 -291 -631 736
63158 736 -128 -211 128 -232 -78 1071 -548 -664 212 -155 761 559 -231 286 -500 388 100 -193 441
63177 441 103 883 -527 -192 -560 -428 -625 -153 -739 787 545 770 -734 139 591 498 -105 -662 883
63196 883 577 -55 366 151 276 -97 1290 -425 -410 -45 514 239 340 -439 -109 539 629 -41 -591 927
63216 927 -164 274 373 -126 -670 -249 -174 12 -711 221 182 289 180 -58 395 -376 101 -130 -220 -350 -143
63237 -143 1262 799 380 -163 -374 -15 384 -663 282 14 188 304 254 -164 659 761 -325 -366 -292 -585
63257 -585 -215 129 901 -676 -34 86 -1464 -313 -661 -272 587 204 -302 423 -221 503 521 -9 -403
63276 -403 410 118 244 483 30 155 -987 56 -215 800 -199 -719 -624 92 191 -214 154 505 -50
63295 -50 570 52 464 -1114 -679 -760 292 -278 386 88 36 767 -271 1013 383 1058 -226 406 784
63314 784 5 -182 507 -275 -198 -209 -168 -350 -9 -348 -328 -571 1486 -68 50 -123 -134 20 -307 440 648
63335 648 753 179 -413 764 -15 399 23 -327 -258 -77 259 -18 216 -386 -294 -262 -672 -506 -523 247 129
63356 129 276 92 9 889 -149 541 -93 883 834 261 -791 137 715 -983 187 -569 -357 -228 -773
63375 -773 -334 -735 -120 453 433 4 -179 874 809 -30 376 549 -363 -447 821 17 17 -361 274 720 -292
63396 -292 6 -974 202 -89 199 -472 -452 -76 -537 153 1586 106 70 -1065 -941 814 755 75 -1
63415 -1 -141 218 -708 336 279 -68 -800 -1862 627 -71 -550 -396 147 1175 -24 289 12 -793 192
63434 192 -33 367 -593 64 369 69 229 1712 -134 -436 270 -119 -665 -191 -297 392 -83 -782 315
63453 315 -430 -544 78 248 -508 -306 -378 -573 -396 560 430 415 338 -462 691 629 -614 105 -231 379
63473 379 355 644 -36 -572 383 -201 356 289 -161 -900 -392 -170 -573 -114 1099 317 -461 -283 -649 404
63493 404 473 -910 1023 325 -390 1049 -648 61 251 -1114 -369 112 -216 -62 529 434 458 165 160 634
63513 634 255 -314 390 229 -439 471 -633 -66 197 258 -931 -321 1351 -614 -699 -569 -800 -77 616
63532 616 326 -830 -15 258 -254 110 514 1164 65 49 477 -66 -522 473 147 -115 396 -31 -326
63551 -326 -826 556 -559 -341 197 147 -55 214 194 -19 -43 39 -354 -593 1079 -954 -217 130 169 634
63571 634 -614 -680 110 258 530 41 5 931 -180 163 -208 494 51 -828 -43 -265 -455 299 -189 385
63591 385 54 -351 811 451 65 -805 -408 69 -113 -63 -169 -816 -412 -583 84 -31 -1089 326 42
63610 42 -454 247 -72 -393 -534 -879 448 167 236 -750 287 -266 -1018 663 173 -808 128 228 -373
63629 -373 33 -886 -78 -391 -139 -659 -392 136 356 -979 -996 487 307 405 -79 124 -432 518 -216 280
63649 280 -564 677 350 -313 -432 -187 647 -213 498 -965 -1 358 -21 320 1122 18 97 616 -291
63668 -291 -799 -140 -961 -62 -174 21 -302 209 -891 192 -198 -329 155 167 1139 -258 -130 263 298
63687 298 -385 686 79 502 748 80 207 855 -843 -323 136 1216 33 -337 124 196 1099 544 259
63706 259 476 150 131 606 -279 -429 -913 257 -205 175 -119 -269 21 194 -728 -736 -677 -427 319 191 -156
63727 -156 -163 -109 -714 403 -672 -228 -810 -401 16 1058 -964 480 339 687 -524 311 317 -166 -691
63746 -691 550 520 820 347 -313 -228 -650 -135 -426 -476 494 -360 -248 470 -17 -97 197 214 -192 -350 -192
63767 -192 -373 -452 418 752 -300 -519 191 171 -9 -102 412 -504 595 977 -224 364 472 -48 -456 -113
63787 -113 96 92 457 -152 -398 398 -295 624 57 -384 -489 49 -1124 -246 -772 -104 317 -41 -1151 349
63807 349 -460 -763 21 -551 -367 371 852 -371 430 -153 504 418 76 516 24 468 230 573 -533
63826 -533 -304 -277 -728 -690 -891 361 604 163 653 -143 -155 382 -105 -29 1063 -346 228 45 635 -479
63846 -479 332 388 -139 -726 -195 586 -67 -950 154 825 479 -17 -271 825 -293 188 402 -539 -394
63865 -394 397 -753 555 -54 -72 145 183 -860 538 -67 -87 -726 -22 -385 -88 882 -918 862 367
63884 367 -139 -172 897 -179 1053 -560 327 461 -461 -559 60 -1120 118 105 28 114 -58 -565 -691
63903 -691 202 -600 42 266 -207 -293 -1439 361 -651 -252 260 -99 -454 -924 -1114 -63 1404 124
63921 124 891 484 -257 561 -764 -434 190 -802 411 -229 108 -529 -375 -336 -582 -491 -413 -202 -987 -735
63941 -735 -163 -133 80 442 -56 -667 -72 -306 300 766 -504 580 -71 11 146 -457 -519 571 -17 827
63961 827 -206 -265 511 544 176 -312 1750 -114 -321 -418 -250 765 -553 174 -503 -248 -429 -285 -77
63980 -77 -1065 580 686 -93 90 716 -54 -590 -601 492 -488 -696 372 -798 346 120 587 968 -917
63999 -917 900 444 -842 -196 -323 -490 1243 512 207 -49 -234 -485 -99 -312 680 38 289 -442 -104
64018 -104 620 292 -260 173 699 149 316 173 -224 -565 105 -74 -20 166 -806 811 977 495 -533
64037 -533 -528 155 -633 974 614 285 -156 -144 11 262 262 -49 408 -51 -96 -610 224 -258 62 299 100
64058 100 -130 543 309 202 -694 383 885 -592 -556 -102 645 -337 -139 -739 42 -477 517 -612 715
64077 715 -685 127 -428 544 286 -31 -47 -213 -470 16 -971 -159 518 -242 -91 690 -498 31 642
64096 642 -484 291 573 -66 -453 -289 501 322 639 -490 -120 -99 -703 6 -574 -35 -57 587 -472
64115 -472 -874 -650 -523 -113 132 -311 -835 746 180 -283 717 721 111 -378 283 -782 -17 186 -184
64134 -184 -658 -606 1045 -92 -236 -578 465 -419 -1321 -157 -86 466 -406 663 518 -116 878 -280
64152 -280 22 235 475 -54 165 -363 303 -283 53 -86 348 377 185 -86 -195 343 1496 1531 -12 105
64172 105 995 -59 -456 557 248 -412 270 -750 -74 -284 -266 49 -141 34 223 133 691 -60 744
64191 744 -415 -452 671 -647 403 -15 162 495 -85 -408 1476 22 13 870 165 148 707 -764 -269
64210 -269 670 -1014 402 -892 -90 146 -317 829 305 581 312 -443 -97 -804 1068 352 583 -204
64228 -204 181 177 81 -602 -392 115 1124 -678 862 -337 -784 -10 66 260 -64 315 520 210 -362 -336
64248 -336 70 14 618 514 268 -341 -151 -186 -82 321 925 423 -927 1316 66 699 145 -24 568
64267 568 139 744 810 -130 -307 524 -434 -548 179 182 -283 -81 90 -730 -157 -143 40 -209 811 317 -295
64288 -295 389 -437 457 258 594 370 261 317 -212 -192 247 319 1072 793 64 -55 -8 -1153 -219 3 552
64309 552 -559 -238 -497 -189 335 250 -426 -150 7 -354 -458 -85 -454 -561 -954 687 -111 -879 -392
64328 -392 437 200 -954 -722 -454 -692 -46 -390 -99 -739 50 -604 -984 -76 -111 132 -900 1012 -531
64347 -531 844 -71 -266 -436 -392 1280 -207 128 502 -354 -536 884 600 1146 -30 -492 258 -1019
64365 -1019 509 -151 533 82 210 552 727 -478 -189 74 637 800 -486 -103 -449 -86 -190 -28
64383 -28 -517 567 459 -668 -448 -321 -174 6 -170 450 -769 565 17 462 177 -987 459 11
64401 11 275 10 -50 47 710 -167 33 -464 69 1590 467 651 919 -1007 93 420 -576 -1229 -374
64420 -374 341 252 -33 160 -228 255 193 -847 283 -230 253 156 -272 312 22 -308 420 -230 521 255
64440 255 437 -987 -209 383 18 220 219 -11 -118 -14 514 451 -107 -550 17 654 862 507 674 72
64460 72 -385 -346 137 37 -352 621 -391 653 -503 398 578 124 -1007 664 -496 -37 -265 6
64478 6 333 215 -447 -143 1048 -884 -398 -839 -336 288 -29 574 -45 -176 -15 -477 106 -60 69 -674
64498 -674 -39 415 -338 431 507 516 87 -557 611 -147 -29 -905 -869 897 -131 444 638 -628 -395 -206
64518 -206 11 230 -8 590 -107 -922 -1082 -313 -231 236 -387 -222 711 377 293 -407 -65 -738 -336 483
64538 483 -225 344 162 -327 -446 17 201 -544 941 573 95 -176 -562 348 -238 -25 -421 -296 538
64557 538 456 -237 288 -268 -505 -88 -350 -68 490 -150 -99 -580 231 -478 -683 -1158 -23 -1097 48
64576 48 -451 -550 -726 -722 -374 -243 -212 316 -50 637 -956 -434 528 -629 -101 704 -231 -145 -687 536 -471
64597 -471 -54 29 -21 225 123 484 -65 302 -19 237 -1049 646 -278 663 247 953 -626 152 -737
64616 -737 322 875 -118 -763 -241 -287 323 142 -460 -7 127 48 122 404 144 -45 -1163 67 138 -1046
64636 -1046 -393 -398 392 274 -1308 127 871 -132 131 -207 -317 -582 382 -640 -365 -741 937 -822
64654 -822 -1408 208 -436 850 330 657 -32 -755 -195 514 -377 149 -145 695 -119 -107 269 616 -962
64673 -962 40 1314 -92 114 102 -510 187 519 1003 -73 -9 -1120 -188 -161 573 -191 -199 508 300 852
64693 852 158 177 14 -24 -196 -171 153 256 -896 -283 -49 -40 -76 72 63 320 -441 -1626 509 -528 -357
64714 -357 941 -696 -286 157 584 990 968 127 517 -296 -233 22 -237 -1244 396 283 432 681 -689
64733 -689 655 -958 803 -441 452 150 344 -211 -687 658 -101 -689 -365 131 -48 -77 -525 202
64751 202 875 -309 203 813 -315 -80 -28 -684 258 701 -203 -253 -635 -1227 -1273 658 -87 -639 555
64770 555 90 -313 451 427 428 -615 624 404 -359 6 634 -475 513 395 512 -288 -87 -307 795
64789 795 -108 -61 -623 25 -426 -537 -341 -342 -5 -663 601 55 195 214 -367 -353 260 -312 -530 -613 1031
64810 1031 -233 -32 436 212 -530 -1140 525 122 -682 77 -778 -353 241 292 389 7 1100 1008 -91
64829 -91 -1040 26 594 376 -529 -635 -218 -274 -379 421 84 240 -248 -699 867 -36 -1054 -575 141
64848 141 -62 -27 -134 -360 -1305 182 -450 777 732 -670 445 475 28 -172 110 509 -23 371 -300
64867 -300 188 -276 -275 170 21 259 739 15 181 540 -352 -360 -52 -174 -500 -284 517 146 -238 80 -839
64888 -839 291 -850 -479 -58 220 950 311 629 631 -297 152 -572 204 -377 844 -1038 -84 272 -230
64907 -230 -273 -162 1006 303 18 229 -1313 393 -638 -498 -410 -539 205 -307 -586 -176 -248 139 -28
64926 -28 -9 -510 753 -577 -637 -182 -784 381 131 -156 -833 814 -826 179 -196 -188 748 329 1058
64945 1058 88 386 -139 -297 266 -253 -128 361 -18 104 -1054 489 415 -147 -748 213 -109 458 367
64964 367 417 -30 311 670 -444 -548 605 353 -605 35 -8 -263 389 -210 607 673 -768 470 113
64983 113 348 301 -1019 -99 1301 -409 -598 -351 -333 166 8 -699 -285 61 -346 256 -551 -428 595
65002 595 -315 339 145 521 455 -923 -354 372 -696 119 179 -682 339 386 -703 -827 -148 -652 839
65021 839 624 -495 -607 -629 -313 693 1276 1008 467 -159 -354 759 236 197 -1120 -1474 798 -81 -387
65040 -387 1175 -13 110 -39 -420 57 -36 589 726 88 50 510 246 -304 -249 -608 417 514 -121 -172
65060 -172 -113 -478 -750 486 -331 -209 -197 -427 315 -534 940 -437 440 346 -531 465 -324 253 -585 -302
65080 -302 -113 -343 113 -160 -595 270 -141 113 -269 931 139 137 -80 -408 -217 457 -652 -1104 689
65099 689 -61 468 655 893 -82 -85 109 -1213 64 582 837 -747 535 -161 -536 -357 -211 -898 -744
65118 -744 -447 -555 -588 -452 -455 332 -208 -348 959 533 58 -656 248 30 -107 461 997 99 761 -532
65138 -532 255 -395 866 215 109 -197 563 -422 201 54 1542 70 -599 284 368 -676 204 142 50
65157 50 -523 -228 -563 -322 -490 136 -29 -368 86 305 -760 220 -197 292 327 -897 -338 -375 606 323
65177 323 382 324 354 604 151 413 -172 -1137 -107 16 288 -200 45 -39 -3 -272 789 319 -235 694 -362
65198 -362 74 1224 263 548 -48 190 1048 389 -436 -371 179 -872 -792 971 -227 -520 265 -478 -385
65217 -385 -1694 -395 701 -524 791 -586 998 326 -506 513 -331 -678 433 -201 506 440 326
65234 326 -38 445 267 96 275 -551 103 -172 93 458 297 -63 -247 1202 164 195 211 -493 567
65253 567 284 -610 153 -79 -317 -483 532 737 -58 611 -60 -156 763 -197 239 190 -987 390 746
65272 746 1252 -106 33 617 -277 -553 -374 622 -168 -974 -1417 44 402 -968 1030 33 -61 471 753
65291 753 -158 629 -294 -444 520 343 487 -432 137 428 -826 520 -157 -575 -472 -38 -355 -475 -1039
65310 -1039 66 72 -135 1 645 1217 1072 -1004 -1 -797 469 -1970 -65 -876 75 760 -401 -666
65328 -666 -574 -458 -128 742 -558 254 377 -707 -433 -56 464 -213 1228 -843 -483 -686 357 -23
65346 -23 -218 -578 -602 131 -409 -218 -142 266 971 706 22 -349 209 -109 227 -165 135 -369 343 -25 457
65367 457 639 -396 -648 -796 -112 -839 -671 -248 -53 907 -221 81 21 -483 -584 248 -62 190 -55
65386 -55 -306 828 307 -30 246 -554 148 -706 169 125 27 379 -307 -255 -553 279 353 -50 -607 -650 -167
65407 -167 -706 777 190 -375 458 -418 -187 674 161 -753 224 -438 -574 495 816 35 -700 181 691
65426 691 391 -2 -470 84 -56 -171 -681 77 596 379 -119 312 -467 -1205 42 -508 -544 454 -273 651
65446 651 -95 111 447 -687 -646 -139 -422 1548 501 -919 1522 119 -1224 -634 -788 300 -134
65463 -134 1166 156 -77 313 442 90 165 178 443 905 412 -215 146 -680 436 599 164 41 692
65482 692 -142 -82 360 268 -295 -316 -237 -583 140 -61 200 -600 455 -695 -286 52 120 132 -180 76 750
65503 750 253 958 -505 -791 -203 -748 67 47 144 312 -132 -121 148 -666 -244 43 -277 -859 -551 777
65523 777 364 357 -2 -1157 130 367 -466 -672 -220 -787 -105 151
65535A51
$$ Imaginary data points
##PAGE= N=2
##DATA TABLE= (X++(I..I)), XYDATA
0 0 16 -16 0 -22 28 -27 45 -45 58 -77 83 -106 121 -142 171 -192 229 -263 293 -349 386 -438 505 -557
24 -557 638 -717 796 -906 1003 -1123 1269 -1410 1588 -1789 2006 -2287 2599 -2980 3468 -4077
40 -4077 4904 -6074 7862 -10992 17553 -121564 -18467 192246 152696 58610 -63673 -102046
52 -102046 -93024 -24607 39231 82861 72165 36856 -15995 -51975 -71331 -56070 -18818 38707
64 38707 81390 86302 35517 -43470 -106460 -105153 -35698 64582 125362 107763 17277 -84285
76 -84285 -131175 -91096 5899 93646 117717 68442 -17572 -82623 -92370 -49851 10895 57503
88 57503 70570 50850 13738 -29537 -61276 -68944 -41786 12038 70023 96425 63391 -13759
100 -13759 -91534 -117625 -67767 28647 110698 122680 55368 -46090 -116856 -111858 -36856 54307
112 54307 104474 88480 23457 -44939 -79444 -68266 -25957 21297 53283 63161 46275 8203
124 8203 -37929 -73791 -72326 -28085 41135 94466 92503 30919 -56593 -112129 -97732 -19339 72397
137 72397 117712 86366 598 -79523 -105916 -66296 8637 69704 83582 49410 -5055 -46311
149 -46311 -59307 -45339 -13597 20966 49582 56961 39475 -4132 -53199 -78503 -57665 4366
161 4366 70318 96076 62475 -16817 -87319 -102101 -51023 33816 95305 92667 32803 -42520
173 -42520 -87235 -73775 -19063 36650 66534 56062 20365 -19174 -44813 -49079 -36503 -5573
185 -5573 29734 57524 57606 24962 -29715 -76148 -78865 -30243 42962 92240 84492 21501 -57510
198 -57510 -100314 -76743 -6529 65515 91685 60016 -4689 -57523 -71316 -44512 124 37412
210 37412 50276 38906 14387 -13617 -37305 -48371 -35826 -3375 38165 65646 54716 7049
222 7049 -51757 -82566 -59811 2434 66360 88162 52730 -16733 -72530 -78616 -35379 26841
234 26841 65574 61678 22297 -23759 -46948 -43547 -18291 6977 26103 32760 29732 12806 -12849
247 -12849 -38297 -47387 -29907 11783 52382 63551 33920 -21861 -67096 -70429 -26929 36151
259 36151 74205 63185 11986 -44539 -68866 -48696 364 42446 53659 33746 763 -26397
271 -26397 -35256 -29445 -14773 6083 24323 36711 34792 10708 -24699 -53352 -52516 -16257 33987
284 33987 67806 60336 11532 -47091 -75200 -54509 -435 53100 67737 42286 -5820 -45758
296 -45758 -51186 -27583 4592 28275 34680 23446 7944 -8040 -21873 -29907 -25186 -6346 20776
309 20776 41541 40008 10225 -31922 -56506 -43893 -1171 43593 61993 36902 -11719 -51485
321 -51485 -55663 -22793 21942 47947 42581 12568 -20756 -35634 -28370 -10473 8666 18833 22461
334 22461 20113 10187 -8072 -27878 -37823 -24049 7436 40712 52865 30587 -14864 -54865 -59714
347 -59714 -26591 25749 60978 56577 16711 -31122 -56432 -44627 -8943 26684 41954 32633
359 32633 9994 -13415 -25794 -27899 -20621 -4319 13677 31260 35144 17987 -13639 -43535 -50612
372 -50612 -24454 20902 56501 55598 18493 -31581 -61544 -50970 -8504 37255 57227 40363
384 40363 2271 -33129 -44152 -29861 -2769 21281 29968 26794 12871 -5040 -21072 -31434
396 -31434 -27772 -8032 21497 43164 41185 11338 -29271 -55538 -46421 -6919 40420 62336 41403
409 41403 -3736 -45888 -57755 -31425 11141 42288 46499 23927 -10435 -32057 -34527 -20800
421 -20800 -391 18328 28341 28348 15829 -8767 -32126 -42240 -28345 5982 43319 55754 34404
434 34404 -11583 -54508 -62772 -31455 20792 60483 60906 25612 -24815 -57463 -52844 -19450 21209
447 21209 46206 43905 19529 -9680 -30796 -38825 -29284 -5794 21850 41433 43131 18819 -19507
460 -19507 -51365 -55327 -24869 23616 61612 61958 22100 -32162 -66019 -58738 -14106 36784 63292
473 63292 50050 7981 -33763 -52449 -40226 -9437 23924 40062 37304 17346 -9402 -31754
485 -31754 -41306 -30676 -45 33080 51381 42330 4237 -39821 -62058 -48514 -843 49937
497 49937 68420 45427 -7439 -55264 -66471 -38186 13422 53657 59738 32301 -10519 -45128
509 -45128 -50613 -30918 2060 32422 45689 37732 11201 -23119 -48144 -50436 -23176 21204 56411
522 56411 62485 29783 -25333 -67406 -70314 -29845 32059 72568 69770 25293 -33571 -71176 -64118
535 -64118 -20675 29379 61683 56197 21950 -19287 -48641 -51841 -30785 5875 38802 55401
547 55401 42303 6977 -35521 -61815 -53749 -12141 39052 70817 58560 11277 -46094 -73401
559 -73401 -56924 -3907 49809 70859 49530 -2122 -48609 -63615 -42595 1352 40895 55232
571 55232 39218 4913 -29912 -49969 -44081 -15845 21956 50768 52645 26282 -19165 -57946
583 -57946 -65315 -33515 21173 66545 72162 34087 -27026 -72700 -73375 -31157 28441 70016 69478
596 69478 27726 -26514 -62415 -62524 -29176 17004 52236 58149 35446 -3163 -42651 -59877 -46362
609 -46362 -8684 38105 66911 56950 13708 -39058 -72432 -62844 -14349 44273 77888 62119
621 62119 10973 -47329 -75637 -57136 -7322 45882 68109 51278 7718 -37438 -59933 -49700
633 -49700 -12869 27379 53411 51581 24477 -17318 -52037 -59873 -34921 13185 55081 67154
645 67154 41404 -14465 -61511 -73609 -42351 16558 64671 73407 38639 -19567 -63122 -68189
657 -68189 -33351 18289 56195 62110 33220 -12205 -48053 -58240 -38012 803 41221 58811
669 58811 46620 7983 -36939 -64571 -56674 -14112 39216 71378 61962 14500 -43640 -77214
681 -77214 -64656 -12833 45405 76027 61424 10887 -43467 -72022 -57954 -12373 36449 61951
693 61951 54569 19370 -25603 -55643 -57553 -29989 13813 53259 63709 39800 -8543 -54155
705 -54155 -71205 -46509 7127 57238 74532 46627 -8046 -59249 -73524 -43718 11019 57192
717 57192 68495 39639 -10985 -51393 -62464 -36952 4473 42514 56183 40660 4156 -35535
729 -35535 -55982 -47112 -12205 32065 60469 54580 16727 -33033 -65971 -60755 -19520 35724 68995
742 68995 62884 16730 -37302 -69055 -59011 -15098 36115 66396 55684 15348 -31514 -58384
754 -58384 -53827 -21028 21787 52998 54996 29284 -12108 -50036 -61675 -38926 6321 50580
766 50580 67830 45739 -3970 -52834 -71743 -49041 5344 56006 73019 45958 -4558 -53038
778 -53038 -69697 -45782 2264 46794 63194 44113 3030 -37036 -56963 -46256 -12786 27902
790 27902 53731 51126 20737 -21688 -53752 -58095 -27250 20759 57232 60621 27600 -22236 -58714
803 -58714 -60647 -24813 24260 58901 57332 23144 -23566 -54730 -53742 -20533 19881 48978 50304
816 50304 23947 -12932 -43319 -50632 -32297 6747 41398 55879 38623 -687 -40854 -62106
828 -62106 -44967 -2279 44941 66160 49408 1559 -47202 -67784 -49463 -1435 45132 65326
840 65326 48267 5351 -38928 -58912 -47729 -10687 30131 53468 49814 19650 -20576 -49854
852 -49854 -53291 -27482 14528 49746 57935 34088 -11997 -51181 -61219 -35541 12713 52660
864 52660 61802 34598 -13545 -50601 -57984 -31430 11987 45799 54156 30247 -8572 -40570 -49231
877 -49231 -32183 2456 34905 48950 37339 5665 -31174 -51641 -43236 -11155 30749 55196
889 55196 49123 13443 -31832 -58061 -50246 -12709 32594 57758 49489 11664 -31657 -55281 -46773
902 -46773 -12473 27632 51206 44786 16475 -18888 -44887 -46320 -22335 13744 41876 48792 30113
915 30113 -8344 -41914 -54212 -34723 5225 44352 58308 38218 -4892 -45375 -60268 -38554
927 -38554 4994 44702 58066 38235 -1684 -40703 -54258 -38132 -1536 34236 50760 39293
939 39293 9718 -26091 -48647 -44012 -16522 20582 48496 50224 23058 -17258 -49809 -52737 -25623
952 -25623 17218 50165 53804 25884 -16287 -48593 -51659 -25306 14426 45819 48550 23355 -12793
965 -12793 -38944 -44504 -25008 5564 33297 43363 29804 -1000 -31837 -45791 -34902 -3512
977 -3512 32274 49544 39626 5488 -32918 -53297 -42070 -5934 35135 54354 41875 5793
989 5793 -34255 -53370 -42433 -7728 30448 50109 41829 11933 -25559 -47675 -43531 -17434 19287
1002 19287 44494 47453 23738 -12578 -44270 -52311 -30425 9023 44475 55766 34375 -7457
1014 -7457 -45790 -57708 -35522 7014 44343 55554 35339 -4817 -40787 -52619 -34896 1052
1026 1052 34598 49302 36731 5046 -27864 -46618 -40005 -12942 23107 47423 43979 17436
1038 17436 -20872 -47822 -47825 -20013 20484 49515 48632 19201 -20641 -48081 -47526 -18447 19973
1051 19973 45969 44104 18404 -17137 -42398 -43234 -19595 13270 39027 43352 24557 -8362 -37841
1064 -37841 -46497 -29119 5461 37584 49849 34161 -2670 -39219 -54255 -37243 1107 39335
1076 39335 55081 39552 -293 -39173 -55635 -40626 -2463 35348 53133 42329 7118 -30124
1088 -30124 -50754 -44855 -13564 22959 47965 46197 21365 -18428 -46434 -50146 -26986 13009
1100 13009 46221 53411 28924 -11152 -45884 -53526 -30619 9354 44572 51745 28488 -8728
1112 -8728 -41487 -49302 -29686 7052 37441 45734 30966 -2335 -32755 -46111 -33509 -2114
1124 -2114 30737 46126 36158 6782 -28299 -49037 -40747 -9351 28196 51676 43969 10791 -29855
1137 -29855 -52740 -45214 -11589 28757 50078 44420 12033 -25318 -49899 -44421 -15322 20860
1149 20860 46794 45087 20713 -15628 -43979 -48366 -25674 11919 43489 52320 31159 -8673
1161 -8673 -43241 -55772 -33897 7538 43736 56320 34739 -5471 -43915 -56047 -36137 3652
1173 3652 40367 53833 37216 -522 -35995 -51669 -38348 -4492 32274 51364 42468 11092
1185 11092 -26893 -50937 -46797 -17064 24459 51318 49431 19754 -20744 -51170 -51214 -22507 20176
1198 20176 52168 51640 22076 -18348 -49278 -50664 -24656 15573 45419 48409 25346 -9802 -40633
1211 -40633 -47668 -27855 7141 36702 47981 32339 -4257 -38060 -49874 -35580 1998 38381
1223 38381 52314 37522 -891 -38964 -53314 -38445 541 38873 54247 40226 1420 -36075
1235 -36075 -53058 -39766 -4880 33671 52565 42449 9969 -29751 -52007 -46753 -14849 24261
1247 24261 52388 50936 20678 -20291 -51878 -53546 -26046 17618 50618 55852 28840 -14456
1259 -14456 -50033 -56058 -29800 12133 46729 54889 31572 -8972 -42860 -52278 -33086 4654
1271 4654 39274 51426 35813 2364 -33895 -50166 -39267 -6507 31429 52062 42824 6889
1283 6889 -30527 -52304 -43795 -10139 29984 51918 43789 10490 -28455 -50506 -44645 -11990 27174
1296 27174 49743 42855 13355 -23923 -45715 -44190 -16292 20755 44281 45507 20597 -16710
1308 -16710 -45621 -48863 -24401 14595 44990 50924 27266 -12334 -46572 -54672 -30153 10130
1320 10130 46877 55596 32964 -9337 -45459 -55640 -35335 4751 41768 55459 39218 687
1332 687 -38207 -54804 -42958 -6165 32046 52978 46461 12531 -28917 -53543 -48509 -15870 25311
1345 25311 53030 51472 18804 -23297 -51339 -51033 -20199 20034 48370 49240 21491 -18103 -46437
1358 -46437 -47543 -22402 14167 42213 47047 25118 -10733 -41246 -46768 -27699 7992 39516
1370 39516 49548 30387 -6148 -40573 -51797 -32569 5134 41082 53549 34664 -3129 -40541
1382 -40541 -53052 -36349 950 37703 53191 38258 2096 -34977 -51908 -39972 -6609 30570
1394 30570 51366 43287 11114 -26955 -51146 -46181 -15269 23832 49705 48636 19384 -22221
1406 -22221 -49631 -50968 -22291 18386 49329 51606 24285 -17331 -46268 -51156 -26386 12814
1418 12814 44346 50846 27890 -9431 -41020 -50502 -30918 5370 38272 50389 35199 -1026
1430 -1026 -35893 -50795 -38706 -3975 32918 51569 40783 6270 -30807 -50813 -42496 -7975
1442 -7975 28931 49618 42300 9734 -26769 -48248 -42826 -12024 23798 46172 42272 15531 -19915
1455 -19915 -43572 -43424 -19056 17068 41870 43913 21195 -14890 -42557 -46853 -23173 13114 42675
1468 42675 47962 25443 -12151 -42478 -48514 -25906 10374 41289 48854 30177 -8482 -39646
1480 -39646 -49258 -31272 4423 37487 49621 35416 953 -35742 -50428 -39287 -5989 31048
1492 31048 51110 43165 10156 -28483 -52210 -45293 -14047 26321 51031 47285 16007 -22777
1504 -22777 -49339 -48480 -20182 19849 46973 47971 22017 -14609 -43395 -47349 -24251 10363 39604
1517 39604 46877 27344 -7894 -37478 -46635 -29772 5276 36199 48008 31264 -2494 -36251
1529 -36251 -48502 -32179 1112 35963 48267 33062 -373 -33981 -47709 -33630 -2790 32144
1541 32144 46294 34936 4345 -28134 -46476 -37858 -8084 26044 46727 40069 11715 -23825
1553 -23825 -46820 -41660 -13813 21965 47317 45104 17889 -20376 -46529 -47492 -19656 17760 47463
1566 47463 47390 22466 -14894 -43890 -48183 -25998 11070 41122 48298 28308 -6532 -38499 -49732
1579 -49732 -31912 1067 36040 49631 35959 2733 -32779 -48946 -39211 -5798 30302 48921
1591 48921 39665 8409 -27644 -46944 -40449 -11039 23664 45085 39542 12630 -22012 -43560
1603 -43560 -40063 -14322 18692 41357 39419 16434 -16274 -39908 -39985 -19258 14292 39908 42320
1616 42320 22667 -11720 -39176 -44628 -23765 10756 38911 46023 25051 -9015 -38688 -46028
1628 -46028 -26989 6753 37966 47358 30386 -2965 -35819 -47688 -33269 201 32345 47745
1640 47745 35476 3629 -29531 -48349 -39131 -7974 27154 49218 42870 11917 -24775 -48157
1652 -48157 -43446 -14530 21773 46479 45008 17691 -19284 -44869 -44514 -20528 16026 43056 45034
1665 45034 22082 -12375 -40777 -45403 -25079 9611 40016 46759 27406 -6761 -37394 -47011
1677 -47011 -30576 4190 35615 47956 32857 -1160 -34511 -48758 -34375 -1617 31620 47657
1689 47657 35409 4586 -28499 -45298 -36287 -7310 26167 44428 38023 10522 -23844 -44274
1701 -44274 -38828 -12494 21562 41662 40283 15154 -20481 -43609 -43036 -16658 17917 43207 42408
1714 42408 18613 -17300 -42455 -44227 -19699 14951 42223 44947 24068 -11628 -41309 -46996
1726 -46996 -26853 8362 39387 48228 29226 -5526 -37830 -50746 -34642 807 34566 50070
1738 50070 37754 2877 -33219 -50569 -40217 -6063 27769 49300 41855 10430 -25112 -48206
1750 -48206 -42578 -13870 22319 46324 42564 16748 -17861 -42425 -42770 -18985 15348 38852 43775
1763 43775 21271 -11121 -39916 -42236 -23373 10008 37542 43483 24197 -9259 -36119 -43868
1775 -43868 -25513 7678 36543 44647 26701 -6290 -35317 -44804 -28918 3411 34086 44587
1787 44587 30827 -87 -31722 -46033 -33033 -2750 30369 47286 36428 6398 -28247 -47326
1799 -47326 -40655 -8839 26220 46897 41275 12699 -24190 -46240 -43436 -16223 20695 45721
1811 45721 45480 20144 -17437 -43795 -46067 -21692 13761 41636 46511 24959 -8852 -39394 -47200
1824 -47200 -29213 6189 38071 47869 32174 -3149 -35616 -48528 -34444 575 32785 47498
1836 47498 34396 2737 -30569 -46896 -35808 -5156 28167 45135 37402 7834 -25175 -43753
1848 -43753 -37353 -10038 23053 43021 39061 12339 -20839 -42664 -38772 -15174 19455 41797
1860 41797 40708 16017 -18459 -41857 -42271 -17894 15734 41162 44092 20001 -14608 -41154 -45278
1873 -45278 -22939 12241 40641 46117 25015 -8369 -39397 -47347 -29013 6097 37356 47553
1885 47553 31945 -1640 -34142 -49016 -35460 -1786 32167 48682 37949 5783 -30063 -48227
1897 -48227 -39593 -8454 27393 47049 41520 11852 -23599 -45248 -41762 -15202 19065 43624
1909 43624 42445 17608 -16432 -41229 -43776 -20033 14297 39973 42984 21358 -11117 -39045
1921 -39045 -44031 -24524 9102 37868 44425 26261 -7046 -35148 -44761 -27613 5875 34493
1933 34493 44062 29381 -3240 -32690 -43924 -32093 -247 30570 43491 33472 3231 -29202
1945 -29202 -44890 -33905 -6331 27162 43845 36114 8994 -24402 -44047 -38269 -11191 23203
1957 23203 43797 38519 13112 -21388 -42663 -40141 -15373 19329 42830 41701 18375 -15868
1969 -15868 -41517 -44523 -20510 13675 40987 45582 24195 -10471 -39972 -46849 -27874 6700
1981 6700 37776 47535 31263 -3540 -35237 -47866 -33883 -1943 32606 48120 37055 5197
1993 5197 -29020 -46017 -37283 -7369 26531 45051 38420 9402 -22913 -42162 -38425 -12749 20293
2006 20293 41450 38946 14808 -18592 -40160 -38864 -16505 16133 38687 38773 18016 -14517 -38497
2019 -38497 -40623 -18996 13674 37632 41104 21131 -12461 -38012 -41001 -22025 10931 36464
2031 36464 43054 25277 -7473 -36093 -43855 -28063 4370 34779 45397 30789 -2039 -33801
2043 -33801 -46607 -34184 -1072 31451 47213 35755 4042 -28343 -47267 -38903 -8358 25735
2055 25735 45102 39438 11795 -22461 -45238 -41271 -14491 19214 42331 41376 19021 -16606 -39870
2068 -39870 -42986 -21369 12620 39286 43047 22582 -9322 -37907 -42828 -24350 7681 35863
2080 35863 43185 25431 -4733 -33813 -41981 -27876 2114 30709 42610 28800 -1574 -28647
2092 -28647 -41783 -31503 -1160 27245 41244 30423 3735 -24854 -40398 -32623 -5961 24933
2104 24933 41838 33721 8833 -22893 -40560 -36395 -10145 21831 41952 37659 12389 -20130
2116 -20130 -41178 -39601 -14201 18370 40396 41766 17801 -15167 -39873 -42297 -20938 11892
2128 11892 37757 43808 24069 -8707 -36507 -44981 -27803 5773 35780 44846 30357 -1531
2140 -1531 -32499 -45413 -32736 -1323 30586 45376 34228 4496 -26770 -43511 -35847 -8002
2152 -8002 23503 42933 37056 10173 -21483 -40828 -36600 -13229 18742 40037 37764 14207 -16686
2165 -16686 -38728 -39009 -16436 14378 38333 38856 18665 -13169 -36480 -40528 -20095 11700 36394
2178 36394 40251 21724 -8729 -35166 -40374 -23817 6945 34466 42139 25187 -5288 -32876
2190 -32876 -42719 -28117 2230 31781 42828 30284 1011 -30182 -44263 -32226 -3499 28420
2202 28420 43471 33109 5770 -25112 -43158 -35879 -6832 24162 42440 36669 11122 -21142
2214 -21142 -41911 -39617 -13225 19698 41518 40400 16780 -16588 -41109 -42853 -21039 13592
2226 13592 39104 43577 23872 -9593 -37721 -43156 -26051 6139 35212 43410 28508 -3113
2238 -3113 -33234 -43463 -30346 -68 30176 41751 30080 2652 -26775 -40875 -31549 -4433
2250 -4433 25332 39770 32144 6992 -22109 -39038 -33381 -9304 20626 39020 33679 9581 -20498
2263 -20498 -38857 -34205 -11327 19498 37627 35238 12506 -17968 -37739 -37743 -15754 16876 37121
2276 37121 38218 18021 -14186 -37984 -40718 -21662 11389 37540 42541 24467 -7779 -36124
2288 -36124 -42896 -27783 4328 34495 44656 29978 -1817 -30829 -43763 -32517 -3350 28920
2300 28920 44290 35365 5712 -26965 -43053 -36270 -10029 22514 42199 38043 12758 -19338
2312 -19338 -40501 -39129 -14938 16130 38762 38847 16280 -15300 -38287 -39162 -18475 11912 35385
2325 35385 38631 19848 -9957 -34127 -38981 -21621 8622 33328 39872 23139 -6050 -31025
2337 -31025 -39623 -24398 5741 31220 40554 26129 -2762 -29082 -40816 -28152 212 28206
2349 28206 40445 30210 1637 -27005 -42057 -31557 -4311 26132 42048 33249 6933 -24581
2361 -24581 -42176 -35944 -9887 22469 41412 37828 12296 -20503 -41124 -39436 -16400 17036
2373 17036 40661 40836 19167 -13644 -39935 -42330 -21308 11279 37999 42974 24655 -8154 -35028
2386 -35028 -43605 -26414 4374 33596 42806 29236 -1460 -30728 -42080 -30184 -1588 28123
2398 28123 41686 31808 4314 -25595 -40070 -33322 -6526 23839 40007 33682 7775 -22415
2410 -22415 -39181 -34742 -10243 20609 38808 34330 11443 -18696 -37145 -35163 -14042 17662
2422 17662 36976 36632 15232 -15625 -36973 -37141 -17352 13394 35980 37968 19164 -10387 -34167
2435 -34167 -40568 -22049 7091 34133 41371 24282 -4977 -33400 -41870 -26438 2787 31405
2447 31405 41708 28906 -296 -30229 -41789 -32001 -3073 27945 41957 33567 6995 -24727
2459 -24727 -41821 -35319 -8670 21680 41810 36460 11523 -20417 -40832 -38069 -14152 17256
2471 17256 39521 39315 18328 -14372 -38011 -40648 -19580 11786 36193 40451 21718 -8891 -34227
2484 -34227 -41208 -24600 6151 33047 40411 26141 -2385 -30418 -40220 -27421 513 28437
2496 28437 39839 28487 1238 -25965 -38750 -28702 -2356 24309 38465 30034 4617 -23260
2508 -23260 -39092 -32021 -5869 23640 39104 32716 7850 -21697 -38829 -34239 -9860 20189
2520 20189 38569 36674 12441 -18911 -38688 -37922 -15572 17716 40843 39464 18904 -14266 -38580
2533 -38580 -42629 -21875 12126 37246 43190 24345 -7799 -35726 -44005 -27328 4001 33358
2545 33358 44271 30119 360 -29792 -43451 -33730 -3663 27715 41998 33449 6189 -23633
2557 -23633 -41208 -34630 -9452 21289 39053 34745 11326 -20140 -38241 -35823 -11928 18096
2569 18096 36539 34877 14104 -15089 -36657 -35621 -14868 15911 35225 36447 16744 -12391
2581 -12391 -34959 -37099 -19037 9965 33421 38875 20910 -8346 -32686 -39125 -22390 6588
2593 6588 32359 39614 23610 -4459 -30981 -40225 -26876 1873 29277 41665 28384 1060
2605 1060 -28130 -41256 -31725 -4292 25949 41502 33449 6997 -24413 -41423 -35041 -9228 21052
2618 21052 40189 38609 13412 -18711 -40473 -39198 -16007 16147 37681 39498 18654 -13224
2630 -13224 -37141 -40703 -21811 9391 34097 40651 23572 -6584 -31933 -40044 -25694 3405
2642 3405 29697 41063 26867 -1102 -29079 -39116 -28382 -600 26011 38292 28937 2148
2654 2148 -24876 -38099 -30002 -4220 23887 38117 31598 5700 -22653 -38795 -31493 -8847 20464
2667 20464 38033 33798 9885 -18269 -37649 -35702 -12199 17449 38127 36395 14673 -15931
2679 -15931 -37897 -38166 -17001 13899 36493 38328 20681 -10856 -36367 -41207 -22534 9263 33788
2692 33788 41520 24932 -6361 -33032 -40608 -28314 2478 31297 41197 30197 233 -28785
2704 -28785 -42100 -30416 -4051 26561 40952 33075 5624 -23446 -40005 -34469 -10495 21055
2716 21055 40241 35532 11505 -17854 -38663 -36697 -14287 16001 37935 37666 16168 -13388 -35269
2729 -35269 -36992 -18214 10851 34297 37963 19813 -9217 -33304 -38489 -20886 6243 31935
2741 31935 37625 22710 -6426 -29915 -38191 -25184 3318 28417 37134 25132 -2349 -28201
2753 -28201 -38577 -26219 333 27107 38071 28479 1783 -25528 -38018 -29755 -4572 24161
2765 24161 39771 33068 7854 -22018 -39550 -34470 -10196 20372 39400 36991 12601 -17782
2777 -17782 -38811 -37955 -15618 14791 37177 38550 18562 -11225 -35622 -40344 -23030 8445 34087
2790 34087 41121 24970 -5168 -31226 -40114 -26625 1313 28500 39726 28995 1582 -25980
2802 -25980 -39577 -28786 -3439 24353 37553 29654 5711 -21543 -36869 -30130 -7209 19753
2814 19753 36220 31802 9259 -17773 -34715 -31728 -11038 17157 34346 32430 11800 -16558
2826 -16558 -34943 -33167 -13166 15596 35547 34934 14871 -13576 -34685 -36337 -16739 10476 33845
2839 33845 38323 19503 -8879 -33426 -39050 -22659 6769 32040 38481 24810 -4109 -30595
2851 -30595 -39741 -27002 11 28138 39750 28932 2374 -25752 -40943 -31751 -4906 23881
2863 23881 40034 33421 7816 -22584 -38459 -33941 -9330 18836 37848 36136 12584 -17337
2875 -17337 -36364 -36290 -15727 14028 35949 36847 17472 -11599 -33515 -36517 -19693 7668 31272
2888 31272 37298 21211 -7530 -30632 -37299 -22385 4631 28309 36834 23021 -3067 -27883
2900 -27883 -36677 -24924 1113 26601 36328 26051 -62 -24361 -36241 -27361 -1548 24113
2912 24113 36318 28264 5333 -21928 -36919 -30458 -6171 21564 37585 31582 8728 -19626
2924 -19626 -36808 -32912 -11243 17368 35941 34998 13621 -15329 -36565 -36227 -16784 12577 34515
2937 34515 38592 19798 -10652 -34017 -37996 -21440 6708 30119 38404 24710 -4543 -29230
2949 -29230 -39247 -26233 1139 26746 40050 28348 795 -25528 -38291 -29930 -3977 23196
2961 23196 37835 30841 6262 -20795 -37318 -31834 -9456 19314 36632 32093 10164 -18080
2973 -18080 -33919 -33299 -12384 14885 34570 33899 13328 -13222 -34227 -34162 -14936 10700 32857
2986 32857 33220 16868 -9548 -31231 -34255 -18745 8061 30347 36746 20876 -6357 -30600 -36448
2999 -36448 -22565 5020 28391 37403 23290 -3097 -27997 -37974 -26254 80 27956 38679
3011 38679 28877 1839 -25766 -39221 -30309 -4569 24011 40620 32194 7296 -21451 -39314
3023 -39314 -34616 -11013 18626 37925 36681 13703 -15259 -36826 -37178 -16987 12848 35609 37493
3036 37493 18975 -10306 -33009 -37649 -21166 6723 31527 36798 22659 -4665 -27854 -36969
3048 -36969 -23362 2017 26261 35172 24757 -754 -25304 -36064 -25515 -304 24328 34211
3060 34211 25483 1978 -22324 -34409 -28055 -2647 21280 34755 27601 5855 -20699 -34329
3072 -34329 -27997 -6893 19904 35392 30690 8405 -19150 -35815 -33632 -11310 17329 35226
3084 35226 35187 13580 -14078 -34229 -35909 -17081 11539 34343 36920 18245 -9179 -32508 -38254
3097 -38254 -21971 5269 30796 38132 24210 -2995 -28423 -37577 -27024 710 27601 37734
3109 37734 28143 2708 -24940 -38102 -29288 -3950 22431 37309 30638 7356 -18886 -35068
3121 -35068 -30580 -10172 19131 35504 32063 11018 -15804 -34333 -32802 -13463 13913 33831
3133 33831 33589 14739 -13351 -32239 -34474 -16261 9639 31642 33899 17922 -6239 -30130 -35271
3146 -35271 -19590 7392 28884 34317 21522 -4272 -27429 -35755 -22935 2609 27222 36242
3158 36242 25011 -2016 -26575 -37036 -26392 -2032 25516 36314 28578 3016 -22422 -37992
3170 -37992 -30674 -5223 21096 37264 32990 8487 -20788 -37757 -33652 -10962 17040 37228
3182 37228 34887 14811 -14452 -35390 -36094 -16399 12709 34028 36840 19026 -8173 -31703 -36995
3195 -36995 -21471 5574 30153 37602 23037 -3757 -29091 -36530 -26109 1080 26722 36343
3207 36343 24723 706 -24710 -35750 -26274 -1479 22546 35146 27556 4499 -21283 -34604
3219 -34604 -28015 -6278 20586 34409 29527 7210 -18640 -33909 -30585 -10560 16644 33520
3231 33520 31219 11015 -15666 -32622 -31871 -12476 13950 32018 34660 14549 -12870 -32104 -34067
3244 -34067 -15873 10911 31671 36270 19487 -7540 -31687 -36597 -20641 5319 29034 35549
3256 35549 24584 -2798 -28002 -37093 -26450 997 26612 39313 27912 2390 -24274 -37425
3268 -37425 -30569 -5385 22236 37116 31423 8302 -19921 -37003 -33499 -10275 15834 35112
3280 35112 33522 13613 -14013 -33760 -34683 -16563 11937 32094 34456 16932 -9310 -30681 -33919
3293 -33919 -18492 7918 28949 33705 18942 -4936 -27180 -33841 -20058 3365 25403 33794
3305 33794 22188 -2212 -25097 -32906 -23212 1306 25187 33569 24709 -591 -23577 -33880 -25488
3318 -25488 -2168 23512 35468 27762 4454 -22027 -34984 -29461 -6828 21292 36376 31108
3330 31108 8507 -19106 -35932 -33161 -11730 15236 35417 35407 15160 -14001 -34023 -36376 -18138
3343 -18138 10387 33057 37339 20657 -7015 -31662 -37159 -22230 5758 29955 37532 24655
3355 24655 -2248 -26496 -36986 -26729 -1179 24360 36086 27397 2525 -23482 -34633 -27698
3367 -27698 -4909 21155 35063 28389 6300 -18758 -33782 -28975 -8033 17651 33259 29318
3379 29318 9398 -17110 -32496 -30643 -11082 13711 31934 31560 12763 -13291 -31889 -31821 -14876
3392 -14876 12023 31615 32579 15860 -10182 -30403 -32162 -17979 8062 29304 34616 20136 -7483
3405 -7483 -29033 -35239 -21849 3863 28249 36527 24124 -2055 -26156 -34877 -25082 26 25433
3418 25433 36427 27684 3811 -23246 -36901 -29478 -6577 21184 36309 32003 8909 -17651
3430 -17651 -35274 -33423 -10729 16353 34586 34018 15002 -12798 -33028 -35855 -16554 10052 30665
3443 30665 35200 18436 -7499 -29495 -35103 -19623 6219 29131 34847 21118 -2849 -25835
3455 -25835 -33375 -22211 1790 24219 34179 23502 172 -23680 -33241 -24260 -654 21705 33402
3468 33402 24971 2469 -20890 -32919 -26016 -4661 20562 33613 28226 6453 -18515 -32512
3480 -32512 -29912 -8484 18133 33127 32001 10127 -16172 -34628 -33535 -12876 14088 33151
3492 33151 34706 15128 -11653 -31987 -34749 -17128 9615 31358 36064 20889 -6723 -31164
3504 -31164 -36997 -23410 4379 28299 36934 26084 -1317 -26730 -37374 -27164 -1273 24698
3516 24698 37672 27612 4257 -21749 -36076 -29288 -6291 20015 35619 29921 8674 -17593
3528 -17593 -33940 -31177 -10940 14695 32393 31378 13093 -12501 -31904 -31280 -14155 11510 30509
3541 30509 31908 14360 -9215 -28587 -30524 -16077 8270 29096 32250 17581 -8089 -27654
3553 -27654 -31599 -17966 6528 27340 34577 19098 -5075 -26228 -33507 -20982 2421 25437
3565 25437 35048 24450 -56 -25182 -35872 -25788 -2143 22263 35431 27958 3800 -21654
3577 -21654 -35546 -30052 -7174 19929 35290 32056 10008 -17059 -35197 -33505 -13113 13956
3589 13956 33732 33670 15419 -11037 -31529 -33468 -17940 8166 30789 34115 19788 -5663 -29167
3602 -29167 -34674 -21927 3438 26032 34414 22640 -670 -24720 -34099 -23276 -411 22907
3614 22907 33105 24994 1228 -21267 -33087 -24472 -3057 19855 32003 25371 5752 -18446
3626 -18446 -32265 -26911 -6812 18147 32122 27729 8454 -16548 -30857 -29400 -9469 14689
3638 14689 31595 30062 11686 -12322 -31174 -30813 -13369 11117 30153 32272 16070 -9997 -30014
3651 -30014 -32666 -18710 7158 28610 34668 20395 -5580 -28814 -35476 -22741 3588 26618
3663 26618 35499 24629 507 -25032 -36362 -27649 -1717 22678 35742 27549 5103 -20675
3675 -20675 -35830 -28946 -6963 18407 34244 31387 9677 -17190 -33400 -31438 -12523 13858
3687 13858 31158 31734 14212 -10837 -30422 -30887 -15913 10320 28717 31541 16881 -7675 -27449
3700 -27449 -32370 -17830 6318 26096 31951 19851 -5755 -24992 -32162 -19740 2394 25471
3712 25471 32315 21397 -2460 -24051 -32048 -22290 970 22160 32956 23778 1311 -21890 -33251
3725 -33251 -26090 -4013 20577 33531 28239 6198 -19309 -33994 -28310 -7090 17250 32546
3737 32546 30604 10295 -16731 -33248 -32193 -12995 12900 32205 33224 16351 -10223 -30376
3749 -30376 -33487 -18161 7874 29765 33236 19868 -5405 -26895 -34608 -22018 2534 26128
3761 26128 33986 23282 -199 -23764 -33628 -24763 -2311 22249 33348 26513 3419 -19598 -33127
3774 -33127 -27723 -6728 17227 32072 26205 7118 -17191 -30599 -27462 -8601 13931 30624
3786 30624 27680 10037 -12744 -29150 -27412 -11207 12417 28780 28378 12524 -11104 -28493 -28500
3799 -28500 -14258 9914 27862 31302 16222 -8024 -27513 -30361 -16871 6738 27131 32535
3811 32535 19616 -4053 -26188 -34414 -21788 2556 25306 35329 23227 -97 -23945 -34800
3823 -34800 -26280 -4140 21442 34388 28038 6154 -20407 -35133 -29965 -9486 17432 33019
3835 33019 31468 11215 -15111 -32904 -31870 -12839 11373 29384 32110 15359 -10498 -28785
3847 -28785 -31468 -17683 7482 26933 31465 17512 -5978 -26394 -31772 -18076 3927 24988
3859 24988 30055 20702 -2152 -23568 -30548 -20471 2267 22756 31524 22434 -493 -22124 -30583
3872 -30583 -22981 -1575 21252 31926 23559 3365 -20036 -32775 -25408 -4320 18487 31080
3884 31080 27656 5927 -18071 -31470 -27635 -8611 15528 30944 29038 10398 -13729 -30337
3896 -30337 -32119 -14015 12049 30412 32413 15772 -8297 -30065 -32202 -17835 7737 28048
3908 28048 33129 20006 -5476 -26695 -33983 -21015 3135 24293 33577 23242 636 -22956
3920 -22956 -32736 -24345 -3210 19595 32805 26121 4459 -18631 -31765 -26037 -6986 17350 31109
3933 31109 28263 8811 -15820 -30384 -27960 -9721 12925 29148 28528 12322 -11820 -27994 -28925
3946 -28925 -12791 9599 26584 29734 13722 -10186 -26383 -29856 -14684 8481 26396 29546
3958 29546 16566 -5777 -24831 -30932 -18257 4522 24489 31878 20073 -4177 -25139 -31699
3970 -31699 -22544 545 23133 31817 23745 893 -22000 -32753 -25076 -2846 19461 33663 27285
3983 27285 5389 -18380 -32798 -30472 -8023 16495 31954 29302 11154 -14076 -32126 -31119
3995 -31119 -13231 11267 30646 30750 15479 -9612 -28716 -31489 -17315 6555 27260 32016 19280
4008 19280 -5393 -26124 -31579 -20511 1756 23124 31954 21885 -389 -22005 -31298 -21665 -545
4021 -545 20787 30985 21055 2855 -19695 -30026 -23971 -2640 18745 30008 24125 5259 -17816
4034 -17816 -29609 -24452 -6147 17267 29854 26578 7583 -15193 -29164 -28104 -8635 13362
4046 13362 30038 27840 11003 -12494 -29217 -29840 -13281 11042 28140 30273 14817 -8965 -27381
4059 -27381 -31962 -17894 6463 27288 32702 19965 -4444 -26253 -32385 -21274 1596 24262
4071 24262 33372 24184 838 -22853 -33077 -25353 -2333 20285 32103 26567 6197 -17475 -31665
4084 -31665 -27576 -8024 15986 29912 28115 10114 -13965 -28766 -28605 -11634 11581 27579 30147
4097 30147 12871 -9448 -26504 -27524 -14222 8584 25434 28060 15287 -6537 -25331 -28825
4109 -28825 -15672 5649 24110 28258 16697 -4033 -24540 -30838 -19149 3024 22699 29434
4121 29434 19249 -1738 -23264 -30895 -22909 -399 21648 31340 23059 2806 -19607 -31463 -24829
4134 -24829 -4300 19715 32548 26647 6782 -16511 -30644 -28140 -8894 14965 30321 29417 10839
4147 10839 -12919 -28707 -30721 -13634 11558 29174 31822 16438 -8222 -27473 -30977 -17482
4159 -17482 5618 26572 31639 19773 -2941 -25098 -31563 -20282 558 22456 31666 21984 -665
4172 -665 -21930 -30826 -23455 -2992 19146 30406 24757 4300 -18376 -29883 -25268 -6175 16512
4185 16512 30689 25417 6315 -15803 -29071 -25356 -8317 13583 28595 25897 9605 -12421
4197 -12421 -28002 -26190 -10375 11486 27104 27809 12623 -9704 -27193 -28549 -14005 9142 27017
4210 27017 29965 16124 -6811 -26184 -31321 -17051 5431 25286 31778 20118 -3131 -24292
4222 -24292 -31323 -21239 1339 24037 32298 23737 2153 -20921 -32591 -25835 -4396 19401 31393
4235 31393 26795 7717 -16779 -31321 -28104 -9536 15084 29752 28855 12003 -12581 -28925 -27650
4248 -27650 -13617 9566 28237 29093 14672 -8117 -25408 -29460 -15771 6974 24339 29009 17056
4261 17056 -4656 -24042 -29395 -18437 3390 23146 28404 18614 -2578 -20878 -28857 -19792 648
4274 648 20234 27853 21024 1037 -19508 -29597 -21801 -2511 18494 30069 22362 4746 -16911
4287 -16911 -29374 -24274 -4485 17457 30100 26118 8014 -15424 -28927 -29123 -9128 13412 30554
4300 30554 28971 12127 -12066 -28869 -30452 -14700 9230 28474 31243 16371 -7837 -27340
4312 -27340 -30473 -18050 4424 26040 31802 20711 -1646 -23717 -31414 -22448 204 21840 31522
4325 31522 23973 1599 -20129 -30871 -25780 -4968 17107 30500 25747 5621 -16572 -29493
4337 -29493 -25260 -7582 15021 27666 26291 8994 -12582 -28022 -26255 -10102 10558 26269
4349 26269 26518 10474 -11481 -25602 -26534 -11573 10029 26052 27655 13669 -8096 -25796 -29132
4362 -29132 -14927 7004 25261 28936 16656 -5797 -24788 -28978 -18667 2942 23286 29746
4374 29746 19848 -1678 -22540 -30654 -21426 -418 21481 31034 24792 4203 -19386 -31092 -25560
4387 -25560 -5006 17537 30199 25785 7920 -16086 -30659 -27372 -9741 13172 29321 28837 11331
4400 11331 -11742 -28411 -29475 -13703 9310 26666 29101 15960 -8547 -25552 -29921 -15786
4412 -15786 5603 23523 29480 17822 -3612 -21841 -28252 -19939 1972 19762 28537 19845 186
4425 186 -19678 -29345 -21448 -1561 19071 28078 22196 2183 -17469 -27935 -22829 -3627 17483
4438 17483 27676 23524 5782 -15032 -27352 -24304 -6694 13563 26369 24756 8102 -13714
4450 -13714 -26633 -26040 -10463 11753 27297 27820 12386 -10890 -27160 -28925 -14743 9006 27164
4463 27164 28688 16044 -7065 -25305 -30606 -18788 3877 24047 31608 18907 -2535 -21999
4475 -21999 -31611 -22645 -1262 20752 31291 23410 3592 -17362 -30208 -24339 -5318 16571 29877
4488 29877 25767 8180 -14340 -28146 -26476 -9442 12090 27708 26102 11091 -10655 -25779
4500 -25779 -26361 -11785 9596 24548 26744 13134 -8206 -24399 -26659 -14035 6686 24588 27307
4513 27307 14465 -5509 -21906 -27553 -16315 4157 21952 26234 17063 -3142 -21875 -27605 -18660
4526 -18660 2273 21697 29231 19926 272 -20333 -28833 -20469 -1272 18933 29606 22828 3691
4539 3691 -17177 -29601 -24569 -5821 16895 28487 26897 7764 -15360 -27926 -26935 -10578 13286
4552 13286 26901 27871 11677 -10411 -27769 -28541 -14811 8210 26100 29358 15701 -5933 -24489
4565 -24489 -29619 -17527 3469 23152 29292 19389 -1110 -20618 -28639 -19529 -22 18388 27667
4578 27667 20897 2758 -18229 -28046 -21072 -3381 15876 26225 20744 5013 -15068 -26866 -22367
4591 -22367 -4937 13699 25708 22508 6587 -12947 -26392 -23226 -7983 11886 26829 23881
4603 23881 9477 -10753 -24959 -25639 -10170 9866 24725 25081 11443 -8223 -25055 -26497 -13822
4616 -13822 7150 25230 28745 15098 -5552 -22239 -28966 -17078 2653 23959 29726 19222
4628 19222 -1476 -20990 -28725 -22483 -1847 19467 29541 22867 3465 -17790 -28840 -24841 -7028
4641 -7028 14941 28372 25432 7897 -13236 -27889 -25242 -10538 11304 26200 26635 12159 -8629
4654 -8629 -24935 -26588 -12745 7339 23260 26736 13962 -6338 -22987 -26860 -14176 5251 22103
4667 22103 27382 15255 -3359 -20160 -25570 -16519 2595 19707 26938 17548 -1662 -20163 -26631
4680 -26631 -19143 -714 18915 26602 19321 677 -18302 -27389 -21115 -2275 17260 26265 22318
4693 22318 4421 -15875 -27095 -23837 -5239 14609 27627 24002 8125 -13276 -26886 -26583 -9880
4706 -9880 11921 26746 26536 11605 -9918 -26879 -26866 -13341 6920 25316 28678 16727 -6024
4719 -6024 -23587 -29085 -16935 4440 22694 28136 19315 -1622 -19809 -28578 -21088 -688 18742
4732 18742 27818 21319 3242 -17664 -26930 -20981 -5213 14504 26153 22553 6410 -14000 -25243
4745 -25243 -21780 -5788 12431 23813 23234 8864 -10875 -23847 -23552 -9104 11061 24281 24085
4758 24085 9782 -9289 -23232 -24062 -10797 7842 23626 23512 12480 -6972 -23164 -26157 -14417
4771 -14417 6126 22501 25747 16113 -4269 -23851 -27878 -17749 2016 21158 28408 19932 309
4784 309 -19866 -29180 -21120 -2295 18323 28734 22142 4031 -17638 -28539 -23585 -7171 15578
4797 15578 27700 24388 8072 -12084 -27369 -25539 -10150 11074 25596 25850 12867 -8303 -24523
4810 -24523 -26299 -13730 6601 23699 26763 14590 -4943 -21160 -25848 -15900 2908 20371 25964
4823 25964 17439 -1898 -19763 -25954 -18123 0 18882 25433 17578 494 -18644 -25939 -18097
4836 -18097 -1193 16228 24589 19794 2697 -17081 -25088 -19573 -3351 15767 26103 21438 5082
4849 5082 -14463 -25812 -21922 -6300 13685 25637 23993 8089 -12936 -25418 -24911 -10776 9337
4862 9337 25859 26281 12552 -9440 -24931 -27914 -14512 5443 24437 28541 16206 -5025 -23408
4875 -23408 -28491 -16850 2452 21015 27913 18808 -144 -19473 -27667 -20864 -1917 18341 26827
4888 26827 22260 3711 -17423 -26469 -21937 -5968 14176 25132 22567 6642 -12678 -25336 -22195
4901 -22195 -7781 11201 25055 22498 8965 -9788 -23876 -22859 -9596 9195 23087 23135 11044
4914 11044 -6985 -22752 -24406 -11231 5522 21770 24313 13733 -6232 -21901 -24954 -13911
4926 -13911 3820 20770 26115 15621 -3341 -20290 -25284 -16894 1454 18992 26656 18642 1010
4939 1010 -18482 -26795 -19610 -1792 16902 27297 21396 3342 -15497 -26084 -22801 -6594 14701
4952 14701 27429 24771 7452 -12606 -25695 -24888 -9804 10280 25564 26134 11173 -8462 -24350
4965 -24350 -25558 -13844 6505 23609 27452 15862 -3851 -21981 -27239 -16768 2989 21023
4977 21023 26284 19018 -410 -19073 -26146 -18424 -859 17414 25295 19329 3098 -15744 -26449
4990 -26449 -20038 -3181 14510 23793 20380 4116 -14040 -24762 -21334 -4907 13065 24241 21229
5003 21229 5812 -11595 -24387 -22209 -8004 11105 24787 23565 8460 -11854 -24308 -23834 -9359
5016 -9359 9620 24231 25147 11814 -7583 -22117 -26084 -12746 6594 23682 26349 15595 -5430
5029 -5430 -21741 -27894 -17559 1635 20483 28414 19232 -450 -19052 -27775 -20097 -2663 17511
5042 17511 27737 21735 4573 -15098 -25471 -22225 -5698 14497 26242 23246 6553 -11472
5054 -11472 -24874 -22626 -8837 10520 23808 23807 11041 -8987 -23255 -24211 -11313 6839 22327
5067 22327 24818 11833 -5985 -21183 -23799 -12765 4724 19841 23526 13676 -4977 -19751 -23967
5080 -23967 -15072 3182 18993 23848 16071 -1109 -18176 -23320 -17447 -6 17663 26129 17604
5093 17604 1506 -17061 -24826 -19807 -2149 16126 25749 20392 3837 -14410 -26160 -22240 -6504
5106 -6504 14085 26289 23647 9300 -12005 -24913 -25168 -11237 8888 24721 25049 12213 -7727
5119 -7727 -22930 -26053 -14456 5021 22443 26428 15917 -3660 -20818 -26435 -17977 1884 18908
5132 18908 25387 17887 780 -17852 -25175 -18922 -1020 15913 25311 20786 2051 -14922 -24504
5145 -24504 -20216 -4597 14417 24211 20645 6072 -13324 -23384 -20709 -6606 11032 23719 21107
5158 21107 8555 -11069 -22804 -22188 -9138 10145 22534 22540 8734 -9452 -21659 -22652 -11635
5171 -11635 7965 21537 24266 12549 -6196 -21775 -26210 -13742 5316 20589 26755 16625
5183 16625 -3485 -19757 -25410 -16685 1637 19348 27367 18397 109 -18119 -27041 -20155 -2431
5196 -2431 16161 26289 21206 4601 -14166 -26134 -22195 -6005 12936 24511 24013 8806 -11821
5209 -11821 -24386 -24390 -10341 9006 22903 25089 10823 -7323 -21865 -23821 -11437 5925 20358
5222 20358 24484 12981 -4505 -19220 -23672 -13742 3131 19443 22843 16126 -1992 -18088 -24554
5235 -24554 -16289 787 16836 24944 16029 184 -17144 -24428 -16684 -1331 16382 23571 18521
5248 18521 1950 -14103 -23446 -18691 -2882 13842 23521 20601 4544 -12999 -23879 -20930 -6803
5261 -6803 11381 24834 22066 8894 -10585 -24670 -24249 -9734 9603 22744 24366 12475 -8265
5274 -8265 -22479 -25582 -13787 5192 21689 26554 15803 -3275 -20331 -26511 -17344 -388 19394
5287 19394 26419 18420 944 -17259 -25551 -20053 -3359 14064 24318 19650 5377 -14084 -24700
5300 -24700 -20477 -6770 11814 22715 20321 8039 -11145 -21494 -20972 -8016 9389 21785 21746
5313 21746 9027 -9085 -21733 -22001 -10015 8051 21801 21697 9732 -6473 -20863 -22316 -11373
5326 -11373 6397 20040 23269 13497 -4414 -19382 -23290 -13943 3592 19064 24773 16188 -1372
5339 -1372 -18476 -24764 -17057 996 18641 25300 18656 1361 -17591 -25965 -19510 -3802 16290
5352 16290 25305 21105 4940 -13337 -23608 -21624 -7558 12448 23954 23454 8438 -10718 -23458
5365 -23458 -23240 -11034 8434 23421 24330 13139 -7828 -22876 -23972 -13705 4779 20999 24783
5378 24783 13938 -3930 -18031 -25047 -15822 2133 17200 23881 16026 -619 -16201 -22969 -15762
5391 -15762 -331 15942 23510 16954 1986 -14952 -22263 -16634 -3162 13717 22880 18797 3131
5404 3131 -12393 -21913 -19642 -5229 12860 23552 19945 6472 -12190 -22306 -20196 -7479 10684
5417 10684 22860 21347 8472 -9878 -23599 -23430 -9675 8231 21859 22940 11650 -6259 -22076
5430 -22076 -24615 -13191 4653 21654 24475 14086 -2179 -19445 -25234 -17370 352 17937 25236
5443 25236 18363 1832 -16572 -24231 -19307 -2267 15065 24252 20575 5606 -13113 -24764 -21921
5456 -21921 -5868 11215 22768 21116 8099 -10239 -21982 -21263 -8727 8354 19887 21917 9734
5469 9734 -7026 -19921 -21403 -10997 6881 19512 20941 11491 -5743 -18093 -21209 -12381 4726
5482 4726 18889 21525 12976 -2662 -16882 -22715 -14308 2205 17168 22250 14646 -492 -17859
5495 -17859 -23251 -15966 -202 16636 24285 17489 1261 -14903 -23374 -18647 -2215 14159 23498
5508 23498 19551 4981 -14196 -23519 -20769 -6587 11037 23022 22340 8494 -9823 -22460 -23902
5521 -23902 -10145 7458 22147 22906 12359 -6393 -21137 -24009 -12864 5537 19953 23865 16177
5534 16177 -2067 -18544 -23361 -15125 1063 16856 22872 16881 69 -14602 -21301 -16854 -1744
5547 -1744 14351 22397 17188 2432 -14490 -21653 -16928 -3721 12250 21307 17099 4672 -11940
5560 -11940 -21384 -18191 -5216 10707 21138 19359 5991 -10399 -20800 -20168 -6621 9927 21268
5573 21268 18935 8396 -8843 -20788 -21989 -10078 7372 20795 22628 11435 -5555 -21137
5585 -21137 -23447 -13059 4180 19601 24915 14264 -2603 -17698 -24763 -16597 615 17465 23130
5598 23130 17431 1389 -16020 -23975 -18551 -3685 13630 23761 19417 4075 -11925 -22037 -19742
5611 -19742 -6940 10711 22611 21919 7670 -10162 -20659 -20207 -9711 8055 20016 21327 10817
5624 10817 -6638 -20507 -21329 -11160 5371 19140 21117 12627 -4587 -17676 -20783 -12991 3883
5637 3883 17557 20371 12783 -2401 -16903 -20953 -13144 -108 15747 22142 14814 258 -15491
5650 -15491 -22169 -16165 -1481 14534 21754 16056 2650 -14065 -21731 -18023 -2684 13437 23224
5663 23224 19375 5758 -11960 -22073 -20259 -6666 11469 22892 21436 9104 -9648 -22342
5675 -22342 -21843 -10764 7788 21463 23188 11845 -5724 -20794 -23621 -13596 3980 19706 24126
5688 24126 15181 -2497 -17924 -23695 -16001 692 16886 22580 16581 415 -14973 -22556 -17612
5701 -17612 -1991 13881 21962 18412 3079 -13389 -22159 -18867 -4295 11442 20555 19061 6582
5714 6582 -10431 -20354 -18511 -6888 9454 20363 19816 7421 -8061 -20019 -20217 -8238 8982
5727 8982 20766 19707 8998 -7112 -19172 -20213 -9708 6652 19017 20133 11519 -4461 -18882
5740 -18882 -21707 -12756 3135 18711 22996 14848 -2355 -17483 -23445 -14785 574 16536 22919
5753 22919 17348 520 -15062 -22919 -18653 -2994 14217 22872 19779 4976 -12975 -22395 -20396
5766 -20396 -6899 10118 22033 21185 8069 -8934 -21558 -22332 -10374 7284 19867 21215 11396
5779 11396 -5835 -19075 -22022 -11519 4404 18530 22233 14059 -2522 -16391 -20990 -13853 1144
5792 1144 15757 21643 14303 -1491 -15896 -21596 -14140 427 14872 20843 15516 624 -15350
5805 -15350 -20934 -15361 -1490 12020 21304 16422 2188 -12346 -20805 -17499 -3851 13153 21240
5818 21240 19805 5245 -10890 -21903 -20181 -5764 10177 21022 20003 7393 -8512 -21747
5830 -21747 -21149 -10393 8041 20853 22719 11938 -5272 -19517 -22681 -13948 3359 19388 24652
5843 24652 14938 -2311 -17818 -24053 -16911 586 16697 23012 17333 627 -14821 -22841 -17903
5856 -17903 -3931 12580 22198 17721 4132 -11225 -20872 -17758 -5136 10893 21308 18489 7551
5869 7551 -9276 -20742 -18056 -7301 8121 18213 18708 8280 -7011 -19221 -20188 -7995 6707
5882 6707 18225 20178 9880 -5550 -17896 -19723 -10214 5071 17351 19523 11594 -3748 -17542
5895 -17542 -21542 -12492 3027 17530 20464 14120 -1754 -16369 -22863 -15445 -522 16075 22912
5908 22912 15942 1775 -15037 -23575 -17943 -3340 13703 22771 19512 4729 -11915 -22259 -20592
5921 -20592 -7514 9724 21773 21284 8464 -9658 -21450 -22340 -10186 6987 20503 22240 11077
5934 11077 -5650 -19141 -22835 -12075 3134 16744 22226 14194 -2635 -15415 -21086 -13579 1405
5947 1405 15944 21283 14141 -215 -14412 -20703 -15472 -1289 12408 19837 14946 1906 -12440
5960 -12440 -19184 -15855 -2812 13061 20044 16697 3654 -10442 -19414 -17229 -4667 10454 20079
5973 20079 18297 5784 -9334 -19665 -19264 -6784 8498 19927 20018 8892 -7769 -20310 -21627
5986 -21627 -9660 7231 19940 21624 10626 -5857 -18753 -22040 -12570 3783 18475 22071 14074
5999 14074 -1665 -18215 -23601 -16670 248 15876 23324 17259 1888 -13947 -22139 -17231 -3213
6012 -3213 13184 22125 19526 5217 -11122 -21776 -19266 -7207 9565 20907 19477 8599 -8754
6025 -8754 -20228 -19275 -9076 6793 19015 20351 9143 -5230 -17799 -18997 -10380 4808 16884
6038 16884 19392 10526 -3900 -16684 -19662 -11177 2527 15830 18817 12620 -1822 -15870 -20253
6051 -20253 -13197 2018 14642 20568 13738 -929 -14783 -20541 -14381 -970 14139 21423 16161
6064 16161 1801 -13188 -21080 -17454 -3327 12722 21471 18234 5437 -11442 -20783 -20244 -6851
6077 -6851 8996 20538 20230 8572 -7599 -21169 -20578 -9862 7396 19413 21969 12266 -4200
6090 -4200 -18117 -21863 -13258 3403 18532 21395 15353 -1399 -15296 -21801 -14963 -126 15429
6103 15429 21168 16441 1689 -13326 -20304 -16116 -2438 12809 20141 15943 3102 -11307 -19245
6116 -19245 -15841 -4572 11087 19346 16272 5566 -9192 -18846 -17764 -6506 8669 19142 16556
6129 16556 6735 -7968 -18173 -19302 -8858 7542 18160 19888 9141 -6491 -18694 -19524 -9737
6142 -9737 6187 18064 19907 11667 -3610 -17842 -21729 -13348 3611 17649 23247 14558 -1644
6155 -1644 -15740 -21805 -15312 464 14922 22152 17101 2434 -14134 -22410 -17742 -4225 12436
6168 12436 21843 18521 5500 -10574 -20951 -20294 -6881 9381 21078 19785 7901 -7208 -20040
6181 -20040 -20684 -9735 5799 18147 19365 10113 -5320 -17905 -20181 -11965 3349 16409 20121
6194 20121 12653 -2115 -15554 -19275 -12414 1025 14883 18586 13088 -864 -14512 -19126 -13729
6207 -13729 324 13993 19245 14084 720 -13975 -19951 -16073 -2314 12535 19844 15300 3044
6220 3044 -10844 -19989 -17138 -3181 10969 20238 17217 6438 -10353 -19959 -18014 -6369 9219
6233 9219 19788 19535 8311 -7741 -19335 -21082 -9892 6229 18254 21288 11793 -4080 -18107
6246 -18107 -21195 -13479 1871 17147 20264 13703 -1168 -15531 -20408 -14744 -55 14308 20924
6259 20924 15362 1672 -13427 -20142 -16074 -3442 11733 20696 16814 4662 -10301 -19127 -17187
6272 -17187 -5157 8989 18246 18518 6484 -7307 -17283 -17796 -6744 7109 16281 17289 9065 -6066
6286 -6066 -17469 -16760 -7815 6089 17318 18911 8952 -5200 -16729 -18870 -10482 4327 17271
6299 17271 19388 11718 -3241 -16551 -18661 -12672 2258 15205 20331 14439 -1228 -13668 -20680
6312 -20680 -14831 -692 13894 21292 17119 2662 -14218 -21699 -16965 -3912 11982 20587 19407
6325 19407 6265 -11194 -20630 -19517 -6832 9457 19110 19430 9210 -7120 -18985 -19268 -9555
6338 -9555 6166 17210 20654 11397 -4140 -17354 -19105 -11259 2145 15593 19018 11256 -1903
6351 -1903 -15264 -19266 -13260 541 13655 19770 12864 -254 -13522 -18635 -13989 -1042 13434
6364 13434 18073 14338 1972 -11701 -19831 -15017 -2133 11397 18856 16340 3853 -11143 -19643
6377 -19643 -16457 -3538 9866 18975 17635 6117 -8907 -18908 -17836 -6126 8175 18562 18600
6390 18600 7300 -7221 -18515 -18965 -9383 5673 17714 20234 11849 -5153 -16349 -20806 -12338
6403 -12338 2014 15859 20763 14229 -616 -15102 -20785 -14991 -1157 14095 19654 16239 2235
$$ [...]
65535f03
##END NTUPLES=NMR FID
##END=
