##TITLE=F19
##JCAMPDX= 6.0         $$ Bruker NMR JCAMP-DX V2.0
##DATA TYPE= NMR SPECTRUM
##DATA CLASS= NTUPLES
##ORIGIN= UXNMR, Bruker Analytische Messtechnik GmbH
##OWNER= root
$$ XWIN-NMR		Version 3.5
$$ Mon Feb 22 10:43:45 2016 Russian Standard Time (UT+4h)  servis@DPX200
##.OBSERVE FREQUENCY= 188.287591
##.OBSERVE NUCLEUS= ^19F
##.ACQUISITION MODE= SIMULTANEOUS
##.ACQUISITION SCHEME= undefined
##.AVERAGES= 16
##.DIGITISER RES= 16
##SPECTROMETER/DATA SYSTEM= spect
##.PULSE SEQUENCE= zg
##.SOLVENT NAME= CDCl3
##.SHIFT REFERENCE= (INTERNAL, CDCl3, 0, 78.8432)
##AUDIT TRAIL= $$ (NUMBER, WHEN, WHO, WHERE, WHAT)
$$ ##TITLE= Audit trail, XWIN-NMR		Version 3.5
$$ ##JCAMPDX= 5.01
$$ ##ORIGIN= Bruker BioSpin GmbH
$$ ##OWNER= servis
$$ F:/spectra/data/servis-vadim/nmr/F19/1/pdata/1/auditp.txt
$$ ##AUDIT TRAIL=  $$ (NUMBER, WHEN, WHO, WHERE, WHAT)
(   1,<2016-02-22 10:42:47.75 +0400>,<servis>,<DPX200>,
      <created by zg, POWCHK disabled, PULCHK disabled
       configuration hash MD5:
       00 E9 B6 7A A2 85 ED C7 34 08 36 98 17 FE 4E 26
       data hash MD5: 128K
       9D 76 DF 32 02 C3 4A BF 76 93 F5 29 DB 24 37 D6>)
(   2,<2016-02-22 10:42:51.06 +0400>,<servis>,<DPX200>,
      <Start of raw data processing
       efp BC_mod = 2 LB = 0.3 FT_mod = 6 PKNL = 1 PHC0 = 855.1305 PHC1 = 26.2648 SI = 128K 
       data hash MD5: 128K
       8A A2 2D C7 E0 C4 BE 42 17 05 C9 74 62 E0 C5 CC>)
(   3,<2016-02-22 10:43:06.89 +0400>,<servis>,<DPX200>,
      <pk PHC0 = -5.2 PHC1 = 0 
       data hash MD5: 128K
       37 93 E9 8E B5 23 C0 54 BB DF AE 85 BA CB BC BC>)
$$ ##END=
$$ 
$$ hash MD5
$$ 0F 0C 1C 02 CF 8B 38 B0 8C 20 74 F3 BA AA CD 3D
##$RELAX= 
##$RELAX= 
##$RELAX= 
##$RELAX= 
##$RELAX= 
##$RELAX= 
$$ Bruker specific parameters
$$ --------------------------
##$DU= <F:/spectra>
##$EXPNO= 1
##$NAME= <F19>
##$PROCNO= 1
##$TYPE= <nmr>
##$USER= <servis-vadim>
##$AMP= (0..31)
100 100 100 100 100 100 100 100 100 100 100 100 100 100 100 100 100 100 
100 100 100 100 100 100 100 100 100 100 100 100 100 100 
##$AQSEQ= 0
##$AQ_mod= 1
##$AUNM= <au_zg>
##$AUTOPOS= <>
##$BF1= 188.310338
##$BF2= 200.13
##$BF3= 200.13
##$BF4= 200.13
##$BF5= 200.13
##$BF6= 200.13
##$BF7= 200.13
##$BF8= 200.13
##$BYTORDA= 1
##$CFDGTYP= 0
##$CFRGTYP= 5
##$CHEMSTR= <none>
##$CNST= (0..31)
1 1 145 1 1 1 1 1 1 1 1 1 1 1 1 1 1 1 1 1 1 1 1 1 1 1 1 1 1 1 1 1 
##$CPDPRG= <>
##$CPDPRG1= <>
##$CPDPRG2= <>
##$CPDPRG3= <>
##$CPDPRG4= <mlev>
##$CPDPRG5= <mlev>
##$CPDPRG6= <mlev>
##$CPDPRG7= <mlev>
##$CPDPRG8= <mlev>
##$CPDPRGB= <>
##$CPDPRGT= <>
##$D= (0..31)
0 1 0 0 0 0 0 0 0 0.06 0 0 2e-05 0 0 0 0.0002 0 0 0 0 0 0 0 0 0 0 0 0 
0 0 0 
##$DATE= 1456123367
##$DBL= (0..7)
120 120 120 120 120 120 120 120 
##$DBP= (0..7)
150 150 150 150 150 150 150 150 
##$DBP07= 0
##$DBPNAM0= <>
##$DBPNAM1= <>
##$DBPNAM2= <>
##$DBPNAM3= <>
##$DBPNAM4= <>
##$DBPNAM5= <>
##$DBPNAM6= <>
##$DBPNAM7= <>
##$DBPOAL= (0..7)
0.5 0.5 0.5 0.5 0.5 0.5 0.5 0.5 
##$DBPOFFS= (0..7)
0 0 0 0 0 0 0 0 
##$DE= 6
##$DECBNUC= <off>
##$DECIM= 2
$$ [...]
##$SUBNAM3= <"">
##$SUBNAM4= <"">
##$SUBNAM5= <"">
##$SUBNAM6= <"">
##$SUBNAM7= <"">
##$SUBNAM8= <"">
##$SUBNAM9= <"">
##$SW= 399.325146843118
##$SWIBOX= (0..15)
0 1 0 0 0 0 0 0 0 0 0 0 0 0 0 0 
##$SW_h= 75187.969924812
##$TD= 131072
##$TD0= 1
##$TE= 0
##$TE2= 300
##$TE3= 300
##$TEG= 300
##$TL= (0..7)
120 120 120 120 120 120 120 120 
##$TP= (0..7)
150 150 150 150 150 150 150 150 
##$TP07= 0
##$TPNAME0= <>
##$TPNAME1= <>
##$TPNAME2= <>
##$TPNAME3= <>
##$TPNAME4= <>
##$TPNAME5= <>
##$TPNAME6= <>
##$TPNAME7= <>
##$TPOAL= (0..7)
0.5 0.5 0.5 0.5 0.5 0.5 0.5 0.5 
##$TPOFFS= (0..7)
0 0 0 0 0 0 0 0 
##$TUNHIN= 0
##$TUNHOUT= 0
##$TUNXOUT= 0
##$USERA1= <user>
##$USERA2= <user>
##$USERA3= <user>
##$USERA4= <user>
##$USERA5= <user>
##$V9= 5
##$VALIST= <valist>
##$VCLIST= <CCCCCCCCCCCCCCC>
##$VD= 0
##$VDLIST= <DDDDDDDDDDDDDDD>
##$VPLIST= <PPPPPPPPPPPPPPP>
##$VTLIST= <TTTTTTTTTTTTTTT>
##$WBST= 1024
##$WBSW= 4
##$XGAIN= (0..3)
0 0 0 0 
##$XL= 0
##$YL= 0
##$YMAX_a= 192246
##$YMIN_a= -131175
##$ZGOPTNS= <>
##$ZL1= 120
##$ZL2= 120
##$ZL3= 120
##$ZL4= 120
##$ABSF1= 0
##$ABSF2= 0
##$ABSG= 0
##$ABSL= 0
##$ALPHA= 0
##$AQORDER= 0
##$ASSFAC= 0
##$ASSFACI= 0
##$ASSFACX= 0
##$ASSWID= 0
##$AUNMP= <proc_1d>
##$AZFE= 0.1
##$AZFW= 5
##$BCFW= 0
##$BC_mod= 2
##$BYTORDP= 0
##$COROFFS= 0
##$CY= 12.5
##$DATMOD= 1
##$DC= 0
##$DFILT= <>
##$DTYPP= 0
##$F1P= 11.0000006437302
##$F2P= -0.999999642372123
##$FCOR= 0.5
##$FTSIZE= 131072
##$FT_mod= 6
##$GAMMA= 0
##$GB= 0
##$INTBC= 1
##$INTSCL= 1
##$ISEN= 128
##$LB= 0.3
##$LEV0= 0
##$LPBIN= 0
##$MAXI= 10000
##$MC2= 0
##$MEAN= 0
##$ME_mod= 0
##$MI= 0
##$NCOEF= 0
##$NC_proc= 0
##$NLEV= 6
##$NOISF1= -64
##$NOISF2= -76
##$NSP= 0
##$NTH_PI= 0
##$NZP= 0
##$OFFSET= 78.84318
##$PC= 1
##$PHC0= 849.9305
##$PHC1= 26.2648
##$PH_mod= 1
##$PKNL= yes
##$PPARMOD= 0
##$PSCAL= 4
##$PSIGN= 0
##$REVERSE= no
##$SF= 188.310338
##$SI= 131072
##$SIGF1= -61
##$SIGF2= -64
##$SINO= 44.63387
##$SIOLD= 32768
##$SREGLST= <1H.CDCl3>
##$SSB= 0
##$STSI= 131072
##$STSR= 0
##$SW_p= 75187.9699248119
##$SYMM= 0
##$S_DEV= 0
##$TDeff= 131072
##$TDoff= 0
##$TI= <>
##$TILT= no
##$TM1= 0
##$TM2= 0
##$TOPLEV= 0
##$USERP1= <user>
##$USERP2= <user>
##$USERP3= <user>
##$USERP4= <user>
##$USERP5= <user>
##$WDW= 1
##$XDIM= 131072
##$YMAX_p= 332356747
##$YMIN_p= -671024
$$ End of Bruker specific parameters
$$ ---------------------------------
##NTUPLES= NMR SPECTRUM
##VAR_NAME=  FREQUENCY,     SPECTRUM/REAL,   SPECTRUM/IMAG
##SYMBOL=    X,             R,               I
##VAR_TYPE=  INDEPENDENT,   DEPENDENT,       DEPENDENT
##VAR_FORM=  AFFN,          ASDF,            ASDF
##VAR_DIM=   131072,        131072,          131072
##UNITS=     HZ,            ARBITRARY UNITS, ARBITRARY UNITS
##FACTOR=    0.573643063109398, 1,           1
##FIRST=     14846.9854596478, 0,            0
##LAST=      -60340.9844651641, 0,           0
##MIN=       -60340.9844651641, -671024,     0
##MAX=       14846.9854596478, 332356747,    0
$$ Real data points
##PAGE= N=1
##DATA TABLE= (X++(R..R)), XYDATA
$$ [...]
84606b15384j45740j9092K19998q5638m9798n3220K9673j40511L754M3459J06834
84595c05665j1318P3772n4043k23975Q5328q9387l1147L0511R0414J11872J38949
84584a84689L590j6226L0027M4392o5909l7065l0185r0445M8898P3977k33635
84573d57270j2445Q5095J61055M0741p7468j60749j26081M1391K23219q295o7572
84562c58379L5649n8298Q4955J19894K5702J296j27587j62632J47886J45499k41438
84551c87453N6998M5440q4206P1989O5417j21987R8369j04588L8050L0378M7074
84540b44519l2964L2043j83710L6474J90947j21726n1918J54401K9525o5562J64651
84529i2358k39208k702R1294m0919L6287n3089J2765j0643J6613J8849J2914j54985
$$ y = [-215384, -361124, -380216, -160218, -245856, -295654, -348874, -319201, -459712, -455958, -412499, -305665, -316983, -243211, -297254, -521229, -435901, -525288, -556435, -525924, -435510, -323638, -184689, -181099, -197325, -167298, -122906, -188815, -225880, -256065, -346510, -297612, -223635, -457270, -469715, -384620, -223565, -182824, -260292, -421041, -547122, -505731, -282512, -290807, -358379, -322730, -381028, -296073, -176179, -150477, -149181, -276768, -439400, -291514, -146015, -387453, -330455, -285015, -369221, -297232, -231815, -353802, -255433, -360021, -321971, -291593, -244519, -277483, -245440, -429150, -392676, -201729, -323455, -375373, -220972, -191447, -257009, -92358, -331566, -334268, -242974, -283893, -247606, -300695, -287930, -298573, -281960, -263111, -250197, -405182]
84517d05182J12379J5233N7521n9401q3949r0658m0162J35368P7785j05146J2175
84506c74037o8352p8378J55753J05302o2527J02077P1823k29096J18671J8025
84496b40739j86107L342J48862J26171j81372j34701J34213L9098l9213J19692
84486b10754K7648q5161n0498L2281J0094l8981l5241J09745K4257J01143o4368
84475a79835j65051R3244J29647p2237O153q4188j4384n7340J22117j26195N9895
84464b88174n8794j16880K7447J55705N5134k4973J22984k09464O4390L4530J34611
84453a03484j93424l5496p082j8155l5089P3882L0663o2232R6055L5684j90206
84442d08884K7423O0701k5277L0009K4932j35922J56468n7694o9106J77577p6734
$$ y = [-405182, -292803, -277570, -220049, -279450, -363399, -454057, -494219, -358851, -281066, -386212, -374037, -442389, -520767, -365014, -259712, -322239, -220162, -148339, -377435, -258764, -240739, -426846, -423504, -274642, -148471, -329843, -464544, -330331, -291233, -330446, -210754, -183106, -268267, -318765, -286484, -276390, -315371, -350612, -240867, -216610, -115467, -179835, -344886, -251642, -121995, -194232, -188079, -272267, -286651, -343991, -221874, -348069, -288174, -346968, -463848, -436401, -280696, -225562, -250535, -127551, -337015, -272625, -238095, -103484, -296908, -332404, -339486, -357641, -392730, -318848, -288185, -350417, -254362, -218678, -408884, -381461, -320760, -346037, -316028, -291096, -427018, -270550, -328244, -397350, -219773, -296507]
84431b96507j377R6600j20718J37533q8430j55944J49841O6694p6464p75L5083
84420b54464m5166l8640J61171j29526l681L4078J83903k50215J77889j80959
84410c45610l0686N5482j9157r6082M6148K57210j88208P673j7301O6600l6237
84399c00168K945J69950j74035Q5438N12j44440j47017K22341K8365K7393J6241
84388b12475j25573O613r4586k154J0360j3164J49057j71700J52829j10393O1016
84377c50170Q8740k737p6956j63119K25176o6763o946R9032q1135J07824Q4433
84366a42621j76762K9092l475N792P736Q2179r4842n8047l3037J09477n2944j7800
84354c45252j5466J97708q5974j75439n9229R3472J61927r4248J6073o6204p8460
$$ y = [-296507, -297884, -201284, -322002, -184469, -272899, -428843, -279002, -212308, -288772, -289547, -254464, -299630, -338270, -177099, -306625, -310306, -276228, -92325, -342540, -164651, -345610, -376296, -320814, -339971, -436053, -389905, -132695, -320903, -313230, -330531, -263931, -300168, -297223, -127273, -301308, -215870, -215358, -359798, -506815, -284474, -256109, -228716, -212475, -338048, -331435, -426021, -428175, -417815, -430979, -281922, -453622, -300793, -411186, -350170, -261430, -264167, -341123, -504242, -279066, -345829, -352775, -253743, -334878, -227054, -142621, -319383, -290291, -293766, -287974, -280238, -198059, -292901, -350948, -383985, -274508, -327452, -345252, -360718, -163010, -248984, -424423, -483652, -390180, -228253, -322501, -306428, -372632, -451092]
84343d51092l5496J82336M416N9780n1885J7422J7312K1602k08066J44653L6155
84332b62863j78801K82918j35064l6888Q09N2655K4458k41900J79541J6895O0929
84321b37311Q0265q1061j38272L1623J55343r478l9536k11844R5340L3385J80724
84310a40822j56572P4787p6862N7279q1890J35727m8355q296M2565m6898p6108
84299c25445n9171O296J41348N5756P0754J29323j07440k37416k06096J50646
84289c81445J63067J07533k09849Q2585j8702k5969k654Q5062n8308l0813k0429
84278c09922M8008m4930M5331Q0087j30357L0186j63271K2606j6418K80234Q4532
84267g3914q6649k25494m5774P9228J19608J06598j27918m2460j46877J78981
$$ y = [-451092, -486588, -304252, -299836, -240056, -291941, -274519, -257207, -235605, -443671, -299018, -262863, -441664, -158746, -293810, -330698, -329889, -277234, -252776, -494676, -315135, -298240, -237311, -157046, -238107, -376379, -344756, -189413, -198891, -238427, -450271, -354931, -321546, -140822, -297394, -222607, -299469, -242190, -324080, -188353, -236708, -245004, -202439, -249337, -325445, -384616, -378320, -236972, -181216, -110462, 18861, -88579, -325995, -532091, -381445, -218378, -110845, -320694, -238109, -256811, -282780, -285434, -200372, -258680, -289493, -309922, -261914, -306844, -261513, -181426, -311783, -281597, -444868, -422262, -438680, -158446, -73914, -160563, -386057, -431831, -352603, -232995, -126397, -254315, -296775, -443652, -264671]
84257b64671j38678J82909m1294j88623P1719J4794K175M8113j15829K02524j239
84246b28100k9567m3315Q6536j79323J4910n0150Q9505Q3339k5333J28772p2214
84235b24940k37241L0362m905J92115j9696j46926J37064j04103L2131p66K3324
84224c23581r7344K42513k22295j9962J54701j00977m205j00246J20115j3806
84214c65087l966r4715N5364r8284J67048N7713j75562K26824n4603l8143J46311
84203a77100q8045k9053K7140l9863n2360l5275J30497j591j50475J01155J48270
84192a66700j79098J4771r9079K30090l0866j35019J11190l4862N2335j8513j94897
84181d50648J21196J79625j01021P5623m5749j28864m9148o285N1556o9587K07326
$$ y = [-264671, -403349, -220440, -261734, -450357, -378638, -363844, -361669, -313556, -429385, -226861, -228100, -257667, -300982, -214446, -393769, -378859, -429009, -339504, -256165, -281498, -152726, -224940, -462181, -431819, -436724, -244609, -264305, -411231, -274167, -378270, -346139, -346905, -323581, -420925, -178412, -400707, -420669, -265968, -366945, -371150, -471396, -351281, -365087, -369053, -463768, -408404, -506688, -339640, -281927, -457489, -230665, -285268, -323411, -177100, -265145, -294198, -267058, -306921, -359281, -394556, -264059, -265650, -416125, -314970, -166700, -345798, -331027, -430106, -200016, -230882, -365901, -254711, -289573, -237238, -255751, -450648, -329452, -149827, -250848, -175225, -220974, -349838, -398986, -405271, -353715, -423302, -215976]
84170b15976O162l4208j21135J8465j04347J65673p0218O1922J23747l80835O845
84159e43905J45881l1428J26756J37182r0199o7657J8023P2649J40090O9183q6126
84148a09551j89795o8348J1861O8247j18745m7975n9525K90624j19460m1585J61653
84137b22599J01795j46843J2614m6879N7217l5358L171Q7405K517J9642j03086
84126b70404m9829M2698j68310J22400p413Q3996K057l3315j8369J9053m8187
84115c25623K4986n2139j89071N5949L01760p392K4756j41623n8365J01889L0727
84104b34146o3032N1244P2267j067r4788R4294k8613M4634p8814p7161J17610
84093a97572k8245o7068L0935L4297J3696n3797J04560l4868N1815O1248m5338
$$ y = [-215976, -209814, -244022, -365157, -346692, -451039, -285366, -355584, -293662, -169915, -550750, -543905, -398024, -429452, -302696, -165514, -255713, -323370, -305347, -232698, -92608, -23425, -109551, -299346, -367694, -355833, -287586, -406331, -454306, -513831, -223207, -342667, -384252, -222599, -120804, -267647, -255033, -301912, -244695, -280053, -276882, -189477, -186960, -167318, -270404, -320233, -277535, -445845, -323445, -330858, -246862, -244805, -278120, -296489, -277436, -325623, -300637, -352776, -541847, -485898, -184138, -191530, -166774, -308397, -366762, -264873, -234146, -297178, -245934, -173667, -174734, -269522, -175228, -203841, -159207, -238021, -315182, -197572, -225817, -292885, -261950, -227653, -213957, -267754, -163194, -198062, -146247, -84999, -130337]
84082a30337k11244m6604J65521l2375p0992J47105k03306R0867P4899r3087o7619
84071c77172J5732N4413J72409q085R0911k76499O4861J0759k4219j8192j78498
84060d73580J42934J61820o8871r8988p0056K00510o8922j66143O5961J2430M4655
84049c18250J38393j37852K4731k766r5582K5206Q8260Q2558j33340m3696J65959
84038b06379O055n0366N618o6324N2820M8033l9711j548j21028M4400L8965M6949
84026b42516J31724j21103j62589M0268J9559l3839J15687p9151p37Q63j32397
84015d64231o6694J90036j0216J50090q9542N0853o374j16676j2423L6943K11555
84004a26679k07013M6220R325j57003J11258j07506K0171p8332m979J37894Q0262
$$ y = [-130337, -341581, -388185, -222664, -255039, -326031, -178926, -382232, -291365, -216466, -309553, -377172, -361440, -307027, -134618, -142703, -51792, -328291, -263430, -252671, -276890, -295082, -473580, -330646, -168826, -237697, -336685, -406741, -206231, -275153, -441296, -375335, -362905, -318250, -179857, -317709, -292978, -295744, -391326, -366120, -277860, -195302, -328642, -372338, -206379, -200324, -250690, -245072, -311396, -258576, -210543, -250254, -251802, -372830, -328430, -289465, -242516, -110792, -231895, -394484, -354216, -334657, -368496, -252809, -331960, -332697, -331834, -464231, -530925, -340889, -351105, -201015, -290557, -239704, -246078, -362754, -375177, -338234, -126679, -333692, -287472, -278147, -435150, -323892, -431398, -411227, -489559, -494538, -356644, -276382]
83993b76382j24463l6220K03367J6935k71860J34730J2787P1974j57349M379K00617
83982b21485p8496M2767J7891p2940N914J52443k28087R226J83227m2914r1799
83971c24253q5883j3501k17593K37301O2769j04264r0393K96374l8462l7940J7849
83960b97996l6476j3289L4431r6319k039J03511l3589J38294l9558K1135k0802
83949b42697K0591J1246j8352M7411j99904K8812K24547j64456q7414J33266M9360
83938a97590l2031O2312r6706j26581J08945J40667q7072n1699N063k06793K12750
83927b68735L8429q5311l0429j37372K5053J75690P1238k22386J91350J1056N75
83916b30842J57039j45013m2455n7385l471r1981J43727l962K8696o6674k7009
$$ y = [-276382, -400845, -437065, -233698, -216763, -488623, -353893, -341106, -269132, -426481, -422102, -221485, -299981, -257214, -239323, -312263, -306349, -153906, -381993, -372767, -189540, -232454, -324253, -410136, -423637, -641230, -403929, -341160, -445424, -535817, -239443, -277905, -315845, -297996, -334472, -347761, -313330, -409649, -411688, -308177, -341766, -203472, -243030, -221895, -242697, -222106, -210860, -229212, -181801, -381705, -352893, -128346, -292802, -380216, -246950, -197590, -229621, -167309, -264015, -390596, -281651, -140984, -228056, -279755, -274692, -481485, -268735, -230306, -315617, -346046, -483418, -458365, -282675, -211437, -433823, -242473, -231417, -230842, -73803, -218816, -261271, -318656, -322127, -414108, -270381, -274343, -245647, -312321, -339330]
83905c39330o3174J08866M3487j38751M205j3081J30049N1349L4055q9030k25123
83894d96478M9204K22374r8845n3908l502o01K08418j45569M508L1443K4224n758
83882b64490q7847J76289L6537j62749m7928J32831J3027R1797j15947k0822Q9467
83871a59835o8893j0912j30245N6086j86998o7246K70028j22531l2459J72024
83861b80981L6331j37430m1162m7936K72078k49400P2538J62612n1202p7628l1228
83850c73408R0807K161k6392J52779j63273L5588O4096q7109Q4266j14881k4649
83839c60015L6890J62413q9284j42100k6661J04708r828l7706Q9135J13656j17049
83828b75841j63257K44772K9589k11102J8656j2808r2926J74167o8828Q9326J434
$$ y = [-339330, -402504, -293638, -250151, -388902, -384697, -397778, -267729, -216380, -182325, -271355, -496478, -447274, -224900, -323745, -377653, -381155, -381756, -173338, -318907, -314399, -282956, -258732, -264490, -352337, -176048, -139511, -302260, -350188, -217357, -204330, -112533, -228480, -249302, -159835, -228728, -239640, -369885, -313799, -500797, -568043, -298015, -420546, -453005, -280981, -244650, -382080, -423242, -471178, -199100, -448500, -375962, -213350, -264552, -342180, -373408, -282601, -280440, -306832, -154053, -317326, -281738, -217642, -304751, -220485, -335366, -360015, -323125, -160712, -249996, -392096, -418757, -314049, -323877, -361583, -272448, -158792, -275841, -439098, -194326, -164737, -375839, -357183, -369991, -462917, -288750, -357578, -268252, -266818]
83817b66818n8952J44335p1124j40389K3673k0326P7487R3012J8218q1616n0426
83806c32926j759K7944r0085K1049k1123J54778j18561N6005o2267M2684Q917
83795c15344j20267k1330Q2857Q1956q577j5993Q6260r4769J69025k03358k44
83784c59784Q1646J2312j3730P7900m0405j41289O5221m7772j59540P6843L5675
83773d12923J79009j49961R207Q8558r6232P8319p4087J20271K7714j20876K14447
83762a36554j62438k78475J25869R9952J3519L5792O0551K057m8201m5726j69911
83751e03565J05643K9200K4277l9675J2941J88708p8089j2872l3697L8860q0409
83740c48678k1515R253J83767j42673j13450j31968L37594j39379j2506p4800
$$ y = [-266818, -325770, -181435, -252559, -392948, -369275, -389601, -312114, -219102, -200884, -282500, -332926, -334685, -306741, -396826, -375777, -396900, -242122, -360683, -304678, -366945, -324261, -315344, -435611, -456941, -374084, -292128, -300705, -316698, -230438, -325207, -156182, -359540, -359784, -278138, -265826, -279556, -201656, -242061, -383350, -318129, -365901, -525441, -448598, -412923, -233914, -383875, -374668, -286110, -382342, -304023, -378110, -257839, -230125, -351001, -136554, -298992, -577467, -451598, -351646, -338127, -302335, -241784, -239727, -287928, -333654, -503565, -397922, -368722, -344445, -384120, -371179, -182471, -260560, -273432, -307129, -268269, -348678, -370193, -360940, -177173, -319846, -433296, -565264, -227670, -367049, -379555, -454355]
83730d54355J34009L5679P6828j67413J5752M8797n7784n8271J33778m0430O8660
83719b64750j13803J24307L4798j32093M0280J37485n1038j36779M2526J33165
83709a85902j23594L7314p434j01783j3178L9571O2121j20237J11782J07077j21271
83698c15534r7976J06354k4005m1492K40631j0424M5227r0015l64675K19624J45994
83687a86291j76107l344P2565j28934J35283k1466K7410m6643J02726j08156j36910
83676d69867n1519J44425j13468R2032K12359q3205O3552L3000n6789l0807r2747
83665c53034j91629K72046L6314m0696j21766J06503l2670j47890M2177K40714
83655a89931j02890J2755m2110j5912K05347j69109n3465k805J10027k5710j24557
$$ y = [-454355, -320346, -284667, -207839, -375252, -359500, -310703, -368487, -426758, -292980, -333410, -264750, -378553, -254246, -219448, -351541, -311261, -173776, -224814, -361593, -319067, -185902, -309496, -272182, -279616, -381399, -394577, -355006, -292885, -413122, -301340, -194263, -315534, -413510, -307156, -331161, -372653, -132022, -142446, -97219, -187234, -551909, -332285, -186291, -362398, -365742, -293177, -422111, -286828, -308294, -280884, -327527, -224801, -332957, -469867, -521386, -376961, -490429, -398397, -186038, -269243, -205691, -172691, -229480, -260287, -353034, -544663, -272617, -236303, -276999, -398765, -292262, -324932, -472822, -430645, -189931, -292821, -280066, -322176, -338088, -132741, -301850, -355315, -358120, -248093, -273803, -398360]
83644c98360O2059J10373j99652R6439J1038M3930p6367l6645P4063N4284j63698
83633d22536J43167q9297O2632L8428k68311J31425J0153K21872q9237n2900n7947
83622c72551L7802J59073R818n0985r1652M3690j3001m1108o1300J65205j36503
83611c51512k28377L38752j09392L5858K69316l52657K31686J4913q047j60313
83601c19773n6732j38983J49953K8385R742m9512N6778J40810k17335q5379J42610
83590c39436k4174J9688n4490N3576P7874q7297m4046O564o0790K26605j75341
83579d01267J46064k09334N753n819K9513O204J36029J20145p8595j32480J0785
83568c73002J23986j19059j2026R4340j9366P9387L6041J206j79952n5666m7067
$$ y = [-398360, -336301, -225928, -425580, -329141, -318103, -274173, -350540, -387185, -313122, -258838, -422536, -279369, -368666, -306034, -267606, -535917, -404492, -394339, -172467, -261704, -314604, -372551, -334749, -175676, -165858, -216843, -308495, -264805, -277806, -318914, -380214, -215009, -351512, -579889, -241137, -350529, -314671, -45355, -398012, -166326, -151413, -159460, -319773, -376505, -515488, -365535, -337150, -327408, -376920, -320142, -179332, -396667, -482046, -339436, -363610, -343922, -398412, -344836, -266962, -354259, -398305, -391741, -452531, -225926, -401267, -255203, -464537, -458784, -464603, -435090, -428886, -292857, -172712, -251307, -383787, -373002, -249016, -368075, -380101, -285761, -305127, -225740, -189699, -188493, -368445, -424111, -471178]
83557d71178K69917j22182j42294J14964p0490J5661j5916J27193J3428L06j5330
83546b95921L2043L1056J48951k88209j3358J29679j40134j2103P8967R996o2740
83535c81773J07391Q6120n4829j1769P9500j16503j90756K22775M2924n8646q2103
83524c57669l3763R0154K801m5385K5223l4209Q1830q5062l1361K2820l1720P7237
83512c19104Q8944j96351p577K15249j44055j39308k6384N4649J08778J88441
83502a76718l1475j59244L5540K5302k1092P0035J9909K0047k55077L32081L5721
83491a04971j46829m368m6378k9244N9108M4599O7211j27938L6397k6727L719
83480b75421q1686m4220Q8161J89254j52068m1974j02748P7006j53797J60544
$$ y = [-471178, -201261, -323443, -465737, -350773, -421263, -405602, -421518, -294325, -280897, -280591, -295921, -263878, -232822, -83871, -372080, -385438, -255759, -395893, -407996, -329029, -319033, -381773, -274382, -188262, -243091, -254860, -175360, -291863, -482619, -259844, -216920, -275566, -357669, -391432, -301278, -298477, -343862, -318639, -352848, -271018, -356080, -387441, -364621, -396341, -319104, -230160, -426511, -434088, -218839, -362894, -502202, -528586, -473937, -365159, -176718, -208193, -367437, -331897, -306595, -327687, -257652, -237743, -217696, -472773, -140692, -104971, -251800, -256168, -302546, -331790, -272682, -228083, -160872, -288810, -252413, -279140, -275421, -357107, -401327, -313166, -123912, -275980, -317954, -420702, -343696, -497493, -336949]
83470c36949J27315j13591O2833j5617q8619N0184K1504N1829P3873j4312j84639
83459c66189o7844k3840L1805R7672J09234k0573o2131j66800K13247l85P2886
83448a82918p0735o8107q9104j2838J40011O3818Q3826J835r8835p7931J11531
83437a99447l601K4120r9673j7363j76485N5550L2700J50194j44907k102j06510
83426d87524K39589m2555N7475o6960P1544o4330J67274j12824P9455r8497j32411
83415c89764L7912l4355J47089k17698P3183K00511j15692l7066N6543K2914n7859
83404c14282J4038p7181R8595M3290j88169N6951p3516K06492p247J1401Q0220
83393a49408r9034j30975J41407j99311J40879K9680j7312p9725n606P0477L7782
$$ y = [-336949, -209634, -323225, -260392, -276009, -364628, -314444, -292940, -241111, -167238, -181550, -366189, -434033, -457873, -426068, -328396, -219162, -239735, -301866, -468666, -255419, -255804, -182918, -253653, -321760, -410864, -423702, -283691, -219873, -136047, -134212, -233047, -310978, -199447, -203048, -178928, -278601, -295964, -472449, -416899, -384199, -234005, -378912, -381014, -487524, -247935, -290490, -233015, -299975, -228431, -292761, -125487, -238311, -158856, -257353, -389764, -351852, -386207, -239118, -456816, -383633, -183122, -298814, -335880, -279337, -256423, -314282, -300244, -377425, -278830, -235540, -423709, -366758, -440274, -233782, -241029, -229628, -149408, -248442, -379417, -238010, -437321, -296442, -266762, -284074, -363799, -369405, -298928, -261146]
83382b61146k0226j27946N9823Q2703J51487j64987k7222N264m0402k7641M6992
83371c23301j53359J96301k1694J20476k25391Q5453K7757M7821N190L1015o5933
83360b75665j58747Q18O152J63508J30065K6363j00960o4711j28544K8229J22300
83349b51192j70977J31273m5676N084j6413J0393m7494P360M0006p3405Q8776
83338c22265Q0279j21106J38646k297L6425m68q3222j30865J67308J3991l6630
83327b60204j10134J06914j72076L4586Q0811p3159j4221j21635K33046j7788
83317c13860l3456J07529L3278M8082k08252L3343Q2219m1896j6340J35365k98474
83306d72462Q9432N5529O0419j23496O4180N7274Q786j51867J17946O6844k9784
$$ y = [-261146, -281372, -409318, -349495, -266792, -115305, -280292, -307514, -302250, -342652, -370293, -323301, -476660, -280359, -302053, -181577, -406968, -321515, -293758, -245937, -240747, -209732, -275665, -434412, -433594, -427442, -263934, -133869, -107506, -208466, -273177, -401721, -373492, -251192, -422169, -290896, -336572, -331488, -347901, -337508, -385002, -377642, -337636, -411041, -322265, -241986, -363092, -224446, -226743, -190318, -190786, -274008, -404873, -237565, -223574, -260204, -370338, -263424, -435500, -400914, -320103, -393262, -407483, -529118, -296072, -313860, -347316, -239787, -206509, -158427, -366679, -333336, -251117, -293013, -309353, -173988, -472462, -383030, -327501, -267082, -390578, -326398, -269124, -260338, -412205, -294259, -227415, -257199]
83295b57199J3846J24495j07767p7756j3252J09196K761n6144Q1779p5598m1315
83284b96954J04165j02265o8592J42465j52807J02140M2079j17225J18178j6556
83274b45372j29829l7742j65190L06524R9317n9104O4361k26620J49279R3899
83264a50477q9695L9507j83776J13853P7447O9647k52192j20698J05268J59827
83254b31289k1943P7396l5363j31996J53797L6132K490j80698K2412P9669p2812
83243c02205o9573m0734J51252L0502n4201K5636l9120O9485L5001j91065j08803
83232d93825J75469O840O3655K4097O113r7735L6914l8195j9655k5173K3372l7053
83220c75176K57055k38095R8383l5107N3133j68247J6842J70229q5897J06164
$$ y = [-257199, -243353, -118858, -226625, -304381, -317633, -208437, -205676, -261820, -180041, -255639, -296954, -192789, -295054, -363646, -221181, -373988, -271848, -229769, -346994, -228816, -245372, -375201, -412943, -578133, -271609, -172292, -231396, -167035, -393655, -244376, -150477, -240172, -200665, -384441, -270588, -193141, -123494, -375686, -496384, -391116, -231289, -253232, -175836, -211199, -343195, -189398, -153266, -150776, -331474, -309062, -229393, -302205, -371778, -412512, -261260, -230758, -284959, -259323, -298443, -228958, -193957, -385022, -493825, -318356, -311516, -247861, -223764, -217651, -315386, -278472, -316667, -336322, -361495, -338123, -375176, -118121, -356216, -257833, -292940, -239807, -408054, -391212, -220983, -306880, -200716]
83210b00716j77579j1730K36563k15142M2726j20179N7790J89011O4073j06000
83200b41183j86351Q6507r296Q0816l2426Q5549j18450j5620P6867k0746K1940
83189b72393j94008J07258N3330J52957M9850l9502j93486J87028p8288j6269
83179b43523K04080j06268J0700k22138J39495l4053j16188P2823k7876K9105
83169b93843j5950l5498L4001M4315n0176j9181m1150R2371k6656J43728N0529
83158a17510j78051Q629Q8692j48043l294N417l933M8043J16057P4j02029Q4173
83146b01775o7745L8489q9871j44161K60718J12083j2303j38873M025R0929k6524
83135a75008l5653k9645m7600p4746o0366L8325j46175J56500J21110M4117q6232
$$ y = [-200716, -378295, -390025, -153462, -368604, -325878, -446057, -388267, -199256, -135183, -241183, -427534, -341027, -350323, -269507, -301933, -216384, -334834, -350454, -273587, -294333, -272393, -466401, -359143, -305813, -152856, -103006, -142508, -335994, -148966, -227254, -243523, -39443, -145711, -135011, -357149, -217654, -251707, -367895, -295072, -322948, -293843, -309793, -345291, -311290, -266975, -317151, -336332, -377482, -285111, -311767, -168039, -117510, -295561, -286932, -198240, -346283, -349577, -344160, -348093, -300050, -183993, -183919, -285948, -201775, -269520, -231031, -320902, -465063, -204345, -92262, -104565, -243438, -239413, -148484, -175008, -210661, -240306, -287906, -362652, -423018, -384693, -530868, -374368, -253258, -209141, -295373]
83124b95373j09513K1669J24451K0336J07978j10954L4646j09973m1361J75080
83114a83014L3199o8221j61972K36520j14651n1320M1214P2452L0653J5216n1776
83103b01700j43045o983o3339J4958J09138l5546N5853N5268k1698j21902J7283
83092c41713R2591P392K2214j18683J16878J00428j89848K0806Q768j0085o6287
83081c57539j09708J84879J16029J041j05516k2662N8266J1776N1254j47487Q9463
83070b30204K6869q2859M470N2370j17248K35107K685k49313J00902J6655m0Q7477
83058a53129j28352q2028O6575M4979m7545N0591L3290l1299k5676M6047p7557
83047c04104J4569j7254j4430m7113M5177J17184O6K968o3368J74348r5258k0738
$$ y = [-295373, -404886, -383217, -258766, -238430, -130452, -241406, -206760, -316733, -358094, -183014, -149815, -218036, -380008, -143488, -258139, -309459, -268245, -195793, -165140, -149924, -201700, -344745, -351728, -415067, -400109, -290971, -326517, -270664, -215396, -237094, -358996, -341713, -249122, -241730, -219516, -338199, -221321, -120893, -310741, -289935, -281167, -291252, -357539, -467247, -282368, -166339, -165298, -270814, -293476, -235210, -223434, -172180, -319667, -230204, -203335, -286194, -281724, -229354, -346602, -111495, -108810, -358123, -257221, -240566, -240606, -153129, -281481, -363509, -296934, -251955, -299500, -248909, -215619, -246918, -272594, -226547, -304104, -289535, -306789, -321219, -368332, -323155, -205971, -205905, -202937, -266305, -91957, -187215, -207953]
83035b07953J067k6248j08537L7244K5945J27152j24876N2793r7436K0972J34845
83024a65032k26857l7000N5176J84927M7571j29838j3470P6132o4177k0601N1503
83013b41666k8398j06922P6933O1857L929j6980m5312N7915L6425J0049j73313
83002c65483J10228m1046Q187N2097r4622J24168R1581k09948k519J3804N9267
82991b54286j31117r3208J23459M4968j06338J20102Q2515r5185J77664q2676
82981b14102O2451K0348n142j9392j12558N0207j8194Q908o0723J03132K2220
82970a62845Q758q7397j17230Q6581m8029n5674O9093O9916M5682O0695j21511
82959b51961P4503q1480J00594k67929Q9345l2396R7466K6863q7006j03309n9060
$$ y = [-207953, -206886, -233134, -341671, -304427, -278482, -151330, -276206, -223413, -320849, -299877, -165032, -391889, -428889, -373713, -188786, -141215, -271053, -284523, -208391, -272568, -293169, -241666, -270064, -376986, -300053, -238196, -234267, -251247, -296559, -238644, -202219, -192170, -365483, -255255, -296301, -288114, -236017, -330639, -206471, -114890, -324838, -327357, -313553, -254286, -385403, -478611, -355152, -310184, -416522, -296420, -213905, -309090, -131426, -214102, -151651, -131303, -136445, -155837, -268395, -218188, -236382, -227474, -288197, -185065, -162845, -154087, -241484, -358714, -272133, -320162, -375836, -306743, -236827, -191145, -130450, -251961, -177458, -258938, -158344, -426273, -336928, -369324, -271858, -244995, -332001, -435310, -494370]
82948d94370m1065L12378j04367Q9562p0850n9551J11409r0312q6314R2537j5045
82937c55988J61221o0371J87457m2266k15244n6827Q6082l6124O1345J5648P7204
82926a77863m5925K9767j27135L95Q8135j36606J53636R515j64889k6583J16406
82915b81147J3787q3978l4619L13726k20694o8305K02259K3182J8420j58271k6684
82904c02324J40280r3774P4256O5835j85705k9259K5329K12382Q4630j99150j8645
82893b26145l6287k5501J62757j13878p7088N875J06351j1574J00554k29219O0945
82882b83210p9498L1401J71742q3571j78071o1049K11125K26503l18901O8027
82872b95502K9938k4471r6457K44121j53968j54249J75800O0321R897j7318o1766
$$ y = [-494370, -535435, -223057, -327424, -237862, -308712, -368263, -256854, -347166, -433480, -340943, -355988, -194767, -255138, -67681, -109947, -325191, -382018, -295936, -332060, -270715, -255067, -177863, -223788, -194021, -321156, -320761, -232626, -369232, -215596, -206081, -370970, -397553, -281147, -267360, -351338, -385957, -72231, -292925, -361230, -158971, -135789, -117369, -275640, -302324, -162044, -255818, -181562, -115727, -301432, -330691, -305362, -92980, -8350, -207500, -226145, -262432, -287933, -125176, -239054, -316142, -310267, -203916, -215490, -114936, -344155, -283210, -362708, -331307, -159565, -243136, -421207, -482256, -271131, -44628, -363529, -295502, -265564, -290035, -386492, -142371, -296339, -450588, -274788, -214467, -204570, -221888, -283654]
82861b83654J50403k2967p4137j24415M677m0064K269J00489j29861Q2922J58966
82850a75372n6144N2742J40606j75897j97524J55216j79958Q1314J06522J6854
82840b31641l9595Q341P5543k1515j3465j60662P8315j01480J13923p9499R599
82829c62136J24823K8735J4592K0059O5788j12081Q8415j00500n0815k5655J05593
82818b03182q468j20713O8059j61361Q2034M9963K41194p3512k45460k5499K57547
82807a39398l8251J0377j68980K84023k53952J1539R2240q31j18605O8546Q324
82796b44968J05229k77380P1114J36774k0974P5467j01729O0612j07594J36393
82786a67056o5863j9564L3532r3486R1136p9679J57496J57375l07413J24280j01414
$$ y = [-283654, -133251, -156218, -230355, -354770, -350093, -390157, -387888, -287399, -417260, -334338, -175372, -231516, -178774, -38168, -214065, -411589, -256373, -436331, -355017, -248495, -231641, -271236, -262895, -187352, -208867, -222332, -382994, -304679, -406159, -292236, -371735, -362136, -237313, -208578, -193986, -173927, -108139, -220220, -131805, -232305, -283120, -308775, -203182, -211650, -332363, -264304, -425665, -343631, -293668, -52474, -125986, -371446, -396945, -139398, -177649, -167272, -336252, -52229, -306181, -294642, -202402, -203233, -321838, -253292, -244968, -139739, -417119, -346005, -209231, -230205, -154738, -256467, -195855, -303449, -167056, -232919, -252483, -218951, -312437, -221301, -300980, -143484, 13891, -293522, -169242, -270656]
82775b70656m6753M0897k9082L7435M1613j0552j8797P7160R403R3409L382o5902
82763a38443Q287j36135J59883o8763K7854J50155j83136J65919k21664j22366
82753c58409O5542J21882o8280J25551r5690M7334r8516K0178m3103j52749J90658
82742b45602K5127J1396R8484j03445j23499R2975l9846J65570j3336j77313k1505
82731c30994k4212N5687N2786P3134j1345q9685J02255J45006j96613l2304K3952
82720b32333J3722n88m2717j37922J64955j10984k02826L20104R2267p3808r9868
82709c09998M3806M9065M331N5118q7677n8963Q3136L4466L7180k737j27603J6588
82697b63288P3345r2034m2042O0479L6502Q1312R0315j2824p83q3167j51383J19810
$$ y = [-270656, -317409, -276512, -305594, -268159, -226546, -237098, -255895, -178735, -169332, -75923, -72541, -138443, -130156, -266291, -106408, -175171, -147317, 2838, -180298, -14379, -236043, -358409, -292867, -170985, -239265, -113714, -209404, -162070, -260586, -240408, -283511, -436260, -245602, -220475, -209079, -110595, -214040, -337539, -244564, -284410, -118840, -132176, -309489, -330994, -355206, -299519, -246733, -173599, -184944, -274629, -172374, -27368, -223981, -256285, -232333, -218611, -219199, -261916, -399838, -234883, -345867, -548693, -228589, -136322, -210130, -309998, -266192, -217127, -212796, -157678, -245355, -304318, -221182, -186716, -149536, -152273, -279876, -263288, -189943, -281977, -324019, -263540, -227038, -145726, -55411, -68235, -69018, -152185, -303568, -183758]
82685a83758j07278N0512K1369L2665q3818j48060K49748k0253j76249J45761
82675b19361L029o9088j8333K05980j19957M6132n2957j06056J67926J23096N3307
82664A3718j17604l6598j83876l4488J53021J9792N8643j5763L4681N058k13833
82653c17249J23101J09905o6120J4374J03746l8443k5011N6j1086q742r1722j25147
82641c32338K3020L3907M9193N7787j0943j44647J15192o7236m0153p2106J76417
82630b11907j2658o7460N3005L4238O451k0159r2682J59570j1117L5252j01296
82619b28763O8821J7989j33225J78792o3055q6392J05869r0601k00655J20307
82609c10913k1099O1342j17038m5439K13655Q1699l6859j42983J61435q1274R9551
$$ y = [-183758, -291036, -240524, -219155, -186490, -270308, -418368, -168620, -188873, -365122, -219361, -216332, -285420, -303753, -97773, -217730, -171598, -224555, -330611, -162685, -39589, 13718, -103886, -140484, -324360, -358848, -205827, -186035, -127392, -143155, -108474, -103416, -317249, -194148, -84243, -150363, -135989, -32243, -70686, -95697, -95641, -106727, -115469, -207191, -332338, -309318, -275411, -226218, -168431, -179374, -324021, -208829, -276065, -316218, -388324, -211907, -224565, -292025, -239020, -204782, -198331, -218490, -311172, -151602, -162719, -127467, -228763, -159942, -141953, -275178, -96386, -159441, -245833, -139964, -230565, -431220, -310913, -332012, -270670, -387708, -433147, -219492, -137793, -174652, -317635, -156200, -237474, -137923]
82598a37923l02145l5935K43121j20639K48092j14363j4409K17032n7978k50271
82588c25418j11227K6161K37198k756n6820k3376N9448P2593o1373M131n7867
82577b39306J66959P0393k6069j16742P8633q8649J94797k30160j87616Q4923
82567b92837o9655K10484J01810n7164j60754M1536J43195m7592o3343q6025M1120
82556b39225J08885j10230K3051R0739k163j28589N0033J4311P5717q3035j8054
82545b18560L4369j11011J40516r179R881j80364p781J07877q7834j7195K04999
82534a34282k0044r6105J6096j3841J13397o3155K11220j71943j34032J13074
82524a79615q5476q8483R8977R1561q4719N4555j25437J16295K5845M6741j03139
$$ y = [-137923, -440068, -476003, -232882, -353521, -105429, -219792, -234201, -17169, -75147, -325418, -436645, -410484, -173286, -176042, -232862, -256238, -196790, -124197, -185570, -181439, -239306, -72347, -1954, -28023, -144765, -66132, -154781, 40016, -190144, -377760, -292837, -362492, -152008, -50198, -107362, -268116, -226580, -83385, -130977, -194320, -280345, -239225, -130340, -240570, -217519, -126780, -128943, -257532, -207499, -193188, -117471, -200506, -218560, -184191, -295202, -154686, -163865, -153984, -334348, -342129, -234252, -322086, -339281, -134282, -154326, -250431, -234335, -248176, -134779, -197934, 13286, -158657, -292689, -179615, -265091, -353574, -254597, -163036, -247755, -193200, -318637, -202342, -176497, -129756, -232895]
82513b32895P8696n7798Q5823j16367p7435J35048Q4544j72422n4371J4459J3337
82502b99381P9552N7936N4168j63636P1256M3363J223n542Q7887o6307Q892K4090
82490a06499O1114L1548j12355p9796q2236j9187K24847j3432j75595Q3173J4172
82479a74246j51182K44346K1013j57790M0334m482R3988P0968j39198l6772q8925
82468b81946J46493J59964j40434L3152j43593j040J20269L9374j26972P2012
82458a22721p7037M9124l9878m8311J14619j03137P8354m4049l7515p8538J56412
82447a52677N2169j22777K6551n2759K5564K6837P3442J62596q1945p4633J7885
82436i9747o6334p972j6466N9332q4136q3430K33314M2336l3111N3770K9063j15340
$$ y = [-232895, -154199, -211997, -126174, -242541, -319976, -184928, -100384, -272806, -327177, -312718, -299381, -219829, -161893, -107725, -271361, -200105, -156742, -155519, -161061, -73174, -139481, -130589, -106499, -45385, -13837, -126192, -205988, -288224, -307411, -82564, -95996, -271591, -188418, -174246, -325428, -81082, -60069, -217859, -177525, -182007, -88019, -17051, -156249, -193021, -281946, -135453, 24511, -115923, -82771, -226364, -227404, -107135, -67761, -194733, -122721, -199758, -150634, -190512, -238823, -124204, -227341, -148987, -193036, -230551, -309089, -152677, -100508, -223285, -196734, -249493, -223929, -197092, -123650, 38946, -42999, -117632, -99747, -166081, -174053, -190519, -131187, -215323, -298753, -65439, -23103, -56214, -2444, 26619, -88721]
82424h8721j27380O7380R640N3854J17613j76087j2112J5191J7018K4571r5897
82413a94930J09432m3629O5959r821J09155l9455j8967j0525l9938J61330j35504
82402d6893J08395o5920J64412l7449j16797K56067k3149j1822K46604K25729
82392F99177J22760N76766L55655K47066j69694m57899l93271j00836n0948k57069
82382E71707j76940O0394k28364M5434m8234Q5267l85104J53464J12514j34737
82372E5401K8809k21880j18919L70383k48137J36444r5186j8890J03637m5757
82362e4095r1653k68622L0946K58153Q6188J3665J80180k73589o5310J25529J71549
82351A12941j97825j04609J41080k31717P6003J63171k67253J89077J7990K3819
$$ y = [-88721, -216101, -148721, -139081, -85227, 32386, -143701, -155813, -140622, -123604, -99033, -194930, -85498, -129127, -63168, -72989, 36166, -3289, -22256, -32781, -72719, 88611, -46893, 61502, -4418, 159994, 122545, 5748, 261815, 238666, 226844, 473448, 699177, 821937, 1398703, 1754358, 2001424, 1831730, 1373831, 980560, 879724, 828776, 571707, 394767, 455161, 226797, 272231, 223997, 309264, -75840, 77624, 190138, 55401, 84210, -137670, -256589, 113794, -134343, 2101, -93085, -111975, -8338, -54095, -145748, -414370, -383424, -125271, -39083, -25418, 154762, -118827, -184137, -58608, 112941, -84884, -189493, -48413, -280130, -204127, -40956, -308209, -119132, -101142, -77323]
82341g7323L8419l2439j1811J939J10874K8312k15890J45431M9393o8280P9263
82330D7888J41784k28278j3681L5890O4283j24992p0024N3530q7174M2201J16172
82319b2401p9557L7519j57192K430J0890K94098p5271m2437L8382j41184o762
82308a41485K7178j9707J6763o4432O8861J7001k8615k4456k7390J2810K5003
82297a38469Q8308K6133r4475o1499R7701k6828j10346J94701l3238p9647R3931
82286d3728L4189n515j03361j54180N9473J47229L2031L4007q5202M8295o7347
82275a04109J21238n7890J3724L1400p2480J10339j5385p5101j66368J82370j09608
82264a41870J49875K6699k23102m362K31291n4769j32854J44937j9842k19328
$$ y = [-77323, -38904, -71343, -83154, -81215, 29659, 57971, -157919, -12488, 36905, -31375, 47888, 189672, -38606, -52287, -16397, 47886, -77106, -147130, -93600, -180774, -138573, -22401, -101958, -64439, -221631, -219201, -208311, 85787, 10516, -31921, 6461, -134723, -141485, -114307, -134014, -117251, -181683, -112822, -95821, -124436, -148892, -176282, -163472, -138469, -50161, -24028, -118503, -180002, -82301, -109129, -219475, -24774, -58012, -137659, -43728, -9539, -15054, -118415, -272595, -213122, -65893, -33862, 145, -85057, -36762, -104109, 17129, -40761, -27037, 4363, -68117, 42222, 26837, -48264, -214632, -32262, -141870, 8005, 34704, -188398, -192760, 38531, -16238, -149092, -4155, -23997, -243325]
82254b43325O7372Q9500q171o0346R3124m4541j74505N0892J27398Q2143n0041
82243g0500p2762O2036R2522M0773j03142m8338M532n4567M3540R8788R4567k43903
82231a56454J01511N8883J7124j06147r7588J7594J03704Q4261M5255r1872r9860
82220a23589N1417J5281O3856j70068K54330M4133j80828J2828r474p7249P6517
82209d2846N0047N4177r6710l1105L33054j71485j08005M7852j39818K9935M0485
82198c4419j8332O8994m5100j11788J79485P1520j77524M7398j20728J09130n5729
82187h7093m5737J59073j99832J25890J16686J57847j05092j53303Q2686m2823
82177H302L977j0718N0280j7293N4017r7388q0728K5420J40691K6077o7881J6153
$$ y = [-243325, -175953, -86453, -94624, -154970, -61846, -106387, -280892, -230000, -102602, -20459, -70500, -143262, -81226, 11296, 52069, -51073, -99411, -94879, -149446, -105906, -7118, 87449, -156454, -54943, 3940, 21064, -85083, -182671, -165077, -61373, 22888, 68143, -23729, -123589, -72172, -56891, 6965, -163103, 91227, 135360, -45468, -32640, -42114, -119363, -42846, 7201, 61378, -35332, -66437, 266617, 95132, -12873, 34979, -104839, -74904, -34419, -52751, 16243, -28857, -140645, 38840, 110360, -67164, -19766, -140494, -31364, -87093, -132830, 26243, -173589, -47699, 68987, 226834, 121742, -31561, 51125, 8302, 12279, 1561, 51841, 34548, 88565, -8823, -89551, -64131, 76560, 102637, 34756, 50909]
82165E0909o267J9430K0737r6138m5629J1506J06138N1253O142j3817q4118m2882
82153b2736J47213K1310l5150j0851L4347J16563l7516j50466j05207R5194R3541
82142A46242J47849k15982o7823P9660K8749l2413J58717Q1816k83558J24039
82132A67296O0225m3540l2307n470k414j30384P2162O4196l0899n9301Q6910k5911
82120A20563R6857j91232J24436o3940J46094K4011k93218J55828R3581r9274
82110A13706l8561J1509R4383q4283j1123j4881J49711j23714l5929K3554N4754
82099A39126m8208R7934K7002J23915j39269m0341j21502J97090J4010P5648L6245
82088C61650P6190L2816j18690p3242O2987k1019q5190k15065P5441K61140j03386
$$ y = [50909, 44642, 64072, 84809, -11329, -56958, -45452, 60686, 111939, 118081, 104264, 20146, -22736, 124477, 145787, 110637, 99786, 134133, 250696, 213180, 62714, -42493, 52701, 146242, 294091, 78109, 10286, 89946, 118695, 86282, 244999, 326815, 43257, 167296, 227521, 183981, 151674, 146204, 143790, 13406, 85568, 149764, 118865, 59564, 146474, 120563, 217420, 26188, 150624, 86684, 232778, 256789, -36429, 119399, 212980, 113706, 75145, 86654, 181037, 96754, 85631, 70750, 220461, 96747, 60818, 84372, 139126, 90918, 188852, 215854, 339769, 200500, 160159, 38657, 235747, 249757, 325405, 361650, 437840, 470656, 351966, 278724, 341711, 320692, 235502, 20437, 95878, 357018, 253632]
82077B53632J30808k18782J15520N1456o8368J00495j62801J56454J546j10943
82067B49017m3574P771Q9345j95773K33337k7062k01527P8920J37710r5077J21189
82056C54276k9975J42098j07988P1992r5003J14495K81J15974j36998o1571R3023
82045D60604J5376j20731K930N7239m2966N392J78054K7042j48282m6647N5246
82034D43257j3468P1786M3686J4438j24931q1868J50639k2310k79677K25240j5133
82023D11659R6203M2008q7513n9877J01461J15033j06502O8513N0664K2551j1903
82012F42297l1182j6646j5898q811m9432N7137R6820j16548R2721K54433j47696
82001G57195j58510M5692N2431K8747K8474k3450J5283L5286R906O3052K46478
$$ y = [253632, 384440, 165658, 281178, 332634, 264266, 364761, 201960, 358414, 359960, 249017, 205443, 213214, 302559, 106786, 340123, 313061, 111534, 190454, 328164, 233087, 354276, 324301, 466399, 358411, 430403, 335400, 449895, 450176, 566150, 429152, 367581, 460604, 475980, 355249, 358179, 415418, 372452, 377844, 555898, 582940, 434658, 388011, 443257, 429789, 501575, 545261, 559699, 434768, 352900, 503539, 481229, 201552, 426792, 411659, 507862, 549870, 462357, 402480, 503941, 618974, 512472, 580985, 631649, 654200, 642297, 611115, 594469, 578571, 569760, 520328, 577465, 674285, 557737, 650458, 904891, 757195, 598685, 644377, 696808, 725555, 754029, 730579, 745862, 781148, 791054, 854106, 1100584]
81990A100584j40101n6364N0592k28527M1824J17280R011j13196Q1734n3147K20894
81979A030584l54035J9670J50620J60541q2587O8444J4416o1223j5577m42j56835
81968G73576J95971j42787P1457J5979J97547j33336O7251J51675m1404o9908
81958A086021J66036n192j36966O0104R4931l4277k12139O7464J15956j81021
81948A020917K49540o535K76549j09422k6350j06858R6643R7152j25811J67723
81938A533548J28034P2691q9549K356N300j10066O0298J82517r1145J9681N1520
81927A765185L4268j09554J00269M8429q0393J974R0763j5796P8704J43625K4629
81916B082103J31913N8575k00425J92492k50406J62561Q1240J63726k9030q7619
$$ y = [1100584, 960483, 904119, 954711, 726184, 768008, 885288, 894299, 781103, 862837, 809690, 1030584, 676549, 696219, 846839, 1007380, 924793, 993237, 1007653, 946430, 930853, 930411, 773576, 969547, 826760, 898217, 914196, 1111743, 978407, 1045658, 1197333, 1155929, 1086021, 1252057, 1246865, 1109899, 1170003, 1264934, 1230657, 1018518, 1085982, 1201938, 1020917, 1270457, 1263922, 1540471, 1431049, 1404699, 1297841, 1394484, 1491636, 1365825, 1533548, 1661582, 1734273, 1644724, 1647080, 1652380, 1542314, 1602612, 1785129, 1693984, 1713665, 1765185, 1799453, 1689899, 1790168, 1838597, 1758204, 1760178, 1850941, 1835145, 1913849, 2057474, 2082103, 2214016, 2272591, 2072166, 2264658, 2014252, 2176813, 2258053, 2421779, 2392749, 2305130]
81906B305130J30640J04106q5257J03322j8745P5563j26299K74752K08062K21977
81896C193251k19666O2439K00207m0404N4265O209m8279j10629J78017k0789J58062
81885C412683l225J29087k2550J96063J37767O6948k5854J31658M3510N4129J22766
81874D242982J47147n645J20507J72130K12768K0488q589J76384J45852o3943
81864E160081J65640J59673K49339r3374J07112K73828P7940J06135N7198K64912
81854F528484K34461K25217K7935L3357K10932L11301O103L25224K84692m4473
81844H143233K81529K00328K72866K55848J38122K08589L04121Q3902K73000J99612
81834A0361150J86395K43610L52004K53255K4811J76033M39281J45404K01658
$$ y = [2305130, 2435770, 2539876, 2454619, 2557941, 2539196, 2614759, 2488460, 2763212, 2971274, 3193251, 2973585, 3036024, 3236231, 3195827, 3250092, 3256301, 3208022, 3097393, 3275410, 3254621, 3412683, 3409458, 3538545, 3515995, 3712058, 3849825, 3916773, 3890919, 4022577, 4066087, 4120216, 4242982, 4390129, 4384484, 4504991, 4677121, 4889889, 4910377, 4901788, 5078172, 5224024, 5160081, 5325721, 5485394, 5734733, 5641359, 5748471, 6022299, 6100239, 6206374, 6263572, 6528484, 6762945, 6988162, 7016097, 7049454, 7260386, 7571687, 7577790, 7903014, 8187706, 8143233, 8424762, 8625090, 8897956, 9153804, 9291926, 9500515, 9804636, 9888538, 10161538, 10361150, 10547545, 10791155, 11143159, 11396414, 11421225, 11597258, 12036539, 12181943, 12383601]
81825A2383601J86775K84836K59057K23596K79067L81117J09476K05782K93036
81816A4606343K47116R6273K43873R1503K00871K24879q1028L15591J20920P7616
81806A6143957K21753L07623n1197j36631K07258k0921K9012q6077J22557k10437
81796A6526897l9358o3360M2504j8070p9211j8193j23975k16458o4963N4861j42713
81785A5857961k68471k86762j18999l981k01656j65740k10787l68352p2445j94979
81775A3965789j76557l96950j42272j92033r5617k49602k90729j34332m14413
81766A1873284n7398j40896k02373k34734k93435k50890j88370j96209l14347
81757I994632j42586k76013j94194j16664o4229k67200l42737j44839J6947m00946
$$ y = [12383601, 12570376, 12855212, 13114269, 13337865, 13616932, 13998049, 14107525, 14313307, 14606343, 14853459, 14949732, 15193605, 15285108, 15485979, 15710858, 15629830, 15945421, 16066341, 16143957, 16365710, 16673333, 16622136, 16485505, 16692763, 16671842, 16700854, 16614777, 16737334, 16526897, 16487539, 16424179, 16466683, 16448613, 16369402, 16351209, 16227234, 16010776, 15945813, 16000674, 15857961, 15589490, 15302728, 15183729, 15179748, 14978092, 14812352, 14601565, 14233213, 14160768, 13965789, 13789232, 13392282, 13250010, 13057977, 12962360, 12712758, 12422029, 12287697, 11873284, 11815886, 11674990, 11472617, 11237883, 10944448, 10693558, 10505188, 10308979, 9994632, 9852046, 9576033, 9381839, 9265175, 9200946, 8933746, 8591009, 8446170, 8463117, 8062171]
81747H062171p8046j00350k86723k45429m7020j21537j58074j70303r3460j96339
81737F564890k73585l8827R0k88726k66084n1570q2980k14150R6759j50398j58895
81726E136524r6705l3802l73063k1905O8009n4805l6151j75517m3946j99982o2640
81715D106017n3681j46251M0697K0404j63488k30610N3484L2946k01870Q9200
81705C546848j92750J13183K3077k24696j42468p011P3445l7088n0102m5477l4285
81694C022676N1512l6862j56508M8715J02264k80196N6563j996J1108r6415l0615
81683B690246l12922M31123K9616J8857j90680l6207O1410k6297O8164m4765P4767
81672B763312j65061R4524L9745J14970n4772j32236O8383N9715r1458j12997
$$ y = [8062171, 7984125, 7883775, 7597052, 7351623, 7304603, 7183066, 7024992, 6854689, 6761229, 6564890, 6291305, 6252478, 6252568, 5963842, 5697758, 5646188, 5563208, 5349058, 5445817, 5295419, 5136524, 5039819, 5006017, 4632954, 4611049, 4679058, 4624253, 4588102, 4412585, 4368639, 4168657, 4106017, 4052336, 3906085, 3946782, 3967186, 3803698, 3573088, 3626572, 3659518, 3457648, 3546848, 3354098, 3467281, 3490358, 3265662, 3123194, 3116183, 3189628, 3152540, 3102438, 3056961, 3022676, 3074188, 3037326, 2880818, 2929533, 3031797, 2751601, 2808164, 2806168, 2817276, 2720861, 2690246, 2377324, 2808447, 2838063, 2856920, 2666240, 2630033, 2691443, 2665146, 2733310, 2688545, 2763312, 2598251, 2692775, 2732520, 2847490, 2792718, 2660482, 2728865, 2788580, 2697122, 2584125]
81662B584125l6349R5601p2668J76059N074J53382L1647R281M7954M0412L0151
81651C064669M7363K2216O4911J4871J93802p4752P692L26110J22846j69045K40386
81640C861069P4410M0567N7545o9190K23534K22974O3997K48263Q3517K91098
81630E097784L54861M16142L23744L70536M44288O60292Q37249Q89377P13870
81621A0108143O73519O70799N63255P10472J010397J322202J201733J552754J835772
81612A9649046K408096L162398L719790M753206O126951P385375J0044246J2988218
81604G0237326J7206939K3268922L1610443M2262297N2542717N5372071L8675653
81597C31176368J180379l6413007n2398712m7779948l7781796k9534112k3119772
$$ y = [2584125, 2547776, 2643377, 2570709, 2746768, 2751842, 2905224, 2936871, 2946152, 2994106, 3034518, 3064669, 3112032, 3134248, 3199159, 3214030, 3407832, 3333080, 3340772, 3666882, 3789728, 3620683, 3861069, 3935479, 3976046, 4033591, 3964401, 4187935, 4410909, 4474906, 4723169, 4806686, 5097784, 5452645, 5868787, 6192531, 6563067, 7007355, 7667647, 8504896, 9394273, 10108143, 10781662, 11452461, 12015716, 12726188, 13736585, 15058787, 16260520, 17813274, 19649046, 22057142, 25219540, 28939330, 33692536, 39819487, 47204862, 57249108, 70237326, 87444265, 110713187, 142323630, 184585927, 237128644, 292500715, 331176368, 332356747, 295943740, 243545028, 195765080, 157983284, 128449172, 105329400]
81590A05329400j8369168j4678479j1672013r339830p605173o029247n049017
81583C2586473m044951l273545k971595k415298j903039j693269j540623j164855
81575A3579298r02937r69174o22703o14571m51241j67018k21636j09264K09494
81566I730248N51812L42924O37552k6692q77290j409222j103117r70460p18409
81557F157346m55652q20827m04792k90572k74992l46004k10582j56829q0146k01941
81547B915009l3877k12315n0275j27001J765j33993j88073m6130j89092J5621
81537A951639q2035R8023j42443Q2400j37271k61062M7869j11934J71138q4460
81527A531864k19115o257p1533n1938j3416J18734n8592j78716J31237j59464
$$ y = [105329400, 86960232, 72281753, 60609740, 51269910, 43664737, 37635490, 32586473, 28541522, 25267977, 22296382, 19881084, 17978045, 16284776, 14744153, 13579298, 12676361, 11707187, 11084484, 10469913, 10018672, 9851654, 9630018, 9520754, 9730248, 10282060, 10624984, 11262536, 11235844, 10358554, 8949332, 7846215, 6875755, 6157346, 5701694, 4880867, 4476075, 4185503, 3910511, 3564507, 3353925, 3197096, 3116950, 2915009, 2881132, 2668817, 2618542, 2491541, 2493306, 2359313, 2171240, 2125110, 1936018, 1951639, 1869604, 1967627, 1825184, 1907584, 1770313, 1509251, 1557120, 1445186, 1616324, 1531864, 1312749, 1306492, 1234959, 1183021, 1169605, 1288339, 1229747, 1051031, 1182268, 1022804]
81517A022804K2777n7750J989j1206r6901J58547K5361Q4082k11166O0569L9222
81506A038328j65962r9834L00828q2426o7316m5149O73l3805N7838j08766L0754
81495H25163O5560r6911m4160j0150j03508P8910P763P0677n6493K4895N3376
81484H15122j45426j12104K539J5643R116j31803R9681o4755K3267O7849j51532
81473D27597J48066j37987j28257N0464J59773j27883K03601p3579n6280k07141
81463B58374J21064R5812n5171j27921K3729K63468K9945j71389J49704J26281
81453G13896k3429J34114q6371O9064J33791L37491M72707M89867P14670J93034
81443C148834l02443p41719m93513l70722k06942l57291J22939l37473O9132j65590
$$ y = [1022804, 1045581, 987831, 989820, 978614, 881713, 1040260, 1065621, 1149703, 938537, 999106, 1038328, 872366, 772532, 1073360, 990934, 923618, 878469, 879142, 845337, 903175, 794409, 825163, 890723, 793812, 749652, 739502, 635994, 714904, 722667, 793344, 736851, 761746, 815122, 669696, 557592, 560131, 575774, 584890, 453087, 552768, 488013, 511280, 579129, 427597, 575663, 437676, 309419, 359883, 519656, 391773, 595374, 521795, 465515, 258374, 379438, 475250, 420079, 292158, 315887, 579355, 609300, 437911, 587615, 713896, 690467, 824581, 738210, 807274, 941065, 1278556, 1751263, 2241130, 2955800, 3148834, 2846391, 2104672, 1611159, 1240437, 1033495, 676204, 799143, 461670, 530802, 365212]
81433C65212K13053j02990r9305L3789r9085j04219R3148k4041p3240J52818j62331
81422A92809p6348j24619k1773K03613k9051j18803J15660o9203N3585P010r8302
81411C4578J82770r9307j3647M2668j8471J09862k35593J05692K8654j32583K3162
81400B7785J11803k7328m0357k3552r6036J9175K17973M9720J1777K373j12630
81389A40703k2120o3394j2163j30448p5473K14471J9585r6101N2500L7218R5551
81378A60329k46026K3388P6573j65712K13846L7708j98522P6887l7528n3426N4740
81367e7743n0343o4565K7333N8463j19181P539O6615o7098J82200q4662J2887
81356h8555j7159J35482l04037J1408K12734J1138p7313J0008n2940o5939J52451
$$ y = [365212, 578265, 475275, 375970, 409759, 310674, 206455, 299603, 275562, 202322, 355140, 192809, 116461, -8158, -29931, 173682, 144631, 25828, 141488, 72285, 125870, 132880, 34578, 217348, 118041, 104394, 147062, 128591, 238453, 2860, 108552, 137206, 4623, 27785, 139588, 112260, 71903, 48351, -47685, -28510, 189463, 239183, 250960, 253333, 140703, 118583, 55189, 43026, -87422, -162895, 51576, 71161, -24940, 27560, 64778, 160329, -85697, -62309, 14264, -151448, 62398, 100106, -98416, -21529, -59057, -112483, -57743, -108086, -172651, -145318, -86855, -206036, -198497, -131882, -198980, -16780, -101442, -88555, -105714, 29768, -274269, -262861, -50127, -38989, -116302, -106294, -159234, -225173, -72722]
81345g2722J9271M1663j22252k6647J92755o0560O7885p5503J0447Q7601k80856
81334b18918O1703K29284n4902l8200o5278K134K6072M0561K0866l0501K50591
81323B23412p824l4319J5571q9458l7663J98860k8729P6671Q5l1992J9578k8286
81311B75906Q9091N1066J19567m7397o8365l1815K44438k84695k1800N6852j7606
81300C65242J29150R2613j10067L7382J47042j23384j22479j22030M4008J1538
81290C49015j20085l0550m3574r5281r1847Q6715o1600J55797q0056j78311o2502
81279a72279J10846q1122j0614M659R2499l7538P9211j767o9993N8018j00770
81268a28850l254k42108P6597J61910j27582J8362N4829K6238P9275j9674R0105
$$ y = [-72722, -53451, -11788, -134040, -160687, 32068, -28492, 39393, -36110, -25663, 61938, -218918, -157215, 72069, 17167, -21033, -86311, -84177, -58105, -17544, 3322, -27179, 223412, 215588, 181269, 196840, 107382, 69719, 268579, 239850, 316521, 316606, 284614, 304192, 275906, 364997, 416063, 535630, 488233, 419868, 388053, 632491, 347796, 325996, 382848, 365242, 494392, 587005, 476938, 514320, 661362, 537978, 415499, 293469, 337477, 349015, 228930, 198380, 154806, 59525, -32322, 54393, -7207, 148590, 68534, -109777, -172279, -61433, -142555, -153169, -148510, -56011, -93549, -14338, -16105, -86098, -28080, -128850, -132104, -374212, -297615, -135705, -263287, -244925, -190096, -163858, -84583, -104257, -14152]
81257a4152p3758m1960m8274j00281K25290j71585J57106m7974l0612P1444q8799
81246a63555j0340r0249L4272O716q881R5393N2051j74341j50538J66634q580
81235b51418k9941J5075J53238q1773k5629r7591L0523R2927M7665J25606r8088
81224a19406O9980j22890r200k2350k00893L9352R2428l8555K253J40216J07822
81213f1243J2671o9290O7798k4439O9152l05549J34090k36717P1824K65215j80547
81202b57035K02069j30439k7289q565j289j35227j4336J6950J2956l5214P1892
81191c05527J9410N7520O9035k6818N2731m0680K423l2238j87354l334J56073
81180b38759K7851m1228m7877R6927m046q9485m4965J587q967O8654K419M741
$$ y = [-14152, -87910, -129870, -178144, -278425, -53135, -224720, -67614, -115588, -146200, -74756, -163555, -173895, -264144, -229872, -223156, -232037, -136644, -84593, -258934, -409472, -242838, -251418, -281359, -266284, -113046, -194819, -220448, -318039, -287516, -194589, -146924, -21318, -119406, -49426, -172316, -181516, -203866, -404759, -365407, -272979, -311534, -309281, -169065, -61243, -48572, -117862, -50064, -74503, -5351, -310900, -176810, -413527, -341703, -76488, -257035, -54966, -185405, -212694, -221259, -222548, -357775, -372111, -355161, -342205, -377419, -305527, -286117, -228597, -159562, -186380, -133649, -174329, -171906, -204144, -391498, -394832, -238759, -210908, -252136, -300013, -203086, -207132, -296617, -341582, -339995, -348962, -280308, -277889, -273148]
81168b73148K8823J03079k13919K2003L0486k3718R1372r2667K9648Q8861n7810
81157b66990J0913J17841j418j62195J3571k394J80054j54559L7234J80018k25903
81146b73828M7096n8453Q4437p7771q603R3778p6761o2737R6148M0155k2869k35999
81134d55407J55368O3030r4913M7235J76011k2875J13464k19932j50041P6332
81124c11728l955k3977O3592o6012K31673j48672N5125j62550J34631M770M8611
81113a78492Q4131j96741m7415j9986R5209j2549m7603J06556L8458j41753J91757
81102a28428P6282j28339p5220L8645K55202k31694J0252j7206j23510O2136j01780
81091c63660O8091q2909K04670j55520j34132L10521k08059M8525R7354j43824
$$ y = [-273148, -244325, -141246, -355165, -333162, -302676, -326394, -235022, -327689, -298041, -209180, -266990, -256077, -138236, -139654, -301849, -288278, -290672, -110618, -265177, -227943, -47925, -273828, -226732, -285185, -200748, -278519, -287122, -193344, -270105, -332842, -236694, -196539, -219408, -455407, -300039, -237009, -331922, -284687, -108676, -131551, -18087, -238019, -388060, -311728, -315683, -339660, -276068, -342080, -110407, -259079, -203954, -366504, -231873, -227103, -178492, -94361, -291102, -338517, -358503, -263294, -275843, -323446, -216890, -178432, -320185, -128428, -52146, -180485, -255705, -217060, 38142, -193552, -183300, -200506, -324016, -261880, -363660, -295569, -378478, -173808, -329328, -463460, -152939, -360998, -312473, -215119, -358943]
81081c58943j5373K9772Q6234r0805K3475J22864J8546j8400K6551N0585p5805
81070b01299m4866J7020m6309m4139K8693L3375O6623P2314j5942P142k54392
81059c81780J05115J168M8185K1301O9010p5662p4044J17112K2480j86012k2208
81048c55335J58320n7482l8307K0025L3163j59469J64059R8040j70585m308O5106
81037b46773J00617j04173j42398J0935R1128J2440N8154j00486M1186o7390Q506
81026c38254J20266j6264l4043J15581j85051J10538q0853n2359K01210J3536
81016a45693j01183P6339Qm12436R0086K9361K59413k82178K43696k03872J28712
81005c17747j449J35469r7162r2284L3477j2609j44300k2514J17151O5892j2763
$$ y = [-358943, -374316, -344544, -258310, -349115, -325640, -202776, -184230, -202630, -176079, -125494, -201299, -246165, -229145, -275454, -319593, -290900, -257525, -190902, -118588, -134530, -127388, -381780, -276665, -275497, -227312, -206011, -137001, -212663, -286707, -169595, -147115, -333127, -355335, -197015, -254497, -292804, -272779, -239616, -399085, -235026, -136986, -307571, -311879, -246773, -146156, -250329, -392727, -381792, -290664, -278224, -220070, -320556, -279370, -346760, -338254, -217988, -234252, -268295, -152714, -337765, -227227, -308080, -360439, -159229, -145693, -246876, -170537, -170529, -582965, -492879, -463518, -204105, -486283, -242587, -446459, -317747, -319196, -183727, -280889, -373173, -339696, -352305, -496605, -519119, -401968, -336076, -348839]
80994c48839J77068o626j87005J4223M4637j28632J42943K4093k02811J68942
80984c02007J62159J27749L4142j69067j35447j77829K07775m4218n5011J41362
80974b10392j37338J21169J3371k31808K04464K5548k46913N8823m2898J75715
80964b70259m5166K9249o9619n5356J27757K1231j20485P0175J63610j03906m887
80953b57656j17574J13349o3852r6505P1911r5215M7216J05133k7357j00525J53952
80942b67123Q4780r3706r7298j63986J67056k8389K02032J68108k51690p9056
80932c59272O1083J87575j84904O9065p5441m766J7340J70135p8833k5851P3955
80921a49914m9375q77p5543R9591p9884k31303J95476L3029J8502l0207L3929
$$ y = [-348839, -171771, -178397, -365402, -351179, -306542, -435174, -292231, -268138, -470949, -302007, -139848, -12099, 22043, -147024, -282471, -460300, -252525, -296743, -351754, -210392, -347730, -226561, -213190, -444998, -240534, -214986, -461899, -403076, -445974, -270259, -315425, -286176, -355795, -411151, -283394, -262163, -382648, -312473, -148863, -252769, -257656, -375230, -261881, -325733, -422238, -350327, -445542, -398326, -293193, -320550, -421075, -267123, -182343, -276049, -373347, -537333, -370277, -398666, -196634, -28526, -280216, -359272, -298189, -110614, -295518, -226453, -301894, -306660, -289320, -119185, -198018, -223869, -149914, -199289, -200166, -275709, -176118, -256002, -487305, -291829, -258800, -240298, -270505, -236576]
80910b36576J39545l13187J59718l1652p1484K09858j41930L6112Q5154k21242
80900c85684J0695J33366k32528J12731R8441r6528J59673P6678j62532P5936
80890b09752K8855j94402J21653P319M9121j41767N0969M660M8169j51993J10452
80879b76716P1429L799k7233P9784J18159j21331q1685J16972r8997M1420J9016
80868a55383j93548M1420r615J02951j47506J7956K10897j32523n7438J1917j67935
80857d78807J28475j7577K3042R786p1895O105J70745q5812L5530N284L493N6144
80845b15487j36834J17356n7951l7493J44439j35058o6650K7255P0483L0434J30802
80834a28704k06915L8119N1939k3957L8985p8876r3584L27524j03934q6330J4780
$$ y = [-236576, -97031, -410218, -250500, -282152, -353636, -143778, -285708, -249596, -164442, -385684, -374989, -241623, -474151, -361420, -262979, -359507, -199834, -123156, -285688, -209752, -180897, -375299, -253646, -246327, -197206, -338973, -288004, -283344, -235175, -387168, -276716, -205287, -201488, -228721, -148937, -30778, -152109, -233794, -116822, -215819, -174399, -155383, -348931, -307511, -317126, -214175, -361681, -343725, -132828, -265351, -322789, -310872, -478807, -350332, -367909, -344867, -335081, -406976, -400871, -230126, -315938, -280408, -275124, -271631, -215487, -352321, -234965, -292916, -330409, -185970, -321028, -387678, -360423, -289940, -259506, -128704, -335619, -297500, -245561, -269518, -230533, -309409, -402993, -75469, -179403, -265733, -250953]
80823b50953j36767M698J66526l697N0542o6057J387J53920j49121j9421O6020
80812a82923N1816p8786j94324q2372J74444P3564J6000r7267J05997L2759J7646
80801a63446K9381r3986k6310j10710J61520o6683N6682N2284k59922K77604o7592
80790b11178k10269m0061K31385o1566J2703N2214j06383j27332m3435J00715
80780d03207J59845j10146O1535j0888m1549p5485P9389q8626O4595o6354Q6363
80769c44528L4056K6383J09204j70640N0900r7094l3115K05076j62537Q6862r3788
80758c89221K24287k43955K22060j34528q4223l908J8620k7328J47723j22120
80748c92593j32604L10397q9074k8734K11974j28110k7943P7913m7917r2392l5773
$$ y = [-250953, -387720, -383022, -216496, -220193, -169651, -235708, -234321, -80401, -229522, -248943, -182923, -131107, -209893, -404217, -486589, -312145, -238581, -222581, -319848, -213851, -181092, -163446, -134065, -228051, -254361, -365071, -203551, -270234, -213552, -161268, -421190, -143586, -211178, -421447, -461508, -230123, -291689, -278986, -226772, -333155, -460487, -503922, -403207, -243362, -353508, -291973, -302861, -344410, -419895, -340506, -429132, -364537, -430891, -344528, -310472, -284089, -174885, -345525, -294625, -391719, -424834, -219758, -382295, -295433, -389221, -164934, -408889, -186829, -321357, -405580, -409488, -390868, -418196, -270473, -392593, -525197, -214800, -303874, -332608, -120634, -248744, -276687, -198774, -246691, -339083, -374856]
80737c74856Q6249m6636M99N84p4257M4034n0619K4506K30003o2704R328k6894
80725b40763k12346K19831L1272k943k24504Q7288K65544J13234k06505J48184
80715b1708p0874r7356n1202L5572J1908O8830P1576k64682R9432J33208k74540
80704c59836P8462K9150M8091j26507R107J65155O7266j03322O9091k70096N3186
80693c40253Q3634k36614j38989Q6282J82027K8344O0512n0729k196R1953r8988
80682c35017K6282L2598j9369r6069J71912R170l6114m6706k00068J19727M4766
80671c28888J21946o8116p8736J7238j37853j455J77947J20911j28824q4978J20651
80660b70157j29587J15063j13419J03671j71743M8916N6336J26000j98843Q7300
$$ y = [-374856, -288607, -335243, -334744, -334160, -408417, -364383, -415002, -390496, -160493, -223197, -213869, -240763, -453109, -233278, -202006, -204949, -429453, -342165, -76621, 36613, -169892, -21708, -92582, -189938, -241140, -205568, -193660, -124830, -53254, -317936, -218504, -85296, -359836, -281374, -252224, -204133, -330640, -321533, -156378, -89112, -192434, -123343, -393439, -340253, -256619, -493233, -632222, -545940, -363913, -335569, -275057, -325786, -327982, -236029, -335017, -308735, -276137, -295506, -391575, -219663, -210493, -246607, -293313, -493381, -373654, -328888, -206942, -275058, -353794, -336556, -474409, -475864, -297917, -177006, -305830, -390808, -270157, -399744, -284681, -398100, -294429, -466172, -417256, -360920, -234920, -433763, -346463]
80650c46463N8919J06583k72332M3924K0988J07782P5138K1914l5083l7788J6696
80639b39722j4386k82075Q4052K57990N6745k13950R1852l8504O1202o0025K9541
80628b67280q3732N5568j06940J47399r541k05151K83462k05638L9248P824J66532
80617a78249L507p4479o2789Q4849k3369r8864P1594p2961K1228R1006J3915m9615
80605b74227O6980j15511R011Q9117K0541j46807n9548O1474J03078o2938o3970
80594c72800m3741N1900Q2175j02539J61526N1881p6737j93542K10365r7377r5755
80583d24644k3170P5611P8268K0581p9306J50667J30294l33859J98437P653j52943
80572c52411p6983J56162j72311O4033j7493J56402o4436o7014J5202O5361l1287
$$ y = [-346463, -287544, -180961, -453293, -409369, -388381, -280599, -205461, -183547, -218630, -256418, -239722, -254108, -536183, -452131, -194141, -137396, -351346, -259494, -297998, -236796, -296821, -267280, -351012, -295444, -402384, -254985, -264526, -469677, -186215, -391853, -352605, -344781, -178249, -174742, -249221, -312010, -227161, -250530, -349394, -277800, -350761, -329533, -238527, -224612, -274227, -207247, -322758, -313747, -224630, -204089, -350896, -410444, -348970, -245892, -308830, -372800, -416541, -364641, -282466, -385005, -223479, -171598, -248335, -441877, -231512, -328889, -424644, -447814, -372203, -293935, -273354, -352660, -201993, -71699, -405558, -207121, -199468, -352411, -429394, -273232, -445543, -381510, -399003, -242601, -307037, -374051, -358849, -293488, -324775]
80561c24775o1074K4322K06280j1049q8981M1901p5893j8868L1381M0671j70221
80550d06306r2702J79921N1533J5910j54607J11267L8246J81712k95223k9102
80540c99351K1783L1567K11747j38268k2177r6323O4486R0251r9597l9353l177
80529c78412J7594J33245j5134m1277Q9478J1410j55337L2629J92306j39461r5596
80518c48555o9099M8202j512O5814m9453R973k0185J17988K2799r086j37720o1918
80506d32752J10359o4349O650J14234J30970o9626Q6225j66848m8738R3902k4740
80495b64713J07188j12958l8546k1218j2883n0363K6755R8198o0097J59467j99658
80484c68828J80946j6122q9563j70406p7717R8455J64821o436k68080K00808J4637
$$ y = [-324775, -385849, -361527, -155247, -166296, -255277, -213376, -289269, -308137, -276756, -236085, -406306, -499008, -319087, -267554, -251644, -406251, -294984, -256738, -75026, -370249, -399351, -377568, -346001, -134254, -272522, -294699, -391022, -326536, -236285, -335882, -375235, -378412, -360818, -227573, -242707, -283984, -194506, -183096, -338433, -305804, -113498, -252959, -348555, -417654, -369452, -370964, -305150, -354603, -344630, -364815, -246827, -224028, -233114, -370834, -432752, -322393, -386742, -380092, -265858, -134888, -204514, -118289, -285137, -333875, -239973, -264713, -157525, -270483, -309029, -330247, -343130, -393493, -366738, -268540, -328637, -169170, -368828, -187882, -204004, -293567, -463973, -541690, -443235, -278414, -284850, -552930, -352122, -337485]
80473c37485O1691j94121J10165l4912p3395K8612l3410J00051N8388L5050J6256
80462b63110m6677k7539Q0974l8669j13096K26656l8137L9209r8626O0707j87863
80451d06171R9034q4538r0129J57455J39531p1731O5269m0183J5199n203Q627
80440b12840J3436n8109l7318M6437j34798J0147J80548j81287p5064J32968L8529
80429b77351N7024n8394p9175M607n8253J2621Q2550l8688k01376R7436P6319
80418c82680J0429P1671J6678J9395j09397J39159K3444p8377j29235J6228K16223
80407a86462M0728j37659p1794k5498O3631o881J14102j39709Q2952m0694J1760
80396b95524L9989m4806K806j0571l8298j6112J03844q3280o04m4905j25472J14678
$$ y = [-337485, -275794, -469915, -359750, -394662, -468057, -439445, -472855, -372804, -314416, -279366, -263110, -309787, -337326, -256352, -295021, -408117, -181461, -219598, -180389, -279015, -218308, -406171, -307137, -391675, -481804, -324349, -184818, -256549, -191280, -231463, -216264, -221467, -212840, -199404, -257513, -294831, -248394, -383192, -373045, -192497, -373784, -448848, -315880, -277351, -220327, -278721, -357896, -353289, -411542, -398921, -316371, -355059, -556435, -458999, -382680, -372251, -300580, -283902, -264507, -373904, -234745, -211301, -289678, -418913, -402685, -186462, -145734, -283393, -355187, -380685, -317054, -323935, -209833, -349542, -266590, -307284, -295524, -255535, -300341, -297535, -308106, -346404, -362516, -258672, -341952, -342556, -387461, -512933, -398255]
80384c98255q9761P1931K18100j01877O5102j79980k8303L9710J28342L2132j37792
80373c80651Q5660R7128K0009k26379J75989q3787L2997M8410l2471j47922N2075
80362c58942M7866j14945N5996J75986N844k15411J11340r0739K33331k6166k9277
80351b05117j31669l2469J51275l6674j8632N2557N925k0478l0264J26179j39071
80340b78438q697O8049r1294k8193k8196k024N4966p0004M8397J6655l3732l0985
80328c83496J02389Q5181J5209q5777k3825m375j09252Q7994n1274K21155M119
80317a41952j11199P9653R6836j18692j75202j5065k6747R5967J00781L7032k76076
80306d54664P2025N3816J40049N0513j41331Q8874j58855j925J49019j13748O9907
$$ y = [-398255, -488016, -416085, -197985, -299862, -234760, -414740, -443043, -403333, -274991, -242859, -380651, -294991, -197863, -177854, -404233, -228244, -312031, -279034, -230624, -263095, -411017, -358942, -311076, -426021, -370025, -194039, -188195, -403606, -292266, -383005, -149674, -175840, -205117, -336786, -369255, -217980, -254654, -273286, -220729, -214804, -235282, -265546, -139367, -278438, -287135, -219086, -310380, -338573, -366769, -368793, -313827, -383831, -335434, -318779, -352511, -383496, -281107, -195926, -180717, -266494, -290319, -294694, -403946, -315952, -367226, -146071, -141952, -253151, -173498, -76662, -195354, -370556, -385621, -412368, -316401, -215620, -178588, -454664, -382639, -328823, -188774, -138261, -279592, -190718, -349573, -351498, -202479, -316227, -246320]
80295b46320J18934K8264j07537j38952J7821R5541o0412k0290N6844J2291o6299
80284c10115N1331L446j55886O2673J43122j22020m9713J51213j44587R5847L002
80273b71687K7279j05291p7285J35126L4711p3650j9091l4861N0525Q3726M5053
80262b05445j79032M4471N4604j12011Q8500P4056n0679N8061Q9337j29693o9798
80251c37629O2662Q8725l2666n4218l0361q166O9197N3679n9467r5630l1635R5281
80239b80228j901R7324Q635j1057P6707j77123J52689j10623q8736k3845J80827
80228a77331j4800m6221j643o712P1326r9297J67171j64561P602l5130p954O1607
80216b45943k2144q5360P9558J7470O0660k64775O4223J85844j4120k03977J14389
$$ y = [-246320, -127386, -99122, -206659, -345611, -327790, -232249, -292661, -312951, -256107, -243816, -310115, -258784, -255338, -411224, -348551, -205429, -327449, -377162, -225949, -370536, -274689, -271687, -244408, -349699, -426984, -291858, -257147, -330797, -349888, -384749, -334224, -250498, -205445, -384477, -340006, -285402, -397413, -308913, -234857, -285536, -227475, -138138, -267831, -337629, -274967, -186242, -218908, -273126, -303487, -311653, -242456, -188777, -248244, -343874, -375509, -280228, -282129, -184805, -176170, -187227, -110520, -287643, -134954, -245577, -334313, -358158, -177331, -192131, -238352, -239995, -246707, -175381, -274678, -107507, -272068, -264466, -299596, -307550, -245943, -268087, -353447, -273889, -256419, -195759, -460534, -396311, -210467, -224587, -428564, -314175]
80205c14175K6933L9440Q012o1248P8788k5601j54088J35115P697j40911J01657
80194b98381K7009P6191L3228j8540p6455Q6849K4935j0888J9801r3199j65047
80183c94497R5150R10j8789P2475p7639j17822J2383r715J01905M7764j19789
80172d07664L6376J16439P801m872q7991O2476q1046J32466K2166j4981K2111
80161a96719j0175k32493m9200K41472r9304k1069N3845j8734P1423j2040q3064
80150c56058O5640o9498j4186m511J0492J26608J4096P62k7365q0888j67842K16766
80138b85984L7745r5388r8591R6020j0598R9066l3753Q7564P628j33418q0971
80127d10680N931N5173K7971k6905J4223J27619o8308k8530r9552J10635j8752
$$ y = [-314175, -287242, -247802, -239790, -301038, -222250, -247851, -401939, -266824, -259127, -400038, -298381, -271372, -195181, -161953, -180493, -256948, -170099, -145164, -156052, -136251, -229450, -394497, -299347, -298437, -317226, -244751, -322390, -440212, -427829, -437544, -335639, -287875, -407664, -371288, -254849, -247048, -251920, -339911, -277435, -358481, -226015, -203849, -218830, -196719, -206894, -439387, -488587, -247115, -346419, -367488, -313643, -332377, -260954, -272994, -356058, -290418, -359916, -374102, -378613, -368121, -241513, -227417, -226655, -254020, -334908, -502750, -285984, -248239, -343627, -442218, -346198, -356796, -257730, -291483, -203919, -196291, -329709, -410680, -404749, -349576, -321605, -348510, -334287, -206668, -274976, -303506, -403058, -292423, -311175]
80116c11175j08469J43735o9014R2797o7929j8041J3983q619j8971p5922N4517
80105c73108l8612J61053M4263J04812j57093K1442p3486j1029J88523l7499q6335
80094b57069N1750r9648J53706o0156p4939m7316l4469K00004Q0687L5675P5806
80083B4031J17605L2282K3744J33724k91568o7869R7396j08750L800k09814N5697
80072a89722p4409O9914j80361k3951K010O0690J40341q4399J12435j76381q360
80061c52193J35244J56887j58963l7149M4779o6549L9894L8747J70683j60384
80051a89004j56831J17464o9506o0803J00341j6263P3314j7137Q8556j12030o5431
80040c07330N0691P0786J47836j13756k8042J9101k08478J89308J7191q5422j93996
$$ y = [-311175, -419644, -275909, -344923, -252126, -320055, -338096, -324113, -332732, -351703, -427625, -373108, -411720, -250667, -206404, -101592, -258685, -237243, -310729, -321758, -133235, -170734, -257069, -205319, -304967, -151261, -211417, -286356, -333672, -368141, -168137, -87450, -51775, 24031, 141636, 173918, 197662, 331386, 39818, -28051, 69345, -39405, -35605, -245419, -189722, -264131, -194217, -374578, -398529, -396519, -335829, -195488, -279887, -167452, -343833, -352193, -216949, -60062, -219025, -256174, -211395, -277944, -238050, -199303, -28620, -189004, -345835, -228371, -297877, -358680, -258339, -274602, -201288, -218425, -129869, -241899, -307330, -256639, -185853, -38017, -151773, -179815, -160714, -369192, -179884, -162693, -248115, -442111]
80029d42111J51656r110o3541J56506L1200j90967J5543Q5881m9308n1896K715
80018c63432L38112P491j8334p9260o7968O5752P6734j67524r5456M365P2971
80007b26549Q4579K3557K7880J6964o3934R3177P8612J13970k04706j12470Q2806
79996h6114M3598M14J03287j6949R4399J24513K5324n8302r2415j33570J68734
79985A72919J11532J06035P8466K03399K84793J61526L1267N01454M54301O30875
79975B736567R53495J538908K273637L674974M792855M086668m12673m480616
79967A5163815m943420k829453j596832j321329j106016q22734n46336l45672
79959A652023m41292j06854k17244J8775l31249l63872L5420j78521N6732m9181
$$ y = [-442111, -290455, -299565, -363106, -206600, -175400, -366367, -350824, -264943, -314251, -366147, -363432, -25320, -17829, -36163, -115423, -183391, -117639, -40905, -208429, -303885, -299520, -226549, -141970, -118413, -90533, -73569, -137503, -44326, 34286, 148256, -56450, -168920, -86114, -42516, -42102, 61185, 44236, 138635, 263148, 288472, 230170, 137755, 4185, 172919, 284451, 390486, 468952, 672351, 957144, 1118670, 1149937, 1651391, 2105692, 2736567, 3690062, 5228970, 7502607, 11177581, 15970436, 20057104, 19644431, 15163815, 10220395, 7390942, 5794110, 4472781, 3366765, 2544031, 1997695, 1652023, 1210731, 1103877, 886633, 905408, 574159, 210287, 245707, 67186, 123918, 74737]
79949G4737j31191J03076k7647j26984J49321r981j70832n0541N4569l4430K0981
79938a48922j5190J5702K9730M7903l5971K5515j48804j7826n2628M4908J50423
79927a05160r8978j10664J50142m9591Q2874n8765L2156K9052j07553o6382K056
79916c00813K2008P7210j18395r9631M4896N1834j9997J66915n2306P1741J51212
79905e326o6204j48376k0207j23174m9209L3914L6095Q9816J46887k16969K39843
79894h2910m9204j86703J28098j73134P7449J09458o7207m5777J27353m6808J2859
79883a96526J0367q8032O271r8511K60159j29575j63982R2254K0077q3770J09565
79872b61703j9879p1114K03572j95138j2584J28965j52483O2238L1292J09426
$$ y = [74737, -56454, 46622, 18975, -108009, 41312, 31331, -139501, -190042, -135473, -169903, -148922, -164112, -148410, -118680, -70777, -106748, -81233, -230037, -247863, -300491, -255583, -105160, -204138, -314802, -164660, -214251, -131377, -190142, -157986, -128934, -236487, -302869, -300813, -278805, -201595, -319990, -419621, -374725, -322891, -342888, -175973, -228279, -156538, -5326, -71530, -219906, -240113, -363287, -412496, -378582, -342487, -252671, -105784, -322753, -82910, -132114, -318817, -190719, -363853, -286404, -176946, -244153, -289930, -162577, -209385, -196526, -186159, -274191, -267920, -366431, -106272, -235847, -399829, -307575, -287498, -371268, -261703, -281582, -352696, -149124, -344262, -356846, -227881, -380364, -318126, -286834, -177408]
79862a77408j61405J17543R1073m1333j56986P4527q0624J33620l1546j04965
79852c37504j4919N5853M2544k7602J5045n2607L6181k3027P9073l9591p0695
79841c37249o8934Q1195r13k2788n4116J44783p641L0806j01806J7915j6894N0346
79829b85296j76248J07933p2122J62647L4857J0210j16909N1035J4186o3357M6221
79818b86843o241J11911n9045k2492n6520r0028j1495J08146j12942j61380J61081
79807d25848J54573l1823j04937J40378k1839L668j2164P6251j43483M3620P1422
79796b50182J36795j40206q4625M4382P992p4875j22723J69611n9182N6617Q4644
79785b31752q2010j07453N8738J7399r3847K47882q1010r5344k5816R1208q9343
$$ y = [-177408, -338813, -221270, -130197, -171530, -328516, -253989, -334613, -200993, -232539, -337504, -352423, -296570, -254026, -281628, -266583, -319190, -283009, -306036, -226963, -266554, -337249, -406183, -324988, -325901, -348689, -402805, -258022, -265663, -234857, -336663, -318748, -335642, -285296, -461544, -353611, -425733, -263086, -228229, -218019, -334928, -283893, -269707, -333064, -286843, -293084, -181173, -240218, -262710, -319230, -409258, -420753, -312607, -425549, -586929, -425848, -271275, -303098, -408035, -267657, -289496, -285828, -297992, -221741, -365224, -321604, -250182, -113387, -253593, -338218, -293836, -285844, -360719, -483442, -313831, -373013, -316396, -231752, -313762, -421215, -362477, -345078, -438925, -191043, -272053, -367397, -393213, -302005, -391348]
79774c91348J27705q3020k1004M3361J32811L6203p4037N9543p7060n1832m5296
79763c43974m4379M8192p3660M7131k9261k4859J03917J57898n8823o125N1332
79752a72611l1619o1420K5262k15147m7752J90360N2579L0837M3548k44281R4027
79741c36217J88846n4637o9002J8246j70428K38118o2999j43730N4886N6682k6926
79730c07161L2124R7224n2051k5130r3462j09170L9026J10166O9562j28558O9870
79719b97560j9352j49525J08020L4099r505j79532O2787J71197Q1598j25391q4244
79708d07408N6771J063o0048j6307K05235l9713j17811j065J39248m9204q5107
79697c74346K02481j95266j275R2255K19926j61654J35785j35211j1160p8914
$$ y = [-391348, -263643, -346663, -367667, -324306, -191495, -155292, -229329, -169786, -246846, -298678, -343974, -388353, -340161, -413821, -366690, -395951, -420810, -316893, -158995, -217818, -223943, -172611, -204230, -265650, -240388, -455535, -503287, -312927, -260348, -229511, -185963, -430244, -336217, -147371, -202008, -271010, -252764, -423192, -185074, -248073, -391803, -336917, -280235, -307161, -275037, -177813, -229864, -254994, -348456, -457626, -418600, -308434, -238872, -367430, -297560, -316912, -466437, -358417, -324318, -333823, -513355, -450568, -279371, -197773, -323164, -407408, -350637, -349574, -409622, -425929, -220694, -260407, -378218, -379283, -240035, -289239, -374346, -171865, -367131, -368406, -276151, -56225, -217879, -82094, -217305, -228465, -307379]
79687c07379j51365J13141O7765j8472J0430J36935k5818j52101J39772r0971
79677b78063j04359J59783k9595J70748j7596j71127J7731J24346p9922r3220
79667c01274J13274O5559j8745P8658p861Q6455j60610J46363R6227J54210J53463
79656D05719K4599j80777k45247l3434m8707k7368l6991m5484r3539R4337j24182
79645c11074O2832l6841M7562j30459l467M3930P5649o115P8356j34102q8464
79634d02193N6591Q929J42030L4530q6749K5607p2605J15752k1734o2357O2036
79623b00163j87753L384P7207N4085n8649O2358p6070j35461J54390K01667o8633
79612a73638m8621j63915R0562L3581j19431J81086K4109l896p343j22653j7124
$$ y = [-307379, -458744, -345603, -277838, -296310, -285880, -148945, -174763, -326864, -187092, -278063, -382422, -222639, -252234, -81486, -99082, -270209, -252478, -128132, -208054, -301274, -188000, -122441, -141186, -62528, -70389, 16066, -144544, 1819, 98046, 252256, 405719, 430318, 249541, 4294, -29140, -77847, -105215, -142206, -187690, -281229, -186892, -311074, -248242, -285083, -237521, -367980, -371447, -327517, -251868, -257983, -179627, -313729, -402193, -345602, -336673, -194643, -160113, -246862, -221255, -293860, -178108, -199842, -262199, -200163, -387916, -384532, -307325, -253240, -311889, -249531, -325601, -461062, -306672, -105005, -173638, -222259, -386174, -295612, -262031, -381462, -200376, -176267, -180163, -187506, -310159, -327283]
79601c27283l1923l1345L5259P903P2800j63561L28046j38414k01143J36264j8171
79590c31568L0044p2127J46204k5474N6133L3635k463m4709n2286Q103j3839M7218
79578b21129j39556J59169j68018P0870P9288J09042n6199o0283L1651k6147N1510
79567a69802J20947r6260O4647p3514j24571P5692J96188l8037j85886K4468m5561
79556b51689r3138K11328l473j43023R4844n4658J40832j92784j17935j3613K91548
79545a31761k28187J8555L4833m8711K37763j08045j13938J49221j45726Q0313
79535b55683M6438p1466j957r1099J23691j35151l2143N7471r325J46170j03638
79524c26692Q9865j51603P3850k0104M3898J72084M362l08367j15756K91453N8705
$$ y = [-327283, -359206, -390551, -355292, -347389, -274589, -438150, -110104, -248518, -449661, -313397, -331568, -301524, -373651, -227447, -252921, -196788, -163153, -165616, -210325, -262611, -254508, -268347, -221129, -360685, -201516, -369534, -298664, -219376, -110334, -166533, -226816, -195165, -221312, -169802, -48855, -145115, -80468, -153982, -278553, -202861, -6673, -44710, -230596, -206128, -251689, -344827, -133499, -136972, -279995, -185151, -239809, -98977, -291761, -409696, -423309, -131761, -359948, -341393, -306560, -355271, -117508, -225553, -339491, -190270, -335996, -255683, -209245, -280711, -282668, -373767, -250076, -385227, -417370, -359899, -369224, -223054, -326692, -236827, -388430, -314580, -334684, -290786, -118702, -114340, -422707, -538463, -247010, -188305]
79513a88305p359k19745J56010P7159k23019O9388L9365l6452J78558r7519n4894
79502c06813L8057N6231R5863l73466J29271K73328j70999p9981J22705N0406
79492a65398N9223J04496j97280l9564M9621o2372j20433n5712K12687J75120
79482c9612j45941k59805K520K60702j37911K19101j21218o8002J00500L1098
79472a58568q8832J59966r6147j4689K69429j92917J58793j3774J34485R5084
79462B52830l0549L1646P290J67416J17805J39817J55047K57454K4996L85388
79452A509140p0466O1129O7262J80413K10497L738L06644J0016k70332o1965k00443
79441A745633J70275j80857k16277j20093m68399K9059r7378j81121J7519j52466
$$ y = [-188305, -195664, -415409, -259399, -182240, -405259, -335871, -296506, -332958, -154400, -251919, -306813, -268756, -212525, -116662, -490128, -360857, -87529, -258528, -338509, -215804, -165398, -106175, -1679, -198959, -238523, -188902, -251274, -371707, -427419, -214732, -39612, -185553, -445358, -442838, -182136, -320047, -100946, -222164, -290166, -189666, -158568, -247400, -87434, -183581, -198270, 71159, -121758, 37035, 23261, 157746, 252830, 222281, 253927, 261217, 428633, 546438, 686255, 841302, 1098756, 1123752, 1509140, 1438674, 1499803, 1567065, 1747478, 1957975, 1961713, 2268357, 2278373, 2008041, 1946076, 1745633, 1915908, 1735051, 1518774, 1398681, 930282, 959341, 861963, 680842, 698361, 545895]
79431E45895j47981m9039j09448j70432J04170j36167K6468O0319k58445j56047
79421b90707M8397J27117j47125J19054K561k20960O7366J09974J01767L5063
79411d7493j97042l8758K3041K4535P0575o9558j24068K1618J12819j2110n7579
79400b94020k1936J6914j58942O0932J51238j47276J30837j8755J20243k33792
79390c94557L24366r1103M56k3792j94095J59881q2517j5538R8019j22313J595
79379c39598o7137K0531J3819K22450j56610j52140P6486n3582R1370j18573K50357
79368b12627k6894K2853r8676q0047n7858J85445J17667M1095k66304J05773M3973
79357b25600j77042K44270m6196j13061q7500J86559q7115M8854M9886M6109j5159
$$ y = [545895, 397914, 348875, 239427, 68995, 173165, 36998, 63466, 123785, -134660, -290707, -242310, -115193, -262318, -143264, -140703, -361663, -294297, -184323, -82556, -47493, -244535, -283293, -260252, -235717, -165142, -234700, -358768, -337150, -224331, -236441, -294020, -315956, -299042, -457984, -397052, -245814, -393090, -262253, -281008, -160765, -394557, -70191, -161294, -160838, -184630, -378725, -218844, -301361, -316899, -218880, -341193, -339598, -406735, -386204, -372385, -149935, -306545, -458685, -382199, -435781, -344411, -462984, -212627, -239521, -216668, -315344, -395391, -453249, -267804, -150137, -109042, -375346, -269573, -225600, -402642, -158372, -204568, -317629, -405129, -218570, -305685, -256831, -206945, -160836, -175995]
79346a75995J9677j66623J00711j24294l8542J48437j1183j9208k2639O7360K8081
79335a94218j70153M043r6012N2016J28741R6357k08020k5909Q0474K8398l2601
79324c36884j50436J19056N7386M0128r8188R1313j6793N0719j10582o0672K08865
79313b06088o1856q0619P8979K3947j89701j4531J01664J3487k1650R173L23J3697
79301c33175j9164r3931j01738M361K228K85829J57993k15121L1657j30305P7434
79290c33932r2933k2866N059M01187k31414L6114l6949j49363J62078N4931L9056
79279a69032k50313J50616M135J9946l9963j23917N3602J38064k79513J11583
79269c84792J63165J3511j09500m2038M1905p6944J42031K1949j19666l5098Q1310
$$ y = [-175995, -156318, -322941, -222230, -346524, -385066, -236629, -247812, -267020, -289659, -222299, -194218, -364371, -360328, -456340, -404324, -275583, -179226, -387246, -413155, -332681, -304283, -336884, -487320, -368264, -310878, -270750, -368938, -277625, -294418, -243699, -354281, -414953, -206088, -267944, -348563, -269584, -245637, -435338, -449869, -348205, -334718, -356368, -347195, -346872, -333175, -352339, -446270, -548008, -543647, -541419, -255590, -97597, -312718, -281061, -411366, -333932, -426865, -449731, -444672, -43485, -274899, -238785, -275734, -425097, -263019, -208088, -169032, -419345, -268729, -264594, -244648, -284611, -408528, -354926, -216862, -496375, -384792, -221627, -208116, -317616, -359654, -317749, -394693, -252662, -230713, -350379, -385477, -304167]
79258c04167l0684J01481J30957j57602j4313j2726n2876l759Q8815K641n2395
79247c04628j07899J57809m4187l717K7867K7210j85229k1130K18314q3183j63329
79236d82102J04302J20314k5780M1876j4109j01131R0755k09032L1347k9019J85643
79225b86936J29259j91928j00796K67936j5267l08630J69935m3266L0338K3974
79215c25381N2971j08308J28698l1290J0468o9508J00300l0323R1557m5780k1412
79204b48008J4487O009O4055j52303q971N8J32934p7170k13503R9933J72063j44731
79192c55147l2876k8529j5548J49179j35383K46751j14882k3189K00849j31067
79182b39842r5671p8637J03215J22116P5734Q856j04842k2226J57N9777j41795
$$ y = [-304167, -334851, -233370, -102413, -260015, -274328, -287054, -339930, -343689, -254874, -252233, -304628, -412527, -254718, -298905, -302622, -274755, -247545, -432774, -453904, -235590, -318773, -482102, -377800, -257486, -283266, -241390, -255499, -356630, -265875, -474907, -443560, -472579, -286936, -157677, -349605, -450401, -182465, -197732, -506362, -336427, -379693, -349355, -325381, -272410, -380718, -252020, -283310, -272842, -342350, -242050, -272373, -180816, -226596, -248008, -233521, -227512, -163457, -315760, -324731, -324673, -191739, -268909, -482412, -382479, -210416, -355147, -388023, -416552, -432100, -282921, -418304, -171553, -286435, -309624, -108775, -239842, -335513, -414150, -310935, -188819, -113085, -104229, -209071, -231297, -231140, -171363, -313158]
79171c13158l3205Q9877l4337J64623p8146j3053q8744k2833j19403k237N4668
79160c95948q6527J07163m4666o216J64768M757j04136n1496K3306J34589j16573
79149c70979J13778n3626m0691J31575j07202N9997J62901j61823N5022K5211
79139a85837J98843r0700k13623j19378J63467q136k717J87714j10419P623k1448
79128a94611j74082K0158O1767J03198o3021m1586P9036R4990j07639r1659j6376
79117c29825J55271m0487j43897m9956k5434J62001P0554J7007j05361k6164J27513
79106a88778l6840j16290l4992R6056l0662K4850n6430N4051K07843m4161j39879
79095b65232l2584n2865J67535l5944k46731M3078j0982J20779Q0780k02894K38515
$$ y = [-313158, -346363, -256486, -290823, -126200, -204346, -217399, -306143, -328976, -448379, -450616, -395948, -482475, -375312, -419978, -426194, -261426, -256669, -360805, -412301, -388995, -254406, -370979, -257201, -310827, -351518, -219943, -327145, -267148, -104247, -266070, -211048, -185837, 13006, -77694, -291317, -410695, -247228, -255364, -258081, -70367, -180786, -173163, -194611, -368693, -348535, -286768, -183570, -246591, -288177, -209141, -114151, -221790, -313449, -329825, -174554, -215041, -358938, -408894, -434328, -272327, -201773, -184766, -290127, -316291, -188778, -225618, -341908, -376900, -280844, -311506, -286656, -343086, -289035, -81192, -125353, -265232, -297816, -350681, -183146, -219090, -465821, -422743, -433725, -312946, -232166, -435060, -196545]
79084a96545l074j81810J82573k32792K02540j33659P8963q6168J1266J67963
79074a90743J8748j29606j75138J48455L4519J01901K63221l76440R7933j42760
79064c49910m0949K69998m4973n3585J0170k58926K35500K9937n5519R8747L975
79053a55535J04579m5846r5299L5338p6029r7413J58496P2105O456o6414Q3759
79042g5803l8546p9986k58229K38012J7179r8832l9813K9223N7312l4731J17929
79031a66285m3970J25903j23858j4486j9162p7210L8827l161j86360J82795J02241
79020a84726K102M1446r1705M1599j21924j94239K31588K9054K0839o0341k1671
79009c07978L6101q1256l3927m6653Q7785O7199n7302J05786j16845P9762J02047
$$ y = [-196545, -199619, -381429, -198856, -431648, -229108, -362767, -283804, -369972, -358706, -190743, -171995, -301601, -476739, -328284, -293765, -191864, 71357, -305083, -207150, -349910, -390859, -120861, -165834, -219419, -209249, -468175, -232675, -202738, -258257, -159510, -155535, -50956, -96802, -192101, -156763, -232792, -330205, -171709, -99604, -93148, -159562, -75803, -114349, -194335, -452564, -214552, -197373, -296205, -336018, -306795, -249483, -284214, -166285, -210255, -84352, -208210, -222696, -241858, -319068, -280241, -283402, -469762, -286967, -184726, -182624, -141178, -232883, -191284, -313208, -507447, -275859, -246805, -225966, -286307, -307978, -271877, -353133, -387060, -433713, -345928, -278729, -336031, -230245, -347090, -267328, -165281]
78998a65281j10064J54063J1708k9769n61k0041J05465l6811L7J9211J21684O4985
78986A14626O0613L0426m3371J4325L1468K66574Q4102M1852J13238J79519L44144
78975A237516O7929N3889K69367k2340N3600m5600K34244L1277Q8709J1793j32914
78964A847470k30571j1452o2928k23420o7676P602l35759r9506j46851j71653
78954E05256k9703j31258j03760J10709j61097k6744j05618j1341r7186j28886
78944a79628n7848K7684q8236R7612J284j22080R1877K677M6878j96204Q8388
78933b87596Q1276j46753M3571Q2549L6307J27203j35091p7764J00649j15230
78923b90879N5952m1387J2244J40937k24446O9861q9851K5839J31470p4128J37455
$$ y = [-165281, -275345, -121282, -109574, -139343, -139904, -159945, -54480, -91291, -91254, -72043, 49641, 114626, 175239, 205665, 162294, 176619, 208087, 474661, 558763, 600615, 713853, 893372, 1237516, 1305445, 1359334, 1628701, 1606361, 1659961, 1614361, 1848605, 1879882, 1968591, 1980384, 1847470, 1616899, 1605447, 1542519, 1319099, 1251423, 1259025, 923266, 823760, 676909, 505256, 475553, 344295, 240535, 351244, 190147, 163403, 57785, 46444, -50742, -179628, -237476, -209792, -298028, -200416, -199132, -321212, -229335, -226658, -179780, -375984, -287596, -206320, -353073, -309502, -226953, -190646, -63443, -198534, -276298, -175649, -290879, -234927, -276314, -264070, -123133, -347579, -277718, -367569, -341730, -210260, -284388, -146933]
78912a46933j35251k49307J58261K92813j0571r2890o3761R3978k41148J62451
78902b32358k9791k40944K31080L5877m9885J10649j29982r7601k65O5262Q0867
78891b57091m6665o2505L761j03044J52662n6745L5478P1532l6200N4423M3700
78880b00694k7792j24113K78760j94705j07841j02290P1799q2518K14011N1476
78870b23907j4310j06947Q4586k7234m0063k09674j4686J58449N2880N7890p8123
78859c61139R5159L1324O9464j61406m4099L6192N1967K2784N0502n3414O2192
78848b00474q6741L9652O4942j89651L6180o480J7708q9272K12569n9295k02118
78837d62980O4952n603j0519J52747k1969r8643J11469q9819j2327K75609n6666
$$ y = [-146933, -282184, -531491, -373230, -80417, -90988, -183878, -247639, -153661, -394809, -232358, -262149, -503093, -272013, -236136, -286021, -175372, -305354, -402955, -403220, -337958, -257091, -303756, -366261, -362500, -465544, -312882, -369627, -334149, -262617, -298817, -244394, -200694, -228486, -352599, -73839, -268544, -376385, -478675, -406876, -489394, -275383, -223907, -238217, -345164, -260578, -287812, -327875, -537549, -552235, -393786, -340906, -283016, -361139, -265980, -234656, -165192, -326598, -370697, -334505, -282538, -259754, -209252, -262666, -200474, -287215, -247563, -182621, -372272, -336092, -342572, -324864, -414136, -201567, -260862, -462980, -398028, -403631, -414150, -261403, -283372, -382015, -270546, -360365, -372692, -97083, -153749]
78826a53749N1097j26376j8869k2940l5796n7031J22105Q193q4140j450k8220
78815c47176j04887J78503O6031k8370j03009K7899r8156k6964J81446m6334j4649
78804c15666R1406n4287j14745K06447j14200j56574J55936o4437j24061J67598
78794c22583J40530m9590q7825n8106r2057K4936j4618O6392n1969P1731M3072
78783c30087j08563J24561J2600m2915N1650K53183k10317j07763R3677P1897
78773a92077J8935j69632j2248N3706J0462J57571j17575n8921o9311j2675K1458
78762c70307K06010j64751p4936O1265q7981Q7414n9535J00010J88269o5313p2796
78751b52651R2852J15372l58924R2061J29954n0900j58453P4373J09039q5358
$$ y = [-153749, -102652, -229028, -247897, -270837, -306633, -363664, -241559, -233366, -317506, -318956, -347176, -452063, -273560, -207529, -235899, -338908, -311009, -409165, -436129, -254683, -301017, -315666, -224260, -278547, -393292, -186845, -301045, -457619, -301683, -366120, -490181, -322583, -182053, -231643, -319468, -377574, -469631, -444695, -459313, -392921, -444890, -373159, -330087, -438650, -314089, -301489, -344404, -292754, -39571, -249888, -357651, -263974, -192077, -173142, -342774, -355022, -301316, -290854, -133283, -250858, -309779, -379090, -391765, -370307, -164297, -329048, -403984, -342719, -430700, -343286, -402821, -302811, -114542, -179855, -252651, -159799, -44427, -403351, -311290, -181336, -232236, -390689, -316316, -207277, -292635]
78741b92635q0829K20834k9815m182p8842m7874O396k16222P4744J04053Q5620
78730b58752l2179l9061J33589j57115M0202k871L8427n8756Q3706K412m6520
78719b96918L871J13033j63066J25169o5384M528k01727J1481J13114K10752k7561
78708a72708q3944j8309J2547Q6317j37607o9781J66586M3588j76852J81166j35443
78697c04440P0930r315j24665O6203o9975J07030o5659M7984l8160q6311K48299
78686a58079j80479K9352r2116O5578R5286o8861j9857p0329L822j1571j2945
78675d20199J29183k0310n8022P7142r6885K02833q4442P6725j87813R9501M7773
78664b34514j19334M8298K3593O9449o1617j49199m6205J16078Q3349M746n9538
$$ y = [-292635, -373464, -152630, -182445, -186627, -265469, -313343, -306947, -523169, -448425, -344372, -258752, -290931, -329992, -196403, -353518, -313316, -316187, -277760, -336516, -252810, -250398, -296918, -293047, -180014, -343080, -217911, -283295, -278767, -480494, -469013, -355899, -145147, -172708, -256652, -274961, -262414, -176097, -313704, -383485, -216899, -173311, -350163, -168997, -304440, -233510, -242825, -367490, -301287, -371262, -264232, -329891, -281907, -320067, -406378, -158079, -338558, -309206, -401322, -335744, -240458, -309319, -329176, -399505, -395683, -407254, -420199, -291016, -311326, -369348, -292206, -389091, -186258, -270700, -193975, -381788, -282287, -234514, -353848, -305550, -281957, -212508, -274125, -423324, -469529, -353451, -270102, -265356, -324894]
78653c24894J25911n384k7441j03145k7633K7436K57873k63028J26709O1555k9191
78642a81232j84103j5732J14467j31350M2897M0500J78315k05500N1710K7088
78632b62940r173j75118J04449j41313R3074N3841j7319O0081q0123m949n0472
78621d29962k2217J33144q9223o3960K60230j10514O8768K4760o2506j49062J17093
78610c23449O9652o3936J11053j65818n34J21627J06161j45863J28596m4253k8117
78599b34881j39869L6292K1138r3712N4651j8244J64827N7002j9189M5165p5512
78588b02332j16408J4320j8163J25719j05743j44206n0272N4165J12952J37057
78578a92911p8980j27176J98344j9187j22565J0278q3400K47912j6367r0135m7087
$$ y = [-324894, -198983, -204367, -231808, -334953, -362586, -335150, -77277, -340305, -213596, -152041, -181232, -365335, -381067, -266600, -397950, -355053, -314553, -136238, -341738, -290028, -262940, -272113, -447231, -342782, -484095, -391021, -337180, -354499, -294418, -374541, -379490, -429962, -452179, -319035, -408258, -472218, -211988, -322502, -253734, -228974, -291480, -440542, -323449, -253797, -317733, -206680, -372498, -373032, -251405, -145244, -291107, -162511, -206764, -234881, -374750, -338458, -317320, -411032, -356381, -374625, -209798, -152796, -171985, -126820, -202332, -318740, -304420, -322583, -196864, -302607, -446813, -497085, -442920, -329968, -192911, -271891, -399067, -200723, -219910, -342475, -332197, -415597, -167685, -184052, -274187, -321274]
$$ [...]
##END NTUPLES=NMR SPECTRUM
##END=
