##TITLE=19F
##JCAMPDX= 6.0         $$ Bruker NMR JCAMP-DX V2.0
##DATA TYPE= NMR FID
##DATA CLASS= NTUPLES
##ORIGIN= UXNMR, Bruker Analytische Messtechnik GmbH
##OWNER= root
$$ XWIN-NMR		Version 3.5
$$ Fri Feb 11 09:06:29 2011 Russian Standard Time (UT+3h)  anp@DPX200
##.OBSERVE FREQUENCY= 188.29809782803
##.OBSERVE NUCLEUS= ^19F
##.DELAY= (6, 6)
##.ACQUISITION MODE= SIMULTANEOUS
##.ACQUISITION SCHEME= undefined
##.AVERAGES= 8
##.DIGITISER RES= 16
##SPECTROMETER/DATA SYSTEM= spect
##.PULSE SEQUENCE= zg
##.SOLVENT NAME= CDCl3
##.SHIFT REFERENCE= (INTERNAL, CDCl3, 0, 15.8315)
##AUDIT TRAIL= $$ (NUMBER, WHEN, WHO, WHERE, WHAT)
$$ ##TITLE= Audit trail, XWIN-NMR		Version 3.5
$$ ##JCAMPDX= 5.01
$$ ##ORIGIN= Bruker BioSpin GmbH
$$ ##OWNER= anp
$$ D:/spectra/data/zvl/nmr/19F/11/audita.txt
$$ ##AUDIT TRAIL=  $$ (NUMBER, WHEN, WHO, WHERE, WHAT)
(   1,<2010-12-10 12:24:16.46 +300>,<anp>,<DPX200>,
      <created by zg, POWCHK disabled, PULCHK disabled
       configuration hash MD5:
       11 64 04 C6 CF 8A CA 3B 7E DD FE 01 35 7D 01 E9
       data hash MD5: 32K
       AD B0 1A C8 E8 82 34 01 6F 28 87 70 32 EC 13 CA>)
$$ ##END=
$$ 
$$ hash MD5
$$ 6D AC B7 DB 52 EE DC D9 EA 84 E3 53 E0 D9 D6 42
##$RELAX= 
##$RELAX= 
##$RELAX= 
##$RELAX= 
##$RELAX= 
$$ Bruker specific parameters
$$ --------------------------
##$DU= <D:/spectra>
##$EXPNO= 11
##$NAME= <19F>
##$PROCNO= 1
##$TYPE= <nmr>
##$USER= <zvl>
##$AMP= (0..31)
100 100 100 100 100 100 100 100 100 100 100 100 100 100 100 100 100 100 
100 100 100 100 100 100 100 100 100 100 100 100 100 100 
##$AQSEQ= 0
##$AQ_mod= 1
##$AUNM= <au_zg>
##$AUTOPOS= <>
##$BF1= 188.310338
##$BF2= 200.13
##$BF3= 200.13
##$BF4= 200.13
##$BF5= 200.13
##$BF6= 200.13
##$BF7= 200.13
##$BF8= 200.13
##$BYTORDA= 1
##$CFDGTYP= 0
##$CFRGTYP= 5
##$CHEMSTR= <none>
##$CNST= (0..31)
1 1 145 1 1 1 1 1 1 1 1 1 1 1 1 1 1 1 1 1 1 1 1 1 1 1 1 1 1 1 1 1 
##$CPDPRG= <>
##$CPDPRG1= <>
##$CPDPRG2= <>
##$CPDPRG3= <>
##$CPDPRG4= <mlev>
##$CPDPRG5= <mlev>
##$CPDPRG6= <mlev>
##$CPDPRG7= <mlev>
##$CPDPRG8= <mlev>
##$CPDPRGB= <>
##$CPDPRGT= <>
##$D= (0..31)
0 2 0 0 0 0 0 0 0 0.06 0 0 0 0 0 0 0.0002 0 0 0 0 0 0 0 0 0 0 0 0 0 0 
0 
##$DATE= 1291973055
##$DBL= (0..7)
120 120 120 120 120 120 120 120 
##$DBP= (0..7)
150 150 150 150 150 150 150 150 
##$DBP07= 0
##$DBPNAM0= <>
##$DBPNAM1= <>
##$DBPNAM2= <>
##$DBPNAM3= <>
##$DBPNAM4= <>
##$DBPNAM5= <>
##$DBPNAM6= <>
##$DBPNAM7= <>
##$DBPOAL= (0..7)
0.5 0.5 0.5 0.5 0.5 0.5 0.5 0.5 
##$DBPOFFS= (0..7)
0 0 0 0 0 0 0 0 
##$DE= 6
##$DECBNUC= <off>
##$DECIM= 2
##$DECNUC= <off>
##$DECSTAT= 4
##$DIGMOD= 1
##$DIGTYP= 9
##$DL= (0..7)
0 120 120 120 120 120 120 120 
##$DP= (0..7)
150 150 150 150 150 150 150 150 
##$DP07= 0
##$DPNAME0= <>
##$DPNAME1= <>
##$DPNAME2= <>
##$DPNAME3= <>
##$DPNAME4= <>
##$DPNAME5= <>
##$DPNAME6= <>
##$DPNAME7= <>
##$DPOAL= (0..7)
0.5 0.5 0.5 0.5 0.5 0.5 0.5 0.5 
##$DPOFFS= (0..7)
0 0 0 0 0 0 0 0 
##$DQDMODE= 0
##$DR= 16
##$DS= 0
##$DSLIST= <SSSSSSSSSSSSSSS>
##$DSPFIRM= 0
##$DSPFVS= 10
##$DTYPA= 0
$$ [...]
##$SUBNAM1= <"">
##$SUBNAM2= <"">
##$SUBNAM3= <"">
##$SUBNAM4= <"">
##$SUBNAM5= <"">
##$SUBNAM6= <"">
##$SUBNAM7= <"">
##$SUBNAM8= <"">
##$SUBNAM9= <"">
##$SW= 399.302864936427
##$SWIBOX= (0..15)
0 1 0 0 0 0 0 0 0 0 0 0 0 0 0 0 
##$SW_h= 75187.969924812
##$TD= 32768
##$TD0= 1
##$TE= 0
##$TE2= 300
##$TE3= 300
##$TEG= 300
##$TL= (0..7)
0 120 120 120 120 120 120 120 
##$TP= (0..7)
150 150 150 150 150 150 150 150 
##$TP07= 0
##$TPNAME0= <>
##$TPNAME1= <>
##$TPNAME2= <>
##$TPNAME3= <>
##$TPNAME4= <>
##$TPNAME5= <>
##$TPNAME6= <>
##$TPNAME7= <>
##$TPOAL= (0..7)
0.5 0.5 0.5 0.5 0.5 0.5 0.5 0.5 
##$TPOFFS= (0..7)
0 0 0 0 0 0 0 0 
##$TUNHIN= 0
##$TUNHOUT= 0
##$TUNXOUT= 0
##$USERA1= <user>
##$USERA2= <user>
##$USERA3= <user>
##$USERA4= <user>
##$USERA5= <user>
##$V9= 5
##$VALIST= <valist>
##$VCLIST= <CCCCCCCCCCCCCCC>
##$VD= 0
##$VDLIST= <DDDDDDDDDDDDDDD>
##$VPLIST= <PPPPPPPPPPPPPPP>
##$VTLIST= <TTTTTTTTTTTTTTT>
##$WBST= 1024
##$WBSW= 4
##$XGAIN= (0..3)
0 0 0 0 
##$XL= 0
##$YL= 0
##$YMAX_a= 9747
##$YMIN_a= -4066
##$ZGOPTNS= <>
##$ZL1= 120
##$ZL2= 120
##$ZL3= 120
##$ZL4= 120
##$ABSF1= 10
##$ABSF2= 0
##$ABSG= 5
##$ABSL= 3
##$ALPHA= 0
##$AQORDER= 0
##$ASSFAC= 0
##$ASSFACI= 0
##$ASSFACX= 0
##$ASSWID= 0
##$AUNMP= <proc_1d>
##$AZFE= 0.1
##$AZFW= 0.1
##$BCFW= 1
##$BC_mod= 2
##$BYTORDP= 0
##$COROFFS= 0
##$CY= 1000
##$DATMOD= 1
##$DC= 2
##$DFILT= <>
##$DTYPP= 0
##$F1P= -61.6131669251322
##$F2P= -63.7828827460679
##$FCOR= 0.5
##$FTSIZE= 0
##$FT_mod= 4
##$GAMMA= 1
##$GB= 0.25
##$INTBC= 1
##$INTSCL= 1
##$ISEN= 128
##$LB= 2
##$LEV0= 0
##$LPBIN= 0
##$MAXI= 10000
##$MC2= 0
##$MEAN= 0
##$ME_mod= 0
##$MI= 0
##$NCOEF= 0
##$NC_proc= 0
##$NLEV= 6
##$NOISF1= -62.74998
##$NOISF2= -67.25003
##$NSP= 1
##$NTH_PI= 0
##$NZP= 0
##$OFFSET= 15.83152
##$PC= 1
##$PHC0= -15.31589
##$PHC1= 98.45487
##$PH_mod= 0
##$PKNL= yes
##$PPARMOD= 0
##$PSCAL= 4
##$PSIGN= 0
##$REVERSE= no
##$SF= 200.13
##$SI= 131072
##$SIGF1= -62
##$SIGF2= -63
##$SINO= 400
##$SIOLD= 131072
##$SREGLST= <1H.CDCl3>
##$SSB= 0
##$STSI= 0
##$STSR= 0
##$SW_p= 3633.72093023255
##$SYMM= 0
##$S_DEV= 0
##$TDeff= 0
##$TDoff= 0
##$TI= <>
##$TILT= no
##$TM1= 0
##$TM2= 0
##$TOPLEV= 0
##$USERP1= <user>
##$USERP2= <user>
##$USERP3= <user>
##$USERP4= <user>
##$USERP5= <user>
##$WDW= 1
##$XDIM= 8192
##$YMAX_p= 0
##$YMIN_p= 0
$$ End of Bruker specific parameters
$$ ---------------------------------
##NTUPLES= NMR FID
##VAR_NAME=  TIME,          FID/REAL,        FID/IMAG
##SYMBOL=    X,             R,               I
##VAR_TYPE=  INDEPENDENT,   DEPENDENT,       DEPENDENT
##VAR_FORM=  AFFN,          ASDF,            ASDF
##VAR_DIM=   16384,         16384,           16384
##UNITS=     SECONDS,       ARBITRARY UNITS, ARBITRARY UNITS
##FACTOR=    1.33e-05,      1,               1
##FIRST=     0,             0,               0
##LAST=      0.2178939,     0,               0
##MIN=       0,             -4066,           0
##MAX=       0.2178939,     9747,            0
$$ Real data points
##PAGE= N=1
##DATA TABLE= (X++(R..R)), XYDATA
$$ [...]
13398 -152 1147 588 401 224 238 -117 -7 -86 351 459 350 129 380 309 743 344 42 -20 -595 67 -215
13419 -215 -133 -263 696 698 -418 -17 -213 -13 297 504 -450 491 602 143 -94 -593 -383 116 -354 282
13439 282 116 -222 -588 -153 -706 -261 -465 -179 -819 -517 -80 -293 -620 -897 -502 -172 -496 -772 -850 -745
13459 -745 188 -713 -667 -1635 -705 -509 -1417 -173 143 -497 -146 -412 -785 -206 466 -1325 -685 425 -914
13478 -914 -884 -701 396 -785 -399 73 -596 -296 -584 -372 -66 729 78 -1056 157 -271 -596 224 -198
13497 -198 -179 63 -278 64 143 -240 -416 342 -595 -283 -50 -301 89 709 586 -101 144 -812 157 -200
13517 -200 624 52 341 16 572 794 614 841 449 181 -84 -167 131 -44 941 422 -52 1060 1102 -47
13537 -47 1155 227 -413 593 556 470 363 -163 1176 998 328 1043 362 392 647 1047 1059 428 896 523
13557 523 -218 268 1242 205 387 54 351 964 -1097 -22 310 -408 292 182 135 164 747 -224 70
13576 70 815 33 184 -357 795 -673 440 -389 479 379 164 -496 424 -139 61 -41 525 238 156
13595 156 -686 -126 -379 359 146 -684 -358 103 -567 276 -423 112 36 -1161 -376 190 -479 -20 303 -1011
13615 -1011 126 -1728 -76 -670 -164 -593 -1068 -768 -773 -746 -1647 -280 232 -599 353 -669 -168 -106 657
13634 657 -251 44 386 -337 -637 -280 -479 -394 488 526 -263 -71 -825 180 -735 32 115 -629 -1394 -465
13654 -465 -556 -820 -860 -643 -588 -411 -322 411 -165 -63 -157 80 520 -591 231 -244 -303 246 544 869 -425
13675 -425 -174 352 -447 511 -191 154 -111 -176 178 -35 -149 -165 15 1101 -38 371 86 292 806 272
13695 272 84 351 -513 69 1050 220 636 -182 445 846 191 427 709 1389 310 -611 1105 643 481
13714 481 1353 -18 1101 517 338 -246 348 479 108 170 472 526 435 597 -300 -727 523 43 -150 148
13734 148 -34 -180 564 111 301 -248 674 765 201 -262 637 697 -381 468 233 105 -269 628 89 650
13754 650 685 520 1060 544 -119 -216 -318 -98 -49 -390 -175 334 -471 -1127 44 -233 -186 -113 -611 714 -759
13775 -759 202 200 -1003 -629 -74 -162 -502 -751 -667 -552 -1 -141 -422 -952 230 -1239 12 -152 -141 -121
13795 -121 -921 283 -820 -334 -210 -585 -691 -190 -1602 -473 -1047 47 -1097 -374 -174 -842 -528 -217
13813 -217 -624 -804 54 -221 -1000 -445 -572 -537 -328 -462 577 -1510 -657 139 -578 -39 -482 -746 254
13832 254 -1221 -1718 -633 514 -830 -880 -246 102 -79 489 134 959 -592 427 465 -669 916 -49
13850 -49 -734 290 80 502 592 64 821 195 -320 630 284 575 -525 683 564 -154 -619 -148 473
13869 473 1382 -340 203 203 -355 815 921 347 -469 698 -636 528 681 346 421 1216 454 723 364
13888 364 -281 821 749 708 603 463 31 -98 231 367 547 -577 199 832 -565 197 709 73 874
13907 874 533 -970 895 664 957 288 206 -99 327 1085 -435 505 849 -89 -543 68 -365 -772 -579
13926 -579 329 -775 -615 -50 -413 244 -374 479 743 -463 -486 24 -600 311 -610 56 545 -415 -162
13945 -162 211 -306 -758 -232 25 -1175 32 -504 -228 -737 78 -715 -256 -223 -115 -218 -723 -203 -263 -747
13965 -747 138 -833 -641 -1032 -131 267 -231 -136 -1334 -829 -562 -767 -217 -136 -828 -908 -29 195 -610 -865
13985 -865 -682 266 -433 -605 -316 -1147 -56 -503 -639 -276 -1219 -56 -43 -528 266 -211 103 18 62 -250
14005 -250 339 -281 -392 -49 -525 -1194 -35 -279 -204 160 -568 -174 148 -55 -392 -613 -225 591 84 -97
14025 -97 -217 -279 -119 -43 298 -25 -435 411 198 -801 303 736 1079 249 220 -202 278 -286 460 -268 463
14046 463 481 664 499 474 411 209 1062 935 1039 9 491 88 474 93 509 76 537 357 -13 65 299
14067 299 289 -488 286 594 928 206 132 122 51 412 1091 489 414 469 736 470 -38 77 562 730 -486
14088 -486 556 -107 704 879 -191 84 610 5 220 149 282 -324 -961 -768 41 -692 -93 268 133
14107 133 -425 -295 78 -861 75 -296 -273 947 -686 -1093 -156 -773 -230 270 -229 -926 -285 -1445 -681
14126 -681 405 305 -622 -900 418 153 253 -1044 -1299 -613 -330 -580 -462 237 -1117 -618 -185 -551
14144 -551 -382 -322 -476 -1395 -595 -1131 -155 -1075 -275 -489 -783 -396 111 -905 -930 -116 -1015 -334 -375 -551
14164 -551 -964 24 -926 -124 -739 105 -426 83 -707 -335 374 -114 -262 -486 -590 -872 -542 -115 127 -308
14184 -308 -383 74 67 415 52 10 -833 -65 731 -527 -479 -424 30 462 -57 657 898 18 798 541 189
14205 189 424 389 945 -589 132 738 669 265 -61 550 140 305 -559 504 234 445 924 334 616 237
14225 237 276 544 452 -188 1036 279 -495 310 -77 -364 59 56 545 224 132 -188 169 19 53 338 1143
14246 1143 337 924 415 377 627 458 1030 705 -338 397 47 435 -128 33 -133 253 106 -339 99
14265 99 -174 176 226 445 -91 179 81 34 217 387 263 -643 283 397 -11 -544 -10 455 257 -200 -899
14286 -899 -305 -148 -332 -198 -202 -992 71 108 -278 -829 -989 -762 -316 -1444 -76 8 -1479 -672 -818 -248
14306 -248 -300 -441 -818 -505 -109 118 -649 -103 -572 -783 374 -170 -850 446 -586 -1533 -366 -286 -309
14325 -309 -387 -571 -632 -513 -1061 -303 -1153 -952 23 -513 -644 -498 339 -1324 -1071 -574 -630 22 76 -1154
14345 -1154 -717 -747 -395 235 -194 -930 138 28 -62 -50 -83 -53 -1020 -958 441 15 -258 -190 -123 -725 255
14366 255 -342 463 63 -451 -527 -174 -411 -121 -1079 491 296 33 439 -409 -347 -848 280 41 -11 528
14386 528 121 296 -610 913 536 -130 386 528 431 -958 -592 630 832 314 499 1288 -60 334 875
14405 875 296 -105 467 737 -404 337 253 363 670 -40 64 44 -297 -412 647 781 477 350 531 949
14425 949 745 522 -6 792 -258 -334 487 547 132 -393 479 -112 826 -231 515 -429 38 -117 6 -144
14445 -144 335 159 946 177 422 260 -406 -54 519 -751 -111 -306 -268 -489 -304 -489 -592 -141 -821 -108
14465 -108 -240 -257 -130 37 -118 -1038 -495 131 -289 -89 -416 -74 -531 -536 -1119 -389 -709 237 -642 -662 -888
14486 -888 195 -262 -891 501 -843 -35 -792 -107 -423 -943 -514 119 -88 -1235 -543 -380 -425 -936 -442
14505 -442 455 -814 -1237 -623 -1228 194 -784 -320 -425 -622 110 147 273 -887 -300 -596 624 -301 146
14524 146 -93 -372 -265 -200 -370 -1005 567 -929 324 -5 401 358 344 -299 -780 607 -201 258 791
14543 791 147 73 -25 515 237 729 80 -1000 281 249 53 840 705 937 377 468 -157 -243 695 334 278
14564 278 20 687 1033 -172 329 968 415 859 1053 1049 1189 853 300 375 881 -111 97 369 501 456 514
14585 514 894 -109 825 124 385 522 -326 207 621 807 821 785 527 159 203 310 4 1087 417 -605
14605 -605 299 470 -87 73 372 157 355 -982 -357 -38 -735 -215 60 1120 316 -905 245 -425
14623 -425 359 131 57 -468 -645 -530 -324 -159 463 300 -654 168 720 -1126 -800 -15 297 330 -418 -456
14643 -456 -320 121 -547 -990 -790 -400 -980 -894 -805 -551 -468 -557 -135 -878 215 -99 -673 -295 -380 115 242
14664 242 279 157 -315 -180 -216 -700 -421 -606 -78 -163 -906 -1197 -400 -608 -244 -336 -1054 71 -507 -397 -545
14685 -545 -351 127 310 -326 -560 -319 449 -80 -34 12 -43 238 85 -466 -841 -520 214 -37 -278 -838 -1109
14706 -1109 2 -457 -567 -393 514 252 613 1491 -458 -319 385 -105 353 1036 518 -22 218 298 122
14725 122 231 284 215 127 805 467 163 1048 954 -243 289 -52 407 242 516 -195 168 1225 -113 498
14745 498 654 484 543 -66 57 -35 635 -960 162 -407 733 -292 1278 1008 875 681 993 1072 -363
14764 -363 213 488 69 -481 858 296 863 272 381 1154 -80 -25 327 1161 359 -55 648 -854 43
14783 43 -184 334 138 247 422 -443 593 155 0 502 124 264 -310 177 -632 143 -318 467 -449 -816
14803 -816 -180 -293 368 -1204 -515 274 368 -121 678 -361 -364 -426 -683 297 28 -43 330 -430 -613 -1239 -673
14824 -673 149 -691 -1057 -180 -1241 361 -876 -1407 -167 25 -336 -606 -342 -432 -65 -986 -1244 -252 -973
14843 -973 -425 82 -292 -174 -251 -1135 -349 933 -672 98 -299 -267 -168 -650 -883 -431 279 -203 174 -829
14863 -829 -334 -55 -581 -994 -124 -377 -216 285 313 -951 -263 242 -79 168 -676 345 -210 -384 -245
14882 -245 -852 272 -359 -806 -451 -739 -70 506 309 59 174 360 -236 -40 749 86 382 660 879
14901 879 249 412 -276 719 -194 189 481 706 299 -19 -667 187 1048 342 1277 987 691 -79 1002
14920 1002 330 192 517 455 -175 831 683 395 -55 371 910 326 520 495 -331 762 292 158 864
14939 864 758 623 695 57 -40 -53 -240 -143 466 800 811 -712 -183 796 445 525 101 560 478 1221 738 880
14961 880 -322 -299 652 -459 -166 -541 -34 -74 364 -193 -595 -424 78 -754 346 257 -67 -821 -1103 146
14981 146 -553 -655 -594 -774 151 -503 -633 120 -748 -551 -516 -352 -1410 -826 -127 -254 -809 -671 298 -1603
15001 -1603 53 -896 -429 -439 -434 -45 47 229 -1144 -146 -761 -576 431 -341 -337 270 -745 -715 -369 -60
15021 -60 105 -438 -20 -1028 203 344 -172 -223 -257 -307 -889 62 -80 683 -320 -361 -945 -42 -205 399
15041 399 -451 675 -454 9 -946 -418 58 127 255 -93 634 950 -192 77 274 370 137 393 -144
15060 -144 216 265 413 328 347 1114 823 1326 48 508 722 -727 540 121 458 1117 -44 717 1090
15079 1090 597 689 833 335 236 1332 189 641 262 -392 496 415 835 242 702 738 629 138 408 440
15099 440 314 559 260 332 533 -93 19 289 361 519 693 990 355 290 1175 409 570 372 400 534 370
15120 370 862 71 396 190 205 100 819 89 95 934 -610 649 -612 -667 -367 138 419 553 -210 -95
15140 -95 52 -249 -633 529 -237 -360 -84 457 61 -991 -445 119 -259 -537 -511 -1460 -695 -2 -89 -19
15160 -19 -239 -1073 -1421 8 -172 475 -689 -587 -703 158 -560 -653 -869 -496 -1000 -1169 -863 -475 -315 -464
15180 -464 -527 39 -505 63 -678 141 -326 -576 -1367 274 -684 -467 -313 -176 -447 268 390 -742 -583
15199 -583 -254 -596 -903 -302 -816 -878 133 -513 122 -386 -155 -161 -256 406 498 359 -610 785 -287 26
15219 26 -1035 88 -241 -336 163 -186 347 -459 617 550 -65 41 -34 -128 -136 -654 161 93 796 0 -687
15240 -687 954 -420 290 -504 647 146 271 825 359 52 -467 60 -128 415 361 598 -128 1456 567
15259 567 166 776 738 -10 838 462 433 497 621 741 120 307 528 786 365 -323 112 827 410 -101 -143
15280 -143 347 400 6 -222 198 509 -125 -175 599 -175 34 261 20 184 47 178 410 326 -168 348 450
15301 450 -876 423 275 424 -304 25 22 -702 -443 -231 -169 316 -260 -519 -394 -649 -507 -146 -121 -344
15321 -344 -1076 -79 -452 227 -149 -449 -125 -585 -722 257 -644 -364 -778 -642 72 -193 -465 -916 346
15340 346 -45 -840 -41 -236 -267 -566 -442 -1108 -856 -606 369 -410 -606 -1033 -1012 -152 -207 -870 -670 -900 -434
15361 -434 -1017 -1519 550 75 105 -1051 137 -1065 -162 -444 -248 143 -321 555 149 -1217 -189 -263
15379 -263 -100 -365 -578 -41 -498 -715 -71 -854 310 590 667 396 329 158 81 155 -334 1002 77 -129
15399 -129 829 74 370 5 -279 -626 -187 239 -277 627 217 28 252 1002 491 -195 508 -104 -300 -309
15419 -309 -77 275 58 353 248 -7 81 424 658 311 31 732 28 841 531 792 -72 263 630 607
15439 607 411 1260 355 -249 979 461 65 735 428 669 -9 291 79 80 208 463 -329 -21 129 352
15459 352 532 -868 959 90 163 842 146 512 -311 -10 74 -472 45 228 342 82 -197 -141 705 20
15479 20 566 -189 -187 -560 -60 -740 19 -561 -197 -887 -481 -169 -302 -278 -4 373 -59 238 -340 -491 87
15500 87 -1159 -615 -1090 -423 -642 -497 549 -269 -169 -640 -38 -428 -872 -265 136 -728 -963 -518 -150
15519 -150 -425 -1519 -353 -348 -1 -664 68 -328 -673 237 -342 -229 -18 -801 -657 -477 -655 -722 -317 -559
15539 -559 -926 -398 -565 -215 -1092 -162 -596 -323 -398 -704 237 -724 -627 -658 -741 -272 -213 339 -241 -147 -233 402
15561 402 392 -265 -383 -768 221 -640 -365 262 -851 293 -611 -484 -226 -172 403 80 -23 221 -121 -125
15581 -125 501 237 924 59 1019 -106 552 950 583 1335 820 126 209 427 219 274 301 857 910 330 274
15602 274 197 59 546 73 729 1258 66 140 141 828 512 517 578 416 262 -79 350 334 108 377 222 146
15624 146 292 1118 916 406 354 308 748 97 -296 -315 -47 -83 295 407 -342 203 568 989 -84 111 1
15645 1 80 -310 -160 -77 -92 701 -71 923 491 255 94 216 -262 -303 127 -428 -571 -517 -398 -250 423 501
15667 501 -894 -206 -121 -62 -509 -366 -399 -252 -297 -1075 -314 -830 115 -594 97 -309 -618 -899 -52 -181 -472
15688 -472 335 -419 -103 241 217 -581 -254 -912 -1043 -263 -628 -730 -504 -721 -1338 -505 -282 -511 -192 -483
15708 -483 -515 -804 -261 125 -157 -289 -326 721 43 -219 -275 -182 -68 -435 655 -546 -468 -118 116 401
15728 401 265 -588 -389 627 -69 -199 -166 -206 -90 -298 64 -320 -535 -992 300 848 31 484 319 -963
15748 -963 509 13 455 739 164 214 295 -288 216 -115 -98 384 44 524 70 365 892 519 346 531
15768 531 266 1069 229 975 715 -231 -114 221 426 745 545 122 120 948 79 691 993 582 -3 604
15788 604 235 320 485 241 -326 283 675 708 -358 573 989 -85 -26 367 117 551 -46 175 741 -220
15808 -220 210 -119 668 583 456 411 -36 380 527 524 -29 635 -313 416 -90 -82 22 -295 -202 -437 -274 506
15830 506 -22 -781 297 343 -20 -627 -574 148 9 -672 300 -305 -180 -781 -534 -459 514 362 -370 52
15850 52 279 -371 -836 -997 -676 94 -397 -255 -887 76 -217 669 -152 -97 -656 -853 -122 -1185 90 -514
15870 -514 84 28 86 -373 -832 -28 -555 -384 -892 -420 -29 -327 -459 -361 -1001 -836 -697 -40 346 -178 -152
15891 -152 -239 -169 93 -25 -109 -854 -870 939 -24 -440 -234 -166 -708 583 -89 -556 612 229 -556 -91
15911 -91 -636 495 -314 -311 633 -663 216 -235 211 598 -761 422 570 457 506 -122 207 -468 -80 561
15931 561 266 220 555 234 236 -77 594 644 977 973 658 -89 220 524 1554 637 526 -151 196 553 672
15952 672 116 605 -422 181 1248 1069 -283 552 813 -75 351 1045 1115 510 1257 -32 663 211 722
15971 722 971 1332 460 241 226 -213 47 127 350 406 437 511 23 596 29 438 -364 -284 366 -216 -163 -39
15993 -39 -217 -44 309 254 352 247 117 -309 134 24 235 -221 -444 -7 273 -437 -35 -346 -196 -922 -241
16014 -241 -335 -310 -2 -440 -29 -374 836 -46 -152 -65 -1249 -96 266 -708 -368 94 -732 -265 -685 415
16034 415 -502 -525 -148 -792 535 -1095 -1226 728 -416 -534 -1132 -805 -815 -29 -1076 -1453 -807 77 -462
16053 -462 26 173 -358 -1211 -880 569 -521 165 1429 -663 -201 -503 -560 -678 -332 397 -467 -532 -268
16072 -268 84 -698 -27 562 -689 109 -843 -284 -542 296 188 -341 353 31 -557 -341 -735 899 -264
16091 -264 413 318 746 508 172 -47 -23 524 -607 184 1048 547 274 1175 376 269 659 278 270 108 451
16112 451 -49 388 -133 508 803 -421 295 886 517 -10 -17 484 -251 -57 385 -206 867 -7 104 124
16132 124 527 -36 -425 652 637 612 686 420 -69 26 923 769 170 -98 -130 335 -811 677 -424 -130
16152 -130 939 461 476 412 -52 -356 224 33 -62 246 276 80 -218 68 -237 319 -458 -461 589 -1136 -554
16173 -554 149 -705 -1043 51 -667 506 -389 -12 -126 -148 118 325 -482 -14 -811 147 -806 -924 154
16192 154 -743 -529 -410 -255 -423 -244 -266 179 143 34 -468 -216 -518 276 -407 -592 -228 -134 -352 -104 390
16213 390 -1226 -421 212 -1118 -192 -403 77 -56 -580 -489 -471 71 -1070 -151 -445 -584 -654 -832 262
16232 262 310 -565 477 -559 -694 247 73 493 -392 89 -168 -476 -556 18 -355 -258 -511 206 -356 -912
16252 -912 -557 78 -269 -416 1178 -408 -39 107 -151 -340 851 109 -53 205 716 142 -727 -410 632
16271 632 275 -128 923 668 222 83 348 469 645 991 130 -265 394 509 385 1032 728 853 365
16290 365 622 742 388 291 378 630 -100 1049 186 -114 159 253 1075 -1322 543 311 1342 1020 756
16309 756 568 380 760 342 474 -179 -129 739 3 206 159 -157 596 328 563 960 344 -859 503 68
16329 68 388 -41 274 -556 -372 -222 -158 124 -42 -102 -375 656 -134 -491 -332 191 24 -268 56 -128
16349 -128 591 -404 -673 -423 -428 -528 -694 -319 -561 -90 -185 -797 539 457 -221 -238 -681 86 256 -567 -347
16370 -347 326 -578 530 725 -741 558 -269 -449 -435 -74 -108 -779 576
16383E76
$$ Imaginary data points
##PAGE= N=2
##DATA TABLE= (X++(I..I)), XYDATA
0 0 0 0 0 0 0 2 -2 2 -2 2 -4 5 -4 6 -6 7 -8 10 -10 11 -13 15 -17 19 -22 26 -29 32 -35 40 -45 51 -56 63 -71 79 -90
37 -90 102 -119 139 -164 195 -236 269 138 9747 1680 -4066 959 -457 156 -73 98 -772 -39 -276
56 -276 -356 -56 -95 -1194 -452 -754 -489 -421 -1051 -182 -240 -832 623 -964 -838 -473 -1383 -842 -89 -1145 -534
77 -534 -1183 -471 -1368 -814 -690 -951 -915 -833 -1485 -302 -1726 -804 233 -144 -896 -1687 -711 -1123 -1192 -1035 -2156
98 -2156 -1394 -1111 -1267 -718 -1327 -220 -1250 -2479 -926 -1292 -751 -652 -749 -1228 -314 -206 12 -750 -845 -211
118 -211 -1200 -666 -1135 -1179 -156 -462 -452 -1155 -1134 -1165 -768 -995 159 474 -905 -343 198 -76 -841 778
138 778 -251 326 -330 -68 814 170 90 466 353 -140 -611 -208 380 1058 741 184 1415 -411 292 841
158 841 942 1988 964 1290 579 1010 920 1351 299 867 795 1568 217 -73 1408 1269 1456 713 693 502
178 502 1382 1427 1772 1425 946 1699 233 2185 982 286 264 -327 956 711 609 1429 744 816 254 891
198 891 948 513 301 845 -212 662 548 -311 -64 16 -317 667 -47 -42 83 -103 463 465 -73 -426 256 139
220 139 24 361 -198 -622 -704 -6 61 404 -1098 783 -149 -275 -201 -580 279 -331 97 -1080 -659 -632 -331
241 -331 -542 -809 -580 -593 -584 -89 -1953 -1116 -1380 -1258 -1341 -697 -445 -1525 467 -681 -1264 -1304 -1641 -105
261 -105 -984 -1084 -852 -1720 -837 -1476 -1355 -1234 -962 -1146 -1067 -583 -864 -399 -920 -994 -1074 -1409 -704 -540 -1243
282 -1243 -937 -928 -381 -1600 -922 -1180 -868 -1010 -425 -247 -702 -844 -373 -290 -449 109 -475 184 -297 36 -198
303 -198 -215 -773 -442 -416 694 350 -602 406 437 71 566 137 330 526 325 492 683 399 892 17 868
324 868 316 503 1577 486 313 -227 301 1023 1050 598 847 323 1338 738 420 1830 931 1040 1820
343 1820 829 1981 1094 1144 1029 654 586 1208 1863 595 1140 754 911 1277 836 406 1250 176 836 1408
363 1408 464 991 889 831 999 440 1227 1077 778 875 1483 103 200 552 252 920 1504 0 925 358
383 358 -88 602 540 330 616 700 296 -713 -348 60 -168 113 -518 179 -402 -1513 -257 -403 -487 -815
403 -815 -473 -393 -225 -564 -1463 -1047 -514 -567 -350 -1027 -496 -933 -677 -70 -390 -600 -952 -777 -289 -298 -729 -449
425 -449 -1197 -1020 -849 -879 -1184 -776 -149 -857 -933 -1214 -1050 -275 -1171 -1156 -386 -1614 -1482 -1205 -1473 71 -181
446 -181 -926 -1257 -1324 -382 -31 210 -146 -1176 -592 -1176 -1143 -1022 -1584 -1023 -931 -497 4 -540 -439 -261 22
467 22 -220 -129 187 -279 423 -159 -389 -186 436 -554 -333 16 -688 -262 188 223 -23 738 528 -268 -263 -256 671
490 671 288 207 637 -364 1514 658 693 166 380 982 -582 864 1219 42 139 163 1042 946 1316 350
510 350 1032 1094 801 507 1804 1469 1014 1123 833 996 322 451 374 1482 675 723 1233 1075 401 758 1011
531 1011 517 559 644 451 -316 1662 765 1071 398 543 1077 1009 -2 247 412 245 680 950 192 768
551 768 1360 277 486 246 528 700 240 1053 62 211 203 395 318 556 -550 479 293 -346 515 377
571 377 -101 16 94 -309 305 31 -426 -56 -1055 -741 -251 -93 -653 -119 -1095 -365 15 -1077 -727 -1491
591 -1491 -596 -965 -1531 -1345 -1121 -1057 -1624 -1240 -1369 -917 -1413 -715 -1407 -552 -1256 -830 -729 -1802 -1128 -1201
611 -1201 -1451 -287 -982 -947 -287 -1344 -1614 -1376 -746 -1182 -714 -1439 -1259 -1034 -715 11 -706 -755 -1300 -1061
631 -1061 -1404 -942 -658 6 -541 -1412 -1182 -587 -477 -612 -183 -42 -1131 451 -472 -147 -242 -462 -104 -296
651 -296 239 190 48 781 433 -475 189 1481 356 689 536 64 53 788 770 716 1640 83 194 805 970
672 970 -205 644 739 -327 1199 292 629 1024 1638 994 762 1074 1650 739 487 927 1277 572 579 1349
692 1349 1255 953 1635 1797 744 423 1386 1364 872 667 1713 1419 881 459 993 788 986 408 1025 820
712 820 -381 310 1273 527 556 487 1340 974 104 626 723 322 -129 520 1035 708 719 154 287 1063 368
733 368 -401 -126 -205 -117 677 699 410 342 -1029 -330 456 679 83 -417 -392 246 -306 -714 -1040 -889 -436 -888
755 -888 -1147 -1058 -204 -741 -837 -718 -875 -498 -706 -389 -715 -916 -629 -1342 -1008 -1179 -1085 -1450 -542 -697 -1159
776 -1159 -591 -767 64 -401 -1207 -1007 -880 -1090 -895 -376 -1018 -617 -1145 -1324 -1601 -1254 -1210 -665 -742 -1070 -593
797 -593 -1496 -747 -677 -1434 -732 -1143 -929 235 -300 -466 -903 -286 -175 -283 -511 -952 -7 -359 95 223
817 223 -498 22 823 -241 -203 -521 517 464 -39 1206 629 763 -13 -511 1036 153 9 285 700 957
837 957 232 1355 662 476 440 259 680 238 1174 472 249 -34 215 394 581 228 85 1489 270 1156
857 1156 1022 1164 899 628 1373 927 978 1059 677 900 940 1129 1022 351 1785 942 823 486 791 837 201
878 201 160 1777 1096 1355 886 896 338 439 730 166 1032 627 430 200 338 517 -27 783 421 557 626
899 626 626 55 1013 -92 -222 37 575 717 293 -892 8 103 876 23 -60 -25 -34 -130 689 -863 -424 553
921 553 -769 -204 -925 152 225 -707 -1040 -591 276 -338 -1114 -646 -731 -1309 -1106 -764 -1105 -1887 -628 -142
941 -142 -1112 -914 -862 -1388 -1000 -712 -1173 -1079 -1680 -2095 -881 -1196 -1362 -1468 -1148 -1331 -1071 -1438 -1468 -981 -276
962 -276 -352 -1165 -1368 -1170 -1641 -1323 -1236 -1066 -463 -1062 -738 -1204 -1476 -890 -781 -679 -600 -952 -1081 -1279 -769
983 -769 -1259 106 26 -502 -375 -875 -84 -336 426 336 362 477 -148 372 -57 949 335 552 86 458 222
1004 222 800 184 1071 856 437 1476 165 897 158 -46 930 328 1077 1083 1184 -5 621 802 680 102
1024 102 850 550 116 1100 206 984 879 1054 693 1020 2337 1318 1147 361 1159 404 158 932 1078
1043 1078 1029 145 1031 136 438 493 507 876 320 1246 905 759 1584 131 1530 1095 1336 924 865 234
1063 234 -5 1161 729 1248 -305 506 328 528 581 102 280 845 851 -363 732 536 -45 764 -365
1082 -365 -666 -89 2 -47 -725 -536 -94 -721 -1044 -136 42 -435 -14 -658 -1004 -1142 -426 -335 -404 -718 -90
1103 -90 -88 -904 -376 -1001 -661 -894 -1659 -516 -716 -1137 -1177 -1105 -911 -857 82 -1269 -1624 -1366 -1714 -1269 -1641
1124 -1641 -1861 -965 -685 -959 -1510 -1108 -1191 -759 -1271 -850 -634 -1150 -965 -1462 -1119 -1026 -766 -966 -907 -208 -1102
1145 -1102 -566 -1252 -36 -372 -778 -467 -1368 -285 -700 -983 -1002 -601 -146 -463 392 -869 403 -800
1163 -800 -507 422 378 214 216 194 -554 -164 -22 -618 171 -1 -565 -632 156 760 592 37 645 630 874 98
1185 98 1384 857 825 1005 67 661 688 811 528 390 626 525 31 916 450 656 850 325 721 891 2103
1206 2103 1382 1012 655 1126 1387 987 926 1353 1014 100 644 879 1207 572 734 -264 1398 1041 914 1165
1226 1165 1202 1132 1441 61 108 28 803 1002 866 693 492 133 741 1405 1378 -315 812 679 323 288 -483
1247 -483 229 155 -347 615 426 -156 453 582 -343 -1057 -977 -150 183 -388 -46 -35 -695 -874 -396 552 -269
1268 -269 -758 22 -1180 -616 -687 -676 -1115 -939 -922 -1285 -17 -958 -1007 -1072 -885 -1001 -936 -1051 -950 -638 -1555
1289 -1555 -637 -350 -938 -952 -1125 -839 -894 -682 -264 -380 -410 -494 -1400 -1034 -1354 -1438 -1118 -1255 -382 -1337 -1022
1310 -1022 -1383 -1720 -375 -693 -1457 -22 -356 -655 -255 -1037 -635 -492 -302 -667 -517 -14 -413 -824 -884
1329 -884 -178 -638 -158 253 -453 48 376 243 -23 -859 126 511 547 -52 789 321 750 -280 573 -125
1349 -125 846 -288 46 188 50 975 1010 1247 308 1919 -158 429 573 921 753 1288 1254 702 1349 1252
1369 1252 532 398 1171 1150 1196 362 228 1410 1753 656 885 705 1437 1013 1028 633 1047 66 212 752
1389 752 446 623 942 1036 383 842 536 709 488 135 176 843 1398 152 678 907 717 1032 456 -137
1409 -137 -77 722 1125 405 -691 770 -169 180 918 206 -416 -4 114 672 404 894 -315 -328 -225 227
1429 227 70 -171 -153 -136 -410 -153 -329 83 -233 -670 -198 -890 -748 -230 -519 -1099 -111 209 -1406 -59
1449 -59 -1148 -63 -800 -829 156 -741 -980 -1470 -1355 -764 -1564 -940 -1211 -963 -1292 -1272 -80 -727 -1447 -147
1469 -147 -462 -972 -1457 -100 -1759 -1328 -1387 -1375 -599 -343 -19 -1086 -1154 -817 -723 -1357 -673 -135 -366 -880
1489 -880 -898 -783 650 -466 -152 -632 -914 -891 -1124 59 -1737 -867 281 -951 -702 -774 159 425 341
1508 341 -103 -567 -359 -188 366 432 351 -132 613 -127 -323 510 322 -52 22 -160 872 -364 401 659
1528 659 37 1382 143 464 1014 801 977 340 910 992 311 657 762 1304 124 764 1084 1483 652
1547 652 276 1332 1449 830 935 248 1061 651 1699 1199 416 174 752 2179 362 475 1216 684 1102
1566 1102 1297 456 738 1412 811 1155 731 951 467 969 537 401 550 727 1187 578 238 1013 123 269
1586 269 726 716 47 202 408 255 595 652 249 -356 224 -75 22 -215 176 -319 -167 -1497 -39 292
1606 292 -248 63 -913 -557 -194 -592 -179 -847 -975 -962 -1068 -379 -498 -17 -1093 -630 -1146 -355 -1502 -659
1626 -659 -484 -493 -904 -986 -371 -1108 -890 -494 -1464 -1057 -664 -687 -1270 -1491 -1583 -1222 -882 -482 -986 -1239 -1427 -1351
1648 -1351 -1171 -1257 -887 187 -429 -1357 -1303 -960 -930 -952 -934 -936 -834 -627 -44 -419 -49 46 -71 -648 -284 -117
1670 -117 -1332 -877 -871 100 -145 237 601 622 501 -237 -106 60 0 331 227 -255 -491 332 -948 -512 147
1691 147 441 844 688 -381 1551 433 367 1141 530 84 616 912 1289 381 402 651 661 1124 944 1314
1711 1314 1030 636 873 -59 473 1381 710 949 777 806 397 721 905 1024 862 541 1368 286 1542
1730 1542 946 883 855 1032 1073 396 773 342 663 153 -176 711 1720 719 832 1182 1831 761 431 917
1750 917 512 877 231 -181 -91 241 845 377 324 -201 368 -356 281 467 -41 426 -138 -8 986 -44
1770 -44 -371 651 -96 -132 490 -671 -310 -842 -356 -436 -613 428 -307 -77 -1077 -1340 -1166 -183 -828 143
1790 143 -490 -804 -1074 -623 -210 -978 -420 -259 -1481 -1135 -1459 -260 -949 -752 -1050 -1168 -379 -214 -767
1809 -767 -713 -220 -1470 -913 -1531 -278 -664 -886 -1300 -1870 -1590 -1447 -914 -1464 -1880 -341 -783 -1246 -482
1828 -482 -763 -680 -1096 178 45 -1552 -483 -381 -412 -979 -1214 -716 -932 -1454 -600 133 -923 -1046 -526
1847 -526 -939 -1148 -108 678 587 -235 24 -139 -358 78 380 -281 -394 482 276 -175 757 493 667 -277
1867 -277 977 480 -87 -226 1115 133 602 516 807 241 155 978 332 813 540 61 527 418 894 1121
1887 1121 776 1201 1031 556 512 744 70 2010 1161 1709 1440 519 1761 709 1374 465 1657 664 304
1906 304 1354 1551 1139 1549 661 968 774 1100 18 1002 861 1121 422 607 -62 107 347 176 -183
1925 -183 263 427 -276 348 88 586 -78 523 1109 314 -285 171 275 -315 729 -166 537 171 -494 -478
1945 -478 -638 -147 -843 -195 133 -560 388 -826 -1267 -655 -96 58 -944 -811 -615 -5 -1376 -850 -1059
1964 -1059 -1492 -514 -879 -1042 -601 -1170 -772 -1573 -360 -2088 -965 -965 -289 -1170 -876 -1218 -1186 -1587 -711 -1539
1984 -1539 -1827 -31 -1034 -871 -1535 -1659 -645 -923 -1168 -1110 -465 -1026 -770 -1602 -78 -61 -1493 -378
2002 -378 -781 -841 -496 -634 -560 -316 -872 -808 -979 -766 435 -475 304 -1023 89 -1093 209 -362 -464
2021 -464 36 -507 -418 -225 -210 -126 123 -57 157 393 -390 -523 137 315 196 257 -627 -691 329 350 180 -67
2043 -67 335 1457 761 723 359 543 508 361 1252 494 609 939 1257 876 677 1302 57 253 1132 869
2063 869 1005 1460 1570 1609 298 1122 936 824 1044 1205 912 533 777 823 784 781 110 747 1125 1026 1231 1575
2085 1575 737 914 -331 389 759 449 823 -20 593 218 486 440 445 9 664 -131 553 280 -132 963
2105 963 1039 358 -287 506 663 529 703 209 -247 -230 10 -591 -18 -188 -845 -245 32 -137 -892 -137 -596
2126 -596 -741 -490 -1274 -628 -376 -341 -191 -857 -489 -551 -1298 -740 -241 -1306 -1071 -587 -107 -444 -333 -661
2146 -661 -720 -730 -761 -499 -950 -1062 -443 -951 -1088 -686 -695 -758 -884 119 -1483 -378 -819 -774 -1954 -1576 -952
2167 -952 -959 -1263 -179 -223 -1167 -874 -1472 -175 -783 -1113 -293 -532 -974 -713 -1168 -297 -829 235 364 -649
2187 -649 -79 432 -97 -861 -258 -706 208 -136 -415 -621 228 -225 -372 -483 -328 -217 -391 -53 -478 693
2207 693 556 326 239 578 1 649 135 295 1106 -203 446 1101 595 769 777 1001 166 1475 779 262
2227 262 891 453 1443 833 396 452 1256 361 409 1445 367 633 1528 1921 1692 1333 1227 942 1034 326
2247 326 865 1265 937 788 1102 353 733 961 479 1187 1071 1184 138 1410 700 380 941 363 957
2266 957 714 454 339 668 -430 403 434 187 361 271 -312 535 -248 422 -307 -260 435 482 -46 -137 -492
2287 -492 528 1066 361 -650 -946 698 -984 103 583 -666 483 376 -28 -215 -760 -584 -476 -1024
2305 -1024 -691 -766 -556 -347 -278 -1301 -250 -388 -762 -1405 -869 -1023 -1256 199 -1688 -610 -452 -812 -1255
2324 -1255 -973 -360 -274 -1261 -138 -971 -1108 -596 -137 -1033 -658 -1272 -910 -1008 -1149 -943 -1595 -203 -384 -698
2344 -698 -998 -520 -298 -1122 -1416 -727 -506 -1037 -998 -804 -137 -1268 -394 -1926 -833 -275 -1106 -435 -463 -210
2364 -210 -417 -175 -1045 -989 231 -19 397 -281 333 299 529 403 -288 -220 579 557 697 -364 563 432 -232
2385 -232 912 -176 586 49 379 524 376 335 266 483 -24 1599 427 1518 784 -393 1313 208
2403 208 1394 961 -171 1141 1256 1158 527 865 243 793 1053 1205 547 671 431 1011 721 1414 683
2422 683 676 462 1169 722 1255 1309 1149 631 409 747 1001 886 674 757 -263 757 827 296 217 -94 -603
2443 -603 721 512 100 321 412 728 -153 65 50 266 -658 567 97 -420 101 -417 364 294 -75 -571
2463 -571 -193 -337 -408 -940 -862 228 -395 -316 -301 -182 80 -794 -334 -445 -388 -839 -839 -300 -777 -826 -402 -1127
2485 -1127 -1297 453 -448 -1754 -607 -1497 -839 -1089 -1184 -558 -548 -912 -1220 -1298 -1756 -1126 -1298 -665 -1257 -1082
2505 -1082 -850 -789 -899 -1441 -1575 -1644 -623 -920 -603 -922 -504 -867 -54 -639 -286 -984 -1008 -599 -435 -620
2525 -620 -309 152 -130 -817 -19 -215 -454 158 -172 -692 -477 166 -425 -496 -171 33 589 7 65 766 63
2546 63 -498 -186 217 383 -833 -134 311 298 776 659 704 302 220 -256 1369 699 267 705 754 964 385
2567 385 1475 2140 1058 952 556 1231 859 895 943 763 177 903 634 592 491 1463 490 943 818 1011
2587 1011 670 1095 1277 1641 1248 1182 1645 1229 62 344 607 842 418 932 1665 -147 690 352 855
2606 855 626 371 714 1016 431 307 1345 750 556 624 144 -220 1237 426 428 381 552 448 123 -240 -56
2627 -56 850 124 -752 -554 281 -197 137 -473 268 5 -806 333 274 -855 367 361 -646 477 277 -824
2647 -824 -818 -874 -433 -1063 -144 -457 -1637 -1446 -285 -651 -979 -1680 -440 -727 -979 -533 -814 -413 -1155 -1195
2667 -1195 -974 -626 -1335 -803 -961 -771 -1417 -880 -1133 -160 -256 -611 -1537 -816 -1357 -834 -969 -802 -553 -675
2687 -675 406 -226 -496 -910 -837 -277 -194 -323 -796 -402 275 -1195 77 -641 -1158 -334 114 262 -535 1
2707 1 465 -618 -104 -48 143 -202 650 813 181 288 -752 -699 -287 844 -427 336 -13 187 234 635
2727 635 348 -74 241 -442 380 -250 706 -138 486 179 361 882 1105 371 573 95 798 958 1049 477
2747 477 194 1068 95 1265 283 719 1232 1163 563 404 479 1551 1054 1193 1093 725 1348 -119 1038
2766 1038 1035 972 1681 1423 1831 703 904 411 1178 1033 1137 1255 298 490 694 1101 1431 1111 977 724
2786 724 -13 -30 1183 102 229 606 269 -2 555 -99 43 445 -411 57 -1444 327 -693 -91 202
2805 202 -1488 20 -821 57 -158 -282 -1151 69 -660 -426 -902 24 -390 -560 -154 -817 -780 143 -332
2824 -332 -416 -625 -1101 -1444 -614 -431 -613 -1421 -919 -431 -699 -14 -187 -950 -1276 -942 -233 -939 -1289 -818
2844 -818 -1646 -1470 -695 -822 -860 -907 -252 -1030 -643 -1309 -660 -595 -1407 -1271 -949 -1450 -905 -1163 -413 -979 -807
2865 -807 745 -864 -1074 -338 -772 -353 -222 -504 206 -856 -261 -423 -401 -26 -961 -410 -300 -204 -111 -946
2885 -946 -1097 -395 720 -584 -156 688 178 177 -112 -291 -297 457 1304 -111 439 672 277 778 -193 1053
2905 1053 773 1637 250 754 776 -173 749 976 856 -168 955 1137 -323 1157 1482 838 861 1638 815
2924 815 470 819 1670 1215 285 -72 466 1460 1209 998 679 698 1073 1772 1485 1070 1258 126 495 1295
2944 1295 942 1059 778 123 855 654 472 -394 1040 955 115 304 -130 540 415 406 878 411 403 -296 -840
2965 -840 291 -201 -56 599 128 -119 -60 -911 177 250 -258 -673 -307 -343 157 329 608 -179 596 -81
2985 -81 -1180 -227 -270 54 -228 -959 -949 -504 -309 -541 -1149 -805 -959 -434 -743 -662 -284 229 -903 -1332 -537
3006 -537 -1506 -497 -666 -632 -807 -1454 -787 -1140 -194 -1340 -804 -1067 109 -476 -1209 -1254 -572 -562 -794 -698
3026 -698 -833 -234 -556 -937 -858 -328 -1476 -785 -543 -338 -1295 -265 -1160 -1831 1 -187 -1108 -790 -230
3045 -230 133 -134 -375 -782 14 -472 215 -382 -803 -691 -24 -484 31 72 -74 296 304 -302 1 -533 -219
3066 -219 78 -136 -45 521 144 -233 592 153 192 1357 545 -411 1179 646 950 39 637 553 803 564
3086 564 638 1066 463 408 793 712 278 709 195 559 1295 1451 1322 953 981 1320 1027 460 956 1875 899
3107 899 1241 1745 808 1079 1156 527 545 1120 531 1381 865 706 1135 1191 1525 955 614 897 245 979 699
3128 699 756 851 130 681 236 297 43 -532 -201 673 542 449 507 191 377 622 -550 -664 -389 127 92 249
3150 249 -597 -624 -327 -842 289 -609 -435 289 238 7 -598 -917 251 -700 -668 -476 -366 -662 -849 -753 -243
3171 -243 54 -743 2 -875 -982 -705 -1026 183 -495 -2075 -867 -1327 8 -1238 -742 -482 -751 -443
3189 -443 -1345 -1543 -1146 -203 -894 -1515 -1271 -659 -414 -570 -631 -578 -432 -846 69 -1263 -1183 -504 -408 -966 -1019
3210 -1019 -601 -1267 -478 -1005 -874 -896 -383 -1041 -944 -669 -522 358 -489 -365 561 -1071 -138 -271 -380 -207
3230 -207 -284 887 -499 -316 -270 -44 891 -118 7 -45 1205 779 -37 208 1006 338 546 632 107 245
3250 245 848 -189 498 1047 275 1062 208 72 412 503 1215 654 -33 884 781 1766 169 94 139 984
3270 984 548 1048 1714 1332 744 1157 1215 1131 1321 1197 882 943 1202 876 1376 1166 683 1437 1267 1199 1145 -28
3292 -28 354 754 202 1718 693 732 165 1335 313 511 238 515 -132 -12 -60 673 262 396 539 318
3312 318 350 -636 99 -725 533 -325 -540 -155 -9 -277 432 -538 461 80 -136 -488 -97 100 -1 -944
3332 -944 -476 198 -548 34 115 -237 -996 311 -1150 -312 -797 -130 -1231 -538 -667 -1102 -935 -1245 -353
3351 -353 -931 -1435 -1097 -690 402 -657 -1321 -968 -462 -990 -949 -1475 -361 -831 -1295 57 -899 -818 -838 -75
3371 -75 -828 -342 -426 -1436 -791 -1193 -1010 -867 -703 -81 -598 -688 -806 105 -910 318 -1561 54 -760
3390 -760 -333 -308 -537 -787 -698 -85 -366 -348 295 -425 11 464 751 174 120 845 177 883 590 262 196 756
3412 756 -332 173 175 -348 -272 591 490 325 976 -467 54 82 110 297 533 -56 642 912 1210 190 1001
3433 1001 632 901 879 734 -111 1515 1232 1281 1381 719 882 169 571 -54 397 1001 1098 1218 920 732
3453 732 473 400 1220 935 -485 -223 1302 33 75 150 549 1190 1270 -41 1094 -361 455 933 269
3472 269 393 -858 704 220 1359 267 628 1146 495 261 1019 -324 505 945 43 -259 -584 -375
3490 -375 -352 -182 -26 233 -17 -302 -108 212 -476 -310 -1086 -122 -430 245 -946 -1344 714 -108 -95 -261
3510 -261 -1228 -1408 -619 129 -342 -1049 -859 -471 -1141 -1039 36 48 -670 -1342 -1040 -1294 -1271 -317 -1547 -464
3530 -464 -1097 -811 -1337 -1063 -645 -144 -1362 -1303 -1264 -945 -1412 -1107 -954 -407 -859 -1013 -188 -438 -521 -621 139
3551 139 -537 30 -126 -233 -763 -566 -658 185 -698 53 -1305 -733 1018 -155 246 -392 -238 -234 324 -897
3571 -897 391 979 -212 -200 578 59 -48 -456 -520 -621 -676 814 -319 419 583 -388 787 147 140 29
3591 29 1026 485 1069 544 1251 155 113 882 36 685 682 522 362 1390 891 1641 768 817 1312 740 1415
3612 1415 779 747 1064 1006 967 1034 1508 1688 394 19 1063 972 204 1518 1327 1115 1270 687 978 908 821
3633 821 880 435 1205 717 690 875 817 -187 223 1274 653 875 -329 255 338 739 1047 -205 947 542
3653 542 107 187 -575 -423 342 -113 835 -169 -165 290 437 227 -481 170 -355 323 83 224 -859 -1090
3673 -1090 -318 -409 -832 -929 -753 -358 -177 -797 -501 -118 468 -793 68 -64 -704 119 -1164 -655 -4 -1352
3693 -1352 -219 -127 -945 -1163 -131 -980 -1187 -793 -1305 -556 -591 -315 -888 -493 -182 -1386 -1241 -571 -588 -900
3713 -900 -822 -1486 122 -715 -270 -807 -356 -626 -621 -253 -1007 -976 -546 49 -186 -405 -789 156 -592 -135 -611
3734 -611 -82 318 -599 -53 -332 -308 -527 -85 448 413 233 -435 -194 916 -1017 746 775 353 -418 -183
3754 -183 469 402 261 504 560 38 325 437 775 465 797 571 217 867 683 272 650 463 196 112 442
3775 442 555 1569 494 345 198 1144 391 931 684 -24 790 1282 363 1371 493 728 875 1727 962
3794 962 1011 1102 922 1627 653 638 1296 605 701 1641 1168 402 1247 676 1488 516 1401 331 98 971 826
3815 826 -249 313 730 1250 428 35 283 -4 -195 523 1159 987 419 -124 326 720 191 -237 411 -149
3835 -149 597 343 11 -203 -462 222 -140 -126 -842 255 -222 -1042 -130 -1436 -608 -522 132 -734 121 -932
3855 -932 108 -1688 -717 -243 -1101 -31 -1260 -1549 -772 -604 -353 -729 -636 -1665 -792 -769 -1576 -1086 -1248
3874 -1248 -664 -1388 -452 -1001 -908 -1224 -779 -665 -1478 -667 -65 -895 -1047 -530 -817 -887 -990 -470 -1108 -1467
3894 -1467 -1079 138 -626 -396 132 -626 -413 -20 -988 -756 -231 -923 -665 -178 -544 -290 -841 -670 -128
3913 -128 -227 -696 -254 -292 253 -9 612 -495 706 455 -551 139 -194 779 432 874 144 507 -391 106
3933 106 199 616 275 18 40 96 -438 852 964 604 218 1407 822 199 1278 943 1377 69 844 1468
3953 1468 1887 1378 96 674 1069 1105 694 567 429 83 1115 864 854 538 435 636 1278 1211 259 344
3973 344 745 108 517 292 506 1205 197 1158 521 627 1535 932 1175 831 759 221 137 548 516 127 772
3994 772 -113 -337 -286 1136 217 87 48 801 731 1100 -453 -274 -148 137 429 120 233 -404 -551 -997
4014 -997 -228 -944 184 119 -1345 -849 -576 -405 129 42 -643 -868 -732 -1082 28 -347 -621 -510 -373 -737
4034 -737 -559 -696 -745 -1168 392 -1104 -1253 -563 -921 -362 -937 -1114 -656 -441 -1243 -147 -1619 -978 -923
4053 -923 -995 -318 -1376 -1080 -782 340 -940 -577 -524 -1361 -683 -885 -1257 -503 -676 -530 -598 -1248 -1032 -437
4073 -437 -1202 111 -331 -15 -400 -598 -502 -521 -284 -649 226 -248 88 242 -918 710 313 -40 490 505
4093 505 -167 443 558 -571 -24 -280 -655 476 629 326 786 867 380 344 -27 1366 457 1005 816 899
4113 899 441 600 1152 567 86 1140 819 761 757 1014 1168 471 768 740 1835 1893 1769 903 1055 943 474
4134 474 538 568 64 547 734 901 1217 633 1212 867 565 1271 830 872 885 524 448 778 1270 823 1183 858
4156 858 814 399 572 -266 952 799 37 736 257 257 352 -341 682 378 -84 -21 -275 157 -109 309 -560
4177 -560 526 54 382 -493 -72 424 -1041 233 -534 -270 -509 -481 48 -131 -12 21 -701 -958 -509 -853
4197 -853 -35 -1039 -392 -872 -252 -839 -569 -866 -960 -1399 -1021 -235 -965 -868 -1180 -1470 -1676 -313 -1102 236
4217 236 -945 -294 -1052 -51 -1270 -943 -1299 -1032 -1043 -1337 -1445 -504 10 -1311 -1322 -709 -1758 -1334 -1477
4236 -1477 -1277 -1437 -493 -459 -129 3 -525 -1402 -619 0 -256 -1397 240 -390 177 6 -137 -339 200
4255 200 -545 80 -714 409 -626 274 -156 85 775 232 1050 -510 -1229 -345 247 -7 640 -173 -580
4274 -580 306 107 814 302 -466 316 628 330 684 554 686 793 -378 391 455 979 487 983 715 185
4294 185 977 1723 414 907 1706 1462 621 1172 1027 359 824 1053 1864 1407 915 965 1004 767 654 578 1029
4315 1029 454 941 1344 1555 621 77 565 550 360 486 261 956 691 856 1012 155 513 526 104 -52
4335 -52 701 -85 -130 -94 787 -403 6 265 537 203 -191 118 60 -260 116 354 518 -425 496 32 -377
4356 -377 -347 -484 -499 -28 -36 185 294 -303 -79 -1166 -556 -526 -982 -186 -756 -1018 -1470 -782 -1112 -1303 -1050
4377 -1050 -1655 -90 -336 -916 -228 -707 -296 -406 -1098 -624 -1270 -897 -1606 -479 -572 -328 -765 124 -620
4396 -620 -1047 -546 -1182 -151 -1283 -733 -547 -1092 -1294 -838 -647 -634 -850 -1200 -348 -572 -424 -613 -523 -993
4416 -993 -921 -701 -1035 -1060 -202 -1129 -790 119 -527 -441 -181 -502 -601 -463 -75 -421 -235 -20 327 614 426
4437 426 561 71 427 298 -123 150 -197 -159 764 330 -287 703 311 251 -95 1325 841 563 626 779 875
4458 875 1522 98 789 746 1216 -32 1318 -81 216 748 922 1491 220 1389 666 775 1623 1495
4476 1495 1022 61 422 1073 1421 970 -348 234 330 751 721 -223 905 807 1193 1050 3 354 132 88
4496 88 387 882 483 526 736 39 547 427 101 36 1209 805 660 884 1197 899 548 458 188 322 330 788
4518 788 1 -284 -672 -336 344 -229 -1010 -667 -630 428 -586 -441 -273 49 -339 -864 -247 -583 -1363 -569
4538 -569 -1047 -757 254 -726 -775 -147 -90 -744 -639 -879 -216 -100 -793 -1251 -1067 -727 -1315 -719 -694 -675 -965
4559 -965 -586 -1541 -754 47 -379 -720 -1051 -1008 -1082 -933 -1292 -1576 -621 393 -931 -528 -1458 -1703 -880 -992
4579 -992 146 -53 -983 -1805 -181 -590 -609 -1075 -249 -117 -784 -862 -534 -1408 -820 -105 -140 128 -523 370
4599 370 -320 -297 -1326 -151 -575 844 -618 -291 607 -523 -546 -211 279 399 270 324 309 365 464 407 62
4620 62 1162 842 216 758 302 766 12 500 717 346 599 1516 1168 990 1152 -115 1161 460 1537
4639 1537 756 624 538 389 422 630 1505 85 1238 1651 824 526 1325 1276 899 844 203 406 1894 631
4659 631 1275 876 609 1313 604 817 772 1340 246 1463 934 191 439 484 558 952 516 -166 880 667
4679 667 846 -94 431 709 985 -183 216 -351 148 728 -100 -41 -620 -284 -235 335 367 103 -92 -536 -706
4700 -706 273 -333 -149 -173 -331 272 -66 4 -734 -28 -57 -1309 -1148 -740 -976 -60 -1308 -665 -1279 -520
4720 -520 -432 -1320 -654 -1206 -924 -706 104 -417 -634 -693 -717 -1023 -462 -207 -904 -270 -1186 -1434 -1535 -965 -809
4741 -809 -943 -875 -679 -468 -813 -1036 -723 -277 -418 -373 -293 99 -717 -1061 -281 -423 -205 114 -1194 -201 -568
4762 -568 25 -786 -954 -791 -825 -125 -848 433 402 -406 -775 -839 -254 239 -12 -53 627 634 351 -184 -214 471
4784 471 1206 -48 638 -557 32 -67 401 854 372 1004 47 -524 9 660 1949 519 702 1772 1024
4803 1024 692 582 1076 966 1047 308 -744 804 429 937 731 1132 969 608 967 828 1934 1126 1092
4822 1092 934 12 1180 1133 663 1091 248 487 1050 687 163 622 -33 1362 988 913 677 1331 11
4841 11 427 642 1154 501 938 36 50 1322 -317 855 -663 571 684 85 919 -325 813 218
4859 218 470 629 631 -81 132 -931 -617 -24 257 -473 76 -274 -502 212 -1115 -633 -200 -55 -483 -653
4879 -653 -994 243 -462 -1256 -18 -307 -1549 -907 -460 -22 -795 -714 10 -356 -1129 -1027 -690 -1059 -473
4898 -473 -877 -727 -1185 -599 -570 -841 -690 -165 -328 -658 -512 -563 -708 -555 -1127 -429 -433 -1203 -443 -709 -1458
4919 -1458 -1702 -682 458 -1071 -1137 -994 -355 -390 -1120 -1375 -1303 -911 -1289 -110 -539 -491 -1035 -691 4 -800
4939 -800 -392 -314 -678 -449 0 -227 -348 -240 34 128 91 -59 46 155 12 94 236 549 -127 498 -121
4960 -121 -33 398 1014 -327 739 605 305 41 33 814 427 1472 522 1084 1003 1177 853 1322 484 99
4980 99 1011 1063 1080 592 1404 631 540 1711 168 912 355 85 1445 562 592 589 1071 2042 195 634 939
5001 939 697 339 172 924 715 1642 1024 374 847 -17 680 910 651 320 740 653 938 147 -18 299
5021 299 625 57 570 532 -64 566 74 -141 266 395 276 806 54 -248 -96 -414 139 -511 62 104 -206
5042 -206 -233 -535 272 -101 -644 -642 -465 444 -37 242 -382 -187 -421 -571 -164 -431 321 -552 -998 -718 111
5063 111 -595 -708 -663 -639 -769 -436 -419 -992 -931 -298 -1300 -876 -851 -1003 -1076 -996 -901 -899 55 -103 -652 -1393 -1059
5086 -1059 -900 -1035 -1488 -554 -198 -1130 -143 87 -1628 -1155 123 -1741 -620 -1113 -339 -905 -10 -328
5104 -328 -621 155 -15 -259 -53 -91 -767 -425 -604 -624 -106 -95 -187 609 -393 -451 -712 307 -408 -398 -83
5125 -83 -63 453 508 -440 146 209 857 89 172 -236 136 645 256 790 43 -30 547 1138 -66 1287 81
5146 81 87 655 357 1450 514 823 973 469 734 1045 1318 718 402 948 649 1195 749 1372 425 1047 1493
5167 1493 1290 1065 910 1028 1215 754 1452 611 8 1427 108 535 1318 176 590 595 304 839 996
5186 996 178 261 710 -517 -44 724 1045 209 871 182 1126 580 305 78 -371 -158 85 -311 -379 -298 701
5207 701 259 421 330 48 -225 -235 438 -325 -243 240 -4 -192 -385 -809 68 -493 521 -437 -132 -232 -565
5228 -565 -833 -735 -319 -447 -118 -1028 107 -132 -1427 -904 -899 -426 -220 -167 -774 -1181 -1094 -1930 -1051 -991 -1166
5249 -1166 -921 -650 -442 -1356 -523 -263 -883 -702 -311 -926 -1203 -481 -217 -830 -430 -1031 -432 -564 -819 -1025
5269 -1025 -229 -759 -347 -680 -395 -556 -429 -344 -37 584 -512 463 275 -774 -7 -161 -461 127 23
5288 23 -132 618 -4 91 -9 -703 111 -422 -1027 -556 -165 -737 898 424 -402 155 887 492 870 -117
5308 -117 870 351 318 119 1313 1454 -693 928 186 878 1460 856 982 174 729 1277 -257 988 246
5327 246 923 1052 -300 -207 435 479 633 822 1068 889 2072 1430 557 1084 -71 1480 272 240 663
5346 663 721 548 1471 1145 687 -14 668 404 -27 996 269 692 1378 838 70 1051 1225 363 18 1158
5366 1158 1014 -63 473 -237 501 340 385 -360 1082 -577 167 141 733 1100 -1325 -341 279 -324 694
5385 694 -393 -644 -484 734 -10 62 -128 -143 -870 -776 -44 -15 -663 -1430 -262 -643 43 -1171 -1114 -1101 -995
5406 -995 -1138 -751 -172 -432 -784 -687 -1023 -981 -1013 -980 -738 -967 -551 -626 -992 -1211 -231 -363 -1574 -739 -694 -192
5428 -192 -986 -827 -522 -1159 -1161 -525 -684 268 -749 -294 159 -878 -547 -696 49 -299 -1048 -439 -1060 -401
5448 -401 -510 -576 -570 204 -90 -273 -197 -632 -229 226 178 -309 -49 -528 -282 -91 360 27 -1000 -94 10
5469 10 -319 -182 -587 -153 425 -890 432 -147 868 641 906 516 271 306 -53 231 262 207 251 170 188
5490 188 284 527 519 368 1144 683 774 349 362 384 1282 804 1039 239 913 1557 315 -512 634 852 769 442
5512 442 -288 676 1236 780 1031 262 727 468 1680 -8 1307 -183 934 205 312 814 1229 361
5530 361 373 147 807 941 222 -167 85 -32 842 302 396 -18 -254 455 -225 1014 169 -98 247 95
5550 95 370 657 303 -751 -415 221 -621 349 -834 -30 271 -329 495 -278 -588 -1397 -224 -384 88
5569 88 -353 394 -344 98 -864 -734 -215 -107 -1577 -834 -429 -1562 -261 -666 -332 -205 -1273 -912 -928
5588 -928 -1239 -340 -954 -603 -973 -1390 -867 -811 -666 -796 -1203 59 -1495 -614 -471 -1079 -829 -566 246 -239
5608 -239 -353 -316 -11 5 -947 -522 -1212 10 -209 -398 225 -1103 -520 306 -306 -1406 -518 -667 -715 -770
5628 -770 -390 96 -62 -162 -834 42 -437 1135 133 -370 207 -821 -306 -216 -13 -2 -70 -768 451 209
5648 209 1201 129 276 -217 199 363 172 1164 111 675 1190 429 1241 582 454 -2 430 686 1344
5667 1344 826 779 810 195 313 1045 583 972 1312 410 96 328 954 -75 177 679 333 870 773 1002
5687 1002 344 -14 749 277 380 449 223 440 859 124 569 516 1300 373 852 1294 1107 393 233 65
5707 65 402 806 -5 1107 504 719 309 751 -239 414 845 292 156 -251 591 172 -338 -326 -755 230
5727 230 -65 125 -190 -594 -689 -263 -635 -1104 447 -627 -336 -285 -278 -698 512 -332 477 -70 -239 -706
5747 -706 -383 -837 -690 -866 -452 -477 -1689 -528 -474 -1028 -1049 -1235 -1237 -1325 -204 -1954 -1077 -603 -69 -1291
5767 -1291 -1544 -602 -837 -698 -624 -1078 -459 -1099 -215 -1182 -1892 -778 -461 -1162 -1098 -389 -321 -451 -748 -1049
5787 -1049 -1134 -662 -212 -505 -457 66 -675 233 340 -656 -505 -276 -754 -544 335 -651 346 89 -379 -20
5807 -20 -105 681 -538 318 135 -79 488 362 80 249 667 437 -41 324 594 -326 -202 -14 506 -299
5827 -299 253 381 405 1076 133 137 -355 313 236 842 1423 561 1158 -227 293 698 554 592 426 758 375
5848 375 808 1065 120 612 732 1106 1033 491 764 -340 887 1303 628 350 149 980 233 720 706 688
5868 688 523 146 1202 -168 1347 102 595 898 227 365 242 866 553 275 303 566 671 -93 195
5887 195 368 -305 353 297 544 -191 -486 939 -825 -168 -950 -45 51 -30 -672 -53 -795 716 -304 -238
5907 -238 468 27 -435 -612 -547 51 -225 -111 171 -641 -412 -888 -737 -702 -320 -578 -783 -1222 -581 -448 -352
5928 -352 -1079 -996 -428 400 -381 -609 -399 -1182 -960 -341 -1143 -1425 -317 -283 -436 -803 -843 -177 -928 -664 76
5949 76 -1042 -499 -547 -700 -589 -880 -519 -638 -580 -1001 -359 -1567 -538 -669 -641 -384 82 -1088 -85 -113
5969 -113 -1057 -277 -209 81 -268 -40 63 -122 170 110 -538 -27 -116 196 423 -200 -55 302 715 278 1274
5990 1274 429 72 1166 45 -691 380 387 301 -180 364 -176 -104 599 512 118 209 1346 751 1509 620
6010 620 171 782 433 392 509 460 1065 495 492 448 610 388 1684 1691 514 527 1127 567 136 682 1408 590
6032 590 1267 915 906 419 516 1160 667 722 206 839 854 350 768 540 601 572 1049 520 714 415 945 486
6054 486 266 464 117 168 438 595 -469 498 -128 -129 110 -359 148 123 -405 645 153 -291 55 3 -523
6075 -523 864 -420 -584 -299 -773 -251 -1162 -161 -707 -973 556 208 -903 -43 498 71 -534 -458 -977
6094 -977 -426 -1496 -918 -177 -1522 197 -583 -798 -123 -853 -229 -869 -696 -71 -1292 -561 -280 -699 -822
6113 -822 -948 -147 -1116 -676 -720 -668 -1249 -1074 -830 -969 -67 -365 -421 -855 -859 -1112 -748 -946 -1007 -205 -623 -687
6135 -687 324 -954 -315 198 -891 542 -146 -977 -193 -16 -643 -1227 -259 -94 366 -16 240 105 78
6154 78 -99 432 -541 -325 401 6 928 652 420 -197 40 244 685 291 754 447 5 321 -548 1117
6174 1117 383 282 1401 1050 634 832 995 979 -72 653 593 41 924 775 1288 746 871 1120 1234 -164
6194 -164 1003 504 778 1029 583 860 975 339 941 190 1659 1370 -101 1038 466 147 397 1238 294
6213 294 547 284 735 797 612 497 807 356 587 175 768 -52 345 -249 592 74 336 1093 832 -493
6233 -493 355 506 347 442 -84 176 489 122 -63 -317 -326 142 -75 -395 494 -539 -594 -975 39 22 -626
6254 -626 -1039 -1001 333 -677 -834 -432 -698 -362 -1214 -454 -651 -541 -1066 -1556 -552 -457 -563 -394 -613 -714
6274 -714 -720 -330 318 -841 -127 114 -440 -1045 -398 -601 -1178 -796 -823 -1125 -1156 -437 -541 -623 -970 -276 -476
6295 -476 -930 -283 -680 -950 -881 -850 -1281 370 303 -1405 -925 -621 826 -1208 -1002 -305 -212 -654 -452 -34
6315 -34 -158 209 -1146 -892 -404 -83 302 8 -647 -903 -339 306 -272 484 287 73 298 -388 721 -3
6335 -3 83 483 1117 536 241 -119 625 1074 -39 468 1037 -120 774 429 502 951 986 -142 364 381 709
6356 709 1614 724 1517 402 740 947 451 497 1041 46 1129 924 590 1181 224 931 672 811 591 2230
6376 2230 1381 109 671 1163 881 445 985 -269 604 530 477 402 635 176 450 1285 1144 474 128 64
6396 64 1386 -385 157 59 466 -145 182 793 -85 62 672 288 589 136 664 -999 373 429 121 -310
6416 -310 -455 -64 -84 14 -733 -134 325 -72 30 81 -419 -184 33 -342 -600 -3 -233 -48 -307 -631 222
6437 222 -447 -935 -278 -1082 -540 -786 -746 -418 -1473 -1495 -750 -653 -366 -950 -1145 -901 -975 -260 -862 148 -522
6458 -522 -1075 -962 -379 -444 -525 -49 -946 -878 -441 -554 -1026 -1378 -510 -1093 -71 -1081 -463 -356 -533 -1201
6478 -1201 63 -538 131 264 -376 10 -1021 -693 -931 165 -1213 -154 -401 -743 122 81 -556 663
6496 663 698 -748 -15 -461 -381 180 791 11 793 -89 -200 480 678 455 -325 240 741 114 -177 835
6516 835 727 257 1008 62 632 612 1235 447 272 91 618 437 -645 1173 451 786 -152 944 612
6535 612 735 1139 1913 1002 748 389 369 773 303 1385 568 416 685 343 1139 210 1200 611 971 1136
6555 1136 200 24 490 -82 36 83 22 -387 145 101 -252 -37 327 524 275 -361 34 257 50 -157 360
6576 360 773 157 65 -629 1468 -178 30 914 -510 -177 -43 -467 479 129 -674 -908 -747 -700 -141 -730
6596 -730 810 372 -312 -152 -514 203 -219 -1056 366 212 -311 -224 97 -1264 -513 -1096 394 -709 -650
6615 -650 -917 -195 -945 -1085 -229 -89 -1053 -776 -1204 -1165 -717 -891 -780 -2076 -871 -219 -646 -964 -427 -1076
6635 -1076 -713 -658 -983 -339 -595 -619 -659 -668 -491 299 -612 -393 -950 -9 -634 -780 -575 -929 88 -647 95
6656 95 -288 -163 -161 67 -194 -1435 -32 -373 -734 -1059 -209 -533 723 -16 482 -555 258 -139 425 -83
6676 -83 -509 172 908 850 299 390 656 12 1540 583 132 545 196 537 -545 -17 9 -207 1030 773
6696 773 1836 1114 750 491 685 554 386 903 1378 1726 796 -126 1253 918 831 179 1814 298 966
6715 966 1151 2048 1301 309 822 1070 -652 659 284 343 898 656 -124 295 948 721 -118 527 136 932
6735 932 642 720 329 277 1638 517 362 -179 804 144 101 657 127 306 143 -455 -140 -109 -340 -305 138
6756 138 291 1000 -671 -596 -408 -43 -375 -778 -673 -1228 -812 334 -617 -693 -858 -1228 -607 -813 -569 -818
6776 -818 -139 -173 -997 -573 -395 -328 -1013 -122 -377 -812 34 275 -854 -673 -817 -931 -1114 -1187 -1033 -592 -1297
6797 -1297 -185 -409 -930 -451 -423 -453 -440 -923 -428 -1217 -1005 -618 -1165 295 -255 -900 -905 -1159 -1565 -639 -1452
6818 -1452 188 -605 -928 -70 -429 742 27 -805 127 -1147 -460 -1142 -614 93 37 -907 -863 -15 -31 -721
6838 -721 -666 581 -458 -25 -196 -258 388 -415 -160 802 293 219 159 639 443 875 409 862 472 156 456
6859 456 1011 286 -80 438 1009 267 309 1256 793 232 893 542 331 177 391 -169 1119 1561 307 973
6879 973 376 378 885 1220 951 1850 821 1147 963 34 1079 503 395 -194 1277 607 293 444 552 265
6899 265 966 77 884 945 677 925 970 1232 346 740 1228 962 -58 -148 307 1295 502 1417 -481 223
6919 223 -127 377 -283 -297 459 -13 74 -420 -727 -550 -280 -841 -412 -252 -296 -563 294 -239 -757 192 -529
6940 -529 -740 -570 -192 -1189 323 -543 -333 -1028 -764 -787 -1157 -885 -799 -886 -1211 -209 -753 -763 -935 -557 -285
6961 -285 -592 -387 -277 -456 -1085 -934 -1107 -418 -677 -401 -1769 -1026 -716 -1248 -1693 -234 -133 -1496 -389
6980 -389 -412 -1059 -604 -899 106 -1449 -1125 -822 -621 -978 -87 19 -337 -522 -435 -835 -829 -281 -215 -248 490
7001 490 -76 -1287 -328 -949 -756 -91 -342 158 -228 668 -963 480 347 542 -232 88 680 -974 264
7020 264 403 192 653 1272 406 820 170 -77 -90 628 526 1051 950 755 454 582 -213 -459 509 1012
7040 1012 -470 -86 1263 1092 64 225 1158 973 530 9 1172 1208 687 927 647 255 183 670 626
7059 626 540 636 236 1268 689 776 1076 721 413 187 684 1019 300 1556 370 211 1183 1784 786 415
7079 415 1049 1684 1350 142 769 796 483 29 698 10 -495 -13 367 601 857 1072 94 369 685 -534
7099 -534 -539 -187 693 -316 -677 274 658 -565 -550 353 -377 68 38 0 292 51 8 -1270 -286 -640 -1052
7120 -1052 464 -445 -699 -366 -271 -632 -855 -1175 -914 -652 -626 208 -1228 -605 -885 -673 -1055 -1028 -313 -1460
7140 -1460 -199 -600 -643 -664 -917 -1348 -1121 -482 -1141 205 -722 -542 180 -1180 -295 -643 -605 -706 -891 -218
7160 -218 -819 -190 500 -767 -383 -926 -249 -326 84 -628 -204 -508 -679 340 -930 -515 -671 -364 -387 -456
7180 -456 -417 27 404 -205 -560 556 -95 351 -702 -170 381 255 147 -422 154 775 194 -333 607 615
7200 615 767 1604 717 1015 -164 628 655 367 162 -413 946 1157 101 683 752 563 468 794 312 896
7220 896 631 914 1042 399 547 1522 1081 868 1379 471 383 940 1102 1083 -131 877 250 1437 1108 742
7240 742 863 840 809 91 1047 937 1118 183 249 -316 598 347 -96 289 -258 -434 593 357 28 147 -242
7261 -242 357 -260 261 91 291 -126 -230 623 -104 513 494 -863 -107 -616 686 -630 -256 -579 -216
7280 -216 422 -475 32 -751 -251 -711 -505 -746 -671 335 -485 -1191 -179 -333 -1004 -950 -1024 -316 -1272 -340
7300 -340 -415 -668 -890 -594 -449 -435 -324 -856 -1098 -674 -472 -686 -809 -480 -519 -967 -489 -935 -137 -1898 -428
7321 -428 -1012 -696 -1020 533 -496 -576 -1485 -1127 -466 -1168 227 -952 -1270 -746 -529 -1002 -418 -795 -954
7340 -954 -565 -300 -177 389 -739 -522 -571 -891 131 -1102 -52 62 -403 262 -997 856 786 -108 79
7359 79 463 413 -682 -188 -183 169 1223 461 644 1015 -209 287 88 705 103 274 794 619 1030 1010 343
7380 343 254 174 928 367 391 1037 434 146 802 339 431 557 864 847 1119 612 419 1460 138 1300 520
7401 520 -53 63 573 635 1248 1067 29 1536 1271 48 322 380 443 1489 601 452 979 943 477 1084
7421 1084 1590 408 851 477 641 242 839 640 1077 626 516 137 717 868 914 458 -459 -123 41 47
7441 47 49 -86 504 151 -451 -109 671 -430 -610 374 -987 -109 141 227 -37 -649 -511 262 -213 -736 -456
7462 -456 -92 -346 -338 -418 -508 366 -1149 -1163 -895 -861 -865 -893 -722 -564 -729 -857 -1001 -964 -719 -1245 -837 -1125 -758
7485 -758 -184 -899 -648 -247 -504 -983 -895 -556 -840 -874 -1744 -979 -608 -811 -150 2 -1191 -444 -763 76
7505 76 15 467 65 -1219 -375 -1185 -237 -920 -309 -687 -780 373 -555 -877 -1002 -324 -638 -214 -420 -132
7525 -132 247 -204 -143 144 119 200 -354 584 535 -75 224 682 143 187 510 636 482 -449 562 490 362 756
7547 756 477 -638 726 51 583 990 1094 1132 1408 490 358 861 810 469 1635 900 549 905 183 521
7567 521 1406 508 652 1065 474 464 1237 327 466 954 263 616 430 919 491 -262 564 509 1145 452 440
7588 440 -587 695 1232 278 -113 700 1000 659 173 615 154 -164 734 264 485 198 607 -114 918
7607 918 -188 465 508 -446 528 253 -446 -359 -30 347 -360 -233 -264 -102 -880 -79 -204 -512 145 192 -317
7628 -317 -579 -877 -920 266 -343 1004 -747 -599 292 392 -684 -732 -532 -531 -1147 -768 -517 -893 -1038 -327
7648 -327 -376 -198 -832 -232 -671 -572 -467 -925 -868 -200 -334 -740 -668 -187 -247 -1087 -117 -728 -915 -110 -1429
7669 -1429 -789 -484 -147 -974 -241 -821 -534 108 -864 117 -451 -125 -739 -1072 -1079 -1118 -479 -451 -128 -26 -192
7690 -192 -16 -215 -660 160 -552 125 30 -103 88 -391 -621 91 468 -234 307 -1441 288 439 -166 572
7710 572 -580 538 554 -406 -97 213 352 722 877 837 1225 554 5 865 978 679 1234 698 362 748
7730 748 215 220 453 1100 318 739 1285 1106 328 241 705 290 -444 1057 1094 153 338 759 628 534 868
7751 868 -353 1402 762 296 35 1345 530 627 1501 414 37 1114 342 -237 512 515 425 -256 -3 10
7771 10 544 -273 251 533 29 331 239 822 553 60 147 -48 121 -181 -224 300 362 -411 335 -355 37 227
7793 227 -305 -49 -16 -331 54 -440 -876 -345 79 -388 -1079 -573 -467 -414 -318 -638 -950 -58 -909 -432 -1102
7814 -1102 283 -1204 -350 -967 -551 -327 -1418 -431 -797 -623 -994 -1111 -1164 -684 -423 -449 -609 -897 -567
7833 -567 166 73 -757 -713 -664 -446 -572 -260 498 -989 -603 -327 -549 335 -357 -237 196 -265 -525 -633 -217
7854 -217 -114 133 -891 -40 -106 202 -201 -844 -373 -532 -291 -714 645 -36 -192 254 434 -1206 -347
7873 -347 539 -118 399 487 617 -734 210 223 385 651 -458 687 457 540 164 1218 243 335 174 -681
7893 -681 430 668 -187 782 1010 897 378 539 1410 631 943 879 174 1249 597 858 702 548 82 109
7913 109 411 774 683 473 541 1288 425 866 1033 488 1315 815 972 1291 460 24 266 589 -4 658 467
7934 467 542 526 720 1032 292 542 1619 1162 395 774 265 629 175 548 357 973 596 -30 403 317 176
7955 176 984 138 -31 65 -364 -638 -689 64 -1367 -316 6 593 -882 410 -513 -235 109 -752 -146
7974 -146 -848 -837 -576 207 121 -34 -487 -422 -675 -7 -1286 105 24 -252 -816 -416 -863 -926 -651 -795 -403
7995 -403 -605 -640 -606 -959 -266 323 234 -305 184 -1088 -649 -1150 -116 -996 -677 -906 -829 -945 -552 -272 -417
8016 -417 -1484 -1393 -689 -581 -328 -1246 -188 -418 289 -1342 -519 -430 -1129 -300 -789 -10 -416 460 -945
8035 -945 -1253 -343 454 -261 -303 -6 332 -271 -475 -702 -498 332 -176 1075 -382 -271 -516 -513 -294 600
8055 600 336 296 355 580 915 73 -179 727 -94 191 236 -79 914 -81 237 88 658 470 1105 282 1167
8076 1167 552 242 662 50 848 807 1216 482 929 973 884 -153 747 1275 1428 841 690 1248 460 815
8096 815 306 1061 529 368 799 611 820 1770 855 351 999 965 594 -170 220 0 403 670 255 -249
8116 -249 500 422 -345 286 -89 113 1148 -143 484 441 -195 1164 1120 -468 -256 45 -67 -38 -99 -113 79
8137 79 -110 -160 27 -306 443 -118 -330 -103 -91 80 -100 -357 -511 -199 182 161 -116 -690 -21 -829 -940
8158 -940 17 -1067 -811 -574 -580 -1071 -581 -1225 -700 -350 -835 -758 -764 -587 -699 -1275 -1049 -764 -931 -1367 -123
8179 -123 -216 -72 -556 -571 -325 -788 -1031 -1383 -1151 -918 -455 -876 -391 171 -421 -667 -330 47 -293 -425 -1260
8200 -1260 -778 -1266 -813 -467 -350 98 -135 -971 -397 -957 278 -505 269 432 -136 379 333 -371 980
8219 980 400 -450 558 602 -296 585 257 173 850 177 896 27 604 34 596 629 361 390 691 927 1162
8240 1162 1487 532 231 178 645 962 671 1047 550 762 660 652 878 343 1299 525 578 280 735 629 381
8261 381 925 659 199 1049 411 110 348 1050 979 272 903 171 890 32 604 753 850 617 888 967 53
8282 53 600 521 -57 58 37 398 885 568 749 -221 -156 -599 768 1047 76 637 306 740 -110 -429 -413
8303 -413 -118 -148 -748 -159 -30 268 -943 -588 755 -244 -443 542 -978 -396 -436 -197 -207 56 137 -795
8323 -795 -524 452 -354 -122 -912 -1027 -346 -1538 -299 -797 -1083 -1437 -396 -1307 -992 -639 -355 -1227 -1392
8342 -1392 -715 94 -782 -1414 -943 -574 -824 -185 -746 -396 -1032 -637 152 -955 -334 -479 -1004 -303 -213 -1298
8362 -1298 -559 -1012 -592 -848 -576 -697 -355 -788 -662 -624 -230 48 -402 -946 -637 77 -331 496 -466 539
8382 539 498 240 -374 -336 -634 -108 -6 -870 213 64 -1 -698 503 957 716 411 -445 -615 272 542
8402 542 1003 514 439 415 646 444 768 516 -63 701 719 277 635 1233 298 431 552 -92 548 727 1731
8423 1731 850 33 918 1316 379 1120 942 -137 1087 345 825 774 566 895 353 1105 752 265 1106
8442 1106 -359 36 229 136 211 486 -129 622 671 1049 548 299 488 692 720 2 342 347 783 620 78
8463 78 187 186 536 655 1035 498 246 281 -64 -149 -140 -134 -76 -354 297 -642 -342 518 229 631 -424 -172 -532
8486 -532 -935 -647 -265 44 -450 -386 -365 -141 -379 -979 -94 -904 -1017 -1159 327 -295 -284 101 -909 -60
8506 -60 -783 -1151 -885 -526 -703 -888 -118 -540 -691 -674 -508 -1708 -1121 -362 -1279 -754 -1067 -1500 -549 -580 -600
8527 -600 -171 -954 -339 -285 -962 -1311 -930 -960 61 -1107 -257 -148 -333 -488 -496 551 -304 -416 -406 -362 -647
8548 -647 -555 -666 -522 16 -1015 -377 -371 -34 -66 102 56 185 85 114 -46 471 565 146 844 342 146 381
8570 381 337 -301 912 307 265 333 295 -201 426 619 627 558 988 190 562 -84 563 729 779 589 695 583
8592 583 267 1264 534 392 598 -182 345 1775 484 584 1002 -512 936 1495 427 269 587 1263
8610 1263 -89 74 49 300 141 842 777 752 706 1308 407 880 819 333 51 1073 658 -106 365 158 195
8631 195 -572 302 469 218 405 603 371 12 287 -611 538 785 150 122 -90 -142 -164 -666 73 93 -815
8652 -815 -1311 -787 -927 -551 -198 -290 -374 -331 -190 -787 -685 -238 -494 -510 -353 -206 -511 -375 -359 -715 -594 -437
8674 -437 129 -462 -1138 81 -637 -462 -487 -662 -567 -414 -370 -497 -516 -837 -814 -716 -880 -1136 -673 -1187 -1085 -858
8696 -858 -1001 -221 -267 -172 -803 -303 -1362 -645 -856 113 -79 -1057 -1667 -884 -740 -328 536 -161 229 -56
8716 -56 90 -1229 -563 -381 -593 267 121 -672 -99 -313 -649 -134 -125 212 -100 -328 -245 278 426 29 -234
8737 -234 -591 194 -79 964 150 106 511 533 589 201 475 -533 748 -923 -218 197 138 1639 747 117
8757 117 840 331 740 -42 829 759 25 1155 955 1068 99 1023 1808 359 188 1278 772 836 615 115
8777 115 566 18 552 812 1443 874 392 647 840 114 990 781 859 1328 916 865 429 1454 620 546 259
8798 259 910 550 1366 1435 904 4 454 48 1094 606 1244 146 -466 480 -134 -393 716 105 -1009
8817 -1009 -436 138 -505 -185 -815 -373 368 312 -15 237 -434 -794 -845 -335 -1373 352 -152 -965 -677 -756
8837 -756 -203 -1075 -571 -525 -427 -682 -789 -278 -821 -242 241 -416 -971 -335 -1391 -737 63 -896 -473 -1573
8857 -1573 -1180 -922 -979 -878 -116 -602 -343 -821 -890 -1035 -884 -630 -819 -446 -717 -627 -1006 -291 -1121 -163 405
8878 405 -922 -85 -548 -512 -553 -1188 -387 286 -506 -1268 -321 -64 -219 -723 -327 -560 45 -676 56 -116
8898 -116 -946 115 -499 -204 -393 -1010 -51 13 73 160 490 -157 -230 257 444 354 4 473 4 728 392
8919 392 596 677 -406 600 528 7 203 576 -276 700 1145 769 1041 914 580 876 670 764 1310 251
8939 251 887 209 800 892 726 834 623 456 817 694 435 1353 44 702 371 156 64 238 639 1387
8959 1387 670 1339 -220 1456 799 128 968 452 640 291 465 -179 25 548 41 56 222 -56 275
8978 275 -237 -379 387 32 -898 831 677 254 -128 556 -402 1073 238 286 511 -385 -84 -300 11 -170
8998 -170 -615 -125 -722 307 97 -344 -261 76 -682 -19 -235 -495 -121 -415 64 -273 -568 -980 373 -529
9018 -529 -350 -1262 -369 336 -1048 -168 -393 -909 -672 -159 -1529 -1173 -533 -1070 -65 -824 -1219 -383 -407
9037 -407 -802 -1048 -188 -951 -538 -9 -1201 -682 -758 -1101 -1032 -370 270 -531 -1308 -56 -993 -621 -489 -114
9057 -114 -969 -515 -596 -673 -543 -884 -238 -634 -563 -244 -747 -519 -124 578 -498 -544 -451 -826 -193 463 564
9078 564 452 -153 526 799 -701 128 234 624 862 -52 56 724 409 -87 1250 664 767 234 122
9097 122 -1 636 948 419 -76 469 874 990 714 890 1047 1471 629 853 803 805 690 541 289 867 634
9118 634 -652 219 286 271 835 1042 924 192 1563 162 670 727 88 670 820 264 1121 -117 635 598
9138 598 486 201 252 444 882 234 443 171 406 -153 103 174 293 41 355 -119 -149 223 302 91 -353
9159 -353 1373 429 28 -137 378 548 173 -331 189 -262 -176 8 -139 -182 -628 -1569 -654 -328 -145 -179 -297
9180 -297 -1115 -463 -438 -106 -668 -1482 -928 23 84 -829 -698 -84 -414 -535 -394 -375 -589 106 25 -473 -921
9201 -921 -242 -33 -864 -862 -348 -1233 -210 -735 -238 -406 -789 -991 -363 -56 -462 -888 -1236 -1242 -1000 -1359 -273
9222 -273 -630 -449 -656 -1039 314 -794 -383 963 92 335 -9 -218 281 -733 -387 170 133 -525 -307
9241 -307 -557 -593 -269 -379 648 28 303 422 515 262 -168 -2 1101 381 -144 -233 515 -58 82 -420
9261 -420 -173 1126 -331 450 269 26 4 467 19 673 739 365 227 292 282 350 -28 646 166 500 365
9282 365 1010 822 1193 709 564 873 594 302 870 918 72 955 718 -32 1049 622 666 585 891 172 1096
9303 1096 801 242 789 1131 650 643 848 359 672 96 -817 147 526 892 412 310 -27 353 905 559
9323 559 179 -273 908 -220 -439 -404 -450 441 41 370 -56 -988 699 -1080 122 44 -36 -365 34 -557
9343 -557 -253 232 162 28 -448 -421 382 -431 -386 -581 -773 10 -950 -710 375 -846 -269 -587 -452 -706
9363 -706 -665 -1087 -298 -623 -932 -170 338 -229 -1054 -1095 -14 -987 -867 -1186 -623 -233 -1192 -813 -403 -988
9383 -988 -387 168 -1629 -848 -983 -326 -800 -834 -178 -207 -758 -691 -663 59 -790 -1000 -565 -1308 57 -374 -499
9404 -499 -281 317 -294 -437 -473 209 277 -159 -342 -406 -111 -761 -450 347 -585 -140 -433 -53 763 -5 -17
9425 -17 222 -188 93 292 613 -125 125 555 1242 -629 -465 225 -228 595 786 1250 951 667 327 303
9445 303 438 624 -282 480 917 610 666 1007 604 307 677 864 527 415 740 594 705 600 157 1229
9465 1229 598 504 1740 1045 32 1155 717 1101 794 1361 47 824 320 395 127 786 383 575 405
9484 405 653 19 248 683 418 743 1645 1632 178 -509 520 113 595 -461 115 297 -123 -4 -44 -675
9504 -675 113 374 -339 -70 240 185 -237 461 180 -209 -1054 156 109 -571 588 -91 -113 -353 -1041 244
9524 244 -922 11 -498 -826 276 -1056 -536 -760 -318 371 -1089 -1150 26 -951 287 -329 -88 -764
9542 -764 -870 -1074 -1703 -532 -519 -1101 -338 -1042 -908 -1541 -423 -191 -486 -621 -1048 -586 -844 -252 -1132 251
9562 251 186 -558 -617 -485 -1300 177 -549 -29 -483 -1042 312 106 -99 -625 -308 -262 -338 -97 -1009 103
9582 103 -374 138 169 -774 277 -54 295 -352 634 88 -715 404 -8 -943 -74 101 414 -121 556 -322
9602 -322 -166 395 -138 412 449 -481 548 -294 748 871 691 1730 666 1097 1131 -53 399 1008 1418
9621 1418 804 590 164 -19 16 561 490 558 573 357 415 -45 625 908 847 1657 112 814 1923 722 937
9642 937 574 472 707 383 13 777 813 1178 517 692 1259 360 750 808 685 1188 249 -119 101 381 265
9663 265 146 286 571 476 138 -113 783 -30 164 597 195 616 537 195 912 32 39 168 -541 -697 -261
9684 -261 110 -9 -857 563 193 -538 -476 -695 -53 -142 42 -532 -1417 -340 -51 -344 -339 -520 -1047 -874 -730
9705 -730 -8 -1080 -614 -1472 -630 37 -1287 -237 -797 -302 -751 -553 -330 -700 -1295 -749 -919 -1096 -592
9724 -592 -46 -1132 -682 -1293 -423 -1004 -153 -734 -554 -134 -887 -267 -517 259 -296 -131 -569 -438 -708 114
9744 114 -379 -345 -162 274 -6 -1003 -130 -218 749 -477 120 -300 -128 -396 -16 272 -278 -383 -113 -771
9764 -771 -717 -326 90 932 455 -333 -299 588 289 164 169 -176 168 538 219 -418 50 436 406 454 -105 105
9786 105 179 349 479 1153 -86 406 96 333 195 948 15 387 456 509 779 71 409 1047 1065 258 469
9807 469 474 962 243 688 1424 1044 551 1401 534 73 77 1489 502 330 296 673 -85 813 938 -43 1137
9828 1137 92 846 1066 262 55 163 231 235 102 551 373 112 -420 437 580 -139 -452 370 -203 304
9848 304 105 263 455 -188 -406 -649 -26 -336 -919 -544 -479 788 -310 -452 478 -1267 -192 -284 -691
9867 -691 -378 -319 -45 -903 151 -514 -1081 -54 137 -355 -1080 -483 -38 -857 225 4 -414 -1028 -880
9886 -880 -1139 -1131 -815 -449 -381 15 -341 -1729 -354 571 -624 -247 -777 55 -905 -940 -812 456 271 -709
9906 -709 -345 -400 -618 -781 -547 -714 36 -874 -1030 160 148 -572 -1069 -562 394 -753 -465 -803 899 -71
9926 -71 150 -114 -554 70 -222 186 -454 585 -149 -197 -681 501 772 416 -194 182 -580 -155 998 537
9946 537 727 521 116 -215 202 274 -112 366 -370 390 442 488 56 884 481 329 960 268 1611 445
9966 445 -254 759 747 -384 1252 1116 641 297 787 706 1021 1136 513 648 696 596 773 70 256 212
9986 212 600 520 583 543 1743 1141 974 844 293 249 828 657 997 1223 170 -20 645 1371 143 45 640
10007 640 917 368 -88 600 -497 -465 -350 -35 717 -312 -650 347 -859 565 -136 -111 -107 190 -653 -658
10027 -658 905 -283 -71 -888 -90 276 -135 -240 166 -293 572 -73 -794 178 -484 203 -447 -863 -770
10046 -770 177 -1688 -644 -531 -1292 -188 -1155 -569 -1250 -645 -741 -147 -320 -879 132 -121 -735 -1178 -510
10065 -510 -748 -1017 -935 -533 -1011 -503 -564 -1095 -760 -101 -641 -1576 457 -544 -863 -1487 152 -914 -840
10084 -840 -65 -176 -460 -81 -287 -1236 36 -356 435 992 212 149 -600 -265 283 -321 -136 -115 224 -576
10104 -576 133 515 -31 -656 -89 24 76 303 441 203 -594 49 -371 -45 362 -761 795 -1 -156
10123 -156 854 -550 639 -37 485 206 -472 318 204 828 781 1031 1101 1160 -379 607 1226 957 758
10142 758 -58 72 770 381 944 1272 913 -78 207 457 1681 248 -296 516 1161 219 476 393 1053
10161 1053 1092 -223 239 492 1158 1360 -20 630 949 434 684 602 607 671 582 100 -149 -222 779 397 644
10182 644 590 556 478 -6 993 -201 160 345 840 547 74 467 -37 -937 -386 692 136 -237 -246 230 -381
10203 -381 275 412 -608 -298 180 340 -985 -563 -369 -1052 -262 -241 -113 -792 -190 -131 -468 -851 -503 -150
10223 -150 -931 -337 -491 -363 -840 -637 -132 -742 -256 159 -1263 139 -207 -1170 -469 -363 -1225 -300 -316
10242 -316 -790 -704 -159 -108 8 6 -1474 -396 -1142 -784 -881 -779 -43 -737 -410 -739 -1006 -582 -615 69 134
10263 134 -135 -445 -525 -402 -1411 -437 -619 -179 -156 367 319 771 -141 -315 303 270 -497 14 -242 -272 766
10284 766 443 737 -160 1087 157 -143 84 -538 -450 76 504 249 382 477 108 1261 394 332 256 152
10304 152 1185 1064 -489 942 1347 547 52 -167 224 546 -7 609 994 7 1228 148 479 760
10322 760 -675 1155 674 -134 225 1361 1209 -409 316 514 371 845 1090 533 -34 606 1392 454
10340 454 302 331 240 425 1277 195 716 633 128 399 -72 389 301 -103 99 -127 558 598 51 452 -223
10361 -223 -18 -415 -22 34 -198 682 440 -397 -346 -270 -1175 -326 -165 -161 -779 -1802 -877 -150 -1071 -777 49
10382 49 -130 470 -630 -201 507 -1052 -514 -171 -1007 -380 112 -437 -499 -654 -644 -1293 -1303 -23 -527 -862
10402 -862 -300 122 -578 -701 -1127 -824 -767 -1513 -1103 -764 -909 -925 -76 -889 -1050 -1174 -1010 -89 -441 -633
10422 -633 -781 -838 -1018 -658 -775 -805 -1242 14 -1066 -735 135 -519 -332 -585 -167 -1239 -243 -1050 -269
10441 -269 466 281 70 62 221 59 -1388 -76 -566 -517 416 263 -503 -683 109 135 -1056 367 -351 516
10461 516 415 -319 -476 293 422 -36 1077 734 717 543 666 288 747 362 353 582 603 634 772 1529 550
10482 550 761 1002 518 1249 763 243 540 968 144 233 791 776 985 428 284 632 730 635 639 1372 49
10503 49 515 572 1141 484 537 630 628 395 429 863 585 264 364 238 61 -88 -226 110 158 1091 266 88
10525 88 -62 161 950 60 189 550 -508 -602 979 -199 -502 627 -302 -87 100 1027 437 -1271 -267
10544 -267 -173 -473 -189 -208 63 -431 -73 -262 -795 -256 -439 323 -99 -267 -613 -729 -247 -768 -1070 -1028 -962
10565 -962 7 -11 -924 -452 -334 -318 -749 -574 27 -980 -812 -444 -631 -257 -810 -695 -512 300 -455 -420
10585 -420 -781 -683 -255 -558 -746 -289 -679 -509 -767 -291 -626 -632 -1400 -848 -764 -675 -9 -363 -433 91 -370 -1225
10607 -1225 -710 -356 -156 -260 65 -683 573 328 -195 54 158 -884 797 34 -1027 596 -20 533
10625 533 219 -119 0 -185 -466 -492 1112 81 339 -481 306 -278 158 178 1010 712 1384 924 641 -594
10645 -594 -162 511 218 1186 1225 1281 861 961 764 723 412 835 1005 -280 324 -771 406 943 1314 673
10665 673 409 493 -217 1227 277 493 1007 -198 647 406 -102 950 523 -75 891 985 843 232 505
10684 505 -35 1014 651 424 574 325 1244 -472 -185 241 411 547 -16 789 -268 360 112 562 234
10703 234 -54 69 581 -41 396 529 -90 -205 123 -16 -193 -256 -882 26 339 -540 -639 -525 -525 -765 -318
10724 -318 -391 105 -833 -517 -1156 -651 -878 -567 407 9 -92 -567 -1138 -536 -596 -555 -362 -1092 -1037 33 14
10745 14 -1372 -706 -701 -616 -371 -137 -563 -575 -807 -591 217 -1297 -1032 -664 -989 -703 -778 -145 -805 -1239 -328
10766 -328 -1832 -1009 -460 -747 -623 -572 -504 -167 -150 -408 -1244 -772 -695 -198 -165 -781 -81 -404 606 193 -655
10787 -655 -571 -1061 18 -267 -251 -1099 -290 364 706 0 -314 465 527 -780 -59 195 578 426 477 971
10807 971 171 252 262 -364 435 781 193 164 522 434 91 356 -208 -731 441 996 327 732 778 307 427
10828 427 349 230 -54 195 1068 872 709 613 545 679 642 345 82 950 1071 779 1098 -20 907 1374 706
10849 706 -240 582 699 -49 291 5 618 559 414 369 558 122 480 -57 -335 674 535 1205 137 155
10869 155 -321 -250 -20 356 524 -247 690 813 171 -909 -90 -342 -287 471 202 212 -98 -594 687 -1208
10889 -1208 -557 334 -60 -170 338 -1084 -342 -239 -1225 25 -308 -173 -1441 414 -379 -334 -432 5 -1153
10908 -1153 -1537 -896 177 -746 -699 259 -623 -578 -542 -633 -863 -758 -492 -776 418 -1009 -637 -711 293 -781
10928 -781 -530 -506 -1270 -737 -756 -225 -746 -716 -1056 -814 -317 -52 494 108 -559 -77 -562 -660 -785 -1183 -696
10949 -696 -449 -301 -794 117 -435 -157 -722 -945 -739 745 79 -108 4 134 -407 192 465 -522 -84
10968 -84 384 -272 94 -449 -141 456 -106 843 14 116 514 -364 79 638 686 656 191 204 734 269 243
10989 243 464 140 77 359 511 82 797 1006 481 649 433 779 902 126 588 811 -88 -597 379 1260
11009 1260 -730 699 260 906 526 1008 1187 563 -598 -105 -168 1090 1296 424 729 1198 389 194
11027 194 453 804 495 1329 716 83 -73 349 -365 -136 222 1064 58 30 -135 131 160 948 -142 -9
11047 -9 313 -186 51 212 29 -1067 -109 31 -212 -250 -81 61 189 -232 360 -280 -779 -910 -346 262
11067 262 -505 263 -586 34 -916 -535 -112 356 17 165 -613 -476 -928 -1283 234 391 -892 -53 -389
11086 -389 -671 -270 -1065 -582 -442 -179 -111 -705 -901 -644 -280 -245 -770 -247 269 32 -732 -256 204 234 -307
11107 -307 414 -828 296 -540 -477 383 -885 -895 -458 -790 -549 -234 -119 -811 662 24 -653 -231 -572
11126 -572 89 227 -111 -123 -447 -280 -122 -684 -728 37 -36 -388 497 -231 -205 237 506 -19 441 -472 377
11147 377 564 273 812 532 -166 -175 -111 254 215 571 -53 1080 177 1081 717 163 699 121 1039 428 231
11168 231 199 360 1118 403 -65 869 114 578 372 1031 991 1143 678 707 717 895 1451 723 527 -46 943
11189 943 -245 864 558 397 1435 929 953 699 -33 358 153 107 707 226 971 -131 288 -378 993
11208 993 -82 249 841 190 299 905 794 626 -454 140 78 265 -818 656 -172 -513 809 243
11226 243 -354 245 -475 -367 -44 93 -363 -416 32 -936 55 442 -420 -344 310 -983 -991 -1106 -884 -121 -236
11247 -236 -902 -1061 -382 -433 -96 -1678 -502 -761 110 -414 -273 -670 -323 -359 -831 -59 -711 -427 -1705
11266 -1705 -463 -368 -919 -17 -453 -300 -700 -468 231 -774 236 -460 -531 145 -469 -495 -508 -860 -806 -889
11286 -889 -168 -316 -929 -1696 -954 -263 -648 -428 212 -511 -304 -700 -464 -853 -625 -173 -435 -469 434 107
11306 107 351 -33 -108 -175 -94 296 -131 -96 -694 -170 -65 815 73 589 77 46 154 357 46 -49 -376 557
11328 557 478 675 692 956 317 430 816 1069 453 -339 1030 475 221 69 453 899 668 546 389 316
11348 316 247 591 350 -11 763 947 1169 846 506 551 324 308 943 651 701 405 1255 265 132 319 47
11369 47 -516 -240 146 429 1157 1096 145 197 -32 365 563 808 157 41 449 284 -106 -26 797 -688 196
11390 196 342 -465 -492 -171 7 -776 419 -216 -434 493 -538 -835 -689 237 -31 108 446 342 -452
11409 -452 181 -511 -804 -719 -447 147 -654 582 84 -376 -85 107 -396 278 -832 -480 -248 40 -979
11428 -979 -1295 -364 -477 -1054 -645 -281 -977 -581 -656 183 -139 -687 -557 -156 -229 33 -1218 -642 -1222 -1020
11448 -1020 -1261 -197 -1241 -616 -1019 -619 -616 -239 -1337 -497 -472 -442 -391 167 -789 -706 -861 -87 -850 -78
11468 -78 -983 -486 29 255 -9 -438 106 -565 -92 81 -157 385 -122 -39 -121 -492 -40 263 293 -947 -241
11489 -241 527 -430 650 372 752 99 375 283 1086 -488 579 -28 450 763 613 1385 49 163 736
11508 736 243 377 417 684 614 -358 1051 771 317 816 371 66 718 457 1169 1013 246 1013 394 713
11528 713 -71 764 1111 224 340 615 570 321 983 468 -141 545 21 -45 1072 842 350 1715 -161
11547 -161 145 500 328 -100 1078 482 -111 -295 294 734 109 1046 -292 595 474 1196 -86 900 -653
11566 -653 239 347 54 59 165 -225 -938 73 -75 459 -218 -183 59 360 73 -882 -449 -450 646 -274 -214
11587 -214 240 -762 -292 -392 -39 -546 -239 -179 -77 87 -1057 -613 -552 -50 -799 -38 -412 -625 -1304 -320
11607 -320 -500 -157 -1323 -969 -1210 335 -530 -966 4 -1458 -231 -610 -855 -642 -845 -1239 -803 -127
11625 -127 -209 -933 -571 -131 -910 -568 -1317 185 -692 -220 -504 -1319 346 -668 -715 -333 9 -408 -98
11644 -98 -401 294 654 -284 -764 20 -424 -818 -2 211 818 -465 809 -468 -448 -388 -932 -152 876
11663 876 13 -110 558 283 -310 169 -77 692 193 488 284 -377 662 377 274 1141 335 1170 333
11682 333 744 763 498 931 221 1056 349 571 -138 343 954 501 1395 1109 786 1072 834 1233 310 647
11702 647 957 578 281 608 124 882 731 919 -103 110 408 288 1087 1758 674 408 764 -243 410
11721 410 82 56 -147 967 -416 -60 844 448 -7 1368 -386 -212 -181 -436 -239 895 266 -297 1135
11740 1135 488 -552 258 -721 -362 72 -740 -219 -444 -121 52 -25 -841 -648 -399 89 -198 1051 -295
11759 -295 -366 -557 -84 -463 -467 -335 -686 -723 -610 -590 -63 -668 -579 -141 -619 -844 -561 -511 12 -735 -632 -230
11781 -230 -661 -818 -435 -731 -447 45 -902 129 -700 -616 -738 -445 -145 -1083 -420 -299 -523 -323 136 45
11801 45 -557 -1419 -122 -344 -451 -470 -870 472 -243 -378 -591 -111 -18 -673 349 428 80 -956 -650 289
11821 289 744 -314 145 57 484 303 -157 1018 543 163 521 -655 -44 -339 365 790 161 58 473
11840 473 650 206 -197 974 460 361 717 431 922 629 183 108 304 879 734 216 -591 406 525 774
11860 774 1234 594 529 791 567 -179 -594 48 83 1002 653 521 1440 789 83 939 468 -342 1138 699
11880 699 -146 136 446 581 1045 828 347 483 449 499 545 115 286 -6 435 -231 720 558 -282 297 216
11901 216 1172 -205 -32 414 132 949 683 527 100 -382 402 -51 -398 705 -79 263 -556 -197 -339
11920 -339 -222 -191 -81 -198 54 -395 -932 -14 -528 -702 -407 -695 -935 -121 -151 750 -250 -482 -286 -621
11940 -621 551 -589 -544 -670 -868 -371 -523 -838 -922 -296 -1569 -84 94 4 -436 -771 -489 -628 -76
11959 -76 -260 113 12 -885 -311 -636 -214 -1041 933 -563 -349 -292 -749 -148 -1520 -718 -665 -296 -116 -194
11979 -194 -324 -111 -127 -159 -42 -1293 -1261 -299 26 -584 65 -441 202 303 -727 682 -600 -251 -263 -72
11999 -72 141 229 -501 -287 739 -240 495 -21 196 -341 -408 871 -619 -153 56 -361 476 -548 322
12018 322 -59 533 -257 1317 29 636 731 166 1092 900 327 389 872 700 797 312 512 80 575 532
12038 532 934 422 619 636 752 546 1061 457 59 946 758 615 -738 501 175 868 1032 684 571
12057 571 460 -148 -691 987 20 -52 413 418 679 -205 536 518 131 1192 -77 195 551 492 -257 221
12077 221 1212 -317 -753 -689 -322 -199 33 269 -46 -51 -317 -294 44 132 412 774 -757 -518 -148 33 148
12098 148 -387 134 -782 -1522 87 -371 -675 -489 171 -699 -566 59 -470 -505 -893 183 -676 -1060 -925
12117 -925 -561 -457 -788 -1408 -798 -324 -33 253 -886 -794 -466 -10 -372 -773 -678 -985 -790 -665 -1208 -924
12137 -924 -660 -265 229 -919 -396 -423 -790 -105 -485 -569 -718 -835 245 -566 -672 0 161 -463 -409 -765
12157 -765 -950 646 119 399 -497 -241 125 -350 560 -813 552 390 194 263 203 423 -67 626 429
12176 429 341 136 -366 237 -169 76 920 857 366 625 -125 168 -527 251 603 222 503 144 -498 865
12196 865 697 142 604 1028 968 230 1011 150 498 475 224 1111 589 1334 158 90 990 333 -327 464
12216 464 744 715 1276 978 994 1411 324 -32 739 1108 1409 416 262 1285 465 68 659 -380 1091
12235 1091 -721 269 174 -124 210 505 -238 272 305 355 413 644 114 243 -157 -190 244 -114 111 -471 70
12256 70 305 672 -395 222 -99 -228 -187 -365 -585 -51 -360 239 116 -144 470 -427 -377 -126 -550 -355
12276 -355 472 274 -293 -1364 226 -473 -172 181 -577 -33 -385 -120 -860 -1184 16 -1350 -685 -299
12294 -299 -1380 -954 -714 -772 -327 950 -886 -1085 171 -597 -1019 -1085 -924 -224 -988 -503 -501 -590 -513 49
12314 49 440 -498 -1442 -677 -509 620 506 -714 -426 -1 192 -640 -587 298 9 -556 482 -333 -230
12333 -230 -18 -163 -462 -45 201 -447 -67 -481 -2 -662 -32 413 315 497 -269 330 291 -316 -507 -19
12353 -19 675 -576 505 91 817 729 441 -143 -140 92 -46 -207 -235 348 1039 328 -217 450 1007 1610 753
12374 753 72 448 746 1295 325 1304 1296 602 -194 399 578 89 64 331 -25 -369 812 -663 501 192
12394 192 569 720 299 673 325 1055 654 388 232 623 534 -112 684 233 -225 16 890 432 345 1004
12414 1004 -564 1312 573 -57 -277 478 883 968 716 54 -445 356 499 -647 420 392 -559 -76 -3
12433 -3 215 -74 -774 -32 -113 -228 -148 -277 -512 109 -1431 -523 349 22 516 -570 -22 -374 -80 140
12453 140 -1195 -9 -13 -1147 -121 673 -434 -580 -314 -321 -197 -675 -320 -1062 420 -8 -128 -175 -710
12472 -710 -1327 -441 -1046 397 -560 -947 -78 -209 -1098 -8 -633 -1216 -459 -471 -719 -859 -511 -47 -739
12491 -739 -185 -496 -127 -247 -913 -262 -1427 -302 -36 -333 -481 -340 -225 776 843 -150 -697 -201 209
12510 209 635 175 65 21 265 464 -571 -522 170 500 14 463 163 826 148 459 -114 516 683 994
12530 994 138 -152 -213 774 -172 570 28 590 97 179 -222 701 127 653 -99 559 509 116 581 441 1776
12551 1776 3 1284 949 699 609 778 659 586 513 978 1343 584 -454 208 810 553 354 425 897 307
12571 307 2013 1066 293 940 528 -246 485 1280 227 1458 -342 476 993 950 581 63 273 -477 211
12590 211 654 -124 1267 279 7 -166 92 766 294 132 236 87 -25 -123 248 184 -210 13 91 321
12610 321 -10 -327 18 -535 -154 427 -1072 -491 -195 -316 -170 0 -273 -639 -59 645 -553 -37 -540
12629 -540 50 122 67 -922 130 -617 -302 146 -416 -438 -882 -309 342 -756 290 255 -570 -841 -109 -244
12649 -244 -928 -1161 -832 316 6 -776 -339 -329 -834 -322 -548 -136 -1945 -496 -682 -270 258 -450 -24
12668 -24 -316 -656 -245 -330 -1 158 -502 306 191 -13 -879 -568 311 150 -291 628 -72 -119 -416 218 -240
12689 -240 -212 824 -363 -507 198 544 506 -329 329 -293 8 1008 -264 -215 99 400 354 1172 296 1216
12709 1216 192 878 350 370 41 841 588 952 884 543 -324 267 1481 488 169 555 -67 832 431
12728 431 55 -121 252 621 592 992 -131 24 625 867 1602 574 1478 816 997 176 455 451 1140 -521
12748 -521 808 1362 99 801 -20 739 988 418 -9 -352 286 683 39 -170 -93 -371 306 -183 71
12767 71 521 136 506 -131 -35 237 89 430 84 -443 -795 330 -412 -385 403 152 -475 -116 -42 -409 -359
12788 -359 -905 -304 504 -771 -942 48 -207 -217 78 359 145 -86 192 -594 -274 -67 -206 54 -864 -539
12808 -539 -181 -710 -878 -158 -554 -1019 683 -308 -993 -257 -66 -442 -980 -1080 -713 -134 -500 -774 -721 -1299
12828 -1299 -964 -352 -625 -817 -397 -882 -78 364 12 -365 -322 -202 137 -1307 -778 -432 -10 -584 633
12847 633 427 383 -29 -9 -157 -548 228 492 -287 136 -215 -478 403 537 1101 1027 -149 895 709 -225
12867 -225 520 -26 -670 1800 440 -1076 -9 672 268 182 -164 96 -121 714 -269 301 951 218 251
12886 251 220 751 316 646 -80 61 638 927 469 166 329 -104 470 152 743 429 590 495 74 591
12906 591 994 322 679 292 429 741 1786 329 454 -62 979 1549 -462 1275 118 1058 707 690
12924 690 713 332 168 -155 171 506 305 -83 214 -95 323 -443 290 -194 125 115 -392 -659 383 -699
12944 -699 -118 269 255 164 -660 208 47 -84 -43 -84 772 1028 -953 124 -132 -926 -160 -240 -515 -623 -408
12965 -408 -136 -78 -884 -824 406 -404 59 -450 43 -753 -850 -873 -879 -270 -238 94 -19 -475 -582 -1317 -767 -427
12987 -427 -103 -649 -53 -429 -663 -830 -711 -67 -379 -941 -671 -543 -629 -786 -210 -556 -486 -740 245 -616
13007 -616 -147 -734 -574 -506 -881 -92 -642 -21 -1153 -590 -265 -45 -215 355 -266 -297 222 -550 -516 267
13027 267 16 250 -617 -889 212 887 57 -300 -749 422 -824 -1078 -7 1025 954 -57 1129 199
13045 199 -98 -429 530 797 522 -901 383 216 568 679 503 793 420 755 720 50 251 448 989
13064 989 965 393 254 1032 538 317 964 888 -793 -148 1006 603 148 922 241 221 102 702 689 843
13084 843 467 -58 150 491 136 839 365 4 440 1137 771 -22 10 305 388 12 -175 69 151 257 325
13105 325 4 22 1216 -221 -680 1115 916 -92 216 -559 -199 607 336 -174 -103 -38 -152 224 142 946
13125 946 425 -489 -310 -185 171 350 -756 -236 -135 -668 -453 -409 -569 -542 -344 -903 -691 75 -678 585
13145 585 -585 -1009 -689 -583 -891 -256 -424 -729 -21 -959 -288 9 -231 -426 -961 -51 33 -154 -856 -566
13165 -566 -451 -1409 -630 -899 -624 -1112 -926 325 -775 -587 -468 -412 -503 -115 -99 -602 -422 44 -532 -226
13185 -226 216 196 -1492 -399 -310 -463 -694 154 288 -450 -620 104 391 -31 58 -481 7 704 412 297
13205 297 380 109 -528 121 492 47 -312 130 130 507 581 605 -249 270 617 866 643 -69 987 228 -645
13226 -645 -360 -629 275 238 852 -175 -311 473 546 181 980 1159 476 1254 -476 621 376 935 524
13245 524 670 774 371 963 1363 537 1250 1728 611 -74 -424 -9 452 17 728 237 667 -223 234
13264 234 95 700 64 -143 487 763 724 -260 225 108 -86 292 104 870 -19 -514 305 103 307 -434
13284 -434 -452 -733 -15 -254 127 604 -768 -729 225 459 216 -181 333 -562 400 593 158 66 489 -470
13304 -470 244 -87 -927 -152 -341 -445 -155 -857 -380 -472 -278 -391 -490 -95 -1249 -1119 -1481 -448 505 -850
13324 -850 -639 -392 -876 -1093 13 -504 -451 -724 -431 -227 65 -1040 923 61 -247 -708 -1233 -552 -943
13343 -943 -498 333 -825 -332 -830 -233 -397 350 -786 -61 -703 -746 20 -254 -448 626 104 -335 -51
13362 -51 -394 -852 -1239 -73 316 167 -245 438 448 -240 -33 -105 -350 359 824 -51 -312 -40 -620 1091
13382 1091 -21 160 314 362 560 529 554 -358 209 578 858 1139 68 305 1203 383 565 -271 -222 714
13402 714 -61 718 403 848 449 419 -313 406 706 873 49 989 18 756 454 1047 665 1266 808 -26
13422 -26 923 68 633 558 413 -146 553 563 172 773 662 1011 177 357 793 -41 -168 22 333 641 221
13443 221 693 -725 458 -26 466 -732 877 2 481 469 247 -5 -204 -254 287 182 -399 147 553
13462 553 -676 -163 -649 -251 369 -137 123 -565 116 165 -164 -238 -246 -532 266 -145 -528 230 -34 -1119
13482 -1119 -853 335 -602 -122 -877 -644 -957 -789 230 -92 -356 -1113 -397 -403 -242 -250 -239 -950 108 238
13502 238 62 -928 -494 -169 -565 39 -612 171 -81 -354 -1141 -841 -71 6 -922 -981 -161 -318 -1111 101
13522 101 -3 -19 -1010 -96 -667 263 432 -94 34 -767 -76 -679 316 308 -145 522 810 164 79 -417 152
13543 152 380 -117 81 -652 356 439 -228 -286 848 408 -235 228 -337 255 651 362 585 1623 1083
13562 1083 -78 -350 -103 -154 -88 500 68 -268 908 369 1154 309 -9 122 1036 605 798 898 731
13581 731 602 860 662 -167 -578 873 856 1063 520 520 286 -204 213 298 98 322 1696 527 583 650 269
13602 269 -21 -183 503 63 -92 705 30 511 985 631 83 298 305 91 343 327 -165 713 -101 -67 -605
13623 -605 123 -129 4 -108 -310 -429 382 37 -1456 -104 38 112 -130 412 -665 306 495 700 137
13642 137 128 -881 134 415 -246 412 306 -522 -381 -302 -533 -727 -343 -563 -619 -769 -508 -54 442 -103
13662 -103 -396 -97 -288 -501 -321 -255 -1173 -241 -201 -824 -116 -726 -1186 -399 -894 -151 -315 118 -467 563
13682 563 -674 -377 -195 577 -116 -652 -809 -612 284 -1452 158 -507 -329 -193 -1161 -369 522 -932
13700 -932 148 650 -317 -951 -478 -166 -405 213 -87 -300 437 8 368 -600 98 -375 184 -433 -426 332
13720 332 300 708 -419 428 -56 -533 777 758 279 352 387 345 652 524 441 435 -338 334 -532 455 45 332
13742 332 -22 -850 280 479 29 -211 515 571 -249 384 124 -277 541 981 115 -207 659 106 329 99
13762 99 307 548 597 303 1161 417 520 1038 575 467 921 602 -674 117 125 99 686 747 587 759 -153
13783 -153 -317 -77 563 82 -686 528 5 628 543 -481 566 171 1033 -381 113 459 417 -236 243
13802 243 -481 -547 -204 -50 89 -148 179 -375 -860 -939 -654 39 468 -574 31 -635 -287 10 194 -448
13822 -448 -195 -376 -72 155 -275 -311 -1038 -716 -1238 -335 -452 385 -610 131 -636 -1028 -370 -372 75 -590 -378
13843 -378 45 -310 -209 208 -968 -350 147 -133 -765 -624 -342 -618 -550 -650 -165 -610 -1042 -471 -644 -509
13863 -509 894 -181 -431 316 -730 -33 -210 -400 -494 -160 247 -222 -634 246 285 504 28 520 465 -573
13883 -573 -281 -331 65 -732 -724 -367 -106 -122 96 352 130 645 154 -564 -528 -357 476 430 747 179 150 409
13905 409 -156 42 771 831 1128 595 -637 741 207 687 646 119 949 890 366 66 755 310 629 591
13925 591 200 577 603 281 -88 487 622 73 95 577 896 1268 942 630 740 439 737 7 1016 282
13945 282 951 226 455 859 -844 291 987 130 279 -41 352 1600 1 -530 -44 147 203 41 -241
13964 -241 576 284 -37 60 521 -124 410 -543 559 461 160 501 301 -100 605 328 -106 164 166 431 -92
13985 -92 259 -134 -866 361 -479 -540 -56 -1192 -269 -59 -129 -417 -433 -391 -422 -372 162 537 270 -85 -738
14006 -738 -87 -717 -921 -829 -1067 -396 -172 -524 93 -421 -394 -1433 -1382 -54 -496 -516 -572 -671 -91 -622 -4
14027 -4 152 74 -51 304 -428 -649 -677 -726 -595 -897 -1026 -230 -1330 -760 -822 -674 -143 -200 119 -161 227 -412
14049 -412 -143 -287 57 -788 -286 170 276 -1049 -576 -1088 269 -767 651 922 -957 193 0 358
14067 358 -109 609 447 -630 543 104 362 -401 -168 1067 632 -244 1022 870 -18 763 153 -242
14085 -242 1215 572 111 -143 -81 1585 410 -89 848 361 499 466 412 265 872 790 166 -336 790 619
14105 619 460 349 828 508 857 1290 243 1102 -194 437 -413 635 566 935 817 378 653 431 383
14124 383 312 662 509 -76 207 898 -43 1059 126 100 336 563 190 1047 572 -895 142 69 -39 -20
14144 -20 130 430 -43 -466 172 -56 -331 168 527 303 20 -363 -979 -423 272 -624 -243 47 -252 -521
14164 -521 -265 -21 -1391 -265 250 -488 294 -1224 -315 -490 -183 -511 -275 -188 -506 -205 33 92 277
14183 277 -404 -589 -105 -859 -329 482 -889 101 -486 -767 -919 -511 -440 -1008 505 -707 -816 68 -733
14202 -733 -581 -362 -219 -47 -1474 -1225 -740 -402 317 -921 -347 -263 -980 37 -157 -997 -382 -645 -1032
14221 -1032 -490 298 -328 -334 -274 -239 -334 279 275 -123 -229 86 -708 394 61 379 268 155 618 -581 -258
14242 -258 1115 489 42 -154 -805 400 649 -192 22 871 23 662 61 451 722 -194 630 21 -127
14261 -127 1093 172 815 587 995 165 238 664 52 -303 -444 98 -243 1134 -614 986 407 175 727
14280 727 853 342 74 1058 1464 -239 681 1035 659 774 -1 452 490 -27 501 887 297 171 866 790
14300 790 -101 -44 594 600 319 -646 978 283 -235 -913 749 691 405 370 -640 -220 924 745 -52 -85
14320 -85 728 -226 406 -451 835 234 114 333 -363 -391 -48 -817 -426 -785 -238 -335 -375 184 -119 726 3
14341 3 -268 -594 -141 -653 368 -61 -641 -886 -79 -763 -713 6 -221 -483 -62 -112 -971 -399 -569 -470 -358
14362 -358 -896 -594 -827 -225 -641 -1365 -126 -738 320 -283 -556 -864 -468 41 -179 -57 -997 -170 -335
14381 -335 -179 -189 -200 -225 -1206 -629 33 -196 -480 -73 368 25 -90 -485 497 -54 -169 933 654 55
14401 55 -622 -187 -836 291 482 -268 458 39 -635 -668 -13 324 337 590 -563 300 134 882 183 435
14421 435 95 1029 528 140 532 499 639 -40 -33 523 1129 -115 767 -145 443 437 644 295 -52 468 1142
14442 1142 761 278 1407 524 -178 776 546 150 314 324 956 324 684 61 1416 -72 -45 -201 411
14461 411 343 400 258 89 985 426 420 -150 168 650 -323 256 -203 1283 588 -150 632 493 514 466 152
14482 152 -172 126 93 191 505 705 578 211 61 -424 -476 585 207 -397 -276 -1315 107 -201 -3 113
14502 113 -101 -16 344 87 23 -300 -398 -375 -515 -423 47 -369 -1152 -494 692 -78 175 -604 -640 118 -759
14523 -759 -84 -273 -357 -521 -262 -199 -596 -308 -285 -643 -1169 -632 -317 -1110 -1644 -123 -1341 -28 -481 -560
14543 -560 -619 -1061 -498 -240 -560 143 -398 -403 -336 90 -780 -911 -245 129 -609 281 -289 -461 -581 -96 -144
14564 -144 1438 -529 340 384 93 10 -848 50 -35 919 538 -655 -158 368 -8 56 291 -377 -190 246
14584 246 -75 264 -461 501 169 -315 350 181 -155 1108 -214 -688 216 167 75 104 1145 1225 31 345
14604 345 787 469 -227 791 259 268 544 -531 760 421 1000 304 903 -731 -518 1087 -126 763
14622 763 41 497 -97 -368 138 170 750 584 1275 -497 -820 528 785 297 849 224 460 773 1031
14641 1031 154 79 -144 421 741 389 264 467 -474 293 740 957 589 327 -151 -422 -369 207 -360 -177
14661 -177 -545 -308 750 -491 -547 -187 -60 -277 -490 299 821 258 1167 -350 -232 387 -72 -110 -326
14680 -326 214 241 -399 -560 -133 239 -210 428 651 -426 -283 103 -943 -340 -303 -100 -966 -702 -1030 -541
14700 -541 -693 -498 -183 178 -467 -808 -439 -292 -455 -635 353 -383 -445 -1423 14 -1180 -534 -297 461
14719 461 -226 -346 -452 -783 -340 -768 39 77 -630 -530 69 -423 -101 -650 -453 125 -289 265 -319 -883
14739 -883 -67 -128 618 289 975 -380 -711 207 681 151 771 -135 -82 149 827 257 781 203 636 691
14759 691 86 256 291 17 -101 1105 334 83 569 -847 635 827 -633 223 723 446 353 370 293 -606
14779 -606 104 580 1022 332 -199 -165 627 267 500 1174 1036 17 540 1263 945 48 585 644 481 556
14799 556 17 327 276 484 -64 968 -448 -68 -112 606 246 831 137 852 707 753 -415 310 790 -371
14819 -371 207 71 414 1091 -659 -216 1193 -610 -554 -198 217 -159 74 -51 -447 547 -32 -365 1039
14838 1039 213 -1674 -89 435 246 -166 460 -261 -480 768 298 -154 -988 -527 732 -399 324 -135
14856 -135 -382 -362 -60 -608 773 209 -772 -17 -679 324 -1182 -293 165 -808 -1089 -821 -1024 -10 -772
14875 -772 -1107 -283 -42 -464 -74 -701 -862 -5 -1595 372 506 -899 -460 505 -105 -822 176 -80 658
14894 658 -234 332 -509 -544 -479 -362 208 -1188 160 -450 -622 -332 336 94 -530 -375 -34 -56 -596 -549
14914 -549 -363 -531 -53 -500 540 164 -1461 1087 452 207 239 -230 -715 87 -405 -112 201 -504 498
14933 498 620 420 -5 388 346 -702 -53 114 3 1222 546 719 155 -732 437 523 -332 512 815
14952 815 203 1317 164 -155 1083 241 279 202 -239 326 901 55 626 356 -65 488 450 983 612 -93
14972 -93 578 -406 644 724 659 843 345 727 452 189 181 -295 508 -249 -336 138 -307 -561 532 1138 -777
14993 -777 1093 831 81 428 -144 22 763 -75 592 1099 4 52 -521 13 45 393 106 427 216 37
15013 37 438 -533 -60 -677 -311 367 -44 30 360 -849 487 -438 242 -253 -1165 100 -93 71 -762
15032 -762 153 -90 -1328 -684 -659 173 -213 -515 -1454 -116 297 470 -260 -1614 -374 -1277 53 -400
15050 -400 -461 -55 -409 -321 -954 -627 283 -87 69 -974 -389 -562 -247 -734 -548 -411 -1076 11 144 -176
15070 -176 -48 -171 53 -903 -835 -102 -154 -426 251 296 -794 -700 -662 -590 -1343 110 -139 -1109 251 663 -414
15091 -414 -257 -1070 -345 -279 -307 -106 -24 1164 -106 557 313 283 100 -266 -77 228 52 224 207 260 195
15112 195 -230 -53 292 49 429 253 166 171 -211 143 1320 993 -44 -195 -242 172 848 169 506 969
15132 969 -414 1065 577 310 383 337 196 572 1193 1156 636 -117 150 456 1787 -137 904 -449 448
15151 448 305 675 1095 244 499 321 645 -323 223 224 -45 -390 66 339 577 314 -383 1092 713 1079
15171 1079 -444 165 575 38 -933 15 109 -291 -373 -67 -489 16 -41 204 875 309 416 -546 -210 -296
15191 -296 586 -464 8 -290 -687 -466 -81 -740 -668 52 -54 -176 -739 358 -608 60 -216 -253 -131 -264
15211 -264 54 -173 -124 -54 -370 -622 -132 -367 -1058 384 -411 -1454 -225 -164 -1213 -508 -503 -700 97 -538
15231 -538 -1133 -766 -1107 -452 -429 -511 -314 -310 -196 -1087 41 -325 -419 1679 -113 -499 -546 536 121 76 29
15252 29 -137 498 368 402 -138 217 -319 95 -55 -407 -24 143 -103 -301 739 660 -518 -148 -23 257
15272 257 -247 300 347 -12 75 693 -216 414 385 1352 572 129 713 517 523 58 845 415 436 -608 -214
15293 -214 670 519 44 289 46 409 759 495 -29 131 512 39 -293 -74 724 554 177 979 1112 540
15313 540 408 284 797 715 -67 455 206 271 -81 -23 79 1540 649 139 242 -411 110 415 758 370
15333 370 -8 125 1158 1421 291 -469 367 -371 -269 -52 460 -80 37 198 -152 -496 117 140 7
15352 7 179 407 -733 -234 79 -261 -544 -671 -807 543 842 398 641 481 -390 -600 -591 -368 -328 -270 -243
15373 -243 21 -298 -364 -43 525 -503 -200 467 -372 -491 -741 279 114 313 99 -1164 -181 211 -509
15392 -509 -775 -655 -534 -467 -17 -23 -190 -335 -731 -788 -776 -908 -646 -1240 -600 -454 66 -232 -371 -172 -1047
15413 -1047 -270 261 -291 -268 -216 -362 -106 -590 -754 -163 -720 346 791 -355 1 478 -451 -307 -210 411
15433 411 56 720 -1026 171 362 160 216 -14 -627 -551 790 679 -34 184 10 131 -656 630 -43
15452 -43 340 176 -160 841 36 483 143 315 -441 63 660 220 817 956 574 1431 408 901 640
15471 640 1064 -179 279 450 585 442 -452 -443 112 19 399 787 399 587 395 501 988 636 -158 479
15491 479 -266 997 -167 639 -117 324 -76 883 -31 735 745 95 299 378 718 -233 467 178 422 -49
15511 -49 360 149 115 101 -20 426 598 -455 97 361 -689 -396 -91 -248 104 352 275 284 637 -27 -747
15532 -747 154 -180 -1491 -173 -69 -600 -703 122 -580 -1223 -682 -839 -308 378 -1130 -599 -1063 -1012 -885
15551 -885 -437 -483 -174 155 210 -386 -720 -316 -488 40 45 341 53 -928 44 -999 -515 -402 -550 -456 -190
15572 -190 -237 -1373 -263 -998 -846 -881 -597 343 -784 -354 -991 -400 -861 -422 30 -710 -1098 -140 -746
15591 -746 -1190 -195 -17 -667 -697 -450 31 -212 -345 517 -224 -136 -801 305 -961 -884 138 -217 -680 -57
15611 -57 100 -518 283 -173 -959 -814 -64 959 -131 -546 431 82 697 -98 613 -127 507 574 913 292
15631 292 429 251 290 557 917 210 319 731 99 1161 684 99 549 977 506 480 95 438 735 -28
15651 -28 628 779 252 -249 1133 -101 687 296 1206 -176 149 -157 1306 272 979 677 -775 710
15669 710 379 741 615 612 483 406 216 250 171 1558 207 204 51 -169 -559 395 736 682 436 198 267 393
15691 393 617 62 -903 293 -380 -142 334 477 638 -101 -326 -883 -411 10 -210 -246 44 -154 -314 -432
15711 -432 159 -5 -996 64 -519 -399 -317 -26 1200 -327 567 -1959 -1053 77 23 -37 181 136 120 -553
15731 -553 -373 -544 -506 -147 -496 -1076 -444 -779 -253 -294 -916 -186 -840 -535 474 -733 -949 -119 -1008 -552
15751 -552 -89 -587 -422 236 -143 -736 -81 -609 -768 -477 -306 -910 -182 46 -752 -97 -670 -387 -21 -725
15771 -725 -295 -381 -111 -3 131 1015 -161 -223 -874 -17 -423 -179 -651 181 384 -289 934 302 617 91
15791 91 70 829 595 68 -8 -94 -111 29 347 -540 -186 219 -29 762 735 -84 602 646 954 662 314 937
$$ [...]
16383c55
##END NTUPLES=NMR FID
##END=
