##TITLE=19F
##JCAMPDX= 6.0         $$ Bruker NMR JCAMP-DX V2.0
##DATA TYPE= NMR SPECTRUM
##DATA CLASS= NTUPLES
##ORIGIN= UXNMR, Bruker Analytische Messtechnik GmbH
##OWNER= root
$$ XWIN-NMR		Version 3.5
$$ Fri Feb 11 09:09:28 2011 Russian Standard Time (UT+3h)  anp@DPX200
##.OBSERVE FREQUENCY= 188.29809782803
##.OBSERVE NUCLEUS= ^19F
##.ACQUISITION MODE= SIMULTANEOUS
##.ACQUISITION SCHEME= undefined
##.AVERAGES= 8
##.DIGITISER RES= 16
##SPECTROMETER/DATA SYSTEM= spect
##.PULSE SEQUENCE= zg
##.SOLVENT NAME= CDCl3
##.SHIFT REFERENCE= (INTERNAL, CDCl3, 0, 134.638)
##AUDIT TRAIL= $$ (NUMBER, WHEN, WHO, WHERE, WHAT)
$$ ##TITLE= Audit trail, XWIN-NMR		Version 3.5
$$ ##JCAMPDX= 5.01
$$ ##ORIGIN= Bruker BioSpin GmbH
$$ ##OWNER= anp
$$ D:/spectra/data/zvl/nmr/19F/11/pdata/1/auditp.txt
$$ ##AUDIT TRAIL=  $$ (NUMBER, WHEN, WHO, WHERE, WHAT)
(   1,<2010-12-10 12:24:16.46 +300>,<anp>,<DPX200>,
      <created by zg, POWCHK disabled, PULCHK disabled
       configuration hash MD5:
       11 64 04 C6 CF 8A CA 3B 7E DD FE 01 35 7D 01 E9
       data hash MD5: 32K
       AD B0 1A C8 E8 82 34 01 6F 28 87 70 32 EC 13 CA>)
(   2,<2010-12-10 12:25:02.98 +300>,<anp>,<DPX200>,
      <Start of raw data processing
       efp BC_mod = 2 LB = 2 FT_mod = 6 PKNL = 1 PHC0 = -15.31589 PHC1 = 98.45487 SI = 128K 
       data hash MD5: 128K
       DE 1F BA 22 4C 16 23 FF E8 AE 92 DD 6B F1 4D B7>)
$$ ##END=
$$ 
$$ hash MD5
$$ CE C9 04 12 79 21 FF 0A 64 FA 3A A1 20 AC 80 B0
##$RELAX= 
##$RELAX= 
##$RELAX= 
##$RELAX= 
##$RELAX= 
$$ Bruker specific parameters
$$ --------------------------
##$DU= <D:/spectra>
##$EXPNO= 11
##$NAME= <19F>
##$PROCNO= 1
##$TYPE= <nmr>
##$USER= <zvl>
##$AMP= (0..31)
100 100 100 100 100 100 100 100 100 100 100 100 100 100 100 100 100 100 
100 100 100 100 100 100 100 100 100 100 100 100 100 100 
##$AQSEQ= 0
##$AQ_mod= 1
##$AUNM= <au_zg>
##$AUTOPOS= <>
##$BF1= 188.310338
##$BF2= 200.13
##$BF3= 200.13
##$BF4= 200.13
##$BF5= 200.13
##$BF6= 200.13
##$BF7= 200.13
##$BF8= 200.13
##$BYTORDA= 1
##$CFDGTYP= 0
##$CFRGTYP= 5
##$CHEMSTR= <none>
##$CNST= (0..31)
1 1 145 1 1 1 1 1 1 1 1 1 1 1 1 1 1 1 1 1 1 1 1 1 1 1 1 1 1 1 1 1 
##$CPDPRG= <>
##$CPDPRG1= <>
##$CPDPRG2= <>
##$CPDPRG3= <>
##$CPDPRG4= <mlev>
##$CPDPRG5= <mlev>
##$CPDPRG6= <mlev>
##$CPDPRG7= <mlev>
##$CPDPRG8= <mlev>
##$CPDPRGB= <>
##$CPDPRGT= <>
##$D= (0..31)
0 2 0 0 0 0 0 0 0 0.06 0 0 0 0 0 0 0.0002 0 0 0 0 0 0 0 0 0 0 0 0 0 0 
0 
##$DATE= 1291973055
##$DBL= (0..7)
120 120 120 120 120 120 120 120 
##$DBP= (0..7)
150 150 150 150 150 150 150 150 
##$DBP07= 0
##$DBPNAM0= <>
##$DBPNAM1= <>
##$DBPNAM2= <>
##$DBPNAM3= <>
##$DBPNAM4= <>
##$DBPNAM5= <>
##$DBPNAM6= <>
##$DBPNAM7= <>
##$DBPOAL= (0..7)
0.5 0.5 0.5 0.5 0.5 0.5 0.5 0.5 
##$DBPOFFS= (0..7)
0 0 0 0 0 0 0 0 
##$DE= 6
##$DECBNUC= <off>
##$DECIM= 2
##$DECNUC= <off>
##$DECSTAT= 4
##$DIGMOD= 1
##$DIGTYP= 9
##$DL= (0..7)
0 120 120 120 120 120 120 120 
##$DP= (0..7)
150 150 150 150 150 150 150 150 
##$DP07= 0
##$DPNAME0= <>
##$DPNAME1= <>
##$DPNAME2= <>
$$ [...]
##$SUBNAM3= <"">
##$SUBNAM4= <"">
##$SUBNAM5= <"">
##$SUBNAM6= <"">
##$SUBNAM7= <"">
##$SUBNAM8= <"">
##$SUBNAM9= <"">
##$SW= 399.302864936427
##$SWIBOX= (0..15)
0 1 0 0 0 0 0 0 0 0 0 0 0 0 0 0 
##$SW_h= 75187.969924812
##$TD= 32768
##$TD0= 1
##$TE= 0
##$TE2= 300
##$TE3= 300
##$TEG= 300
##$TL= (0..7)
0 120 120 120 120 120 120 120 
##$TP= (0..7)
150 150 150 150 150 150 150 150 
##$TP07= 0
##$TPNAME0= <>
##$TPNAME1= <>
##$TPNAME2= <>
##$TPNAME3= <>
##$TPNAME4= <>
##$TPNAME5= <>
##$TPNAME6= <>
##$TPNAME7= <>
##$TPOAL= (0..7)
0.5 0.5 0.5 0.5 0.5 0.5 0.5 0.5 
##$TPOFFS= (0..7)
0 0 0 0 0 0 0 0 
##$TUNHIN= 0
##$TUNHOUT= 0
##$TUNXOUT= 0
##$USERA1= <user>
##$USERA2= <user>
##$USERA3= <user>
##$USERA4= <user>
##$USERA5= <user>
##$V9= 5
##$VALIST= <valist>
##$VCLIST= <CCCCCCCCCCCCCCC>
##$VD= 0
##$VDLIST= <DDDDDDDDDDDDDDD>
##$VPLIST= <PPPPPPPPPPPPPPP>
##$VTLIST= <TTTTTTTTTTTTTTT>
##$WBST= 1024
##$WBSW= 4
##$XGAIN= (0..3)
0 0 0 0 
##$XL= 0
##$YL= 0
##$YMAX_a= 9747
##$YMIN_a= -4066
##$ZGOPTNS= <>
##$ZL1= 120
##$ZL2= 120
##$ZL3= 120
##$ZL4= 120
##$ABSF1= 0
##$ABSF2= 0
##$ABSG= 0
##$ABSL= 0
##$ALPHA= 0
##$AQORDER= 0
##$ASSFAC= 0
##$ASSFACI= 0
##$ASSFACX= 0
##$ASSWID= 0
##$AUNMP= <proc_1d>
##$AZFE= 0.1
##$AZFW= 0.1
##$BCFW= 0
##$BC_mod= 2
##$BYTORDP= 0
##$COROFFS= 0
##$CY= 1000
##$DATMOD= 1
##$DC= 0
##$DFILT= <>
##$DTYPP= 0
##$F1P= -61.6131669251322
##$F2P= -63.7828827460679
##$FCOR= 1
##$FTSIZE= 131072
##$FT_mod= 6
##$GAMMA= 0
##$GB= 0
##$INTBC= 1
##$INTSCL= 1
##$ISEN= 128
##$LB= 2
##$LEV0= 0
##$LPBIN= 0
##$MAXI= 10000
##$MC2= 0
##$MEAN= 0
##$ME_mod= 0
##$MI= 0
##$NCOEF= 0
##$NC_proc= -6
##$NLEV= 6
##$NOISF1= -62.74998
##$NOISF2= -67.25003
##$NSP= 0
##$NTH_PI= 0
##$NZP= 0
##$OFFSET= 134.6379
##$PC= 1
##$PHC0= -15.31589
##$PHC1= 98.45487
##$PH_mod= 1
##$PKNL= yes
##$PPARMOD= 0
##$PSCAL= 4
##$PSIGN= 0
##$REVERSE= no
##$SF= 188.3103381
##$SI= 131072
##$SIGF1= -62
##$SIGF2= -63
##$SINO= 400
##$SIOLD= 32768
##$SREGLST= <1H.CDCl3>
##$SSB= 0
##$STSI= 131072
##$STSR= 0
##$SW_p= 75187.969924812
##$SYMM= 0
##$S_DEV= 0
##$TDeff= 32768
##$TDoff= 0
##$TI= <>
##$TILT= no
##$TM1= 0
##$TM2= 0
##$TOPLEV= 0
##$USERP1= <user>
##$USERP2= <user>
##$USERP3= <user>
##$USERP4= <user>
##$USERP5= <user>
##$WDW= 1
##$XDIM= 131072
##$YMAX_p= 437507146
##$YMIN_p= -14544932
$$ End of Bruker specific parameters
$$ ---------------------------------
##NTUPLES= NMR SPECTRUM
##VAR_NAME=  FREQUENCY,     SPECTRUM/REAL,   SPECTRUM/IMAG
##SYMBOL=    X,             R,               I
##VAR_TYPE=  INDEPENDENT,   DEPENDENT,       DEPENDENT
##VAR_FORM=  AFFN,          ASDF,            ASDF
##VAR_DIM=   131072,        131072,          131072
##UNITS=     HZ,            ARBITRARY UNITS, ARBITRARY UNITS
##FACTOR=    0.573643063109399, 1,           1
##FIRST=     25353.7072793421, 0,            0
##LAST=      -49834.2626454699, 0,           0
##MIN=       -49834.2626454699, -14544932,   0
##MAX=       25353.7072793421, 437507146,    0
$$ Real data points
##PAGE= N=1
##DATA TABLE= (X++(R..R)), XYDATA
$$ [...]
69052G85238J458332J157814N97270n6390n91538q42591p63236m46228p9504J40810
$$ 785238 2243570 3401384 3998654 3942264 3350726 2508135 1744899 1298671 1219167 1359977
69042A359977R9290j89394n92253r23057j028526q55541m70590k6324L06010M06553
$$ 1359977 1459267 1269873 677620 -245437 -1273963 -2129504 -2600094 -2626418 -2320408 -1913855
69032a913855K50084r1703m84419p83647q84289p50460m19848J4212M34415P35091
$$ -1913855 -1663771 -1755474 -2239893 -3023540 -3907829 -4658289 -5078137 -5063925 -4629510 -3894419
69022c894419Q52679P83478N83046L45520J67443J08008J62215K61240L04143
$$ -3894419 -3041740 -2258262 -1675216 -1329696 -1162253 -1054245 -892030 -630790 -326647
69013c26647K10100l2353l45227n85619o09426l47281J44720O89468J054176J052231
$$ -326647 -116547 -148900 -494127 -1079746 -1689172 -2036453 -1891733 -1202265 -148089 904142
69003I04142O35999o5507p87519j236529j218165p27908L9043P66620J152361
$$ 904142 1540141 1474634 687115 -549414 -1767579 -2495487 -2456444 -1689824 -537463
68994e37463J037959M77275k88636r37634j205288r94240m07011L08814Q74363
$$ -537463 500496 977771 689135 -248499 -1453787 -2448027 -2855038 -2546224 -1671861
68985a671861J098650R50361N54127J19069j62686j99253k7933K18423L86619
$$ -1671861 -573211 377150 931277 1050346 887660 688407 660474 878897 1265516
68976A265516L81382K09764k6975j87264j61439P2062M32232P68812R28170Q22645
$$ 1265516 1646898 1856662 1829687 1642423 1480984 1553046 1985278 2754090 3682260 4504905
68966D504905M73002N225l98138n72999m44722o5480L99169P31698P49498L83046
$$ 4504905 4977907 4983132 4584994 4011995 3567273 3501793 3900962 4632660 5382158 5765204
68956E765204k87394j054211j658232j889423j671826j096512l86551J93421M46062
$$ 5765204 5477810 4423599 2765367 875944 -795882 -1892394 -2278945 -2085524 -1639462
68947a639462L22166o2007m79297o94651n71111j31440M52181R35471J111014
$$ -1639462 -1317296 -1379303 -1858600 -2553251 -3124362 -3255802 -2803621 -1868150 -757136
68938g57136Q99411L81986k38184p26989r19003p80961m12713J0402L22896M40509
$$ -757136 142275 524261 286077 -440912 -1359915 -2140876 -2553589 -2543187 -2220291 -1779782
68928a779782L85664K59426J78678K12645L50286N12223N97473N38523L36178
$$ -1779782 -1394118 -1134692 -956014 -743369 -393083 119140 716613 1255136 1591314
68919A591314N7989j96305l42510l48230k40944q7018M4576J13954J22330J01402
$$ 1591314 1649303 1452998 1110488 762258 521314 434296 478872 592826 715156 816558
68909H16558Q9350J08425J56001K11579K52658K68076K60536K37972K01196J37839
$$ 816558 905908 1014333 1170334 1381913 1634571 1902647 2163183 2401155 2602351 2740190
68899B740190K8479j37341l44791n48358o83440o91519n47352k74277O1002L72549
$$ 2740190 2768669 2631328 2286537 1738179 1054739 363220 -184132 -458409 -397407 -24858
68889b4858N87183O69267O27240N00527L35391J63354o727j80423l60344n31835
$$ -24858 562325 1231592 1858832 2359359 2694750 2858104 2851377 2670954 2310610 1778775
68879A778775o61914p13436o67009n37666l75282k46104k03259k60707l84359
$$ 1778775 1116861 403425 -263584 -801250 -1176532 -1422636 -1625895 -1886602 -2270961
68870b270961n05718n52178m79487k90764l3327K24234M22434N33418N65186N47436
$$ -2270961 -2776679 -3328857 -3808344 -4099108 -4132435 -3908201 -3485767 -2952349 -2387163 -1839727
68860a839727N08822M59584L89699K83141J38827j5696j28283j44379l6749J73623
$$ -1839727 -1330905 -871321 -481622 -198481 -59654 -75350 -203633 -348012 -384761 -211138
68850b11138M18768O09461O74530N94403M10863K06195O0643R281K1357J4924
$$ -211138 207630 817091 1491621 2086024 2496887 2703082 2763725 2773006 2794363 2809287
68840B809287r8123l58179p23346j074839j264110j182139q18159k77514K54015
$$ 2809287 2711164 2352985 1629639 554800 -709310 -1891449 -2709608 -2987122 -2733107
68831b733107N86658O10503L47493n4618l86400m71399k48345J97815O71861R56127
$$ -2733107 -2146449 -1535946 -1188453 -1243071 -1629471 -2100870 -2349215 -2151400 -1479539 -523412
68821e23412R10499N38474j1757n12390p57889o57156k73968K02444N42780N79799
$$ -523412 387087 925561 913804 401414 -356475 -1013631 -1287599 -1085155 -542375 37424
68811C7424K81162k38822p71835j107038j119400q16405l25184J70266N10502
$$ 37424 318586 79764 -692071 -1799109 -2918509 -3734914 -4060098 -3889832 -3379330
68802c379330O23357N41782L72865K36421K03925K66041L41921L23647J33738
$$ -3379330 -2755973 -2214191 -1841326 -1604905 -1400980 -1134939 -793018 -469371 -335633
68793c35633k30884o87815j095337j304579j216557q22035k09694M59835J004600
$$ -335633 -566517 -1254332 -2349669 -3654248 -4870805 -5692840 -5902534 -5442699 -4438099
68784d438099J279242J221098Q69652L53154j53441m85752n43781l24034Q1479
$$ -4438099 -3158857 -1937759 -1068107 -714953 -868394 -1354146 -1897927 -2221961 -2140482
68775b140482N19558Q31523R10013P35639L79717k7242l47859m89157m32093k28693
$$ -2140482 -1620924 -789401 120612 856251 1235968 1208726 860867 371710 -60383 -289076
68765b89076K9193K53152L92845M47026M48461M33517M14265L68742K54655L9025
$$ -289076 -259883 -6731 386114 833140 1281601 1715118 2129383 2498125 2752780 2791805
68755B791805k72533o23317r18016j055933r70571o58148j82969L42035P90800
$$ 2791805 2519272 1895955 977939 -77994 -1048565 -1706713 -1889682 -1547647 -756847
68746g56847J061465J102644R22015N78156J61448k29127n08328o23360n66765
$$ -756847 304618 1407262 2329277 2907433 3068881 2839754 2331426 1708066 1141301
68737A141301l80250j45680L8458R1326j5940k40527m75330n86179m68124r8638
$$ 1141301 761051 615371 653829 745155 729215 488688 13358 -572821 -1040945 -1139583
68727a139583M36923R63399J275423J217475P52028j4188q59678j524204j802232
$$ -1139583 -702660 260739 1536162 2753637 3505665 3491477 2631799 1107595 -694637
68718f94637j616885j045348k86742M13305Q50681R29546O84711K55364j75298
$$ -694637 -2311522 -3356870 -3643612 -3230307 -2379626 -1450080 -765369 -510005 -685303
68709f85303m48915m83677k92708L2959L66310N93563O53021N51462L54699J57614
$$ -685303 -1134218 -1617895 -1910603 -1877644 -1511334 -917771 -264750 286712 641411 799025
68699G99025M5444O0597J87227L59402M89875N07963L90614J72810o8093k47585
$$ 799025 844469 905066 1092293 1451695 1941570 2449533 2840147 3012957 2944864 2697279
68689B697279l12684k65395j59095o9285n3595j22214k35019l27513l51346l05972
$$ 2697279 2384595 2119200 1960105 1890820 1837225 1715011 1479992 1152479 801133 495161
68679D95161k41604k29223l12980m72695o21467o45463m68505j06884L19654O34245
$$ 495161 253557 24334 -288646 -761341 -1382808 -2028271 -2496776 -2603660 -2284006 -1649761
68669a649761O89356M50934L3446l40164m41989j59031M31681J076872J452038
$$ -1649761 -960405 -509471 -476025 -816189 -1258178 -1417209 -985528 91344 1543382
68660A543382J313454O25372m02313j390378j950369j856084j146021j07686Q49745
$$ 1543382 2856836 3482208 3079895 1689517 -260852 -2116936 -3262957 -3370643 -2520898
68651b520898J374770J321326P97882R9495m39490n98655l58755J12453N59762
$$ -2520898 -1146128 175198 973080 1072575 633085 34430 -324325 -211872 347890
68642C47890P69462O62639L12013j15913m54173o11730n96532m82631l50130k38216
$$ 347890 1117352 1779991 2092004 1976091 1521918 910188 313656 -168975 -519105 -757321
68632g57321j38236k5170R9588J88119J66821j1839l19708o41367q16188p17442
$$ -757321 -895557 -920727 -821139 -633020 -466199 -478038 -797746 -1439113 -2255301 -2972743
68622b972743l26721K40191P76246J077654J042606P21488K89917m3008j43046
$$ -2972743 -3299464 -3059273 -2283027 -1205373 -162767 558721 848638 805630 662584
68613F62584j7407J96869L16530K21321p2654m17956o18355n44116k15288J96018
$$ 662584 645177 842046 1158576 1379897 1307243 889287 270932 -273184 -488472 -292454
68603b92454M49659L65151p5377p06177j253139j467981j251792p03031o4923
$$ -292454 157205 522356 446979 -259198 -1512337 -2980318 -4232110 -4935141 -5000064
68594e000064L99493N38276L78689R8341q2244k5350K48742N76947P48621O26843
$$ -5000064 -4600571 -4062295 -3683606 -3585265 -3667509 -3692859 -3444117 -2867170 -2118549 -1491706
68584a491706K28382k81097o72833p73714n53037j31609K88628N32582N36885
$$ -1491706 -1263324 -1544421 -2217254 -2990968 -3544005 -3675614 -3386986 -2854404 -2317519
68575b317519L66569J59121L3304J9066N0292K3011j19038l27418m60695l63870
$$ -2317519 -1950950 -1791829 -1758525 -1739459 -1689167 -1666156 -1785194 -2112612 -2573307 -2937177
68565b937177K7911O23641J193702J470051J281231O50350k00329r46808j316457
$$ -2937177 -2909266 -2285625 -1091923 378128 1659359 2309709 2109380 1162572 -153885
68556a53885j218544p83358k88010o855o5178l73980o81142p12338l26821L95386
$$ -153885 -1372429 -2155787 -2443797 -2450652 -2515830 -2889810 -3570952 -4283290 -4610111 -4214725
68546d214725J182526J702712J730206J260154N12508j76288n17644m07295L3537
$$ -4214725 -3032199 -1329487 400719 1660873 2173381 1997093 1479449 1072154 1105691
68537A105691N29206P92365O63678J79645m59585r97968j246357j157936q24791
$$ 1105691 1634897 2427262 3090940 3270585 2811000 1813032 566675 -591261 -1416052
68528a416052m08639n1848J80813L03426L63708L88744L60842K39520J2777k60964
$$ -1416052 -1824691 -1876539 -1695726 -1392300 -1028592 -639848 -279006 -39486 -26709 -287673
68518b87673m55527m32676j24427M05624R63580J298881J219564O92078j27905
$$ -287673 -743200 -1175876 -1300303 -894679 68901 1367782 2587346 3279424 3151519
68509C151519r54111j492430j568749j199222n69573O3384M95603O61455O40038
$$ 3151519 2197408 704978 -863771 -2062993 -2632566 -2569182 -2073579 -1412124 -772086
68500g72086N84530O17883P54467Q90947Q70199N81241L8501o04889j119116j303852
$$ -772086 -187556 430327 1184794 2075741 2945940 3527181 3565682 2960793 1841677 537825
68490E37825j084050n46847R7947O12033Q29741P17893L70513n1190l97394n86306
$$ 537825 -546225 -1093072 -995125 -383092 446649 1164542 1535055 1483865 1086471 500165
68480E00165o15759n34120l96141k33232n3439J35448L01981L88422L36133J25259
$$ 500165 -115594 -649714 -1045855 -1279087 -1332526 -1197078 -895097 -506675 -170542 -45283
68470d5283j97427n24426p30239p31283n30757k21782N6154J86476J34142l8389
$$ -45283 -242710 -767136 -1497375 -2228658 -2759415 -2981197 -2925043 -2738567 -2604425 -2642814
68460b642814k07389k57352j46108P0467K68488L25375J90951p8883l45585m57688
$$ -2642814 -2850203 -3107555 -3253663 -3183196 -2914708 -2589333 -2398382 -2477265 -2822850 -3280538
68450c280538l30971K956M05635O94760P30090M79930L6295m27100p32049p70794
$$ -3280538 -3611509 -3608553 -3202918 -2508158 -1778068 -1298138 -1261843 -1688943 -2420992 -3191786
68440c191786n45028j54885K51589N41434O43465N62103L59617J21626p5853j85968
$$ -3191786 -3736814 -3891699 -3640110 -3098676 -2455211 -1893108 -1533491 -1411865 -1487718 -1673686
68430a673686j95530j20154L472J25866J95632J75023N7525j21124k88603l62368
$$ -1673686 -1869216 -1989370 -1985898 -1860032 -1664400 -1489377 -1431852 -1552976 -1841579 -2203947
68420b203947k89062p8576J87696L84936M01381J97798j61377n25901p23545o41942
$$ -2203947 -2493009 -2571585 -2383889 -1998953 -1597572 -1399774 -1561151 -2087052 -2810597 -3452539
68410c452539k88076K06991O44500Q50579P59861M47382R0965j18478p3835J93655
$$ -3452539 -3740615 -3533624 -2889124 -2038545 -1278684 -831302 -740337 -858815 -932650 -738995
68400g38995N30741P41479O88921L66603r7120n03940o85624n87093k89872L5016
$$ -738995 -208254 533225 1222146 1588749 1491629 987689 302065 -285028 -574900 -539884
68390e39884K18373J79326l8427k98281m51127m19461k38948l5181N0895n2896
$$ -539884 -321511 -142185 -180612 -478893 -930020 -1349481 -1588429 -1623610 -1572715 -1625611
68380a625611l03293n59103o54570m89781q9502M01867P87850R15714P51344L94841
$$ -1625611 -1928904 -2488007 -3142577 -3632358 -3721860 -3319993 -2532143 -1616429 -865085 -470244
68370d70244K9236j71117j25893J14536L97968N48509M53986J19910l34190p31106
$$ -470244 -441008 -612125 -738018 -623482 -225514 322995 776981 896891 562701 -168405
68360a68405r15270q17066m74945j0588M25610P10897P84852O53680L71225J2226
$$ -168405 -1083675 -1900741 -2375686 -2386274 -1960664 -1249767 -464915 188765 559990 572216
68350E72216l48446o45825q28317q61751p37356m79721j46470J86201M49655O09150
$$ 572216 223770 -422055 -1250372 -2112123 -2849479 -3329200 -3475670 -3289469 -2839814 -2230664
68340b230664O75743O94988P16257P58768P94550P60948N99087K98496p8461m10631
$$ -2230664 -1554921 -859933 -143676 615092 1409642 2170590 2769677 3068173 2989712 2579081
68330B579081n69261m83746j88095J79541M30300M10051P7465m64295j001278
$$ 2579081 2009820 1526074 1337979 1517520 1947820 2357871 2435336 1971041 969763
68321I69763j296267j192214o84831O9146Q12423J289584J346524R84799L50607
$$ 969763 -326504 -1518718 -2203549 -2134403 -1321980 -32396 1314128 2298927 2649534
68312B649534l32156q52011j083897j019254p47117m02687j10860N1500O4581
$$ 2649534 2317378 1465367 381470 -637784 -1384901 -1787588 -1898448 -1846948 -1782367
68303a782367m8496k44254m76201p01326q79500r73705r56347q19823n83700k90782
$$ -1782367 -1830863 -2075117 -2551318 -3252644 -4132144 -5105849 -6062196 -6882019 -7465719 -7756501
68293g756501R453K82704N24269P55495J001372J260282J484148J584385J466709
$$ -7756501 -7747048 -7464344 -6940075 -6184580 -5183208 -3922926 -2438778 -854393 612316
68284F12316J081516M65322k50605q74855j223495j192990q05425k03781M03086
$$ 612316 1693832 2159154 1908549 1033694 -189801 -1382791 -2188216 -2391997 -1988911
68275a988911Q22707R52570Q12671N23729K42955Q8670Q9290J79627K44053J83576
$$ -1988911 -1166204 -213634 599037 1122766 1365721 1454391 1543681 1723308 1967361 2150937
68265B150937k7077l20728n66512o32211m50207n5640M21354Q05949R48979P86412
$$ 2150937 2123860 1803132 1236620 604409 154202 98562 519916 1325865 2274844 3061256
68255C061256L62945j88581p01006j035704j128513j002242p44691m65284k50440
$$ 3061256 3424201 3235620 2534614 1498910 370397 -631845 -1376536 -1841820 -2092260
68246b092260j35404j01053r2951n1546N9872K39605M48161O22525O97843O29398
$$ -2092260 -2227664 -2328717 -2421668 -2473214 -2413342 -2173737 -1725576 -1103051 -405208 224190
68236B24190M09091P2515l05230o25187p89378p29722m33110M6399N95084J067936
$$ 224190 633281 705796 400566 -224621 -1013999 -1743721 -2176831 -2130432 -1535348 -467412
68226d67412J331296J306399R98002M96125n1913m90375p07464o71400m36368
$$ -467412 863884 2170283 3168285 3664410 3612497 3122122 2414658 1743258 1306890
68217A306890j16276J62870L12482L12804K13927J06979P8446J67496L44619N20924
$$ 1306890 1190614 1353484 1665966 1978770 2192697 2299676 2378122 2545618 2890237 3411161
68207C411161N84633M50180J00071l97711r04788j255838j315711j030228m52293
$$ 3411161 3995794 4445974 4546045 4148334 3243546 1987708 671997 -358231 -810524
68198h10524K67041R21339J312691J316289R23971K50813m99469j100539j379485
$$ -810524 -543483 377856 1690547 3006836 3930807 4181620 3682151 2581612 1202127
68189A202127j276434q65550l28000J15035K85751J18356l13827q24452j184502
$$ 1202127 -74307 -939857 -1267857 -1152822 -867071 -748715 -1062542 -1886994 -3071496
68180c071496j210271q34875j35440O94176J413605J820761J818284J437614Q15152
$$ -3071496 -4281767 -5116642 -5252082 -4557906 -3144301 -1323540 494744 1932358 2747510
68171B747510J34405m39973q10121r59768r36581q16047o65760n24589m00916
$$ 2747510 2881915 2441942 1631821 672053 -264528 -1080575 -1746335 -2270924 -2671840
68162b671840k84207j59478j6275J49773L38755N45827P55783R36400J038079
$$ -2671840 -2956047 -3115525 -3131800 -2982027 -2643272 -2097445 -1341662 -405262 632817
68153F32817J005879Q03121M37266k6282m74052p79485q51373o74886l24800N8553
$$ 632817 1638696 2441817 2879083 2852801 2378749 1599264 747891 73005 -251795 -193242
68143a93242L23212L67075J79810j54196m93713p02347p06039n20561k37764K1144
$$ -193242 129970 497045 676855 522659 28946 -673401 -1379440 -1900001 -2137765 -2116621
68133b116621J61883J56145M6344q3563j54307j30565l4235P3009J26804R6511
$$ -2116621 -1954738 -1798593 -1752249 -1835812 -1990119 -2120684 -2154919 -2081910 -1955106 -1858595
68123a858595K079r6510j30814n9830J07767L15440M82822N39857M55204K47217
$$ -1858595 -1856516 -1953026 -2083840 -2143670 -2035903 -1720463 -1237641 -697784 -242580 4637
68113D637k5267k86206m68721n34607m81708l39626j57756R674J18062J44071
$$ 4637 -20630 -306836 -775557 -1310164 -1791872 -2131498 -2289254 -2279580 -2161518 -2017447
68103b017447R2334n273r9661j42859j09301j0957J02770J64094J19519l7929
$$ -2017447 -1925113 -1930386 -2030047 -2172906 -2282207 -2293164 -2190394 -2026300 -1906781 -1944710
68093a944710k53942m27119m50487k64200J05441N42531Q80861R72776P58138
$$ -1944710 -2198652 -2625771 -3076258 -3340458 -3235017 -2692486 -1811625 -838849 -80711
68084h0711L00560k29350o20416p09665m53918M9466O03837R98932J102138R13142
$$ -80711 219849 -9501 -629917 -1339582 -1793500 -1744034 -1140197 -141265 960873 1874015
68074A874015N56552K16340M3722Q2937K51035L81843L13327k3671n58621j100344
$$ 1874015 2430567 2646907 2690629 2773566 3024601 3406444 3719771 3696100 3137479 2037135
68064B037135j415115j329319q10585R153Q79080J523748J745749J494375Q74253
$$ 2037135 622020 -707299 -1517884 -1508731 -629651 894097 2639846 4134221 5008474
68055E008474R4664o15203j087987j264895j193699r86217p59434n87620m83822
$$ 5008474 5103138 4487935 3399948 2135053 941354 -44863 -804297 -1391917 -1875739
68046a875739m13172l25801j90385j2075J71293L09582L64951L28095K19465P7106
$$ -1875739 -2288911 -2614712 -2805097 -2817172 -2645879 -2336297 -1971346 -1643251 -1423786 -1346680
68036a346680o0967j70410k44244k86580l01670k85499k25089j06213P4497K99463
$$ -1346680 -1407647 -1578057 -1822301 -2108881 -2410551 -2696050 -2921139 -3027352 -2952855 -2653392
68026b653392N27785P02992P69079O89642M63608J31889k28081n19844o53930
$$ -2653392 -2125607 -1422615 -653536 36106 499714 631603 403522 -116322 -770252
68017g70252n76131k90029J34382N71786Q73142R11598O29659P0707o19979j231014
$$ -770252 -1346383 -1636412 -1502030 -930244 -57102 854496 1484155 1554862 934883 -296131
68007b96131j550454j440832q96241n6912Q29249J488554J718480J462630Q32862
$$ -296131 -1846585 -3287417 -4183658 -4240570 -3411321 -1922767 -204287 1258343 2091205
67998B091205O7515n59405q42467p20227k91170K35410O31484P44906N56083J74042
$$ 2091205 2158720 1599315 756848 36621 -254549 -19139 612345 1357251 1913334 2087376
67988B087376k23169m73945n04360l53536j44345j6591n6569k56647n22325p20576
$$ 2087376 1864207 1390262 885902 532366 388021 371430 314861 58214 -464111 -1184687
67978a184687p44026n59841k21752J57051M53949N84895N29743L28157N4272k13492
$$ -1184687 -1928713 -2488554 -2710306 -2553255 -2099306 -1514411 -984668 -656511 -602239 -815731
67968h15731m13154n05591m71930l11436m5465K75610N72446P52855P44106N29039
$$ -815731 -1228885 -1734476 -2206406 -2517842 -2563307 -2287697 -1715251 -962396 -218290 310749
67958C10749J66234k22047m95527n57840m04866j32298J06662J76816L3318k47667
$$ 310749 476983 254936 -240591 -798431 -1203297 -1335595 -1228933 -1052117 -1018799 -1266466
67948a266466n00115n50202l10404J62891O81499J006710R63234N30316j37108
$$ -1266466 -1766581 -2316783 -2627187 -2464296 -1782797 -776087 187147 717463 580355
67939E80355p71179j110374j018688n47090R2734O29114Q55862P21261L38849
$$ 580355 -190824 -1301198 -2319886 -2866976 -2774242 -2145128 -1289266 -568005 -229156
67930b29156q1562l44175l61164j83605M2383J66414J19950m9002k09701k29836
$$ -229156 -310718 -654893 -1016057 -1199662 -1157279 -990865 -870915 -919917 -1129618 -1359454
67920a359454n7195K44532N26100O32545M88331J40762k62407n48957o10318m53932
$$ -1359454 -1416649 -1172117 -646017 -13472 474859 615621 353214 -195743 -806061 -1259993
67910a259993j92041K5702R7405K3916r7234j35438j1999K42423M92473N65602
$$ -1259993 -1452034 -1426332 -1328927 -1305011 -1402245 -1537683 -1549682 -1307259 -814786 -249184
67900b49184L48004j42465p47405j231262j387570j135619n59394J30512O92812
$$ -249184 98820 -43645 -791050 -2022312 -3409882 -4545501 -5104895 -4974383 -4281571
67891d281571R61887R13554O61085L87887K53623L21006N36635P69940Q85390
$$ -4281571 -3319684 -2406130 -1745045 -1357158 -1103535 -782529 -245894 524046 1409436
67882A409436Q09244N59050K26211p3653k53976k88233k08395p9010L4248Q4503
$$ 1409436 2218680 2777730 3003941 2930288 2676312 2388079 2179684 2100674 2134922 2219425
67872B219425M6533r0458l27558o50377j015906j344417j529785j472076j121997
$$ 2219425 2265958 2175500 1847942 1197565 181659 -1162758 -2692543 -4164619 -5286616
67863e286616n16062K18316Q96186J336777J428564J169762O66983R3866l71189
$$ -5286616 -5802678 -5584362 -4688176 -3351399 -1922835 -753073 -86090 7776 -363413
67854c63413o01808n54390k66901J65715O23756R89937J167953J096764P65808
$$ -363413 -965221 -1519611 -1786512 -1620797 -997041 -7104 1160849 2257613 3023421
67845C023421K29740l87419r11706j167662j045119n57804J37860P83395J112063
$$ 3023421 3253161 2865742 1954036 786374 -258745 -816549 -678689 104706 1216769
67836A216769R61216L53382m96038j256336j616699j421416p43118J42645Q73891
$$ 1216769 2177985 2531367 2035329 778993 -837706 -2259122 -3002240 -2859595 -1985704
67827a985704J159317R05368K55141m78738r56201r61414m95147K32422R01933
$$ -1985704 -826387 78981 334122 -144616 -1100817 -2062231 -2557378 -2324956 -1423023
67818a423023J229407J088211N55204j34885p00137r33246p79897l43688J76290
$$ -1423023 -193616 894595 1449799 1314914 614777 -318469 -1098366 -1442054 -1265764
67809a265764N79615P44787O62427M14530J19028j28014k84665l59679l83362
$$ -1265764 -686149 58638 721065 1135595 1254623 1126609 841944 482265 98903
67800I8903l74795l26043k11259j2727K54215N34484P51014Q38701P76345N98410
$$ 98903 -275892 -601935 -813194 -825921 -571706 -37222 713792 1552493 2328838 2927248
67790B927248L78485J91233P1681o498j20222l55872p55667j277559j790916k115470
$$ 2927248 3305733 3496966 3568647 3562149 3441927 3086055 2330388 1052829 -738087 -2853557
67780b853557k091386j652342q69051N9587Q69572J327348J320059R02157K76153
$$ -2853557 -4944943 -6597285 -7466336 -7406749 -6537177 -5209829 -3889770 -2987613 -2711460
67771b711460k87526n60071m47452k6862M90289Q53562Q85298N59452J2160n20428
$$ -2711460 -2998986 -3559057 -4006509 -4033371 -3543082 -2689520 -1804222 -1244770 -1232610 -1753038
67761a753038q08339p29160l18621K51338P54310J010588R59748O72448L00393
$$ -1753038 -2561377 -3290537 -3609158 -3357820 -2603510 -1592922 -633174 39274 339667
67752C39667o188j69720k09815k12290k63884l91542n41213o07986n00029j99337
$$ 339667 333479 163759 -46056 -258346 -522230 -913772 -1454985 -2062971 -2563000 -2762337
67742b762337K16484O05700Q31682Q32560O52595M16707K60631K54208L60159
$$ -2762337 -2545853 -1940153 -1108471 -275911 376684 793391 1054022 1308230 1668389
67733A668389M52492L86527Q3974m13091r50140j328589j400884j143556o70026
$$ 1668389 2120881 2507408 2591382 2178291 1228151 -100438 -1501322 -2644878 -3314904
67724c314904j75746J56801K44972J40788l291j9081J86033N77731J008554J288718
$$ -3314904 -3490650 -3333849 -3088877 -2948089 -2951380 -2970461 -2784428 -2206697 -1198143 90575
67714I0575J277663R51172M12929j52052n56971o87203n36799j96760J92237M96263
$$ 90575 1368238 2319410 2732339 2580287 2023316 1336113 799314 602554 794791 1291054
67704A291054O28828N64392L29109j7594l98662p29233r26312r25432p04562l05164
$$ 1291054 1919882 2484274 2813383 2795789 2397127 1667894 741582 -183850 -888412 -1193576
67694a193576J65251N59947P45508O59949L47861m9337l50033m13674k09253J63669
$$ -1193576 -1028325 -468378 277130 937079 1284940 1235603 885570 471896 262643 426312
67684D26312N15024O49700M59522k1682o26802j124692j318233j126634o16000
$$ 426312 941336 1591036 2050558 2028876 1402074 277382 -1040851 -2167485 -2783485
67675b783485L2515N98872R08458Q88645N78667R7178m10603q20347j054164j083084
$$ -2783485 -2750970 -2152098 -1243640 -354995 223672 320850 -89753 -910100 -1964264 -3047348
67665c047348r16764n92866j71745K67264O36129Q59370R00967P83307N83997
$$ -3047348 -3964112 -4556978 -4728723 -4461459 -3825330 -2965960 -2064993 -1281686 -697689
67656f97689M06017L31407L80345M97790N77663N15137K61742j45202n95153r53715
$$ -697689 -291672 39735 420080 917870 1495533 2010670 2272412 2127210 1532057 578342
67646E78342j123990j088530r10453o94159n27497m36960l79854k76801o5683
$$ 578342 -545648 -1634178 -2544631 -3238790 -3766287 -4203247 -4583101 -4859902 -4925585
67637d925585K53489O08024Q82507R73350Q39018N20097J20234k40103m71896
$$ -4925585 -4672096 -4064072 -3181565 -2208215 -1369197 -849100 -728866 -968969 -1440865
67628a440865n44081m78873l24660j26525Q7463K99227M83389N97885N95205M51691
$$ -1440865 -1984946 -2463819 -2788479 -2915004 -2827541 -2528314 -2044925 -1447040 -851835 -400144
67618d00144J96969p9307k56064k36862o274L46170O54068P47279N37130P0182
$$ -400144 -203175 -282482 -538546 -775408 -781682 -435512 218556 965835 1502965 1573147
67608A573147m80755q89215r79119p09694j98013L34029O63592O70776L91288
$$ 1573147 1092392 203177 -775942 -1485636 -1683649 -1349620 -686028 -15252 376036
67599C76036p482l13494l75162j71562J85815N17047O67344N80558L16438P071
$$ 376036 368554 55060 -320102 -491664 -305849 211198 878542 1459100 1775538 1782609
67589A782609k19325l03469k74245k15324k02808k53351l14500l02891j66516
$$ 1782609 1563284 1259815 985570 770246 567438 314087 -413 -303304 -469820
67580d69820O8167K95810L83158K45333r5786n07228q02582q35177n78703j50737
$$ -469820 -401653 -105843 277315 522648 426862 -80366 -882948 -1718125 -2296828 -2447565
67570b447565K37363L82651J94998k49494p35234j003710q74640l33762M54852
$$ -2447565 -2210202 -1827551 -1632553 -1882047 -2617281 -3620991 -4495631 -4829393 -4374541
67561d374541J217704J689236J722940J346272P37510J39622k46233l38887j95249
$$ -4374541 -3156837 -1467601 255339 1601611 2339121 2478743 2232510 1893623 1698374
67552A698374L3618J82462J48653o7443l71832o26100p10893n75737k56898J39662
$$ 1698374 1731992 1914454 2063107 1995664 1623832 997732 286839 -288898 -545796 -406134
67542d06134M79568O48091N88180L17602p8126m73513p43097q02072o35005l02318
$$ -406134 73434 721525 1309705 1627307 1549181 1075668 332571 -469501 -1104506 -1406824
67532a406824P9778L81096N06863M35371K27107p76j25754p5432J37780M19789
$$ -1406824 -1327046 -945950 -439087 -3716 223391 222615 96861 21429 159209 578998
67522E78998O35734O70864M83463J25173k80895n93761p14658o25828l91341j21911
$$ 578998 1214732 1885596 2369059 2494232 2213337 1619576 904918 279090 -112251 -234162
67512b34162P7406J51084J09193J1514o8672q1034j7561R1476J98414K62165K62841
$$ -234162 -156756 -5672 103521 115035 46363 -34671 -52232 39244 237658 499823 762664
67501G62664K02719R8234k8119j49942k34444k42561j39004Q7468M02923P21332
$$ 762664 965383 1063617 1035498 885556 651112 408551 269547 357015 759938 1481270
67491A481270R23568R01482O10712J06277m61771q98613j044009q46319l94781
$$ 1481270 2404838 3306320 3917032 4023309 3561538 2662925 1618916 772597 377816
67482C77816J09978M39034M36926R5605m35613r11705j099443q82528l16161L94405
$$ 377816 487794 926828 1363754 1459359 1023746 112041 -987402 -1869930 -2186091 -1791686
67472a791686R81875J231367J069665N90029L835m56268o36132n18407k16376
$$ -1791686 -809811 421556 1491221 2081250 2085085 1628817 992685 474278 257902
67463B57902Q8931K35661J51286j23524m63007p18135p81011o23541k97854R5093
$$ 257902 346833 582494 733780 610256 147249 -570886 -1351897 -1975438 -2273292 -2178199
67453b178199M49097O87424P76522P19796N42151K77606l3753l42343n87812p07614
$$ -2178199 -1729102 -1041678 -265156 454640 996791 1274397 1240644 898301 310489 -397125
67443c97125o56193m26836o3889L44358O92730Q96150R20457P92641N85589L84431
$$ -397125 -1053318 -1480154 -1544043 -1199685 -506955 389195 1309652 2102293 2687882 3072313
67433C072313K50402J98845K00482K03223J61868O0080q5653k39966l70542m64459
$$ 3072313 3322715 3521560 3722042 3925265 4087133 4147213 4061560 3821594 3451052 2986593
67423B986593n29444n80250o19669o27603n67318m07870j51214J52250M11688
$$ 2986593 2457149 1876899 1257230 629627 62309 -345561 -496775 -344525 67163
67414F7163N27980M37355J46229k60980o47585q74801q55179n85857j47198L31881
$$ 67163 595143 1032498 1178727 917747 270162 -604639 -1459818 -2045675 -2192873 -1860992
67404a860992P25376R55041J009603R32674P88962O28060M64315K81201N4730
$$ -1860992 -1135616 -180575 829028 1761702 2550664 3178724 3643039 3924240 3978970
67395C978970k19601n12933p70636r37097r83431r21938p98563o66942n58336
$$ 3978970 3759369 3246436 2475800 1538703 555272 -366666 -1165229 -1832171 -2390507
67386b390507m64445l43547j47742J42619M95876Q30595J042789J046962Q12295
$$ -2390507 -2854952 -3198499 -3346241 -3203622 -2707746 -1877151 -834362 212600 1024895
67377A024895L77858j59005o74616j056551j231979j178717r20291n12701l1004
$$ 1024895 1402753 1243748 569132 -487419 -1719398 -2898115 -3818406 -4331107 -4362111
67368d362111M40889Q19476J034478J046437Q63908N50008K09308m5828j38639
$$ -4362111 -3921222 -3101746 -2067268 -1020831 -156923 393085 602393 556565 417926
67359D17926o2006J15215K76685L11922J70538j09694m16940o17206o19934m24706
$$ 417926 355920 471135 747820 1059742 1230280 1120586 703646 86440 -533494 -958200
67349i58200j24488J37835K38991J36152j12200l76548n22690m80037k76364k0763
$$ -958200 -1082688 -944853 -705862 -569710 -681910 -1058458 -1581148 -2061185 -2337549 -2358312
67339b358312J56262J73883M5193j29535k17909j30274J25258M37688O42526O02130
$$ -2358312 -2202050 -2028167 -1982974 -2112509 -2330418 -2460692 -2335434 -1897746 -1255220 -653090
67329f53090K77268k45931p87368j147912j192394r02595l78112K11437O97322
$$ -653090 -375822 -621753 -1409121 -2557033 -3749427 -4652022 -5030134 -4818697 -4121375
67320d121375R72399J017050Q85410O65965M39842K55998J29516N5529K5033L1866
$$ -4121375 -3148976 -2131926 -1246516 -580551 -140709 115289 244805 300334 325367 357233
67310C57233O9496J24509J75622K01710J93941J62241J28720J09698R7332N5171
$$ 357233 426729 551238 726860 928570 1122511 1284752 1413472 1523170 1620502 1675673
67300A675673o4586k87675n86331q71133j017881r22444n58803r150N54530R34816
$$ 1675673 1611087 1323412 737081 -134052 -1151933 -2074377 -2633180 -2642330 -2087800 -1152984
67290a152984R92122P07631J94113l52632p39452q57519p20668m43344j72165
$$ -1152984 -160862 546769 740882 388250 -351202 -1208721 -1929389 -2372733 -2544898
67281b544898q656L5951L1475P3228K13767M22370N96591O20464M36716R1147
$$ -2544898 -2553554 -2517603 -2486128 -2412900 -2199133 -1776763 -1180172 -559708 -122992 -31845
67271c1845k78469n06376m83436k17295J65394M78088N65747L81911J1984l68910
$$ -31845 -310314 -816690 -1300126 -1517421 -1352027 -873939 -308192 73719 85703 -283207
67261b83207n81351n26463k27961J87263N56284P57605P58847O13456M14297K34940
$$ -283207 -864558 -1391021 -1618982 -1431719 -875435 -117830 641017 1254473 1668770 1903710
67251A903710R3637m1004k10002m18069o13635p10678o41882m11774j15347R4832
$$ 1903710 1997347 1956343 1746341 1328272 714637 3959 -637923 -1049697 -1165044 -1070212
67241a070212Q1394k01047o66578j120960j340684j172786o08274K06243J024535
$$ -1070212 -988818 -1189865 -1856443 -2977403 -4318087 -5490873 -6099147 -5892904 -4868369
67232d868369J598200J770803J527868R85083L27002k70105o94855r15826r57936
$$ -4868369 -3270169 -1499366 28502 1013585 1340587 1070482 375627 -540199 -1498135
67223a498135q62029o54205l41031P1533N52370J032788J418350J620404J590642
$$ -1498135 -2360164 -3014369 -3355400 -3283867 -2731497 -1698709 -280359 1340045 2930687
67214B930687J340121R33184M60675P503l69099o42456q04336q50181p73846n75778
$$ 2930687 4270808 5203992 5664667 5672170 5303071 4660615 3856279 3006098 2232252 1656474
67204A656474k77975O6998L83015N93606O50670N53051L43864Q7316j62166l80801
$$ 1656474 1378499 1445497 1828512 2422118 3072788 3625839 3969703 4057019 3894853 3514052
67194C514052n74268p55866r18718j021654j001437q08345m46498N537M10578
$$ 3514052 2939784 2183918 1265200 243546 -757891 -1566236 -2012734 -2007197 -1596619
67185a596619O23093N52551K08986k93571p80213j085973j121117r00164n22259
$$ -1596619 -973526 -420975 -211989 -505560 -1285773 -2371746 -3492863 -4393027 -4915286
67176d915286j15273K25954M75018O66289Q51656J049125J215129J259109J094627
$$ -4915286 -5030559 -4804605 -4329587 -3663298 -2811642 -1762517 -547388 711721 1806348
67167A806348O99475J50019l93270p47016p85492n01108j3466M79844P88739Q12219
$$ 1806348 2505823 2655842 2262572 1515556 730064 228956 215490 695334 1484073 2296292
67157B296292N77254K17146r8927k49784k18259r2702j4801j01135l78320p64124
$$ 2296292 2873546 3090692 2991765 2741981 2523722 2431020 2416219 2315084 1936764 1172640
67147A172640j103535j241578j096973p01011j83782K84480N67850O19603M92996
$$ 1172640 69105 -1172473 -2269446 -2970457 -3154239 -2869759 -2301909 -1682306 -1189310
67138a189310L05558J76774J70543K69625L92140M39127L47668J22909j65727
$$ -1189310 -883752 -706978 -536435 -266810 125330 564457 912125 1035034 869307
67129H69307m20198n61845n67156m74184l58314k91529l06894l85982m74030n12819
$$ 869307 449109 -112736 -679892 -1154076 -1512390 -1803919 -2110813 -2496795 -2970825 -3483644
67119c483644m72557l65536k35301j28854o8796m1912j0839N8221J68723K85064
$$ -3483644 -3956201 -4321737 -4557038 -4685892 -4754688 -4796600 -4807439 -4749218 -4580495 -4295431
67109d295431L49127L14451J78931m183j46690j69794n0294J57174L37333L66707
$$ -4295431 -3946304 -3631853 -3452922 -3457105 -3603795 -3773589 -3823883 -3666709 -3329376 -2962669
67099b962669J77749j97363o27658r32670r59880o55121r2700N49685J060417
$$ -2962669 -2784920 -2982283 -3609941 -4542611 -5502491 -6157612 -6250312 -5700627 -4640210
67090d640210J276522J142913P24370J69459l52591p11269q46218p64141n13088
$$ -4640210 -3363688 -2220775 -1496405 -1326946 -1679537 -2390806 -3237024 -4001165 -4514253
67081d514253j54934K47990O30330R17340J030925R15475N74349R4537l63379
$$ -4514253 -4669187 -4421197 -3790867 -2873527 -1842602 -927127 -352778 -258241 -621620
67072f21620o17434n42338j37705M51261R79539J201420R80685L59417m50832
$$ -621620 -1239054 -1781392 -1919097 -1467836 -488297 713123 1693808 2053225 1602393
67063A602393j155836j505402j400898r32543l29213J53528L51325K57268O407
$$ 1602393 446557 -1058845 -2459743 -3392286 -3721499 -3567971 -3216646 -2959378 -2952971
67054b952971k09003k46076q2855J81145L91857M34979L03630J01327k0809M3593
$$ -2952971 -3161974 -3408050 -3490905 -3309760 -2917903 -2482924 -2179294 -2077967 -2098776 -2055183
67044b055183K87505N86146P61869O84255L50547r9548m46131m98735j97217L48845
$$ -2055183 -1767678 -1181532 -419663 264592 615139 515591 69460 -429275 -626492 -277647
67034b77647R04101J214153J122787O42861n1888p07138j099024j122646q19996
$$ -277647 626454 1840607 2963394 3606255 3554367 2847229 1748205 625559 -194437
67025a94437l41855J29729M56693N84122N33420L65025J38763j05431l41759n41146
$$ -194437 -536292 -406563 50130 634252 1167672 1532697 1671460 1566029 1224270 683124
67015F83124o62397o63978n31513l01853o3230P6260L9576j75521m86006p56091
$$ 683124 20727 -643251 -1174764 -1476617 -1539847 -1463587 -1424011 -1599532 -2085538 -2841629
67005b841629q58894p36395m26247m1141K88193M75680N15102M70464M29557M48974
$$ -2841629 -3700523 -4436918 -4863165 -4904306 -4616113 -4140433 -3625331 -3154867 -2725310 -2276336
66995b276336N22612N90822N82984M66450K71372P5759m0660m5820K2523P6551
$$ -2276336 -1753724 -1162902 -579918 -113468 157904 233663 193003 147183 169706 246257
66985B46257K9718j50221m18325o74427q18165q05052o69874n02368l88598l53083
$$ 246257 275975 125754 -292571 -966998 -1785163 -2590215 -3260089 -3762457 -4151055 -4504138
66975d504138l38259k37220L5855M77582R71939J331349J386302J078036N03096
$$ -4504138 -4842397 -5079617 -5043762 -4566180 -3594241 -2262892 -876590 201446 704542
66966G04542j19010n43892o19025l59659N6770L77334L99263P1854m76505r99298
$$ 704542 585532 41640 -577385 -937044 -880274 -502940 -103677 -31823 -508328 -1507626
66956a507626j249740j096564n81597J06079P22211J077105J109193Q91000N72433
$$ -1507626 -2757366 -3853930 -4435527 -4329448 -3607237 -2530132 -1420939 -529939 42494
66947D2494K96969J35881P0848K6435p2424k52718m79993o81602p88085p66712
$$ 42494 339463 475344 546192 572627 500203 247485 -232508 -914110 -1702195 -2468907
66937b468907o29704m17367j71574Q1254L27803N51337P16948P73624O76387M16825
$$ -2468907 -3098611 -3515978 -3687552 -3606298 -3278495 -2727158 -2010210 -1236586 -560199 -143374
66927a43374M2209l52024o56647p93655p48081n69132l40130j34464J7581J33175
$$ -143374 -101165 -453189 -1109836 -1903491 -2651572 -3220704 -3560834 -3695298 -3677717 -3544542
66917c544542K52123M00026N63363O92270P28793O41880M45906J90285p2767l19716
$$ -3544542 -3292419 -2892393 -2329030 -1636760 -907967 -266087 179819 370104 297337 -22379
66907b2379n62793q24469j094299j298991j313748j020350l86814M76781J327271
$$ -22379 -585172 -1409641 -2503940 -3802931 -5116679 -6137029 -6523843 -6047062 -4719791
66898d719791J872904J902179J395490N57916k54440o89021n62147M6778Q23642
$$ -4719791 -2846887 -944708 450782 1008698 754258 65237 -496910 -450132 373510
66889C73510J362853J359440P56863k23007j183817j741924j704569j151827l84259
$$ 373510 1736363 3095803 3852666 3629659 2445842 703918 -1000651 -2152478 -2536737
66880b536737K33737M53425K53681j67489n11422n41167k02320L57309Q73469
$$ -2536737 -2303000 -1849575 -1595894 -1763383 -2274805 -2815972 -3018292 -2660983 -1787514
66871a787514J105926R57563N12010k3561m32836n96916n37275l78323k58300
$$ -1787514 -681588 275975 787985 764424 331588 -265328 -802603 -1180926 -1439226
66862a439226k43719k96480l09242j84020R5415M41442P04354P53766N52599J81207
$$ -1439226 -1682945 -1979425 -2288667 -2472687 -2377272 -1935830 -1231476 -477710 74889 256096
66852B56096k02126m42009m63370l03757q5132N6594M3920j06941l03746m34598
$$ 256096 53970 -388039 -851409 -1155166 -1240298 -1183704 -1139784 -1246725 -1550471 -1985069
66842a985069m28444k86094o8065J48115L11904M18025M90783N48931N77986N31362
$$ -1985069 -2413513 -2699607 -2767672 -2619557 -2307653 -1889628 -1398845 -849914 -271928 259434
66832B59434L61744O2841l07389o41370q30777q23588o55491m34329k82670k68762
$$ 259434 621178 684019 376630 -264740 -1095517 -1919105 -2574596 -3008925 -3291595 -3560357
66822c560357l64934m58940m14778j51233L04823Q20816J217023J351203J184923
$$ -3560357 -3925291 -4384231 -4799009 -4950242 -4645419 -3824603 -2607580 -1256377 -71454
66813g1454P97282L40522l6917k57852l39696l65023m20391n40730o90802p91712
$$ -71454 725828 1066350 1029433 771581 431885 66862 -353529 -894259 -1585061 -2376773
66803b376773p73297o18889l75195j22644P3603K00005K94713M11161N68903P24901
$$ -2376773 -3150070 -3768959 -4144154 -4266798 -4193195 -3993190 -3698477 -3287316 -2718413 -1993512
66793a993512P87160O66724L39068j22727n66721q27484q04957n14001p6354L41754
$$ -1993512 -1206352 -539628 -200560 -323287 -890008 -1717492 -2522449 -3036450 -3112804 -2771050
66783b771050O12579P04727O84222O59465P03298P98965Q43373P07886L22590
$$ -2771050 -2158471 -1453744 -769522 -110057 593241 1392206 2235579 2943465 3266055
66774C266055k65256q94992j360595j508375j311788q82079m08326n9178J00051
$$ 3266055 3000799 2105807 745212 -763163 -2074951 -2957030 -3365356 -3424534 -3324483
66765c324483J29908J67554L34480O53954J025541J272232J235222Q64791K57560
$$ -3324483 -3194575 -3027021 -2692541 -2038587 -1013046 259186 1494408 2359199 2616759
66756B616759l80654q27385r43728p31991l24669Q4997L31938L43125J49877j47716
$$ 2616759 2236105 1408720 464992 -266999 -591668 -506671 -174733 168392 318269 170553
66746A70553m36549o33617o98269o18542l92853k7480M45942R48665J353523J519267
$$ 170553 -265996 -899613 -1597882 -2216424 -2609277 -2636757 -2190815 -1242150 111373 1630640
66736A630640J352364Q65577J96338m35238q16626q39518n51943j34399J92192
$$ 1630640 2983004 3848581 4044919 3609681 2793055 1953537 1401594 1267195 1459387
66727A459387K80984J35342r6162k05883m9546L61834Q53094J168013J102940
$$ 1459387 1740371 1875713 1779551 1573668 1524122 1885956 2739050 3907063 5010003
66718E010003O20576j18078q23290j213722j151120p03522j05599L61521N07462
$$ 5010003 5630579 5512501 4689211 3475489 2324369 1620847 1515248 1876769 2384231
66709B384231L16609o0811m00322n24739l90751r8509J74006K70394J33374j77862
$$ 2384231 2700840 2640029 2239707 1714968 1324217 1225708 1399714 1670108 1803482 1625620
66699A625620n32042p99400r09813q65835p12152m90040k11823J26928N08820
$$ 1625620 1093578 294178 -615635 -1481470 -2193622 -2683662 -2895485 -2768557 -2259737
66690b259737Q62322J067296J006192O36527M0481n85680j008098j064089p46204
$$ -2259737 -1397415 -330119 676073 1312600 1353081 767401 -240697 -1304786 -2050990
66681b050990k12714K87117N37606M65851J75628j14538j96970M647L87823P25726
$$ -2050990 -2263704 -1976587 -1438981 -973130 -797502 -912040 -1109010 -1104363 -716540 9186
66671I186P95745N11558j6347n29122p54723n58330k5710N68737Q95968P39868
$$ 9186 804931 1316489 1300142 771020 16297 -542033 -567743 994 896962 1636830
66661A636830J10768p54769j507732j854356j690936j138424m64040O3227L03913
$$ 1636830 1747598 992829 -514903 -2369259 -4060195 -5198619 -5662659 -5599432 -5295519
66652e295519K98372K15745K37573M45723P77821J071765J168952J013164O86543
$$ -5295519 -4997147 -4781402 -4543829 -4098106 -3320285 -2248520 -1079568 -66404 620139
66643F20139L62262K02421K61501M52055N93284N15382J60761l75073q86185j159241
$$ 620139 982401 1184822 1446323 1898378 2491662 3007044 3167805 2792732 1906547 747306
66633G47306j080886o92364j64495K90063N17899M86014K75490J9086j76157k76206
$$ 747306 -333580 -1025944 -1190439 -900376 -382477 103537 379027 398113 221956 -54250
66623e4250l14463l44543l87416m09938l49385j67201J05386L63920M78037L65697
$$ -54250 -368713 -713256 -1100672 -1510610 -1859995 -2027196 -1921810 -1557890 -1079853 -714156
66613g14156N0980l31889n96695n98326l11754J46867N70721P59921O16256J86917
$$ -714156 -663176 -995065 -1591760 -2190086 -2501840 -2354973 -1784252 -1024331 -408075 -221158
66603b21158l63315q33979j080244j066942q62012n80533l16362j01440Q7371
$$ -221158 -584473 -1418452 -2498696 -3565638 -4427650 -5008183 -5324545 -5425985 -5338614
66594e338614K84523M87974O41339O60002M86391J39940k71561n90931o83097
$$ -5338614 -5054091 -4566117 -3924778 -3264776 -2778385 -2638445 -2910006 -3500937 -4184034
66585d184034n01550j13443L31002O69162P99889P23139N27381L35219K38580
$$ -4184034 -4685584 -4799027 -4468025 -3798863 -2998974 -2275835 -1748454 -1413235 -1174655
66576a174655K57527L40879M02795L71185K21272k0013k94304n39613p08461p70352
$$ -1174655 -917128 -576249 -173454 197731 419003 398990 104686 -434927 -1143388 -1913740
66566a913740p05855n05267j78911K26760O23053Q97053R53946P65470L96339
$$ -1913740 -2619595 -3124862 -3303773 -3077013 -2453960 -1556907 -602961 162509 558848
66557E58848j2827l05148l83077k59660n4090P1163R22k63852n99765q24935q00605
$$ 558848 546021 240873 -142204 -401864 -455954 -384791 -383869 -647721 -1247486 -2072421 -2873026
66546b873026n13819r1732K65083L96406K79374N0214o7888J04234N83886J191934
$$ -2873026 -3386845 -3478577 -3213494 -2817088 -2537714 -2487500 -2555388 -2451154 -1867268 -675334
66536f75334J629160J630141J114740K52874n99670j068663r49053l14945N08547
$$ -675334 953826 2583967 3698707 3951581 3351911 2283248 1334195 1019250 1527797
66527A527797J101110J153142O17057k72978j121383j567785j457903r03074k03471
$$ 1527797 2628907 3782049 4399106 4126128 3004745 1436960 -20943 -924017 -1127488
66518a127488L17637M77093L07130R293j78999j25459J27805M01697M97017L19423
$$ -1127488 -809851 -332758 -25628 -16335 -195334 -320793 -192988 208709 705726 1025149
66508A025149o0864m48081o34120n18955j68386K23658M45667L88065J03625k24632
$$ 1025149 964285 516204 -117916 -636871 -805257 -581599 -135932 252133 355758 131126
66498A31126l88463k72201Q2598N00001P64672P34276M07706q4666n57302q64865
$$ 131126 -257337 -529538 -446940 53061 817733 1552009 1959715 1875049 1317747 452882
66488D52882r62638r02734p76925o47592n11746l18732k6089L46886P06687R26301
$$ 452882 -509756 -1412490 -2189415 -2837007 -3348753 -3667485 -3693574 -3346688 -2640001 -1713700
66478a713700R16121O81203L27524J0103j48395j21139J4939J31322J28447m293
$$ -1713700 -797579 -116376 211148 221251 72856 -48283 -33344 97978 226425 222132
66468B22132j85366k95904k57580q4099J26775K56076K41138J16766r111l2380
$$ 222132 36766 -259138 -516718 -600817 -474042 -217966 23172 139938 130827 98447
66458I8447O6757J95262J96968m2704m99427r86057j229963j019563l41164N76946
$$ 98447 165204 360466 557434 514730 15303 -970754 -2200717 -3220280 -3561444 -2984498
66448b984498J350953J624354J254441L99684n46896j151138j159234o28548J05566
$$ -2984498 -1633545 -9191 1245250 1644934 1098038 -53100 -1212334 -1840882 -1735316
66439a735316O12494O01559Q1643o43239j141476j093127m68885M50781J227357
$$ -1735316 -1122822 -521263 -439620 -1082859 -2224335 -3317462 -3786347 -3335566 -2108209
66430b108209J502714J191574N21109j03287l29270n4819N19529J011653J081632
$$ -2108209 -605495 586079 1107188 1003901 674631 619812 1139341 2150994 3232626
66421C232626O29821j43678q51144j135502q69139k20176M49300P91265O63786
$$ 3232626 3862447 3718769 2867625 1732123 862984 642808 1092108 1883373 2547159
66412B547159J96346l05914n57556m67620j87233j386j32219n77226j087372j306365
$$ 2547159 2743505 2437591 1880035 1412415 1225182 1223796 1091577 514351 -573021 -1879386
66402a879386r92534j89102P67282J417247J437935Q40756j4836o11707n69952
$$ -1879386 -2871920 -3061022 -2293740 -876493 561442 1402198 1387362 775655 205703
66393B05703J20612J070077J689496J519947N07320r36818k132627k487375j815999
$$ 205703 326315 1396392 3085888 4605835 5113155 4176337 2043710 -443665 -2259664
66384b259664m48228R40860J686766J482849N27783o06337j307436j267438o41135
$$ -2259664 -2707892 -1767032 -80266 1402583 1930366 1324029 16593 -1250845 -1891980
66375a891980O8057L25248j03692j001373j819870k003917j326296l5841J273161
$$ -1891980 -1823923 -1498675 -1602367 -2603740 -4423610 -6427527 -7753823 -7789664 -6516503
66366f516503J997312J869615J108629K79181n6304L11325J099194J698236J553837
$$ -6516503 -4519191 -2649576 -1540947 -1261766 -1318070 -1006745 92449 1790685 3344522
66357C344522N36264r29277k069224k202187j162546N49727K002835K339446J276243
$$ 3344522 3880786 2951509 882285 -1319902 -2482448 -1932721 70114 2409560 3685803
66348C685803o95447k542680l247252k381711l74658J701405K718478K135055
$$ 3685803 2990356 447676 -2799576 -5181287 -5555945 -3854540 -1136062 998993
66340I98993L24385j612659k462213j601098O14279L011841M248048L578322J311692
$$ 998993 1323378 -289281 -2751494 -4352592 -3738313 -726472 3521576 7099898 8411590
66331H411590j327353k873812k462788l51772K194931L620108K992648N97404
$$ 8411590 7084237 4210425 1747637 1395865 3590796 7210904 10203552 10800956
66323A0800956k172765l599046k666797K58495L543430N183141M008342N01522
$$ 10800956 8628191 5029145 2362348 2620843 6164273 11347414 15355756 15857278
66315A5857278l311369m927907k859582K304327P961328J0817296Q876689L042168
$$ 15857278 12545909 7618002 4758420 7062747 15024075 25841371 34718060 37760228
66307C7760228k670228k669923P449005K8189093N4881366P8718018Q9892398
$$ 37760228 35090000 32420077 39869082 68058175 122939541 201657559 291549957
66300B91549957Q1613622N3244663J1098904l3579456o8679160q5638135q2363560
$$ 291549957 373163579 426408242 437507146 403927690 335248530 249610395 167246835
66293A67246835o3486481l7974121j5266395j671658J487493k611456q607391
$$ 167246835 103760354 65786233 50519838 48848180 50335673 47724217 39116826
66286C9116826j1824260j0310055n220387L88446L529584K919194n20871m412135
$$ 39116826 27292566 16982511 11762124 12150570 15680154 18599348 18078477 13666342
66278A3666342o376763n345208k022659J660387L724170L245865P93482k001360
$$ 13666342 7289579 1944371 -78288 1582099 5306269 8552134 9345616 7344256
66270G344256l434201k694741k74410K378525L721471K989687N92964k158923
$$ 7344256 3910055 1215314 940904 3319429 7040900 10030587 10623551 8464628
66262H464628l815998l588303j742542O02837K139356K097260O35069j306796
$$ 8464628 4648630 1060327 -682215 -79378 2059978 4157238 4792307 3485511
66254C485511k577318k469811j090765P47883K026765K106405J067505l76435
$$ 3485511 908193 -1561618 -2652383 -1904500 122265 2228670 3296175 2919740
66246B919740j324346j220745j68099J152501J893654J540323K06961j431327
$$ 2919740 1595394 374649 206550 1359051 3252705 4793028 4999989 3568662
66238C568662k525020k526660j485871j806J129702J365927P07312l30628j037278
$$ 3568662 1043642 -1483018 -2968889 -2970695 -1840993 -475066 232246 -98382 -1135660
66229a135660r28106k4622J162821J933027J798037P62753o75114j799761k068329
$$ -1135660 -2063766 -2088388 -925567 1007460 2805497 3568250 2893136 1093375 -974954
66220i74954j399315k02260Q59858J236715P80805j93225j102363j425047r81259
$$ -974954 -2374269 -2576529 -1716671 -479956 300849 107624 -994739 -2419786 -3401045
66211c401045j3440R64827J457146J245482M85098m06159r88812j032214o10609
$$ -3401045 -3414485 -2449658 -992512 252970 738068 331909 -656903 -1689117 -2299726
66202b299726k5067L88794M49246K07933j13228k76756j76506J09262L81996M55748
$$ -2299726 -2324793 -1935999 -1486753 -1278820 -1392048 -1668804 -1845310 -1736048 -1354052 -898304
66192h98304K72636o8670l83226n19039m47605k69851j37410j43379k55506l36802
$$ -898304 -625668 -694338 -1077564 -1596603 -2044208 -2314059 -2451469 -2594848 -2850354 -3187156
66182c187156k41831P2975M98232Q18293Q33931M89896p1441n69050p28335m33687
$$ -3187156 -3428987 -3356012 -2857780 -2039487 -1205556 -715660 -787101 -1356151 -2084486 -2518173
66172b518173J98156Q68642J247919J145068O06142j12529o79735q58902o20641
$$ -2518173 -2320017 -1451375 -203456 941612 1547754 1435225 755490 -103412 -724053
66163g24053j41354L05019M97662L78342O4214k34493l38090j90401J26895M56966
$$ -724053 -865407 -560388 -62726 315616 379830 145337 -192753 -383154 -256259 200707
66153B00707O61844O88657N72604L84718J67721r1879m35044q66028j301972j580436
$$ 200707 862551 1551208 2123812 2508530 2676251 2584372 2149328 1283300 -18672 -1599108
66143a599108j533010j087985l39652M65587J030836J149970Q12494K11115l56980
$$ -1599108 -3132118 -4220103 -4559755 -4094168 -3063332 -1913362 -1100868 -889753 -1246733
66134a246733o44239n78215k88503j9912J8436k19084n84818q24904p33780k85817
$$ -1246733 -1890972 -2469187 -2757690 -2777602 -2759166 -2978250 -3563068 -4387972 -5121752 -5407569
66124e407569L35214Q30389R52999O53771J18092l31015m13517n5860N57257J076883
$$ -5407569 -5072355 -4241966 -3288967 -2635196 -2517104 -2848119 -3261636 -3317496 -2760239 -1683356
66114a683356J181804P63596K92p26630j031190p32048M1902R08692J425111J312565
$$ -1683356 -501552 262044 262336 -464294 -1495484 -2227532 -2185630 -1276938 148173 1460738
66104A460738N98277m01003j241305j571722j296947o01376J69183O96689Q46004
$$ 1460738 2059015 1658012 416707 -1155015 -2451962 -3053338 -2884155 -2187466 -1341462
66095a341462P06327N06378M60977O40771R37650J139463J064020O70877Q6232
$$ -1341462 -635135 -128757 332220 972991 1910641 3050104 4114124 4785001 4871233
66086D871233m69994q08061q68408p39903n89372n48909o31878p29562o90170
$$ 4871233 4401239 3593178 2724770 1984867 1395495 846586 214708 -514854 -1205024
66077a205024m30459q980L88414N47792L55864j17999o39095r21349p79233k34679
$$ -1205024 -1635483 -1644463 -1256049 -708257 -352393 -470392 -1109487 -2030836 -2810069 -3044748
66067c044748M82071J042088J182176Q38001J76218m90429q59177p82594l29430
$$ -3044748 -2562677 -1520589 -338413 499588 675806 185377 -673800 -1456394 -1785824
66058a785824K65642P31074Q94796P57279M68895K31958J85777L36976N67494
$$ -1785824 -1520182 -789108 105688 862967 1331862 1563820 1749597 2086573 2654067
66049B654067P08146O31952L15930j56718o46400j024210j217917j217454j048201
$$ 2654067 3362213 3994165 4310095 4153377 3506977 2482767 1264850 47396 -1000805
66040a000805p38962l10049K11772P67158J253211J545289J546997J242136P16361
$$ -1000805 -1739767 -2049816 -1838044 -1070886 182325 1727614 3274611 4516747 5233108
66031E233108J30616l44567o01346o35432n34286m20607l83969m38996n31553
$$ 5233108 5363724 5019157 4417811 3782379 3248093 2827486 2443517 2004521 1472968
66022A472968n85294n57040m65479l75493l49274l97114m61608m48384k86599
$$ 1472968 887674 330634 -134845 -510338 -859612 -1256726 -1718334 -2166718 -2453317
66013b453317J7914L71675O35243O96015N30319K17749j01830l03922l42781k64759
$$ -2453317 -2435403 -2063728 -1428485 -732470 -202151 15598 -86232 -390154 -732935 -997694
66003i97694j64419j12311j02455n6657J12908M20801P61504R38736P66895J93512
$$ -997694 -1162113 -1274424 -1376879 -1433536 -1320628 -899827 -138323 800413 1567308 1760820
65993A760820o29803j380456j700605j374720m57363P22807J696378K065281J689906
$$ 1760820 1131017 -249439 -1950044 -3324764 -3782127 -3059320 -1362942 702339 2392245
65984B392245P55577l17809j079103j259448q88147k54514K59546L84341R5597
$$ 2392245 3147822 2830013 1750910 491462 -396685 -651199 -391653 -7312 88285
65975H8285l91494p58026p67636l99100J46196N62127O11784K59071l14135q11437
$$ 88285 -303209 -1061235 -1828871 -2227971 -2081775 -1519648 -907864 -648793 -962928 -1774365
65965a774365r84589p62805k78104K22549N22807N53542M13979K89115L17551
$$ -1774365 -2758954 -3521759 -3799863 -3577314 -3054507 -2500965 -2086986 -1797871 -1480320
65956a480320M93096O62696O24519K67879l31604r25249j214374j018618l93901
$$ -1480320 -987224 -324528 299991 567870 236266 -688983 -1903357 -2921975 -3315876
65947c315876L72556Q96545Q94332L38577n13483j239309j458896j024198r2340
$$ -3315876 -2943320 -2046775 -1152443 -813866 -1327349 -2566658 -4025554 -5049752 -5142092
65938e142092R53989J695405J874739J504958Q36624K11102j16170q8154J58356
$$ -5142092 -4188103 -2492698 -617959 886999 1723623 1934725 1818555 1730401 1888757
65929A888757L99790M65688L29337J01650n9412o2339N3875J44565N6969k60763
$$ 1888757 2288547 2754235 3083572 3185222 3125810 3063471 3117346 3261911 3318880 3058117
65919C058117p08197j073990j149715q51612k78901L27823P07920P15760L94814
$$ 3058117 2349920 1275930 126215 -725397 -1004298 -676475 31445 747205 1142019
65910A142019n0205l67426l94652j43634K13165M43484L85856L7297m48322q46443
$$ 1142019 1091814 724388 329736 186102 399267 842751 1228607 1265904 817582 -28861
65900b8861r81214q10885m34661k3141K82274M40792N14980O08579P82056J000733
$$ -28861 -1010075 -1820960 -2255621 -2278762 -1996488 -1555696 -1040716 -432137 349919 1350652
65890A350652J148718J100371Q04842L30272j61982n00667n97676m95944l42804
$$ 1350652 2499370 3599741 4404583 4734855 4572873 4072206 3474530 2978586 2635782
65881B635782l03015m61259p70681j077547j207809j065313o84810k09856J89861
$$ 2635782 2332767 1871508 1100827 23280 -1184529 -2249842 -2934652 -3144508 -2954647
65872b954647M11418M65958M52662M77029N66308O38363N48766J92193m02598
$$ -2954647 -2543229 -2077271 -1624609 -1147580 -581272 57091 605857 798050 395452
65863C95452j047079j463222j421119q72336k468Q35105J279566J139431M94377
$$ 395452 -651627 -2114849 -3535968 -4408304 -4410772 -3575667 -2296101 -1156670 -662293
65854f62293l34193r33953j000896m87846L71980J177670J552401J319022N74917
$$ -662293 -996486 -1930439 -2931335 -3419181 -3047201 -1869531 -317130 1001892 1576809
65845A576809l65245j123898j431701j232674o79834l5677M62892P04770P26065
$$ 1576809 1211564 87666 -1344035 -2576709 -3256543 -3292220 -2829328 -2124558 -1398493
65836a398493O54504O18128O72151P80282Q51872Q05486O19071L40357N7563j47043
$$ -1398493 -743989 -125861 546290 1326572 2178444 2983930 3603001 3943358 4000921 3853878
65826C853878k32145k04280r9948L9210J80064K94822L50610L08009J37598j52382
$$ 3853878 3621733 3417453 3317505 3356715 3536779 3831601 4182211 4490220 4627818 4475436
65816D475436m97243p85904r04253p94145m95531j43028Q9288P1421k13352o52613
$$ 4475436 3978193 3192289 2288036 1493891 998360 855332 944620 1016041 802689 150076
65806A50076j054545j239855j127994p71360l19172O7956L03568M11625M92855
$$ 150076 -904469 -2144324 -3272318 -4043678 -4362850 -4294894 -3991326 -3579701 -3086846
65797c086846O42293Q69538J073699J093858Q10258K37739m47832r74873j105986
$$ -3086846 -2444553 -1575015 -501316 592542 1402800 1640539 1192707 217834 -888152
65788h88152p65263r1708O16369J042906J010025N65817m4508n10477o21390l75336
$$ -888152 -1653415 -1745123 -1128754 -85848 924177 1489994 1445486 935009 313619 -61717
65778f1717K7513L04108K54625j17280n98907q83906p47288j83701N70050J145728
$$ -61717 -34204 269904 524529 407249 -191658 -1075564 -1822852 -2006553 -1436503 -290775
65768b90775J232582P45094j21129r78223j436301j297495o53420J64204P53665
$$ -290775 941807 1686901 1565772 587549 -848752 -2146247 -2799667 -2635463 -1881798
65759a881798Q45579M33496k32411p81740r16852n62072J05443P54248J070979
$$ -1881798 -1036219 -602723 -835134 -1616874 -2533726 -3095798 -2990355 -2236107 -1165128
65750a165128R15716L82659k59187p08154p78018m77628J2144M43364O27439N17298
$$ -1165128 -249412 133247 -125940 -834094 -1612112 -2089740 -2077596 -1634232 -1006793 -489495
65740d89495K09026j27916l46696l91606l06536j87391j12949r6963q7730j1287
$$ -489495 -280469 -408385 -755081 -1146687 -1453223 -1640614 -1753563 -1850526 -1938256 -1949543
65730a949543J71083M27198O61925P64295O66921L84521J0821l23832n11139n09844
$$ -1949543 -1778460 -1351262 -689337 74958 741879 1126400 1137221 813389 302250 -207594
65720b07594l56212j38441M8567J44014J39150O8129j8371q0215j02172r1622
$$ -207594 -563806 -702247 -653680 -509666 -370516 -302387 -320758 -400973 -503145 -594767
65710e94767o5318l5389k705M0255J00774J77527K57107L16714L31434K83516
$$ -594767 -660085 -695474 -698179 -657924 -557150 -379623 -122516 194198 525632 809148
65700H09148J71193J4638j43782k47910k45748j13164J25968L95286N85467N95876
$$ 809148 980341 994979 851197 603287 357539 244375 370343 765629 1351096 1946972
65690A946972L83397m652m34161p30186p50072m51845P6251O43646J034191J097937
$$ 1946972 2330369 2325717 1891556 1161370 411298 -40547 35704 679350 1713541 2811478
65680B811478Q14369K96063k69052p07230r34270r78492r41866r23760r52592
$$ 2811478 3625847 3921910 3652858 2945628 2011358 1032866 91000 -832760 -1785352
65671a785352r65757q50453n22020O681O08118J089715J286265J144965P54579
$$ -1785352 -2751109 -3601562 -4123582 -4116901 -3508783 -2419068 -1132803 12162 766741
65662G66741L00171l3375j55960j11592l9687q0605k81090n57292p40855o84505
$$ 766741 1066912 1033537 877577 765985 726298 645693 364603 -192689 -933544 -1618049
65652a618049l65830P5813L99313L93454R608n82735j059153j099863n66987L96324
$$ -1618049 -1983879 -1908066 -1508753 -1115299 -1105691 -1688426 -2747579 -3847442 -4414429 -4018105
65642d018105J406169K008398J900021J090281q4706j108386j524256j153736
$$ -4018105 -2611936 -603538 1296483 2386764 2302058 1193672 -330584 -1484320
65634a484320j83567R21328J637246J626141Q87077k55027j311734j860033j725615
$$ -1484320 -1667887 -746559 890687 2516828 3403905 3148878 1837144 -22889 -1748504
65625a748504j037328j37928N92997R10754P91222M01329j4147k60624k70789
$$ -1748504 -2785832 -2923760 -2330763 -1420009 -628787 -227458 -241605 -502229 -773018
65616g73018j01996J27484L14954M16275M38122L98014K89851Q4824k31279o12876
$$ -773018 -875014 -747530 -432576 -16301 421821 819835 1109686 1194510 963231 350355
65606C50355r40385j059031q58271l48851L11935Q72066J096390Q83714L26327
$$ 350355 -590030 -1649061 -2507332 -2856183 -2544248 -1672182 -575792 307922 634249
65597F34249l24621p75579q31756m90447O2442N50946P50484N97517K10680j84749
$$ 634249 309628 -465951 -1297707 -1788154 -1725712 -1174766 -424282 173235 383915 199166
65587A99166l84670l14585n9595J97650K92533J79142m2810j90643j14336K03020
$$ 199166 -185504 -500089 -559684 -362034 -69501 109641 66831 -123812 -238148 -35128
65577c5128O20753R10356Q83464N06966o1745n44292o83192l82388K29499Q50334
$$ -35128 585625 1495981 2379445 2886411 2824666 2280374 1597182 1214794 1444293 2294627
65567B294627J147791R23922K18083p03886j469055j766428j483716p48678J39213
$$ 2294627 3442418 4366340 4584423 3880537 2411482 645054 -838662 -1587340 -1448127
65558a448127Q47728J152023J012318N61762K2906l97788n85418n34259l13926
$$ -1448127 -600399 551624 1563942 2125704 2148610 1750822 1165404 631145 317219
65549C17219j5648K86593N42410P06312P18186N06191J8153p34071j645177k525013
$$ 317219 301571 588164 1130574 1836886 2555072 3061263 3079416 2345345 700168 -1824845
65539a824845l149079l332086k992817k182141j063964J39249J210786J988581
$$ -1824845 -4973924 -8306010 -11298827 -13480968 -14544932 -14405683 -13194897 -11206316
65531a1206316K386056K388467K038328J422394O63349r0581o87500j007433j001639
$$ -11206316 -8820260 -6431793 -4393465 -2971071 -2307722 -2398303 -3085803 -4093236 -5094875
65522e094875p16657k85966J14590L32859L00032N6212k70894n24629n87780m28800
$$ -5094875 -5811532 -6097498 -5982908 -5650049 -5350017 -5293805 -5564699 -6089328 -6677108 -7105908
65512g105908j05843K69763N89128P91351Q77719Q91802Q81060Q64120Q22262
$$ -7105908 -7211751 -6941988 -6352860 -5561509 -4683790 -3791988 -2910928 -2046808 -1224546
65503a224546P18209N28983K71873P097j85480k43520j53639L9148K48461L81437
$$ -1224546 -506337 22646 294519 301616 116136 -127384 -281023 -241875 6586 388023
65493C88023L75060K18720m4209l33257n57417o41839n48331k87005Q2095M58926
$$ 388023 763083 981803 937594 604337 46920 -594919 -1143250 -1430255 -1348160 -889234
65483h89234P26280P83606N83630J57815l83616q83530j193635j232307j017506
$$ -889234 -162954 620652 1204282 1362097 978481 94951 -1098684 -2330991 -3348497
65474c348497o56334k92804l7390Q6015J46217K57339N00475Q56523J190698J304932
$$ -3348497 -4004831 -4297635 -4335025 -4249010 -4102793 -3845454 -3344979 -2488456 -1297758 7174
65464G174J038627L69220n41718j388749j839883j681630r24599J83358J248148
$$ 7174 1045801 1415021 873303 -515446 -2355329 -4036959 -4961558 -4778200 -3530052
65455c530052J887806J888894J291356L64621n12747j014563r97845n47971P5993
$$ -3530052 -1642246 246648 1538004 1902625 1389878 375315 -622530 -1170501 -1094508
65446a094508N65059O94632M11126j61131p87180j226367j327084j074198n76989
$$ -1094508 -529449 165183 576309 415178 -372002 -1598369 -2925453 -3999651 -4576640
65437d576640j1512M52813P11783P51067O34238M65307L43412L26512M14899N57647
$$ -4576640 -4588152 -4135339 -3423556 -2672489 -2038251 -1572944 -1229532 -903020 -488121 69526
65427F9526O77641P05244O07854M03541J52493p0987k13944k70524k83883l20936
$$ 69526 747167 1452411 2060265 2463806 2616299 2545312 2331368 2060844 1776961 1456025
65417A456025m31252o11787p98918q96490q28877n91793k70496r268N8526j13400
$$ 1456025 1024773 412986 -385932 -1282422 -2111299 -2703092 -2973588 -2982856 -2924330 -3037730
65407c037730m43473p44713q07373n05742J24019Q78633J465157J629611J276960
$$ -3037730 -3481203 -4225916 -5033289 -5539031 -5415012 -4536379 -3071222 -1441611 -164651
65398a64651N23309l48011j008348j226792r66726l90945K24400O22330O78358
$$ -164651 358658 10647 -997701 -2224493 -3191219 -3582164 -3357764 -2735434 -2057076
65389b057076M41408Q8053j80129k39771r7475J30984K95271K93516J18431j53917
$$ -2057076 -1615668 -1527615 -1707744 -1947515 -2044990 -1914006 -1618735 -1325219 -1206788 -1360705
65379a360705m18714o03027o95271p28973p36697p09275n91776l23149J03872
$$ -1360705 -1779419 -2382446 -3077717 -3806690 -4543387 -5252662 -5844438 -6167587 -6063715
65370f063715O03103J008222J142223R11347L72298k69755p40776q21568m55481
$$ -6063715 -5460612 -4452390 -3310167 -2398820 -2026522 -2296277 -3037053 -3858621 -4314102
65361d314102K15843R10417J332291J305994Q53945J80328m28546p36582o58619
$$ -4314102 -4098259 -3187842 -1855551 -549557 304388 484716 56170 -680412 -1339031
65352a339031k84115J80881N18057N93118L99862L9529l43095o27104p52587p17183
$$ -1339031 -1623146 -1442265 -924208 -331090 68772 108301 -234794 -861898 -1614485 -2331668
65342b331668n47428k72250Q1523M72395Q25837J038141J012197P11315J99583
$$ -2331668 -2879096 -3151346 -3069823 -2597428 -1771591 -733450 278747 990062 1189645
65333A189645l61688p70519q72425o36980j80484K82198N36707M70716J25949
$$ 1189645 827957 57438 -814987 -1451967 -1632451 -1350253 -813546 -342830 -216881
65324b16881l26609o75592p75470o14247l07942k7070J02684O9847k1824k0640
$$ -216881 -543490 -1219082 -1994552 -2608799 -2916741 -2943811 -2841127 -2771280 -2793104 -2813744
65314b813744J75773N48613R52901J184191J082462O18378q3412p95814j288523
$$ -2813744 -2637971 -2089358 -1136457 47734 1130196 1748574 1665162 869348 -419175
65305d19175j424605j208297p65821k76175J08108L10924L35700K32445N7573
$$ -419175 -1843780 -3052077 -3817898 -4094073 -3985965 -3675041 -3339341 -3106896 -3049323
65296c049323j46751l45845m92709n20013l60251J1419N37945J075876J440506
$$ -3049323 -3196074 -3541919 -4034628 -4554641 -4914892 -4903473 -4365528 -3289652 -1849146
65287a849146J486273J183121O45137Q9004k63151k89774k9407L39844N92609
$$ -1849146 -362873 820248 1465385 1554389 1291238 1001464 972057 1311901 1904510
65278A904510N72929K73280j66763n41454o94570o05133l94482k50014l08480
$$ 1904510 2477439 2750719 2583956 2042502 1347932 742799 348317 98303 -210177
65269b10177n66278q70765j001962q02074k80566L67713Q48181R15742N09835
$$ -210177 -776455 -1647220 -2649182 -3451256 -3731822 -3364109 -2515928 -1600186 -1090351
65260a090351j98679q78726j196323r79410l05595N33281J172647J351029J031154
$$ -1090351 -1289030 -2167756 -3364079 -4343489 -4649084 -4115803 -2943156 -1592127 -560973
65251e60973M06290k08280n39850m92769j84810J29579K04727o0849n70002j079663
$$ -560973 -154683 -362963 -902813 -1395582 -1580392 -1450813 -1246086 -1306935 -1876937 -2956600
65241b956600j329922j179823o78999m0168M70013O62806N14159J64798j61541
$$ -2956600 -4286522 -5466345 -6145344 -6185512 -5715499 -5052693 -4538534 -4373736 -4535277
65232d535277k75752j15561K32040N84288P59745O67522L45612o5669l95897n23206
$$ -4535277 -4811029 -4926590 -4694550 -4110262 -3350517 -2682995 -2337383 -2403052 -2798949 -3322155
65222c322155m21749j60278J40228L63966M44606L80056K18494K9295j24680k03203
$$ -3322155 -3743904 -3904182 -3763954 -3399988 -2955382 -2575326 -2356832 -2327537 -2452217 -2655420
65212b655420j92207j00049M7983K15135L60405M49179M65073M16948L34795K53576
$$ -2655420 -2847627 -2947676 -2899693 -2684558 -2324153 -1874974 -1409901 -992953 -658158 -404582
65202d04582J91973J38449N5290r7997l32666o08482q37307r15980p75525m22374
$$ -404582 -212609 -74160 -18870 -116867 -449533 -1058015 -1895322 -2811302 -3586827 -4009201
65192d009201N1492M98523P74447P99038N89581K50675p4421k66826k79072j45261
$$ -4009201 -3957709 -3459186 -2684739 -1885701 -1296120 -1045445 -1119866 -1386692 -1665764 -1811025
65182a811025M6864K04041K69688K40301J52507N3681k3939p1069r0546p9986
$$ -1811025 -1764161 -1560120 -1290432 -1050131 -897624 -843943 -867882 -938951 -1029497 -1109483
65172a109483k3863R6884K83346N01463O85000P62577O96132N07731K74973R2111
$$ -1109483 -1133346 -1036462 -753116 -251653 433347 1195924 1892056 2399787 2674760 2766871
65162B766871J5266K3050J9356j16412m53905r51569j448897j723980j594599
$$ 2766871 2782137 2805187 2824543 2708131 2254226 1302657 -146240 -1870220 -3464819
65153c464819j015127j18776Q21292J499004J702718J403091P59747M4304m82017
$$ -3464819 -4479946 -4598722 -3777430 -2278426 -575708 827383 1587130 1631434 1149417
65144A149417o76969n61803k85564l3709O8109N847j37629k48513k57285j78984
$$ 1149417 472448 -89355 -374919 -408628 -340519 -334672 -472301 -720814 -978099 -1157083
65134a157083r7043j03004k30217m22700n59403n21480k64500J46501N61055Q15402
$$ -1157083 -1254126 -1357130 -1587347 -2010047 -2569450 -3090930 -3355430 -3208929 -2647874 -1832472
65124a832472Q14496N79472K34645n8843j86422j35096R476J20937J11659j2034
$$ -1832472 -1017976 -438504 -203859 -262702 -449124 -584220 -574744 -453807 -342148 -354182
65114c54182j51138j72347Q324L63971P54160R86910R15805N22260o1545o04361
$$ -354182 -505320 -677667 -669343 -305372 448788 1435698 2351503 2873763 2812218 2207857
65104B207857q79795p72812l36838K27171O60572P63717M84968n8561o36456j009173
$$ 2207857 1328062 555250 218412 445583 1106155 1869872 2354840 2296279 1659823 650650
65094F50650j032168p13450k01233K88857N71306N68363L34923K3039j94604k06265
$$ 650650 -381518 -1094968 -1296201 -1007344 -436038 132325 467248 490287 295683 89418
65084H9418j1663K79419M98157M94207K06122l05209q74381j293805j395776j121197
$$ 89418 77755 357174 855331 1349538 1555660 1250451 376070 -917735 -2313511 -3434708
65074c434708n46846J40757P15373R97315R20964N55639P1066l37668n32962m88775
$$ -3434708 -3981554 -3840797 -3125424 -2128109 -1207145 -651506 -580440 -918108 -1451070 -1939845
65064a939845k91916r0529j4400j05501k93042m26569l52604J515N77953J199195
$$ -1939845 -2231761 -2322290 -2336690 -2442191 -2735233 -3161802 -3514406 -3512891 -2934938 -1735743
65054a735743J637495J712854J374933P30593L278n58450p82805o42312k58344
$$ -1735743 -98248 1614606 2989539 3720132 3723410 3164960 2382155 1739843 1481499
65045A481499J57294L96016L39502L516m77212r12287j136856j075582p64878
$$ 1481499 1638793 2034809 2374311 2377827 1900615 988328 -148528 -1224110 -1988988
65036a988988l28859P6189L23124L56521K02925n0298k94717m41622m48906l26748
$$ -1988988 -2317847 -2241658 -1918534 -1562013 -1359088 -1409386 -1704103 -2145725 -2594631 -2921379
65026b921379j23702R8462K90040M29124N22719N94254O64026P32046P71998P40239
$$ -2921379 -3045081 -2946619 -2656579 -2227455 -1704736 -1110482 -446456 285590 1057588 1797827
65016A797827N96879L29649l1245m15903p35981r16182r21986p70724n20788k44695
$$ 1797827 2394706 2724355 2693110 2277207 1541226 625044 -296942 -1067666 -1588454 -1833149
65006a833149J21J88004L21728M13333M62861M50262L47795J46906j17359l63037
$$ -1833149 -1833028 -1645024 -1323296 -909963 -447102 3160 350955 497861 380502 17465
64996A7465m87524m15105j42582K43346N91938P50865O37896K86276j61797n14658
$$ 17465 -470059 -885164 -1027746 -784400 -192462 558403 1196299 1482575 1320778 806120
64986H06120o17746m26031k6259M03078O75153O80694M34120N8020k84171m71057
$$ 806120 188374 -237657 -263916 139162 814315 1495009 1929129 1987149 1702978 1231921
64976A231921m78414l79022k90030k98848m09710n40803n73338m24726j04272
$$ 1231921 753507 374485 84455 -214393 -624103 -1164906 -1738244 -2162970 -2267242
64967b267242K80805N73899O46788M64894J04916k84518n57557o40775n60884
$$ -2267242 -1986437 -1412538 -765750 -300856 -195940 -480458 -1038015 -1678790 -2239674
64958b239674m17510l18711l17254l84183m33963l85021k18468J748J61834J67314
$$ -2239674 -2657184 -2975895 -3293149 -3677332 -4111295 -4496316 -4714784 -4713036 -4551202 -4383888
64948d383888Q556k17840l49375k42808J39779O92187J198405J428310J249614
$$ -4383888 -4375332 -4593172 -4942547 -5185355 -5045576 -4353389 -3154984 -1726674 -477060
64939d77060O99892j9658o28950q93235p27818k33527L53057P69362Q43599N64340
$$ -477060 222832 203174 -425776 -1319011 -2046829 -2280356 -1927299 -1157937 -314338 250002
64929B50002P3781m06859o80156o54255l69015L8202M02998O03017N94779M08407
$$ 250002 323783 -83076 -763232 -1417487 -1786502 -1748300 -1345302 -742285 -147506 260901
64919B60901J13205k20922n44650q26631j037193j136463j080301q43812m48444
$$ 260901 374106 153184 -391466 -1218097 -2255290 -3391753 -4472054 -5315866 -5764310
64910e764310K6463M59938P30740P66438N76882K54924n7490k23682j63801J17276
$$ -5764310 -5737847 -5277909 -4547169 -3780731 -3203849 -2948925 -3006415 -3230097 -3393898 -3276622
64900c276622N35074R58377J254379J328622J148051P44258K01245l65695q34745
$$ -3276622 -2741548 -1783171 -528792 799830 1947881 2692139 2893384 2527689 1692944
64891A692944j103195j111557q61767m22662Q3314N13065P47479P32338M98253
$$ 1692944 589749 -521808 -1383575 -1806237 -1722923 -1209858 -462379 269959 768212
64882G68212J49079j78851l70902l78871k36742m0661R7321J00317m0724k66727
$$ 768212 917291 738440 367538 -11333 -248075 -288736 -191415 -91098 -131822 -398549
64872c98549m80963n94559n65215m11916k00823j1195J01299J26952J01241Q3416
$$ -398549 -879512 -1474071 -2039286 -2451202 -2652025 -2663220 -2561921 -2434969 -2333728 -2250312
64862b250312J25853K48381M28108O07775P18109P04980N51560K88074j4026k62383
$$ -2250312 -2124459 -1876078 -1447970 -840195 -122086 582894 1134454 1422528 1408502 1146119
64852A146119l73335l02380o5423K58354N46504O72888N54850J90299l32029q57202
$$ 1146119 772784 470404 404981 663335 1209839 1882727 2437577 2627876 2295847 1438645
64842A438645j217665j296458j074289o39385j53813K11282L44658K38562j2095
$$ 1438645 220980 -1075478 -2149767 -2789152 -2942965 -2731683 -2387025 -2148463 -2160558
64833b160558k54483l46395k18064R9794M92920Q16195R57130Q81630O42957L52356
$$ -2160558 -2415041 -2761436 -2979500 -2879706 -2386786 -1570591 -613461 268169 911126 1263482
64823A263482J27066M0194R4211K27443L47619L75301K77527P8406j55347l45140
$$ 1263482 1390548 1430742 1524953 1752396 2100015 2475316 2752843 2831249 2675902 2330762
64813B330762m33135m03439k84869j36295k2077J2289m4469j67668l08059m11394
$$ 2330762 1897627 1494188 1209319 1073024 1050947 1063236 1018767 851099 543040 131646
64803A31646m38742l80184k56995j11887Q599P2023P0697K0578n0520j19019j77261
$$ 131646 -307096 -687280 -944275 -1056162 -1047563 -975540 -904843 -884265 -934785 -1053804 -1231065
64792a231065k34268l04875l93323m81108n27476m84403l19745l6911L19854O78524
$$ -1231065 -1465333 -1770208 -2163531 -2644639 -3172115 -3656518 -3976263 -4013174 -3693320 -3014796
64782c014796R64971J128648J155508J062503Q78621O25437L10373o2120m68446
$$ -3014796 -2049825 -921177 234331 1296834 2175455 2800892 3111265 3049145 2580699
64773B580699q48908j111769j163728r56113n23624Q675M61598O71384N63231
$$ 2580699 1731791 620022 -543706 -1499819 -2023443 -2014768 -1553170 -881786 -318555
64764c18555J93184k65905n93317o16379k90120K77307Q67298J243605J253330
$$ -318555 -125371 -391276 -984593 -1600972 -1891092 -1613785 -746487 497118 1750448
64755A750448Q89977K90658l29152p70625r31069q32570n91104l47099j95649
$$ 1750448 2640425 2931083 2601931 1831306 900237 67667 -523437 -870536 -1066185
64746a066185j51343j61591j55213r4903k110N9502L0887r4472k52129l31710
$$ -1066185 -1217528 -1379119 -1534332 -1629235 -1631345 -1571843 -1540956 -1635428 -1887557 -2219267
64736b219267k34488O7114N01811R21737J166634J138941Q51581M23096K1224
$$ -2219267 -2453755 -2386641 -1884830 -963093 203541 1342482 2194063 2617159 2638383
64727B638383k17466k51637j50605n3324r1861l18344o72779j008406j162397
$$ 2638383 2420917 2169280 2018675 1965351 1873490 1555146 882367 -126039 -1288436
64718a288436j036810o49719j31219L33646N87209N67104L27980Q401k38999l18972
$$ -1288436 -2325246 -2974965 -3106184 -2772538 -2185329 -1618225 -1290245 -1281844 -1520843 -1839815
64708a839815k32174o3760O9647Q5977j7525j63316k36259j47523J13458M66203
$$ -1839815 -2071989 -2135749 -2066102 -1980125 -1997650 -2160966 -2397225 -2544748 -2431290 -1965087
64698a965087P73033R03507P97662M96338J22846j75667k98394k37488p7216N4602
$$ -1965087 -1192054 -288547 509115 1005453 1128299 952632 654238 416750 339534 394136
64688C94136N8517p8607k71399l78924k83558L3924M64102Q04870Q52359N06211
$$ 394136 452653 374046 102647 -276277 -559835 -525911 -61809 743061 1595420 2101631
64678B101631j62911r21755j462805j537529j074749k26935O82375J291620J357619
$$ 2101631 1938720 1016965 -445840 -1983369 -3058118 -3285053 -2602678 -1311058 46561
64669D6561Q64721L5524p63900j182890j037897l88844M92979J248528J587552
$$ 46561 911282 946806 182906 -999984 -2037881 -2426725 -1933746 -685218 902334
64660I02334J406315Q15536P1659n50027q76989q99276p44928n91233n62260o66159
$$ 902334 2308649 3124185 3195844 2645817 1768828 869552 124624 -466609 -1028869 -1695028
64650a695028q01678q25560o41337k60784J94123N48542O60352M89703J18154
$$ -1695028 -2496706 -3322266 -3963603 -4224387 -4030264 -3481722 -2821370 -2331667 -2213513
64641b213513k89959n62367n92205l76073l408L91491O87295Q15794P70557N88926
$$ -2213513 -2503472 -3065839 -3658044 -4034117 -4037525 -3646034 -2958739 -2142945 -1372388 -783462
64631g83462L24505K7649k58725m93487o34125o45178n16679k80708j1561J97099
$$ -783462 -458957 -431308 -690033 -1183520 -1817645 -2462823 -2979502 -3260210 -3271771 -3074672
64621c074672K70814J89877J807j98474l12681k85244j27071R5756L01701M39070
$$ -3074672 -2803858 -2613981 -2612174 -2810648 -3123329 -3408573 -3535644 -3439888 -3138187 -2699117
64611b699117N10554N62502O45191P68193Q79432Q84086O96717K99465k27254
$$ -2699117 -2188563 -1626061 -980870 -212677 666755 1550841 2247558 2547023 2319769
64602B319769p22708j008627r68357o03539l9079N27357R07687R98252Q12687
$$ 2319769 1597061 588434 -379923 -983462 -1022541 -495184 412503 1410755 2223442
64593B223442M60400Q5691j99222l54139m07976m21442m41107m72179m83225m35601
$$ 2223442 2683842 2769533 2570311 2216172 1808196 1386754 945647 473468 -9757 -445358
64583d45358l15865j49315J3658J28342J82035J97226K08325K27243K22592J30938
$$ -445358 -761223 -910538 -896880 -768538 -586503 -389277 -180952 46291 268883 399821
64573C99821j00937m65349q67141j144583j136363p65511r6747O67886J261386
$$ 399821 298884 -166465 -1033606 -2178189 -3314552 -4080063 -4176810 -3508924 -2247538
64564b247538J463415J199630N79749j46695o98160q82254o73333k11281K74703
$$ -2247538 -784123 415507 995256 848561 150401 -731853 -1405186 -1616467 -1341764
64555a341764N77216O01408L93400R8166j25278j84067q6420Q1703K18544K67761
$$ -1341764 -764548 -163140 230260 328426 203148 19081 -67339 14364 232908 500669
64545E00669K43401K06831K13487K65227L00301K29598j234l61782p32550r54911
$$ 500669 744070 950901 1164388 1429615 1729916 1959514 1958280 1596498 863948 -90963
64535i0963r12417o00056j41179K62378M25868K75754j06836n18586p29487n95755
$$ -90963 -1003380 -1603436 -1744615 -1482237 -1056369 -780615 -887451 -1406037 -2135524 -2731279
64525b731279j34292M79090R88309J175208R60670M40534j59851n89515o84253
$$ -2731279 -2865571 -2386481 -1398172 -222964 737706 1178240 1018389 428874 -255379
64516b55379m35260J5575M47749O64897N79686K43941j85145n22206o36167n01227
$$ -255379 -690639 -675064 -227315 437582 1017268 1261209 1076064 553858 -82309 -583536
64506e83536j97507J33163L51965L78307K13887o9468l67107n84413o67071o09651
$$ -583536 -781043 -647880 -295915 82392 296279 226811 -140296 -724709 -1391780 -2001431
64496b001431m44406k20121J7411K35499M13947N38179N93068N63013M39649K33648
$$ -2001431 -2445837 -2665958 -2648547 -2413048 -1999101 -1460922 -867854 -304841 134808 368456
64486C68456j6334k44679l73592l39364j21353K38861O39632R47140J042629Q72329
$$ 368456 352122 107443 -266149 -605513 -726866 -488005 151627 1098767 2141396 3013725
64476C013725M78597m674l96069n36502l57620Q1391O08010J000022J074700P66324
$$ 3013725 3492322 3487648 3091579 2555077 2197457 2278848 2886858 3886880 4961580 5727904
64466E727904J57718n49791j116655j361571j232335q20505l14777Q4318K48798
$$ 5727904 5885622 5335831 4219176 2857605 1625270 804765 489988 574306 823104
64457H23104J68877n8417k88387m04050l70132k40436j17889r0569j78536l19805
$$ 823104 991981 933564 645177 241127 -129005 -369441 -487330 -577899 -756435 -1076240
64447a076240m02943l29141p1039L03344O55736Q41176P79331M98035J26064j63486
$$ -1076240 -1479183 -1808324 -1879363 -1576019 -920283 -79107 700224 1198259 1324323 1160837
64437A160837k33791n1047K94921O27365P61224N88271J29711m68408r95821j267832
$$ 1160837 927046 875999 1170920 1798285 2559509 3147780 3277491 2809083 1813262 545430
64427E45430j203896q59515l97053r094J70318J25376l8652j50947o3103K71993
$$ 545430 -658466 -1517981 -1915034 -1924128 -1753810 -1628434 -1667086 -1818033 -1881136 -1609143
64417a609143P68302J238099J473472J340591Q42877J23308n95435j104880j294577
$$ -1609143 -840841 397258 1870730 3211321 4054198 4177506 3582071 2477191 1182614
64408A182614j186933r08466o14303m05895k84639j65124N9918M38925R10635
$$ 1182614 -4319 -912785 -1527088 -1932983 -2217622 -2382746 -2322828 -1883903 -973268
64399i73268J314374J461056J231454O51146r9820p53563j069769r46034m68925
$$ -973268 341106 1802162 3033616 3684762 3584942 2831379 1761610 815576 346651
64390C46651J21567N40077N86704K38978l38707q72540j106630r20133l80084
$$ 346651 468218 1008295 1594999 1833977 1495270 622730 -483900 -1404033 -1784117
64381a784117K92220Q22389J002116P71666K31725m13729r50470j237111j243137
$$ -1784117 -1491897 -669508 332608 1104274 1335999 922270 -28200 -1265311 -2508448
64372b508448j033184p15840l89118j09724J05245K55758L37079L35526K43443
$$ -2508448 -3541632 -4257472 -4646590 -4756314 -4651069 -4395311 -4058232 -3722706 -3479263
64363c479263P9817j02139k31085k51757j57863j989J27549J53597N5849j11604
$$ -3479263 -3399446 -3501585 -3732670 -3984427 -4142290 -4144279 -4016730 -3863133 -3807284 -3918888
64353c918888k44062k41646o7769K22192N00573O28563N28688K30451j36703m02271
$$ -3918888 -4162950 -4404596 -4472365 -4250173 -3749600 -3121037 -2592349 -2361898 -2498601 -2900872
64343b900872m37314k19503J52800N05383O70258N64749K29265j93458n25736
$$ -2900872 -3338186 -3557689 -3404889 -2899506 -2229248 -1664499 -1435234 -1628692 -2154428
64334b154428o34984m88183j57355K22184N16625O48993O20862M95598L57544
$$ -2154428 -2789412 -3277595 -3434950 -3212766 -2696141 -2047148 -1426286 -930688 -573144
64325e73144K70744K56766K97650L55981L96948M00258L59171K73070J43069k4338
$$ -573144 -302400 -45634 252016 607997 1004945 1405203 1764374 2037444 2180513 2156175
64315B156175k08693l70987m61031m37297k90417n6702J88655L58664L90375K72017
$$ 2156175 1947482 1576495 1115464 678167 387750 331048 519703 878367 1268742 1540759
64305A540759M7498k04170m03950n04519n03278m32221l32996k33003j36194l2245
$$ 1540759 1588257 1384087 980137 475618 -27660 -459881 -792877 -1025880 -1162074 -1194319
64295a194319Q4041J97515K73068K72772J79701J3303j74368l20918l82285l51383
$$ -1194319 -1110278 -912763 -639695 -366923 -187222 -173919 -348287 -669205 -1051490 -1402873
64285a402873k55957j37420k4248Q2806K03545L53181N15591O34424O32191M50819
$$ -1402873 -1658830 -1796250 -1820498 -1737692 -1534147 -1180966 -665375 -30951 601240 1052059
64275A052059R2503l63609p82694j027270j017589p69093l86818j8285K12141
$$ 1052059 1144562 780953 -1741 -1029011 -2046600 -2815693 -3202511 -3220796 -3008655
64266c008655K54915J48182j2152j26666j40801o2485N6998J63472K34880K89031
$$ -3008655 -2753740 -2605558 -2617710 -2744376 -2885177 -2947662 -2890664 -2727192 -2492312 -2203281
64256b203281L60647M64511N71395O16217N37645L26782N3321j52646j60596Q7040
$$ -2203281 -1842634 -1378123 -806728 -190511 347134 673916 727237 574591 413995 501035
64246E01035N28280R91727J265187J192803P53123P7400o03676j060464j163374
$$ 501035 1029315 2021042 3286229 4479032 5232155 5309555 4705879 3645415 2482041
64237B482041r32509n15612j08930J36041J72051N4854j11329k45200l33083m21488
$$ 2482041 1549532 1033920 924990 1061031 1233082 1287936 1176607 931407 598324 176836
64227A76836n64732p63105r34125r40924o67578j01067O29096J283190J607613
$$ 176836 -387896 -1151001 -2085126 -3026050 -3693628 -3794695 -3165599 -1882409 -274796
64218b74796J451446Q45189l66p78358j215041j182950p45347j13604M57738P84606
$$ -274796 1176650 2021839 2021473 1243115 28074 -1154876 -1900223 -2013827 -1556089 -771483
64208g71483Q21074O53249M30593K76740K28438K31936J92616M4805k00007m53577
$$ -771483 49591 702840 1133433 1410173 1638611 1870547 2063163 2107968 1907961 1454384
64198A454384n97917n50678l11420L6468L67705N76114O20738N33322L86580K44924
$$ 1454384 856467 305789 -5631 30837 398542 974656 1595394 2128716 2515296 2760220
64188B760220J27959P881j59511l90925o47545q42211q80355p12818l70605L9504
$$ 2760220 2888179 2896060 2736549 2345624 1698079 855868 -24487 -737305 -1107910 -1068406
64178a068406L78658N37754M86185K82971M5220j09341j16708Q273J85984L15306
$$ -1068406 -689748 -151994 334191 617162 662382 553041 436333 444606 630590 945896
64168I45896L22637J92836l0183k69133m49105n25045m90147l66246j86138K0469
$$ 945896 1268533 1461369 1431186 1162053 712948 187903 -302244 -668490 -854628 -834159
64158h34159K31171M26948N87036O89027P15450O62358N43196L84089K12673M7300
$$ -834159 -602988 -176040 410996 1100023 1815473 2477831 3021027 3405116 3617789 3665089
64148C665089j06234k48194l73218m62341m86232m20358k64589n5146J40671K47964
$$ 3665089 3558855 3310661 2937443 2475102 1988870 1568512 1303923 1248777 1389448 1637412
64138A637412K16597M6998k04176m42942n74126n39062l38709l3099K81090N04244
$$ 1637412 1854009 1901007 1696831 1253889 679763 140701 -198008 -231107 49983 554227
64128E54227N65342M41328J61050k03673n55146p91454q30694o35326k31145K87705
$$ 554227 1119569 1560897 1721947 1518274 963128 171674 -659020 -1294346 -1525491 -1237786
64118a237786P75642J075806J073812P45529J76886m57838r55456j159174j018070
$$ -1237786 -462144 613662 1687474 2433003 2609889 2152051 1196595 37421 -980649
64109i80649o04189p9020L75361O28640O45252M80565K36791N014j75106l18396
$$ -980649 -1584838 -1663858 -1288497 -659857 -14605 465960 702751 707765 532659 214263
64099B14263m62795o26186p80225q58945p97936n80329k59941N5766K56804K88461
$$ 214263 -248532 -874718 -1654943 -2513888 -3311824 -3892153 -4152094 -4096328 -3839524 -3551063
64089c551063J82244L9942k2928N6206K48612M48451N34437M45582K26710J3631
$$ -3551063 -3368819 -3328877 -3351805 -3295599 -3046987 -2598536 -2064099 -1618517 -1391807 -1378176
64079a378176l9608J45051N06203Q50401R34982N90038j80991j176252k064876
$$ -1378176 -1417784 -1272733 -766530 83871 1018853 1608891 1427900 251648 -1813228
64070a813228k523060k374411j668173o57808L09775R41497J113016R00206N18384
$$ -1813228 -4336288 -6710699 -8378872 -9036680 -8726905 -7785408 -6672392 -5772186 -5253802
64061e253802K04926J05692K19235M20185N42314M73927K16243j21410l81495
$$ -5253802 -5048876 -4943184 -4723949 -4303764 -3761450 -3287523 -3071280 -3192690 -3574185
64052c574185m38176k55543J02141N07543Q30567R89720R72003Q18773N92966
$$ -3574185 -4012361 -4267904 -4165763 -3658220 -2827653 -1837933 -865930 -47157 545809
64043E45809L49537J23839o1756j85005k19094j42763M0529K88430N23488O57658
$$ 545809 895346 1019185 957429 772424 553330 410567 451096 739526 1263014 1920672
64033A920672O27524M22769R2895k71639n74475p47511p69019o60397m67847k41562
$$ 1920672 2548196 2970965 3063860 2792221 2217746 1470235 701216 40819 -427028 -668590
64023f68590k3006J57105K75772L17785K82453J92496R5247M8650R4018K28540
$$ -668590 -691596 -534491 -258719 59066 341519 534015 629262 677912 771930 1000470
64013A000470L95214N01615M63571K53689p2244l89813n59795m97131k19448J53133
$$ 1000470 1395684 1897299 2360870 2614559 2542315 2152502 1592707 1095576 876128 1029261
64003A029261M51323N38936L82531P0849k28655l55619k40796N6616L79433N55851
$$ 1029261 1480584 2019520 2402051 2472900 2244245 1888626 1647830 1704446 2083879 2639730
63993B639730M91707K21775j08538l22356l09013q6877K04083L77589L04333j2925
$$ 2639730 3131437 3353212 3244674 2922318 2613305 2526428 2730511 3108100 3412433 3399508
63983C399508m34682p55189q12043n76552j75410J70162K57968J2707m68284r56450
$$ 3399508 2964826 2209637 1397594 821042 645632 815794 1073762 1086469 618185 -338265
63973c38265j200990j051374n32751J62316P60445J029217Q75908L79228k55396
$$ -338265 -1539255 -2590629 -3123380 -2961064 -2200619 -1171402 -295494 83734 -171662
63964a71662p90028j050883r85080o59281k11568K12934N11301O40504O07022
$$ -171662 -961690 -2012573 -2997653 -3656934 -3868502 -3655568 -3144267 -2503763 -1896741
63955a896741M44898J98981q0137l35054n05185n41283m26365j90080R6043L44987
$$ -1896741 -1451843 -1252862 -1332999 -1668053 -2173238 -2714521 -3140886 -3330966 -3234923 -2889936
63945b889936M91216N18703M63717L89571L47115L43865L40532K77802J17827
$$ -2889936 -2398720 -1880017 -1416300 -1026729 -679614 -335749 4783 282585 400412
63936D00412j24874l83224n70290o26860n55667m20432l08299k76576l15865l53732
$$ 400412 275538 -107686 -677976 -1304836 -1860503 -2280935 -2589234 -2865810 -3181675 -3535407
63926c535407k99905j08256J81754M52687N67350M48860J37580k11432l96501
$$ -3535407 -3835312 -3943568 -3761814 -3309127 -2741777 -2292917 -2155337 -2366769 -2763270
63917b763270k72464J64053P54886J242293J386418J081674M13337l75583r92471
$$ -2763270 -3035734 -2871681 -2116795 -874502 511916 1593590 2006927 1631344 638873
63908F38873j225657j033974n53411k1444L39533M20072K56569j0582k24144k92014
$$ 638873 -586784 -1620758 -2174169 -2195613 -1856080 -1436008 -1179439 -1190021 -1414165 -1706179
63898a706179k21122r0678J2678N5250P5256J50464L36279O14143Q83959J008006
$$ -1706179 -1927301 -2017979 -2005301 -1950051 -1874795 -1724331 -1388052 -773909 110050 1118056
63888A118056Q83082N00295m1775n78797r54825j088840r99161p76096n22871
$$ 1118056 2001138 2501433 2459658 1880861 926036 -162804 -1161965 -1938061 -2460932
63879b460932l01604j15597O5121K56055M23858M92589L91400J15650k39671n03208
$$ -2460932 -2762536 -2878133 -2813012 -2556957 -2133099 -1640510 -1249110 -1133460 -1373131 -1876339
63869a876339n04449j68191M26047J058755J461067J441417R85093K73194l93742
$$ -1876339 -2380788 -2548979 -2122932 -1064177 396890 1838307 2823400 3096594 2702852
63860B702852p33358o13576j13471N17599R81747J073677P70814K29749l04732
$$ 2702852 1969494 1355918 1242447 1760046 2741793 3815470 4586284 4816033 4511301
63851D511301o27184o68283n12728l34191k87622m20219o49445q17498p88863
$$ 4511301 3884117 3215834 2703106 2368915 2081293 1661074 1011629 194131 -594732
63842e94732n34287j53267J77616L01535J69254j31077m19074n17940l49098K5270
$$ -594732 -1129019 -1282286 -1104670 -803135 -633881 -764958 -1184032 -1701972 -2051070 -2025800
63832b025800M34257O87048O70794M05927L0993k72950l76961k67891m9392J17466
$$ -2025800 -1591543 -904495 -233701 172226 203219 -69731 -446692 -714583 -763975 -646509
63822f46509J00375j36879n18977q99617j132957j137239r19728n55794j40151
$$ -646509 -546134 -683013 -1201990 -2101607 -3234564 -4371803 -5291531 -5847325 -5987476
63813e987476K58861O16820R37055J216493J419660J480744J335252R63308M17860
$$ -5987476 -5728615 -5111795 -4174740 -2958247 -1538587 -57843 1277409 2240717 2658577
63804B658577j81789o91699j000750j074758r64533p73957o05262n10126m71469
$$ 2658577 2476788 1785089 784339 -290419 -1254952 -2028909 -2634171 -3144297 -3615766
63795c615766m23684k98485p0337K23278M97140O60143O60837N12743K86986P7399
$$ -3615766 -4039450 -4337935 -4408272 -4184994 -3687854 -3027711 -2366874 -1854131 -1567145 -1489746
63785a489746m2876n1092K2571J18098J79634J81422J32959O3330l604o7018j48842
$$ -1489746 -1532622 -1583714 -1561143 -1443045 -1263411 -1081989 -949030 -885700 -889304 -956322 -1105164
63774a105164k75411m52184o47300p95558q23596o85378l90563j0600L42809N59297
$$ -1105164 -1380575 -1832759 -2480059 -3275617 -4099213 -4784591 -5175154 -5185754 -4842945 -4283648
63764d283648N74182L96236J06138j74650l32162l05374j09733J71227M22755
$$ -4283648 -3709466 -3313230 -3207092 -3381742 -3713904 -4019278 -4129011 -3957784 -3535029
63755c535029N48601N12181L51117J58429L8337N6358K06775M13422N64937N69242
$$ -3535029 -2986428 -2474247 -2123130 -1964701 -1926364 -1870006 -1663231 -1249809 -684872 -115630
63745a15630M01952J24708j37656k52949j45881J59640N41885Q28458Q69821O06518
$$ -115630 286322 411030 273374 20425 -125456 34184 576069 1404527 2274348 2880866
63735B880866R9358m91619r70120j180230j062992o69906j31529L99846Q04472
$$ 2880866 2980224 2488605 1518485 338255 -724737 -1394643 -1526172 -1126326 -321854
63726c21854J022679J048961R04738O12216J87920l40697r09510j405619j686200
$$ -321854 700825 1749786 2654524 3266740 3454660 3113963 2204453 798834 -887366
63717h87366j627998j187284m39378M27516J168980J571280J531453J094485M30497
$$ -887366 -2515364 -3702648 -4142026 -3714510 -2545530 -974250 557203 1651688 2082185
63708B082185k37432p21374r32991q97818p18397n09720l41760k16626q7362R7241
$$ 2082185 1844753 1123379 190388 -707430 -1425827 -1935547 -2277307 -2493933 -2581295 -2484054
63698b484054L49862O28299Q53287R48452Q78664O65444L72363P0799j93113m11751
$$ -2484054 -2134192 -1505893 -652606 295846 1174510 1839954 2212317 2283116 2090003 1678252
63688A678252o03836p86867r53081j065049j074246r51408p09738m06029j17953
$$ 1678252 1074416 287549 -665532 -1730581 -2804827 -3756235 -4465973 -4872002 -4989955
63679d989955Q9918J91909K04449J66109J08329L6487o5564k09814l74654m93962
$$ -4989955 -4900037 -4708128 -4503679 -4337570 -4229241 -4192754 -4258318 -4468132 -4842786 -5336748
63669e336748m77897k59660J55587O69402J115082J324134J205485P97856K65307
$$ -5336748 -5814645 -6074305 -5918718 -5249316 -4134234 -2810100 -1604615 -806759 -541452
63660e41452j67624l14335j12526L43548Q42333J148820J109519P19577J21422
$$ -541452 -709076 -1023411 -1135937 -792389 49944 1198764 2308283 3027860 3149282
63651C149282m62666q30440q84590o64595l14974j0044J25707O4141j30851l49637
$$ 3149282 2686616 1856176 971586 306991 -7983 -18027 107680 171821 40970 -308667
63641c08667m96836n33487m83208m05116l53370l47477l68241l77674l47485k77394
$$ -308667 -805503 -1338990 -1822198 -2227314 -2580684 -2928161 -3296402 -3674076 -4021561 -4298955
63631d298955j92487j22846p9781m4962J9579J45799L33811N42303P02899P52422
$$ -4298955 -4491442 -4614288 -4694069 -4739031 -4719452 -4573653 -4239842 -3697539 -2994640 -2242218
63621b242218O66320M74967K52989Q5946L0642Q8815K07278L04153L08065J91317
$$ -2242218 -1575898 -1100931 -847942 -761996 -731354 -642539 -435261 -131108 176957 368274
63611C68274j8223k50685m25342m83914m11369k36957j8055J83433L21154L73903
$$ 368274 350051 99366 -325976 -809890 -1221259 -1458216 -1476271 -1292838 -971684 -597781
63601e97781L44458K52287J26033r81r3025j15442m2341J31919L81863O47335
$$ -597781 -253323 -1036 124997 124016 30991 -84451 -126792 5127 386990 1034325
63591A034325Q42679Q79312O96313K88607k78978q80132j359054j578232j466888
$$ 1034325 1877004 2756316 3452629 3741236 3462258 2582126 1223072 -355160 -1822048
63582a822048j052286m59934J21549N01980N57169K77079k25970p55545j103652
$$ -1822048 -2874334 -3334268 -3212719 -2710739 -2153570 -1876491 -2102461 -2858006 -3961658
63573c961658j130077q16052k68900L25408P81728R92055R64033Q04260O55175
$$ -3961658 -5091735 -5907787 -6176687 -5851279 -5069551 -4077496 -3113463 -2309203 -1654028
63564a654028O17269O96123Q01802Q01688N99660J99638k82105o65717p95389
$$ -1654028 -1036759 -340636 461166 1262854 1862514 2062152 1780047 1114330 318941
63555C18941o21534k33750J75745M02860L32347k983m36340p49308p81920n14571
$$ 318941 -302593 -536343 -360598 42262 374609 371626 -64714 -814022 -1595942 -2110513
$$ [...]
##END NTUPLES=NMR SPECTRUM
##END=
