##TITLE=31P_DE-80H_X3
 64 sc D2O
 26.2.2025
##JCAMPDX= 6.0         $$ Bruker NMR JCAMP-DX V2.0
##DATA TYPE= NMR FID
##DATA CLASS= NTUPLES
##ORIGIN= UXNMR, Bruker Analytische Messtechnik GmbH
##OWNER= root
$$ XWIN-NMR		Version 3.5
$$ Tue Jun  2 16:57:26 2026 Russian Standard Time (UT+4h)  Yarkov@DPX200
##.OBSERVE FREQUENCY= 81.013821
##.OBSERVE NUCLEUS= ^31P
##.DELAY= (6, 6)
##.ACQUISITION MODE= SIMULTANEOUS
##.ACQUISITION SCHEME= undefined
##.AVERAGES= 64
##.DIGITISER RES= 17
##SPECTROMETER/DATA SYSTEM= spect
##.PULSE SEQUENCE= zgpg30
##.SOLVENT NAME= D2O
##.SHIFT REFERENCE= (INTERNAL, D2O, 0, 243.863)
##AUDIT TRAIL= $$ (NUMBER, WHEN, WHO, WHERE, WHAT)
$$ ##TITLE= Audit trail, XWIN-NMR		Version 3.5
$$ ##JCAMPDX= 5.01
$$ ##ORIGIN= Bruker BioSpin GmbH
$$ ##OWNER= Yarkov
$$ C:/Bruker/XWIN-NMR/data/yarkov2/nmr/P31/2/audita.txt
$$ ##AUDIT TRAIL=  $$ (NUMBER, WHEN, WHO, WHERE, WHAT)
(   1,<2026-06-02 16:56:32.78 +0400>,<Yarkov>,<DPX200>,
      <created by zg, POWCHK disabled, PULCHK disabled
       configuration hash MD5:
       00 E9 B6 7A A2 85 ED C7 34 08 36 98 17 FE 4E 26
       data hash MD5: 32K
       F7 D4 CB 48 5F B8 F0 12 0A E4 20 B8 D7 C0 70 83>)
$$ ##END=
$$ 
$$ hash MD5
$$ F9 39 31 FE 17 8B 29 CD DC CB 0C 93 D8 A5 38 5B
##$RELAX= 
##$RELAX= 
##$RELAX= 
##$RELAX= 
##$RELAX= 
##$RELAX= 
##$RELAX= 
##$RELAX= 
$$ Bruker specific parameters
$$ --------------------------
##$DU= <C:/Bruker/XWIN-NMR>
##$EXPNO= 2
##$NAME= <P31>
##$PROCNO= 1
##$TYPE= <nmr>
##$USER= <yarkov2>
##$AMP= (0..31)
100 100 100 100 100 100 100 100 100 100 100 100 100 100 100 100 100 100 
100 100 100 100 100 100 100 100 100 100 100 100 100 100 
##$AQSEQ= 0
##$AQ_mod= 1
##$AUNM= <au_zg>
##$AUTOPOS= <>
##$BF1= 81.014009
##$BF2= 200.13
##$BF3= 200.13
##$BF4= 200.13
##$BF5= 200.13
##$BF6= 200.13
##$BF7= 200.13
##$BF8= 200.13
##$BYTORDA= 1
##$CFDGTYP= 0
##$CFRGTYP= 5
##$CHEMSTR= <none>
##$CNST= (0..31)
1 1 145 1 1 1 1 1 1 1 1 1 1 1 1 1 1 1 1 1 1 1 1 1 1 1 1 1 1 1 1 1 
##$CPDPRG= <waltz16>
##$CPDPRG1= <>
##$CPDPRG2= <waltz16>
##$CPDPRG3= <>
##$CPDPRG4= <mlev>
##$CPDPRG5= <mlev>
##$CPDPRG6= <mlev>
##$CPDPRG7= <mlev>
##$CPDPRG8= <mlev>
##$CPDPRGB= <>
##$CPDPRGT= <>
##$D= (0..31)
0 1 0 0 0 0 0 0 0 0.06 0 0.03 2e-05 3e-06 0 0 0.0002 0 0 0 0 0 0 0 0 0 
0 0 0 0 0 0 
##$DATE= 1780404992
##$DBL= (0..7)
120 120 120 11 120 120 24 19 
##$DBP= (0..7)
150 150 150 150 150 150 150 150 
##$DBP07= 0
##$DBPNAM0= <>
##$DBPNAM1= <>
##$DBPNAM2= <>
##$DBPNAM3= <>
##$DBPNAM4= <>
##$DBPNAM5= <>
##$DBPNAM6= <>
##$DBPNAM7= <>
##$DBPOAL= (0..7)
0.5 0.5 0.5 0.5 0.5 0.5 0.5 0.5 
##$DBPOFFS= (0..7)
0 0 0 0 0 0 0 0 
##$DE= 6
##$DECBNUC= <off>
##$DECIM= 4
##$DECNUC= <off>
##$DECSTAT= 4
##$DIGMOD= 1
##$DIGTYP= 9
##$DL= (0..7)
0 0 52 120 120 21 21 25 
##$DP= (0..7)
150 150 150 150 150 150 150 150 
##$DP07= 0
##$DPNAME0= <>
##$DPNAME1= <>
##$DPNAME2= <>
##$DPNAME3= <>
##$DPNAME4= <>
##$DPNAME5= <>
##$DPNAME6= <>
##$DPNAME7= <>
##$DPOAL= (0..7)
0.5 0.5 0.5 0.5 0.5 0.5 0.5 0.5 
##$DPOFFS= (0..7)
0 0 0 0 0 0 0 0 
$$ [...]
##$SUBNAM1= <"">
##$SUBNAM2= <"">
##$SUBNAM3= <"">
##$SUBNAM4= <"">
##$SUBNAM5= <"">
##$SUBNAM6= <"">
##$SUBNAM7= <"">
##$SUBNAM8= <"">
##$SUBNAM9= <"">
##$SW= 400.765351723535
##$SWIBOX= (0..15)
0 1 3 0 0 0 0 0 0 0 0 0 0 0 0 0 
##$SW_h= 32467.5324675325
##$TD= 32768
##$TD0= 1
##$TE= 0
##$TE2= 300
##$TE3= 300
##$TEG= 300
##$TL= (0..7)
0 120 53 12 22 120 120 120 
##$TP= (0..7)
150 150 150 150 150 150 150 150 
##$TP07= 0
##$TPNAME0= <>
##$TPNAME1= <>
##$TPNAME2= <>
##$TPNAME3= <>
##$TPNAME4= <>
##$TPNAME5= <>
##$TPNAME6= <>
##$TPNAME7= <>
##$TPOAL= (0..7)
0.5 0.5 0.5 0.5 0.5 0.5 0.5 0.5 
##$TPOFFS= (0..7)
0 0 0 0 0 0 0 0 
##$TUNHIN= 0
##$TUNHOUT= 0
##$TUNXOUT= 0
##$USERA1= <user>
##$USERA2= <user>
##$USERA3= <user>
##$USERA4= <user>
##$USERA5= <user>
##$V9= 5
##$VALIST= <valist>
##$VCLIST= <CCCCCCCCCCCCCCC>
##$VD= 0
##$VDLIST= <DDDDDDDDDDDDDDD>
##$VPLIST= <PPPPPPPPPPPPPPP>
##$VTLIST= <TTTTTTTTTTTTTTT>
##$WBST= 1024
##$WBSW= 4
##$XGAIN= (0..3)
0 0 0 0 
##$XL= 0
##$YL= 0
##$YMAX_a= 8481
##$YMIN_a= -8746
##$ZGOPTNS= <>
##$ZL1= 120
##$ZL2= 120
##$ZL3= 120
##$ZL4= 120
##$ABSF1= 60
##$ABSF2= -190
##$ABSG= 5
##$ABSL= 3
##$ALPHA= 0
##$AQORDER= 0
##$ASSFAC= 0
##$ASSFACI= 0
##$ASSFACX= 0
##$ASSWID= 0
##$AUNMP= <proc_1d>
##$AZFE= 0.1
##$AZFW= 0.5
##$BCFW= 1
##$BC_mod= 2
##$BYTORDP= 1
##$COROFFS= 0
##$CY= 9.86611175537109
##$DATMOD= 1
##$DC= 1
##$DFILT= <>
##$DTYPP= 0
##$F1P= 182.462994727601
##$F2P= 168.069089081705
##$FCOR= 0.5
##$FTSIZE= 0
##$FT_mod= 0
##$GAMMA= 1
##$GB= 0
##$INTBC= 1
##$INTSCL= 1
##$ISEN= 30
##$LB= 1.5
##$LEV0= 0
##$LPBIN= 0
##$MAXI= 11.51145
##$MC2= 0
##$MEAN= 0
##$ME_mod= 0
##$MI= 1.244541
##$NCOEF= 0
##$NC_proc= 0
##$NLEV= 6
##$NOISF1= 0
##$NOISF2= 0
##$NSP= 1
##$NTH_PI= 0
##$NZP= 1
##$OFFSET= 243.8632
##$PC= 1.4
##$PHC0= 1599.201
##$PHC1= 73.15952
##$PH_mod= 0
##$PKNL= yes
##$PPARMOD= 0
##$PSCAL= 0
##$PSIGN= 0
##$REVERSE= no
##$SF= 81.0140731611343
##$SI= 65536
##$SIGF1= 0
##$SIGF2= 0
##$SINO= 80
##$SIOLD= 65536
##$SREGLST= <31P.CDCl3>
##$SSB= 0
##$STSI= 0
##$STSR= 0
##$SW_p= 25641.0256410257
##$SYMM= 0
##$S_DEV= 0
##$TDeff= 0
##$TDoff= 0
##$TI= <>
##$TILT= no
##$TM1= 0
##$TM2= 0
##$TOPLEV= 0
##$USERP1= <user>
##$USERP2= <user>
##$USERP3= <user>
##$USERP4= <user>
##$USERP5= <user>
##$WDW= 1
##$XDIM= 64
##$YMAX_p= 0
##$YMIN_p= 0
$$ End of Bruker specific parameters
$$ ---------------------------------
##NTUPLES= NMR FID
##VAR_NAME=  TIME,          FID/REAL,        FID/IMAG
##SYMBOL=    X,             R,               I
##VAR_TYPE=  INDEPENDENT,   DEPENDENT,       DEPENDENT
##VAR_FORM=  AFFN,          ASDF,            ASDF
##VAR_DIM=   16384,         16384,           16384
##UNITS=     SECONDS,       ARBITRARY UNITS, ARBITRARY UNITS
##FACTOR=    3.08e-05,      1,               1
##FIRST=     0,             0,               0
##LAST=      0.5045964,     0,               0
##MIN=       0,             -8746,           0
##MAX=       0.5045964,     8481,            0
$$ Real data points
##PAGE= N=1
##DATA TABLE= (X++(R..R)), XYDATA
$$ [...]
7554 -219 590 523 -106 -663 -1286 442 -287 691 1401 688 1069 -1470 -661 -1272 202 -292 982 459 -1543
7573 -1543 66 -894 148 9 438 206 -62 466 -915 -1567 -1374 -116 236 852 1401 -549 -654 141
7591 141 -1084 -274 370 1071 -675 -400 -107 -536 413 -440 1484 -13 1005 -110 -496 578 -707
7608 -707 99 1088 382 -69 -325 -115 -124 754 -657 647 668 -1957 1069 -552 -1197 1044 846 335 -518
7627 -518 -726 437 -676 -87 191 646 -81 190 66 -114 -1796 -1774 -38 823 -552 992 105 -702
7645 -702 -1437 116 32 1114 479 -331 1036 -1248 715 -224 -571 -275 -114 987 -1074 -328 -1296 415
7663 415 490 195 1113 -140 -1119 -545 -851 -1040 -286 450 638 1096 656 -473 -321 350 -211 438 1188 -319
7683 -319 -638 305 -78 -86 -462 1500 -477 -49 608 -716 -257 -523 -341 -166 60 1365 485 -78 -539
7702 -539 -399 730 310 1867 -20 795 -1399 -566 -943 -767 591 -188 839 -471 -931 -474 -949 951
7720 951 360 1712 -775 31 -941 -568 -897 -1733 886 579 1497 -954 -332 -55 463 1033 1593 757 -34
7739 -34 -730 -700 -1116 -189 -30 460 1091 883 1258 -175 -147 -79 -580 1225 -37 279 -828 685 -115 126
7759 126 109 44 1226 -337 1146 421 -901 1190 784 504 813 424 -1420 -2048 -1151 -933 1171 -178
7777 -178 921 681 -888 -555 -907 -62 1129 1446 616 -134 238 -975 -300 18 93 1504 203 -472
7795 -472 -824 -188 -82 -922 742 323 645 -461 -623 -1261 108 557 -631 1555 -276 -1277 223
7812 223 -1581 75 -309 1637 258 399 -65 -669 -55 -229 1060 427 1602 1012 -981 805 63
7829 63 -221 -413 221 918 -392 1597 -1750 278 -836 63 1864 241 575 -771 184 -760 -72 335
7847 335 -199 723 117 -30 -1617 -1470 -206 -871 -290 -317 481 -336 -1341 -532 -184 377 235 974 230
7866 230 -1898 -786 -747 -208 -35 523 2160 890 617 -1987 -704 -428 611 178 455 390 38 -1384
7884 -1384 -983 146 763 146 1248 697 -582 -122 -981 626 889 761 251 -51 -365 -804 539 -948
7902 -948 1391 675 1499 -782 382 -179 -1089 697 -687 733 599 -247 -166 -1757 -1061 -830 1817 1053
7920 1053 -336 170 -820 704 -1319 586 521 466 1154 -1599 -645 -1048 533 39 226 1713 -1508 768
7938 768 -186 195 -140 -218 1276 -358 18 610 -122 207 -188 -812 -394 94 153 -550 -427 -922 321 -768
7958 -768 516 119 1857 -74 -1633 -16 -549 7 288 963 398 -1054 298 -572 -1387 510 -75
7975 -75 1274 209 779 -1520 -430 594 -455 1988 -537 1364 -446 284 -816 -82 -116 893 1056
7992 1056 710 579 17 -2179 530 508 689 1277 517 311 -643 -55 -529 70 1854 1224 967 -662 -148
8011 -148 -1272 -228 1011 774 1784 -732 6 -1241 455 389 -68 3097 242 346 -738 -265 -459
8028 -459 -705 1018 237 1734 -229 -488 -1563 -1086 954 -180 891 396 511 -868 -707 579 -1543
8045 -1543 750 -73 324 -38 252 760 -748 423 1077 -245 -185 538 -151 -639 -808 523 1842 1734
8063 1734 -558 302 -612 -1026 -1492 390 440 415 186 -298 267 -1493 -796 494 -304 980 36 664 -252
8082 -252 -892 591 -271 1053 418 266 -280 -1401 86 -917 470 108 605 1706 -171 -102 -1425
8099 -1425 -632 -1102 155 678 -746 1444 -1289 375 -558 78 1560 19 835 -1858 -1515 -1881 -260
8116 -260 564 413 1513 -851 -1313 308 -1369 -520 -1258 420 -312 1144 -272 -910 1442 -805 -371
8133 -371 1008 780 1143 744 -1951 -959 163 288 729 0 -1 -14 -1041 -350 219 585 756 809 1347 -460
8153 -460 -48 -1467 148 1227 191 1718 -558 -315 -640 -1006 43 298 1900 -629 -105 -802 -685
8170 -685 -738 -891 1858 638 40 947 -1405 -289 -919 -185 -131 327 1539 -1450 -247 -1119 -158 -453
8188 -453 -319 1600 421 142 -1643 669 202 781 1133 -330 370 384 -35 -1498 -1167 -855 -35 1460
8206 1460 859 357 -1206 -974 800 -207 1323 287 1099 597 -1462 -148 -1330 -173 -171 808 -23
8223 -23 264 -307 -1063 -1127 -423 249 638 306 -899 -1225 121 -921 -89 261 168 -263 -1326 -222 -560
8242 -560 -199 -28 1060 1351 -515 293 -643 -1215 713 -699 1753 459 860 -1521 -1333 -1052 115
8259 115 393 382 642 380 156 -1384 -1193 -197 897 761 358 53 1137 -93 681 -324 220 776 656
8278 656 213 -1589 -665 -952 157 150 -336 1256 480 -78 -699 -618 456 -88 1364 345 386 213 -182
8297 -182 -951 -607 1181 -1804 1087 567 -613 -1209 96 626 -253 980 467 162 36 -379 440 -282
8315 -282 79 -39 637 -912 -1630 -522 -1335 -973 1002 874 298 -481 179 -764 -404 23 343 1194 350
8334 350 819 127 -118 -603 473 689 -625 975 144 150 -406 -689 164 1043 1087 163 -317 -315 -1112 1070
8354 1070 -214 1073 -233 430 822 -1134 -1110 -463 278 1062 647 982 45 -349 -556 -929 -11 23 797
8373 797 439 -722 -251 87 -24 -56 320 -9 338 -153 -365 -244 -68 749 228 342 -1315 473 -929
8392 -929 -918 -8 -91 -76 107 289 -221 -1697 924 -368 732 278 839 -160 634 128 -1185 286 456
8411 456 788 514 -669 441 -1244 660 849 -62 1782 -75 752 -1171 -490 -142 -308 1555 440
8428 440 778 52 -338 -237 -1308 -713 -453 1520 1417 1969 226 -2094 681 131 -350 255 552 41
8446 41 -697 46 -646 589 -345 844 1050 -446 -41 -1292 -939 -1219 266 1358 -318 679 511 -528
8464 -528 -588 -540 139 420 1161 -63 -56 -510 -986 421 851 290 -156 871 -1105 -1565 -287 -428 413 -685
8484 -685 382 -352 -286 359 -535 374 848 916 644 -491 556 -843 144 624 752 877 -211 391 -1113
8503 -1113 -24 -177 389 182 -165 1576 77 -82 507 -882 992 -460 341 718 301 -1831 -1286
8520 -1286 602 -912 1175 -452 26 -551 -298 942 -944 -72 392 939 -749 -1068 114 -303 -28
8537 -28 -628 520 206 67 365 -791 128 -1316 658 934 -657 -312 -204 27 -1171 -373 564 112
8555 112 -219 -1155 -1634 -937 -236 233 252 1011 -387 246 -271 -1250 301 -834 361 -267 -859 524 -1505
8574 -1505 -326 -954 206 1447 -69 459 -926 -929 -1090 112 10 -126 802 716 1249 -238 453 -910
8592 -910 68 276 407 -93 2 342 -814 121 -474 241 -5 -438 -638 59 -999 -429 -190 499 -588
8611 -588 -97 -492 442 133 -649 831 908 1097 -1138 -125 554 -1134 277 474 35 2086 1119 5
8629 5 -149 634 -437 366 128 -829 233 -801 -2330 -2491 -269 1195 -111 -5 -241 177 -702 -725 -62
8648 -62 509 1483 -163 653 161 -171 -1120 -685 1008 -232 850 314 -514 1204 -765 1310 967 1261
8666 1261 374 -749 -59 -432 -507 -964 594 -181 -1130 1408 610 -1601 -541 209 -401 -814 648 -10
8684 -10 442 -819 -1075 265 -194 -249 -1498 -208 -1287 136 -420 1108 -357 651 563 -1648 49
8701 49 -544 -240 333 -376 786 235 -49 -78 -1368 1520 -300 1199 259 447 -1 -1618 -515 -1302
8719 -1302 1129 147 517 341 75 -464 511 -738 -10 -800 834 -705 614 -1132 -195 48 347 855
8737 855 181 1801 -597 -940 -539 -773 -102 -154 612 -4 -227 -444 -2033 -868 -303 118 992 1270 -582
8756 -582 -1928 90 -31 324 794 818 664 -915 216 -134 743 -435 -301 1301 -945 1246 -986
8773 -986 -524 1242 -921 626 -453 -600 -373 -738 -269 742 1232 201 1171 -63 667 6 -1734
8790 -1734 460 215 399 -597 -674 -433 -500 364 -266 909 664 760 67 -510 -606 113 -22 101 -48 377
8810 377 -1393 -396 -836 -108 270 -327 469 -138 -173 -1316 852 -657 -630 -174 957 726 -730 -355 -439
8829 -439 -1459 386 401 872 640 -472 -737 -294 1111 -566 488 1452 221 -96 -1589 -208 -1073
8846 -1073 1049 1634 1241 646 -957 -271 -1210 264 -171 -117 758 -38 -169 -1385 -245 -53 -295 1767
8864 1767 -224 816 -640 -492 -701 -476 733 -177 429 60 -1457 -500 -1176 -12 233 1172 670 -55
8882 -55 842 -1049 275 -467 974 763 815 686 -946 -1464 -331 276 -29 858 1430 314 -151 -960 108
8901 108 -132 350 1050 -603 944 -1656 -435 195 -387 854 58 1728 257 630 -990 -94 -174 -518
8919 -518 -30 920 616 -542 -496 -469 -640 588 1208 819 511 -1034 -341 146 -108 306 -340 790 -168
8938 -168 168 -426 -368 579 9 1365 -255 379 138 -606 71 -656 733 357 690 -1518 -671 -1258 -917
8957 -917 282 621 1327 56 329 265 -1214 416 -801 -417 211 1089 800 -2260 928 -1266 394
8974 394 -298 -145 -67 -419 -864 -1449 356 -921 460 1260 -189 1336 -1295 205 -853 -329 840
8991 840 1055 -208 -814 -115 -1138 -228 222 32 1146 -345 -124 1 -1801 441 471 1380 758 261
9009 261 231 -809 -1132 -387 113 -297 1026 626 582 282 -1055 -160 74 260 166 -327 712 -587 -1012
9028 -1012 851 1083 -58 396 -273 -650 -402 -2104 -484 1768 344 753 -718 -475 -444 -201 677 288
9046 288 842 1150 -359 -458 -286 -489 -303 863 824 531 435 -825 -237 -1229 -747 1303 521 -18 -1016 805
9066 805 -1642 -547 -1644 400 396 123 -641 -1242 -234 -495 -1107 77 -282 1330 -614 -77 -970 -166
9084 -166 125 605 1343 112 -16 -853 -25 -341 -157 905 -576 1333 6 -1136 -1318 -19 31 556
9102 556 493 10 170 2 -1313 302 -1219 1889 724 -345 512 -473 -1409 -400 663 623 428 1103
9120 1103 85 -555 -1428 -223 -485 -677 900 -825 -564 71 -1489 165 -1276 449 392 1169 -223
9137 -223 -573 -730 -1143 2023 315 756 258 -429 -345 -978 -477 -1219 1212 -406 390 -163 -676 -1388 -1050
9156 -1050 1125 251 585 1870 -258 -1161 -715 339 58 1159 1313 -445 827 -1400 -459 -1316 -56
9173 -56 859 -518 519 -1644 882 -285 -205 -328 -472 824 302 -1347 -587 -616 -361 -773 25 626 181
9192 181 165 -758 -656 -1370 1397 382 959 573 -550 -1098 -1140 225 774 155 399 -377 76 -689 -553
9211 -553 -62 -1438 1189 -94 837 -326 -562 -329 -983 -3 665 30 -247 -447 -158 -1281 884 1279
9229 1279 1340 644 573 107 -960 1075 91 -249 -27 814 -37 -484 466 105 -72 326 608 1114 -193
9248 -193 819 -259 -853 -237 134 1801 164 360 -183 586 -111 260 1034 1379 1613 -133 -37 -268 14
9267 14 340 84 -691 -77 -756 -1004 -1175 258 -477 691 65 -11 -51 -1314 -1479 -2033 -496 -827 1144
9286 1144 577 -181 1075 -2340 -252 -284 -126 415 -334 -246 -1823 -234 903 380 778 366 417 -262 840
9305 840 -1259 -836 1018 1244 629 -802 78 147 -1413 371 704 479 -12 442 -394 -1112 404 -175
9323 -175 433 859 1334 2039 -807 475 -1686 124 -482 1146 1395 -249 526 -870 -444 159 742 498
9341 498 699 1053 -1260 1445 -821 -210 1177 336 1920 -248 -119 -895 -881 -775 636 1828 769
9358 769 -236 -738 -933 -27 -736 1146 -211 755 -738 -1482 1064 -694 933 -806 65 507 -922
9375 -922 376 -625 879 -432 1080 180 -180 36 -414 -410 131 -199 70 759 1363 -1042 -609 -1398 -144
9394 -144 402 117 -220 -203 151 -46 -489 167 -634 1109 313 -219 -698 8 -610 -1229 428 51 -1043
9413 -1043 964 1101 -341 -862 277 -39 1833 1173 595 799 -1038 34 -646 -418 973 -735 1138
9430 1138 -781 426 -555 -788 -739 -710 867 307 237 -147 -57 -97 -423 456 223 859 -571 -153 410 -43
9450 -43 14 553 733 274 -1063 -611 -166 453 -379 449 44 -639 -143 -84 -774 -279 99 370 -252 319 82
9471 82 -372 -694 690 696 -55 1009 -1135 -461 -183 -453 133 -646 1531 -278 -251 -56 -481 275 886 363
9491 363 -8 804 229 -170 1473 -44 -195 406 797 12 615 -297 -1035 684 292 -431 -51 -220 -203
9510 -203 -1191 258 -229 -292 120 843 198 -1577 287 35 -212 381 -796 134 400 841 58 -245 -546
9529 -546 -1071 1371 494 209 -235 -912 -468 -175 276 -921 417 1824 174 681 -627 1015 -1376
9546 -1376 809 -546 189 1159 -757 -211 55 183 711 331 -150 -1231 -277 -1736 -397 -846 -192 506
9564 506 -554 395 -1130 -510 -729 193 646 -530 947 -1272 -424 -1492 -475 1177 512 461 838 185
9582 185 69 -751 -37 -117 466 271 261 -891 -1098 -197 -606 100 173 444 336 -1104 -637 711 344 362
9602 362 532 529 -267 -775 -6 152 84 -111 607 535 82 250 -610 -250 -783 1366 -110 756 -816 147
9622 147 457 -1150 379 -180 624 460 183 -362 -1168 -5 -587 1324 375 436 -310 -275 -51 -152 632
9641 632 -742 611 950 -460 181 -544 496 171 -351 1130 -364 313 -1596 -1080 -1083 -467 707 -262
9659 -262 730 353 552 -335 -651 180 811 320 -168 -756 769 -916 691 711 1248 10 262 -721 -1879
9678 -1879 -279 -940 603 131 183 -234 -526 164 -936 605 568 1218 539 -127 575 -293 -235 -47 -561
9697 -561 840 -1008 185 475 -712 -535 -859 409 464 451 -516 -366 357 -574 -727 241 -29 406 254
9716 254 -1254 -1539 640 211 1258 1168 156 671 -600 37 459 61 584 584 522 -904 1175 403 -75
9735 -75 780 610 99 771 703 -908 -411 -955 325 993 200 2071 -174 -674 -603 -220 302 190 617 786
9755 786 711 130 -480 793 -102 2088 126 231 -38 -1401 -71 -357 545 -176 1015 -446 -678 1091
9773 1091 -72 -67 239 -824 -701 -1278 -423 -8 190 -889 1027 206 364 1407 382 -609 -364 -721
9791 -721 1531 45 1370 -199 -258 637 577 -113 114 631 -923 -180 56 -275 78 -2037 996 1745
9809 1745 1647 303 -1272 18 -94 1370 608 -784 1267 -606 233 185 -430 354 -502 -61 108 551
9827 551 -124 -778 -1090 242 360 125 94 -934 -837 -1362 -356 303 -714 1508 -395 -141 -350 361 -525
9846 -525 -1464 941 -103 -131 -1074 -194 765 -1159 52 -205 1222 -12 -567 -1090 -816 180 17 1114
9864 1114 1330 -8 461 -400 242 -494 476 55 796 640 -1091 38 -996 -152 -343 413 1420 -1403
9882 -1403 -1196 -751 -557 511 207 1362 227 659 -273 -2318 -917 -1526 -27 -105 738 310 -181 -222
9900 -222 -860 -160 604 115 640 -424 597 -369 637 501 1126 789 -274 1542 -836 617 -739
9917 -739 -76 484 501 883 690 -836 -473 -184 244 -612 255 -38 513 -992 -2152 -616 -254 1648 -398
9936 -398 617 770 150 -480 -961 320 -304 647 -203 -386 378 -64 1070 -751 1112 1940 -143 -112
9954 -112 -618 -736 -1034 -395 -117 -205 976 -488 -867 -1101 -1223 -816 1139 997 477 -760 -373 -628 -488
9973 -488 643 1822 627 464 -481 -784 381 139 1872 265 684 378 -296 114 -1252 -503 118 595
9991 595 1364 1356 725 -1202 329 -280 -37 616 986 509 -643 -822 -1178 -994 217 -261 933 339 -473
10010 -473 -528 222 30 -887 1028 905 1015 -682 36 -509 -260 785 -530 -15 -706 -287 -205 -1573 -786
10029 -786 -1042 771 1276 477 -436 35 -476 -359 1008 1351 1573 982 225 660 -553 9 -96 408 816
10048 816 -295 -365 -931 -314 -202 -211 1168 117 1309 -879 184 -267 -841 504 -601 705 314 770
10066 770 -53 -639 -585 -885 301 1207 -529 30 -442 -229 -925 -75 1096 -199 433 -979 -581 -1559
10084 -1559 1363 -139 1185 135 -1199 -168 -1464 136 81 -461 2053 636 1348 -1454 701 -691
10100 -691 66 644 119 -1086 292 -1040 -2102 32 401 207 109 -675 -1375 420 -1909 512 -740
10117 -740 415 13 1745 -285 -509 -628 -418 -35 149 1318 82 -685 -545 -1180 244 890 625 1180
10135 1180 -459 -245 -604 -276 -630 -295 242 104 1100 547 659 -442 242 242 157 1392 9 361 -855
10154 -855 -1579 667 -646 -210 -543 695 -548 -1008 -383 -467 -158 893 516 1628 -175 1133 -930
10171 -930 -1183 -292 -166 72 -781 -666 -1507 311 -764 185 708 1013 1375 -1060 -450 208 9 1044
10189 1044 448 1417 284 -331 -951 -350 1137 881 890 -329 -446 -466 -109 319 -512 1281 -1601 295
10207 295 650 -1048 -297 -1466 -1010 -748 210 1244 -331 1221 -1199 -10 152 278 -165 364 654
10224 654 799 -371 -522 351 727 -653 -772 -581 -116 -830 624 729 -402 502 -24 -4 -530 -24 -207
10243 -207 -919 1440 -679 -538 -224 -28 -754 -1314 -56 330 1224 -164 -174 -509 -426 -691 -659 1339 1192
10262 1192 886 748 -855 185 -1179 162 503 -69 852 -1043 -80 -1027 -335 -191 55 1574 -1185
10279 -1185 -292 -959 -947 213 108 -13 -243 329 167 -1154 -131 -449 1338 1100 -54 -67 -141 -462 -1078
10298 -1078 -520 -252 786 1585 355 524 -1596 -466 -1112 11 281 428 1239 78 -1151 223 98
10315 98 -213 -256 873 -46 691 268 -1298 151 166 1599 139 -604 -623 -587 -323 4 391 374 -44 -418
10335 -418 -1571 -1431 -489 196 -285 1451 530 -411 -522 -1521 659 401 663 473 -223 81 58 108 -657
10354 -657 1848 713 -256 690 -1416 423 -755 -522 46 -180 961 -102 770 -271 -726 103 188
10371 188 2476 -143 692 638 -161 887 -1287 501 175 746 2183 1635 226 123 -68 -355 -952 192
10389 192 346 635 17 -1136 -199 -196 461 -1518 384 -380 -58 -178 -826 -684 130 775 -732 1135 -1250
10408 -1250 258 -808 -336 -577 -450 -56 -1160 587 -637 -638 -274 -783 610 -624 -750 118 -457 56
10426 56 -21 214 196 966 -410 -663 -864 566 825 -787 815 44 -556 -891 -752 -586 -853 1767 -589
10445 -589 414 -1056 -732 -902 99 -797 -853 470 1130 450 -732 1594 717 -722 -799 1126 -354
10462 -354 -930 221 -579 -454 1165 612 -804 -288 96 -1389 -144 408 987 102 223 -520 -1297 -42
10480 -42 -1732 143 775 1508 1613 -157 -368 -613 229 -695 -669 189 234 -213 -444 326 -1108 437 1386
10499 1386 32 916 153 -189 -600 -37 779 -897 -137 974 205 -774 421 687 892 1159 -420 390
10517 390 -98 585 -1009 -163 82 -184 -26 666 -4 501 -973 70 -924 1163 264 -235 -630 -757
10535 -757 -682 -1064 647 -43 844 1419 -247 -352 -134 91 5 404 997 -577 954 -296 912 650
10553 650 -1051 1305 -297 219 369 -195 301 -757 968 -329 -428 664 -603 530 -1139 17
10569 17 -238 1060 688 -710 629 -431 -225 -614 -66 510 -76 -198 -415 -616 -1265 -372 -846 -546 240
10588 240 173 -314 -500 -46 1310 910 349 250 739 -548 -348 167 -1589 863 262 1340 -317 -171
10606 -171 271 -507 1 -628 443 634 320 491 -472 -576 -54 621 809 245 -57 -917 -959 -115 -244 -635
10626 -635 1041 1138 -688 558 -1292 -794 450 15 1690 -1008 -221 -18 -143 -450 -301 1569 627
10643 627 1299 396 -1955 828 -787 845 -47 -875 -440 -722 709 15 320 -326 -751 -236 -1420 55
10661 55 -252 -809 460 -304 238 -688 142 -557 -250 -967 -53 890 -1346 433 -384 412 -857 -174 661
10680 661 -883 884 274 118 -255 -674 135 -260 1194 -675 333 -22 -575 -198 -502 730 -481
10697 -481 148 420 -1035 549 178 -198 -52 701 1443 422 1446 -1645 -129 -200 68 -271 15 385
10715 385 316 -10 -1266 930 -543 -616 1564 63 1985 -703 -926 381 196 915 695 381 -790
10732 -790 -167 -881 7 -108 -493 293 75 -390 -265 -1801 859 -84 -161 974 404 201 -905 211
10750 211 -691 88 678 696 994 50 247 -272 -645 -106 712 944 -320 1326 1028 -653 -187 -536 -38
10769 -38 2 333 315 -267 -664 -509 -379 30 197 -273 1053 -502 -1309 946 -110 1222 492 -824 437
10788 437 -1087 -586 -955 778 692 305 423 -1526 761 326 537 266 -318 -22 21 -52 381 618 291
10807 291 20 356 -549 312 -116 -302 -204 410 913 -1153 657 -280 -134 -773 -472 1022 -606 509
10825 509 74 -634 -643 -1218 -201 -2 1231 753 439 -107 -344 568 173 -1278 610 -311 283 -568 -671
10844 -671 -1237 -1240 396 -307 356 -270 1061 -71 -1203 -866 -1079 311 -1058 245 146 -1054 -1408 -1437
10862 -1437 149 1250 232 -1067 -74 1043 -1825 -276 772 1660 -104 -942 -561 -560 375 -598 559
10879 559 637 -649 180 -1413 88 38 431 1139 44 -483 637 462 -859 269 72 1122 -779
10896 -779 -33 936 777 -595 -176 415 1128 -109 650 -582 -19 -428 -178 -1195 78 558 193 572
10914 572 -1337 228 -9 496 637 -273 625 -548 -523 130 401 668 119 1090 -626 -35 162 -770 393
10933 393 110 43 2001 -251 1010 -942 -885 428 -275 -44 -1323 1036 99 -806 -594 -1160 594 -13
10951 -13 557 652 573 59 -657 -526 604 1431 243 -432 7 -74 -569 17 -477 916 701 29 -327 -320 -705
10972 -705 -1207 438 -79 196 35 -489 -1450 -393 545 -589 1456 -102 551 -754 -266 -1081 -577 722
10990 722 -395 1122 420 -1117 524 -785 466 263 922 -31 1377 -418 -138 1095 -1062 704
11006 704 242 818 213 -616 -925 -998 -759 -84 471 99 -151 57 -2161 182 -596 -812 1986 272 -491
11025 -491 -1285 -354 53 -476 -4 166 885 222 135 -589 -516 457 447 809 137 519 -168 -944 38 -1489
11045 -1489 688 1459 127 -99 -820 589 -1427 -230 711 514 289 275 116 -1254 -426 -603 375 874
11063 874 536 968 -636 -135 -517 324 813 -507 1586 -616 216 -461 -1463 -116 308 109 -1255
11080 -1255 1017 -408 -1443 -455 598 103 191 985 907 -866 -165 -1274 813 252 1441 62 770
11097 770 54 -972 -291 -57 263 411 -1170 532 -738 534 -494 507 180 1769 1268 -72 637
11114 637 -1912 -184 -197 213 459 -263 137 -414 -44 -953 -347 428 212 1058 527 -652 -1006 -1283 604
11133 604 133 1650 -170 -263 435 -1280 88 -626 724 271 -265 568 -322 -106 824 647 882 187
11151 187 372 -598 368 -566 859 -423 602 970 -129 -756 -987 -491 -368 -693 172 -934 1175 -1343
11169 -1343 -1060 -664 -1597 1012 -57 1103 -174 -1247 -1367 -1869 -49 263 877 868 -80 505 -1110 157
11187 157 -812 414 723 233 117 -1329 -171 -250 1374 -1649 17 919 -1153 176 -1473 465 -1629
11204 -1629 -446 739 64 1305 -21 -707 -1092 -865 441 406 1221 -622 -904 379 -1051 -131 -352
11221 -352 1307 -197 -122 -423 -247 1819 -374 165 961 771 338 -18 954 -82 912 650 1227 640
11239 640 -795 825 -1059 -255 -635 -253 1045 136 774 -1285 220 172 -287 -810 1074 1451 -1019
11256 -1019 -1104 -1068 -1129 -36 -1057 431 426 160 387 -2100 -253 -315 602 -326 470 -49 -1212 104 -1001
11275 -1001 500 42 1856 970 283 -154 -1237 755 -553 467 1323 73 163 -937 -208 -416 728
11292 728 227 74 1197 -758 305 270 -674 1105 -575 1320 -122 -735 487 -1272 -236 29 -718
11309 -718 861 -652 -350 -439 -148 -1339 441 853 -231 -633 1031 145 -979 -163 -182 -142 101 -371
11327 -371 72 -468 405 314 277 166 484 1048 -866 -847 -956 -44 -685 562 282 1104 1028 -599 -1612 162
11347 162 -21 913 1424 426 68 161 691 -933 -586 800 546 -35 -262 -253 -1655 977 540 649 1192
11366 1192 -381 209 -943 -710 -189 210 -738 457 329 196 -266 -1011 -538 492 181 461 -300 -999
11384 -999 -82 -694 -939 -199 1379 -561 689 -1054 -551 118 -1209 274 -263 912 42 -1272 -563
11401 -563 -1321 1220 -247 638 1310 63 1091 870 515 365 -412 222 -299 -14 -176 -1363 -298 375
11419 375 1104 216 765 233 -456 213 -1871 292 -1505 1005 -968 219 27 -418 812 -254 1324
11436 1324 445 187 -114 -598 -71 -768 -344 405 538 792 -1283 117 -1279 390 -423 657 943 610
11454 610 -81 -589 1112 -576 132 57 356 -122 -18 -25 -104 -35 646 -86 280 26 403 57 -1220 -397
11474 -397 119 922 937 51 -455 -873 410 82 353 -642 -106 -553 298 1032 -870 889 386 -335 559
11493 559 -612 820 -660 -774 549 448 1208 439 355 -801 -582 -797 -1242 -570 647 -113 98 -509
11511 -509 662 -205 -520 -95 273 486 771 532 -155 144 434 849 373 715 1254 -196 -223 -1984 758
11530 758 -1167 239 -660 -858 -275 -2085 756 -867 1268 681 666 685 -338 -687 12 -819 201 -1337
11548 -1337 47 -731 -734 -1351 -824 578 825 476 -438 -543 -417 -1386 418 -206 915 596 -477 -440 111
11567 111 -231 -968 -955 341 667 -601 -539 -313 -748 989 -565 -116 -483 1019 144 -744 12 -803 375
11586 375 94 526 408 -46 1455 -316 -518 128 1068 421 59 697 299 -442 -982 91 1067 512 -214
11605 -214 -1136 -25 255 -1066 852 -757 -30 330 -2029 -835 -289 174 -265 1344 968 -217 1194
11622 1194 -505 525 361 873 -595 925 726 -176 -580 -782 1235 138 1558 869 -953 753
11638 753 -983 -751 265 -263 556 -652 381 325 -695 -1161 -23 464 198 746 -1188 1159 308
11655 308 -158 775 235 804 -595 864 533 -819 407 3 -968 911 128 43 -602 -693 -173 -406 636
11674 636 294 541 -209 334 -507 -882 851 393 -1165 -439 641 -486 388 -126 -528 398 -582 847
11692 847 -636 -526 -912 -146 -108 313 186 -217 267 -340 -214 633 -559 457 64 1279 79 -1090
11710 -1090 -82 266 -238 969 -450 -567 -671 533 -767 -1218 -385 -199 1489 26 513 -308 100
11727 100 -429 167 969 -290 450 261 465 -203 -370 1037 -225 1473 453 240 538 -296 845 -680
11745 -680 741 154 669 -782 -486 1039 -509 1725 -633 -88 -457 -226 -553 -284 512 127 475 708
11763 708 -740 538 -666 -392 -128 -347 489 -891 1321 -1394 605 67 688 48 -567 1517 -374
11780 -374 -552 -1642 -250 575 191 496 570 110 -970 -162 -1051 69 633 257 891 38 -259 -657 216
11799 216 1111 -874 -613 487 -1225 -16 -1002 783 -416 -301 -178 -785 374 -937 -610 -106 -47
11816 -47 629 -415 647 -77 -850 -192 117 1894 -328 694 -742 757 -1103 -1204 -520 115 872
11833 872 -667 333 323 -162 -4 234 609 -103 -408 -11 -903 -174 -732 357 381 -197 -763 -468 608
11852 608 -935 -71 -361 602 639 137 -105 -765 532 -851 377 -27 943 -169 -703 -397 -309 -462 -871
11871 -871 925 2400 730 820 -316 -1137 -1080 -651 -758 -163 141 -729 -765 -1007 -325 392 185 1572 253
11890 253 214 -574 -1382 118 44 -765 512 -616 510 -984 107 -1398 -532 1125 565 695 -589
11907 -589 -72 -990 32 -301 226 754 -231 186 -1328 48 246 -219 452 591 171 106 -1203 -319 -596
11926 -596 -218 610 525 -173 -255 -230 -346 285 1 902 72 -768 -278 -975 -388 -342 328 470 -230 263 -422
11947 -422 234 -119 -1009 419 550 1921 -541 513 -366 -165 365 -520 266 733 -660 -525 -1232 -720
11965 -720 -692 13 5 358 -359 -1348 -768 -539 662 460 403 -150 -489 836 -966 386 -117 615 1104 -275
11985 -275 1031 1072 737 -901 -427 -155 603 457 128 -224 560 -260 178 686 917 951 -216 196 -1325
12004 -1325 -557 -358 685 -68 217 659 159 231 -758 461 486 83 -229 -256 -777 -861 -158 161 876 718
12024 718 587 174 -30 -368 -361 -103 -241 -461 968 73 -1429 373 -217 436 396 1366 119 -1077 -1515
12043 -1515 -641 -950 -492 288 -326 1161 -281 -1218 -580 -1025 150 -892 1589 569 -327 545 -428
12060 -428 299 -1003 217 431 -272 -299 -66 -1090 -363 443 519 -123 850 -1106 426 -532 724 -392
12078 -392 759 1152 128 -162 -580 18 627 248 650 830 -205 409 -475 -732 111 436 -144 590 849
12097 849 -781 171 -741 462 -214 2137 937 -1007 241 -448 -1063 -500 -97 330 1093 338 -650 203
12115 203 -761 610 674 -635 746 -1817 279 -706 -278 -297 -724 795 67 -97 -1611 -975 -524 -611
12133 -611 987 -1146 1557 511 -525 -483 -1123 76 -812 1823 658 -325 -743 164 -597 -282 398
12150 398 447 -142 760 -487 -954 -383 5 309 1261 1290 -701 616 -244 -146 -311 647 520 -15 142 -576
12170 -576 534 -855 586 437 69 319 -343 -542 208 -1618 8 -94 657 -70 -518 -1301 -243 765
12188 765 -176 1721 1299 1322 -751 -847 -702 -785 187 -215 935 380 -1365 -854 -345 514 -552 505 730
12207 730 -646 172 385 -309 -928 -302 495 527 -28 630 -347 -527 -992 1138 -717 797 -22 145 182
12226 182 -1006 417 413 1162 448 786 -347 -1125 -634 -529 1094 -135 268 407 -454 0 -2340 -665
12244 -665 416 847 533 -1164 1463 -717 110 -780 93 452 1170 48 -734 506 -147 -8 1086
12261 1086 935 670 -1214 -260 366 10 655 614 1 49 50 -362 -1155 -707 -81 307 -541 831 86 67
12281 67 -323 -473 633 762 710 275 435 474 -461 712 141 197 31 -231 373 408 122 -47 -359 -60 -547
12302 -547 685 -619 -1005 -874 -774 351 -374 1366 45 389 1106 800 151 -783 347 688 362 -249
12320 -249 -251 144 -199 1639 1763 837 881 -217 -515 -1671 460 -1333 682 -129 744 -21 -377 381 -1607
12339 -1607 -1173 1013 1022 1342 130 -21 -375 -880 -533 -335 513 188 807 -847 -267 194 -901 724
12357 724 -125 135 176 393 -2 -1383 -47 346 -498 32 113 -599 -857 533 -114 123 602 943 1233
12376 1233 -584 -1113 -610 687 1379 767 251 -178 -773 -892 35 75 -273 1125 174 164 65 549 -151
12395 -151 81 814 458 -31 -558 79 -114 -182 2438 484 829 899 182 -650 -504 1029 251 1129 180
12414 180 -463 206 -694 320 -1181 547 -246 293 -660 -1396 857 -1064 -173 624 7 -103 -568 -548
12432 -548 -1091 -459 154 -753 816 -310 1238 -959 7 487 -69 241 197 -264 1304 830 -601 -497
12450 -497 318 230 197 637 836 -75 -1249 -172 533 -342 934 -544 267 -1031 -363 -1105 1439 -84
12468 -84 -706 588 -434 529 30 -1039 -342 -265 222 -184 36 -869 -740 28 -162 728 -86 -302 187
12487 187 1245 -261 -459 699 -106 831 466 -831 109 280 179 -7 -287 863 -518 155 -724 -46
12505 -46 -659 253 -403 -309 760 -1477 927 -868 -187 -452 -428 848 38 222 -176 -1021 444 -996
12523 -996 -278 -1566 307 153 209 -176 -819 1358 39 315 237 39 1072 -519 -762 45 -150 -847
12541 -847 -163 -24 -2336 198 383 722 229 348 2427 96 72 337 -503 -26 -35 -219 649 -389 -445
12560 -445 -834 171 76 506 917 1038 422 -462 -1066 186 385 1028 295 -15 -196 -371 -1016 -385 -54
12579 -54 497 -544 -20 3 -1024 -638 252 1098 -360 -216 -178 308 1497 -686 -598 5 338 778 83
12598 83 276 333 -185 1152 337 68 419 809 -1293 -441 -268 649 188 69 623 -671 -749 -770 70 303
12618 303 -1113 2035 -692 68 -419 -1118 -213 528 2183 -153 -255 34 -577 668 -985 1179 -224
12635 -224 916 863 -528 972 -539 -334 -488 235 975 -322 784 -182 -1030 991 48 1056 352
12652 352 1907 -83 -76 66 -263 -477 892 1351 -249 -560 -823 -204 -66 1025 909 -395 -217 -486
12670 -486 -114 709 35 825 -454 640 636 -1107 145 593 232 679 -87 725 -349 -395 -375 189 -516
12689 -516 -1380 818 -1058 314 -1290 -353 -645 -1027 -1200 -363 1663 51 -653 -330 5 1732 432
12706 432 1693 -601 393 -582 -662 -625 -435 697 -298 1023 -289 516 -1375 32 -346 -1558 -20
12723 -20 -517 -186 407 -1143 1141 -496 763 1474 331 -303 -372 191 -95 1017 460 -314 164 -211
12741 -211 -213 -228 1161 385 -719 2014 -547 -95 -1448 -51 -200 508 692 880 1753 -1112 -22 767
12759 767 -808 214 649 120 -1153 -1121 -828 -1024 432 -967 613 239 -293 -376 311 1437 -409 331
12777 331 406 85 472 -534 -464 -520 -178 1431 -1185 65 -575 367 -1633 -157 -304 -1167 1344 36
12795 36 -197 -1201 -218 -310 -124 1662 -59 446 110 -671 -88 -205 968 -808 558 313 315 -140 -1362
12814 -1362 197 -884 445 -547 -619 -298 -859 1204 -759 -56 804 -408 501 -269 -175 -1228 260
12831 260 38 84 311 82 -26 -1514 -41 -959 -226 666 -189 1060 -318 -991 -57 -1028 -14 -1244
12849 -1244 644 239 1 -1050 -840 395 -1802 889 657 -26 -478 -175 -929 -578 1141 202 137 -135
12867 -135 -238 582 -133 -744 -754 962 540 -1146 140 -883 479 -116 629 1617 493 1139 -1031 -132
12885 -132 262 -1372 -103 -165 374 -647 -698 -525 -1016 631 -274 583 546 -55 -67 -453 928 -285 1085
12904 1085 538 -77 382 -1186 347 -1141 -522 -994 239 1618 -881 331 446 -1398 -294 -807
12920 -807 1208 972 -866 -875 -317 -912 1054 1324 33 733 -498 -61 -411 -740 332 248 357 992 1085
12939 1085 -368 -226 61 -17 406 855 1020 -246 -557 -270 -202 267 -770 421 1418 -544 -121 -774
12957 -774 -411 -495 455 1115 -174 294 -198 -984 -671 497 1564 67 371 -1242 -1051 -607 584 1241
12975 1241 -313 1163 774 988 1124 -491 204 419 784 -649 927 -88 -519 24 -2555 -30 1900
12992 1900 203 199 -468 1115 -2472 -197 917 27 121 40 473 -1148 75 -1556 -587 406 -190 278
13010 278 -321 -852 -701 163 904 -200 934 -567 -620 -1717 -832 434 133 388 474 170 -1017 -386
13028 -386 665 -427 90 -390 868 -1098 -901 451 -247 -264 570 -224 117 -1056 -268 -1165 -141 120
13046 120 -613 256 1112 243 -1021 -228 -1002 336 775 925 234 79 -532 513 535 -119 -704 1083 118
13065 118 406 133 -941 -32 -330 345 777 -502 -68 -1366 -576 -1079 836 281 1115 357 187 235 -288
13084 -288 -179 -288 541 1772 940 -237 -805 -238 -1153 -413 263 583 917 -841 -42 -655 130 1199
13102 1199 657 418 473 -126 -950 -678 517 -1589 1366 246 407 -628 -453 -699 -172 8 -158 851
13120 851 610 -1023 -387 -2122 -576 -558 1899 137 1898 771 -1682 -76 -29 19 1084 299 1938
13137 1938 798 -446 -678 -131 221 -886 1798 -438 313 -1538 -1 -880 183 1291 -94 -82
13153 -82 720 -967 426 -951 -24 71 30 -58 -1129 -493 -1617 -649 -388 -146 -1013 103 -421 -440 -125
13172 -125 -269 342 690 -992 821 -527 -704 -528 -912 -358 -29 755 -458 -224 -1197 226 -77 496
13190 496 721 334 482 -774 865 -317 -127 896 -268 925 456 -490 64 -1838 580 -543 528
13207 528 106 312 -541 -377 875 -1311 1363 123 -445 750 -589 -1100 -628 552 801 499 894
13224 894 -932 135 -1588 162 772 439 -1 341 1579 -281 -510 462 -256 1466 410 886 421
13241 421 545 -548 204 1358 642 557 330 318 934 -1400 722 -231 810 1191 -468 473 -956 28
13259 28 -189 253 -296 849 543 -1071 -534 -655 1092 -1568 -841 1109 48 395 -2536 885 441
13276 441 463 1496 -462 250 -430 -2 709 -403 188 -710 623 288 119 839 -664 553 -443 998
13294 998 -335 -642 -148 -41 813 -221 1088 444 984 728 320 350 66 -659 394 790 645 -641
13312 -641 -25 -313 0 -333 154 497 427 -397 -355 -36 185 758 -88 554 998 21 1079 57 -296 -756
13332 -756 444 1298 180 -134 -263 -415 457 -472 156 -496 -381 871 -2300 -1173 -507 244 360 -246
13350 -246 773 335 -315 -487 -227 967 542 628 80 257 -734 -114 -205 -422 500 -6 830 -1076 603
13369 603 -897 -353 -241 446 831 -408 -56 550 -62 104 837 1209 -129 -11 297 118 -9 -582 -863
13388 -863 177 -61 340 -491 167 -1188 -7 -1560 -1471 1471 -128 1215 -1585 -783 -176 -692 1423
13405 1423 272 1559 211 -313 -471 -269 306 750 69 967 -373 90 -518 143 103 590 547 231 -749
13424 -749 -673 -558 -1248 -562 -375 749 -437 -1982 -878 -991 93 -586 1084 853 405 1322 163 942
13442 942 -568 -640 -307 324 -504 -241 490 35 104 515 -292 1141 792 -1074 -959 -306 712 -945 1199
13461 1199 313 1424 -203 -362 418 -148 -748 369 23 -482 1150 -566 -492 -81 -402 285 -263 108
13479 108 -322 -573 -52 -1145 -811 -9 100 89 -1793 754 -450 99 -370 -158 930 -545 -311 -498
13497 -498 -634 637 -523 1736 -667 695 -662 -473 -542 535 628 532 662 -108 -924 -800 49 521
13515 521 -97 244 1044 -750 -980 -416 -493 -1047 322 517 311 949 138 -665 -77 -189 1411 295 -13
13534 -13 -25 -602 198 473 6 -64 -30 -735 -335 509 -37 663 50 -776 -30 -75 767 -346 -132 -1048 361
13555 361 -1636 -337 103 -1465 908 -408 791 181 794 297 -82 -312 703 237 49 1521 492
13572 492 -226 75 -1130 48 -1974 414 220 294 925 -144 337 -860 811 -430 899 677 669 702
13590 702 197 -886 -168 -1358 -32 558 1061 -476 71 716 -356 515 338 531 1581 -153 415
13607 415 -557 788 956 208 955 603 304 -370 -356 -227 457 -218 -30 913 -694 451 -1114 -307 940
13626 940 392 679 -628 -823 -796 -386 137 -346 -595 -972 -452 462 -1137 -979 -89 103 -527 807 868
13645 868 -917 146 -2140 1492 166 693 550 93 634 425 427 114 340 534 -1089 1395 -754 -555
13663 -555 -446 317 -624 -438 1016 -929 79 -276 -328 -943 248 1006 167 792 78 714 375 -53 -225
13682 -225 638 -322 -390 597 -1155 -159 354 -1218 733 742 67 254 654 -30 -590 514 -1047 -354 -166
13701 -166 -1333 887 -25 214 352 1110 956 -968 394 -49 -462 576 1139 -274 -696 612 2
13718 2 4 863 113 227 443 890 -483 -992 566 -780 428 -702 111 1200 -932 -725 -991 -255 -888
13737 -888 904 524 341 1476 15 -553 -2522 428 -456 783 944 -415 -368 -707 755 -523 -483
13754 -483 230 45 -417 238 1046 849 -34 1298 404 -405 -882 107 -248 -166 -1373 -285 8 -143 866
13773 866 -782 -647 830 -415 485 -74 -321 -335 480 1371 -413 1506 -233 -452 -701 -1146 78 589
13791 589 822 602 -540 875 -396 62 42 -755 34 310 743 -1024 1085 74 282 -389 1143 532
13809 532 -228 1227 208 -985 -1443 -769 -218 142 761 149 -38 1329 -997 -669 -602 680 936 -322
13827 -322 -879 -263 -342 -879 1070 -539 1135 190 -710 -229 -668 499 -853 357 177 -576 -393 -1230
13845 -1230 -299 104 835 418 865 1265 -124 503 -1316 303 -178 -1087 1379 112 -856 -810 -513 971
13863 971 -863 491 463 527 406 -951 235 -1291 349 -907 1664 -1212 -230 -376 -701 -281 -315 -302
13881 -302 790 290 -168 -1536 262 -565 -183 789 12 1219 -368 -38 -371 -986 800 -56 680 -257
13899 -257 457 -745 -251 705 -366 218 -523 348 -380 -483 -583 82 -182 417 1199 243 -1279 -758 -119
13918 -119 409 196 1103 778 293 646 -1256 659 -33 -468 -252 -199 510 165 -1004 -603 -1157 450 -531
13937 -531 -685 517 -1210 197 418 479 240 896 -709 709 -116 -108 616 -1223 563 -792 1368 46
13955 46 -1000 216 -4 2156 -153 757 485 1300 -322 -1456 -512 -1324 447 1369 526 611 -1070 -1374
13973 -1374 -1187 -638 912 1122 1373 -987 645 -1135 -150 471 338 449 -69 -262 -214 -764 -451 -828
13991 -828 1341 368 -147 -218 285 -505 -299 -304 -513 1188 -379 42 62 -1057 -514 -626 322 702 720 617
14011 617 -395 138 -943 1503 1789 -69 374 267 -193 -966 257 1246 -396 267 860 60 -272 -914
14029 -914 -137 -1149 457 1164 158 -147 -47 -913 -501 -78 -856 979 238 -624 -69 -604 -588 312 557
14048 557 15 38 -458 -859 -339 -1554 571 1308 1038 43 -747 382 297 -113 662 46 1052 -202 570
14067 570 -719 -580 -372 -179 835 -476 -328 -20 -146 -480 -601 774 1055 755 1477 415 -1794 200
14085 200 -141 -220 1606 107 -611 -361 -568 -891 1002 741 1231 193 703 -465 -885 -894 -182 -146 -176 -354
14105 -354 121 1531 -595 -118 1536 1434 684 195 824 738 184 -886 7 881 -534 824 -917 -661
14123 -661 -26 -1444 1700 388 1129 367 459 -3 -487 421 -985 2030 815 473 94 -1636 -509
14140 -509 -202 258 320 -302 351 -736 -733 -1248 54 587 -1241 671 -744 390 -1074 -9 -112 87
14158 87 1954 -681 677 -420 -1060 318 -1342 -143 61 1434 485 -189 -237 -600 506 707 668 118
14176 118 544 -411 -385 649 934 530 352 1167 204 -428 166 -168 1035 1245 413 587 -188 -810 -521
14195 -521 90 -310 -243 592 138 824 -455 708 136 -1072 782 121 -19 286 47 -755 -1260 10
14213 10 329 194 -303 -537 32 -1492 -19 -480 486 1305 1093 -535 194 -781 -127 -49 391 -335 652
14232 652 -254 524 -599 1465 356 149 497 22 888 -1010 3 -402 294 1457 581 371 -611 -178
14250 -178 -161 -1231 379 -957 343 -1033 1090 -457 -607 -688 623 104 82 1351 760 -219 -410 -619
14268 -619 355 -817 983 13 -844 1357 -1412 -324 44 763 853 -249 -442 -360 -667 48 380 651
14286 651 520 270 -112 -324 -939 -1234 -12 264 1429 685 422 434 -1030 -373 -61 1178 413 981 -587
14305 -587 -1569 -374 -1472 94 815 719 138 145 391 -601 445 -1236 265 525 -1167 960 228 -33
14323 -33 -327 -350 557 -329 1188 -702 678 -285 -254 59 -194 1651 -1160 371 803 -499 1463 -534
14341 -534 750 444 455 558 -1653 -655 -625 238 -982 1104 -286 -34 -604 -2553 1381 -299 681 1143
14359 1143 -93 254 -689 181 433 -56 -297 -299 1146 548 232 -440 -572 776 1053 550 -189 418 -763
14378 -763 191 -146 -424 1530 -558 716 437 -326 -564 -786 467 569 825 195 -652 -870 -436 807
14396 807 -87 -434 373 -1524 -498 117 620 71 533 210 -772 1140 373 848 -426 124 145 -394 -476
14415 -476 -387 608 -199 -469 -103 -65 133 -538 -1140 -993 -392 390 -872 265 415 -735 627 -156 -245
14434 -245 -952 -202 596 1310 378 -449 138 -579 263 -67 1533 419 1441 -109 463 512 -924 -250
14452 -250 378 275 -29 -183 -370 -215 572 -227 -75 345 -14 1274 754 -372 -1232 -427 414 335 834
14471 834 79 -152 -916 566 -857 -1050 243 -211 -26 236 -744 866 -358 440 -107 -212 262 -379
14489 -379 371 -34 -461 -783 98 709 -88 -757 133 -385 -256 189 811 360 449 -618 535 412 -1084
14508 -1084 -209 382 366 -790 75 924 -404 458 275 233 -140 -188 -407 -415 1029 665 705 7 -134 -25
14528 -25 -746 497 -401 449 -74 -356 -148 -405 1048 -218 544 -260 -537 229 -1204 -535 375 164 -363
14547 -363 143 227 491 583 -1314 -1053 -681 -835 452 -145 455 -1419 1098 -486 -24 1108 255 100
14565 100 -53 695 435 -1009 -357 285 669 277 151 1042 -1064 540 -395 52 -130 -460 96 309 -149
14584 -149 -1578 1 -410 913 547 40 541 398 -760 -775 1278 355 -16 -498 -955 220 79 -251
14602 -251 -600 -124 338 -172 -724 -636 -1091 -444 74 1187 -417 107 -20 -80 513 -898 1187 249 -215
14621 -215 119 -1397 725 -1752 -1047 537 501 1032 -1528 428 -1511 356 -287 814 396 -114 22
14638 22 -25 881 -1013 -102 501 883 150 227 -96 -12 223 655 -587 501 -1174 237 -309 -1207 -478
14657 -478 -1027 1539 -648 1249 195 -1147 -244 -78 450 1433 648 -460 -708 671 -1207 941 -177
14674 -177 -42 775 342 1077 -717 319 -86 -183 130 132 850 -86 -186 -377 -565 -173 -613 814 180 -19
14694 -19 36 -447 360 -280 856 425 591 251 -188 -683 -226 1174 -133 -96 611 -56 211 -1534 -725
14713 -725 261 1147 -664 -623 1250 -1424 -1356 -324 266 333 -801 1141 124 -152 -60 -1456 231 -965
14731 -965 1124 -266 845 -443 -1296 -265 926 1011 -1160 684 -847 -17 -319 -429 -387 -1730 1051
14748 1051 -877 -773 -394 1177 373 583 302 -346 -15 465 -468 360 31 154 539 825 1045 -124
14766 -124 63 445 -1035 577 -467 146 -413 625 -960 -179 -174 924 -214 -1204 -505 -763 -478 58
14784 58 347 -1298 -23 739 1362 -411 -800 -400 -612 -989 910 750 -1014 -624 -1415 297 -751 -10
14802 -10 729 -76 -562 -1930 269 -251 200 1755 620 842 -584 613 -186 -176 310 196 709 -931
14820 -931 -134 -455 -831 -521 -864 -661 336 941 -887 -638 -457 -739 1246 -147 1282 990 337 742
14838 742 -1148 492 -970 987 384 -426 -500 -406 451 -283 -168 -977 -91 412 -92 -333 -486 775 135
14857 135 842 1599 -792 -355 -1094 84 537 -844 1218 488 502 98 228 -735 -605 1051 84 -278
14875 -278 414 111 820 273 1018 587 924 -152 -509 69 -1576 207 -591 -209 818 -875 1019 -919
14893 -919 -412 -522 316 34 -663 185 -48 787 -1427 130 49 -114 -256 -763 -456 -198 -187 448 -984
14912 -984 488 -242 702 89 -726 -555 -1555 133 597 333 -253 -280 -701 -355 1247 -89 879 1006
14930 1006 84 358 366 -226 -1667 -263 282 -365 484 -1271 -342 -786 -736 618 665 768 245 194 -1769
14949 -1769 246 -947 15 689 -709 1485 -616 -1360 -944 -356 -188 214 -318 102 -161 -196 -658 344
14967 344 -499 1025 649 585 109 166 -830 -978 -112 366 673 840 56 1111 -1010 -789 -624 523 536
14986 536 -108 381 -1466 -538 -33 439 723 -11 1233 -430 -547 448 -942 735 301 518 -1861 -570
15004 -570 -1503 -333 981 -555 -123 737 10 -474 -887 -1600 -112 673 2 -778 -421 -463 -655 -244 437
15023 437 523 1494 1548 -183 95 -343 328 173 114 211 1205 736 -1414 -584 99 -499 -175 -69 133 407
15043 407 -588 -1445 215 -424 -90 619 556 -594 -156 -733 225 -1418 896 1835 487 635 -490 -529
15061 -529 -1362 567 -325 504 -426 -131 114 -1092 711 865 417 1413 841 414 -179 -421 -186 -1098 706
15080 706 1143 434 -825 -47 -334 -224 923 809 108 -50 -709 81 -127 525 -515 685 -72 612
15098 612 10 -606 -361 -284 895 -179 357 242 -1063 350 -711 291 -430 1117 1528 -1072 -309
15115 -309 -993 -107 -82 859 -727 -87 22 -1172 1114 -1540 -1198 -509 1172 503 603 -345 499 -785
15133 -785 681 183 1274 352 690 -1368 -527 1124 -820 -66 -306 934 253 285 -947 -1091 538
15150 538 -659 1456 869 632 132 -1549 908 -489 937 803 636 -1013 -1070 -576 -673 -360 1261 432
15168 432 1841 59 -1297 -901 -369 -580 -753 752 -608 539 525 -327 -746 -388 62 617 -294 209
15186 209 -710 774 -392 825 223 624 96 -502 298 -458 774 -11 242 637 105 1318 -1039 -402
15204 -402 150 -439 -509 631 -185 -550 1067 439 -57 -998 -54 1192 -620 -216 -923 -70 -370 -336 776
15223 776 294 413 -513 758 137 -543 978 343 394 230 383 568 -529 732 -501 1284 -851 520
15241 520 730 -510 636 -507 1080 968 278 735 -274 496 -2121 7 301 33 623 -491 1102
15258 1102 -893 -832 -660 -1515 285 335 -37 -1253 -164 469 -692 397 -888 1895 -843 -600 849
15275 849 -1663 -399 -297 1080 -244 845 -462 -996 615 -50 -294 881 1209 -605 309 500 -1113
15292 -1113 355 -221 -93 898 412 90 -166 732 781 -116 930 249 813 552 676 -259 -171 1057 -359
15311 -359 -177 -1175 916 -518 142 1113 67 1172 65 -688 -154 -221 -719 -602 1259 192 -198 1138
15329 1138 -968 -20 -1970 -869 -679 831 791 683 673 -884 228 712 309 647 -64 -159 -839 -622
15347 -622 -1212 -282 -17 -445 -158 -155 528 -864 -433 633 164 1042 95 160 33 -902 -228 87 -370 406
15367 406 561 -265 -492 -474 -1296 568 -102 -120 1587 -1208 725 -427 270 112 1355 1091 35 569
15385 569 -194 -449 24 -134 1611 -597 1667 -379 -1343 -826 -235 799 -189 327 212 157 -9 24 -122
15404 -122 169 1962 293 517 -162 435 -431 -1254 1285 833 197 -29 -713 -461 83 431 -478 444 801
15423 801 -611 -53 -494 475 -905 341 268 956 829 -1398 -113 -79 309 83 -108 1031 1045 -683
15441 -683 63 -513 389 -490 752 29 -93 -143 -597 -412 -286 1544 549 961 -700 -20 30 -664 -225
15460 -225 245 270 -497 1337 696 -112 550 335 -290 1283 704 541 -262 347 -501 688 673 443 716
15479 716 -774 806 -253 384 138 -65 1114 227 145 5 -923 427 60 362 469 535 274 -883
15497 -883 -535 -675 106 58 354 908 -203 451 -645 339 -415 933 542 -1097 1552 -663 730 -721
15515 -721 211 112 -207 -249 -1340 -883 -928 46 -89 467 472 -58 487 -1468 702 992 -434 895 39 48
15535 48 447 -631 -269 -2265 1028 67 638 -457 -417 -881 -1270 307 -1183 1284 288 -329 421 -1378
15553 -1378 986 -79 589 703 -331 1918 -211 605 -573 -107 791 508 1193 -269 -282 -564 196
15570 196 187 -1406 503 -200 -410 251 534 705 -1232 448 795 1007 -1508 -75 292 -1323 334 240
15588 240 831 337 1346 -1089 -670 458 -69 623 -8 43 7 -456 -46 15 -61 609 215 1270 -1203
15607 -1203 -328 203 -82 567 -1189 -87 143 553 392 2 827 -821 -220 752 208 -223 -1512 -329
15625 -329 227 385 5 130 392 -292 724 120 -12 196 270 1993 -328 104 -847 -265 -704 -378 539
15644 539 -907 79 -448 -422 -509 1422 441 490 530 -286 -233 -173 -454 -389 139 -359 89 993 161 32 -275
15665 -275 63 318 -159 495 797 140 773 742 -80 -386 152 -13 182 229 -1170 93 -734 802 182
15684 182 -346 407 -414 -18 85 672 741 495 -640 -228 1839 -886 -208 -901 40 -538 -292 -79 -699
15703 -699 88 414 1282 356 -37 370 -631 -604 185 -138 -180 -271 1439 696 162 -1085 -1689 387 476 1030
15723 1030 271 -45 -247 -503 -18 -274 -129 -73 1172 808 -804 -896 -74 139 164 -552 174 -1023 425
15742 425 -750 -399 394 -1260 432 -338 -407 120 295 -377 348 -547 -834 460 283 -1236 -204 -753
15760 -753 1950 -635 1281 -46 425 296 -85 578 -886 1151 37 848 541 -1058 -283 -58 549
15777 549 -416 -76 454 -375 899 -443 1610 -167 1003 195 -570 552 528 -402 154 309 552 -562
15795 -562 8 -781 476 -101 -759 -137 -212 86 -634 314 -14 -14 554 424 257 445 -82 -343 -606 -265
15815 -265 -210 957 90 593 -77 -240 1663 -671 -666 -12 743 288 -332 334 -1148 -224 1099 -671 767
15834 767 -707 115 -945 -688 115 735 674 -236 107 -826 118 -39 843 190 -400 501 -375 -312 500 -853
15854 -853 -37 -852 368 -405 1339 571 -752 494 102 44 -416 258 1153 1838 -33 -828 237 -907
15872 -907 630 319 -99 1408 -456 -417 -346 -1044 1717 1109 1193 -698 97 58 -72 -172 -88 598 1453 21
15892 21 -1034 -998 -658 -176 992 -620 -1573 333 -935 1204 -680 1217 -217 1146 -97 -577 501
15909 501 -1030 84 -936 -441 1155 51 -645 -831 -829 435 1195 666 597 51 -406 135 -898 -60
15927 -60 591 -339 424 -215 1772 -488 -833 135 551 -740 85 293 78 139 539 275 913 -257 442
15946 442 2098 -352 -72 164 -474 -368 1106 -382 -1271 -663 -1179 -275 -575 414 960 -392 38 493
15964 493 130 45 -259 -438 -476 841 -848 1559 -543 -929 266 -393 1360 -1775 346 -528 -1404 675
15982 675 -355 667 -8 1209 -878 -1323 -338 -1693 31 -735 1031 1167 591 -641 -501 -404 -574
15999 -574 1121 130 177 -703 -122 524 -739 -285 251 661 430 -143 340 -14 275 31 -1114 602 502
16018 502 -760 86 -521 32 -790 1906 -836 48 -664 -61 -451 -1404 756 -976 586 -362 564 -263
16036 -263 -968 320 -811 139 626 577 754 -358 871 -118 -1357 166 -866 143 -1707 325 -830
16053 -830 602 -733 520 721 176 841 39 -756 -525 -328 721 121 1153 589 -1459 319 -633
16070 -633 1089 -506 306 -288 -1086 507 -1698 -107 -273 755 442 898 -384 -206 506 113 -145
16087 -145 -384 76 -172 396 143 -1307 224 274 -397 180 -722 -872 -523 -275 57 87 587 765 -692
16106 -692 -887 -244 -922 -213 852 -183 688 47 1211 1136 -249 -727 -126 270 -620 317 -85 584 -121
16125 -121 -193 318 118 -893 -25 -673 -957 -842 468 416 617 656 550 45 -421 1017 1464 109 993
16144 993 -451 48 5 -349 -505 -626 -512 -8 1654 273 -588 -45 -221 466 -454 618 -872 1025
16162 1025 -27 -159 -72 -805 615 236 511 186 -825 -332 -641 49 1215 732 -201 -239 640 -600
16180 -600 170 -763 368 465 -80 1204 -1001 -1028 -346 -224 -101 -1049 -214 -901 120 -944 -115 -265 -35
16199 -35 402 1120 308 -385 -7 332 47 -270 610 256 -67 -411 -14 -585 -37 53 674 408 -1301 890
16219 890 -1474 775 -664 948 171 -305 279 -245 -146 -1016 189 661 -545 1369 148 660 -870
16236 -870 193 -276 98 367 -641 704 -509 -731 -140 -423 770 159 938 -99 -765 -174 -868 1818
16254 1818 -1434 1033 -182 -1365 637 -1328 608 183 172 936 4 153 -110 88 -669 -160 249
16271 249 -44 1118 -981 -151 20 -464 655 1074 199 -713 683 111 -854 -128 -21 610 1824 198
16289 198 -107 -210 581 -366 -446 342 187 -388 -224 -245 -784 -611 -1582 -965 645 -581 -471 -595 143 -338
16309 -338 -1265 221 186 297 26 -128 -467 -101 -454 -362 438 -685 851 63 -699 0 -221 494 -471
16328 -471 676 -1254 -1293 1042 -1378 1337 -258 -176 415 -910 85 -562 64 -472 321 291 -579 1215
16346 1215 -543 765 -952 171 318 428 -520 -635 337 -584 814 112 -571 1287 327 436 -81
16363 -81 -630 222 -434 1676 -644 1053 -111 -670 509 -476 1745 -135 577 -251 -205 362 491 340
16381 340 -672 610
16383F10
$$ Imaginary data points
##PAGE= N=2
##DATA TABLE= (X++(I..I)), XYDATA
0 0 0 0 0 0 0 0 0 0 0 0 0 0 0 0 0 0 0 0 0 0 0 0 0 0 0 0 0 0 0 0 0 3 -4 2 -3 4 -5 5 -5 5 -8 7 -7 6 -6 11 -12 13 -10 12 -16
51 -16 14 -17 16 -20 22 -23 25 -26 36 -40 46 -59 79 -101 161 -6620 365 5959 8201 5767 49 -5853
73 -5853 -8746 -4442 -75 6762 7220 5322 -285 -6846 -6835 -5460 1089 6591 6946 4855 -1332 -4960
89 -4960 -7485 -4674 716 6017 6646 4291 -783 -6199 -7594 -4522 781 5165 8081 4173 -1312 -7015
105 -7015 -7117 -4384 3597 5756 7825 3104 -1651 -7429 -6508 -3323 1436 6636 6335 3511 -451 -6612
121 -6612 -6758 -3300 2618 6683 7074 4426 -2545 -7007 -7462 -3474 1850 6200 7397 2665 -1494 -6556
137 -6556 -6470 -2582 3106 7068 7041 2828 -3121 -7688 -6747 -2999 4593 5849 6608 2822 -2929 -5796 -6477
154 -6477 -2539 2829 7304 5963 1929 -3551 -7379 -4609 -2624 3099 5085 6295 2804 -4672 -6046
169 -6046 -6543 -1496 4007 7455 5273 1528 -3539 -6025 -6428 -603 3741 7208 4373 706 -3882 -7196
185 -7196 -5925 -2042 4198 6616 5270 1475 -4117 -7309 -5186 769 3365 7165 4601 1182 -4422
200 -4422 -6694 -4580 -1304 3870 7008 5496 990 -4569 -5810 -4404 -654 4861 6294 5748 154
215 154 -4278 -6775 -5162 -206 5111 7015 4688 -746 -4290 -6304 -2984 522 5468 6616 4140
230 4140 -765 -3905 -5619 -4313 -308 4216 7061 3928 -586 -4974 -7387 -2668 654 5173 6685
245 6685 2774 -1224 -5592 -6213 -3955 -66 4301 5465 3606 -1989 -3757 -6440 -2626 911 4802
260 4802 6259 3147 -1082 -4806 -4742 -2342 732 5699 6124 3229 -1281 -4849 -5677 -2957 1894 3678
276 3678 5896 2440 -467 -5293 -4206 -3199 1903 5084 4459 2036 -1491 -5560 -3879 -2195 2599
291 2599 4478 3930 1363 -3367 -4061 -4642 -1414 1022 5473 4488 950 -1779 -5589 -4524 -1805 2825
307 2825 5271 3396 2152 -2900 -4778 -3216 -479 2562 4471 3893 326 -3078 -5280 -4644 -540 2321
323 2321 5320 3664 657 -2284 -4945 -3216 -1415 2553 4349 4803 -297 -3528 -3831 -4114 509 3336
339 3336 4512 2686 949 -1404 -5208 -4234 -485 3368 5708 3999 907 -3017 -4377 -3530 -204 3044
355 3044 5197 3889 -527 -3195 -4440 -2217 -717 1806 4668 3592 -1148 -3208 -5247 -3064 1116
370 1116 3225 3288 3147 -465 -4797 -5348 -2943 1511 2479 4079 1450 -783 -2586 -4899 -2433 -144
386 -144 2934 4265 2414 189 -4499 -2849 -1858 1124 3909 3995 2551 -627 -3967 -5002 -2132 1441
402 1441 4005 5021 2239 -808 -3133 -3907 -1855 1285 3871 2552 1868 -2753 -4180 -3944 -1718 3140
418 3140 3271 2889 1859 -2232 -3815 -4537 -1120 2505 4834 4489 874 -1980 -4528 -3259 -1531 2054
434 2054 3885 3827 2082 -2290 -3198 -4663 -820 2949 3087 4058 625 -2519 -4979 -4284 -1131 3323 5301
451 5301 3319 1292 -3390 -4854 -2980 -1483 3501 4461 4089 411 -3921 -4096 -3495 -971 2792 4760
467 4760 2928 719 -3073 -5204 -1522 261 4061 4088 3825 -372 -4880 -3144 -4099 102 3107 4021
483 4021 2281 -1968 -2816 -4633 -3201 2462 2756 3701 1516 -59 -3376 -4984 -2294 663 4549 2816
499 2816 2780 -540 -3918 -4803 -2201 559 4162 4893 1556 -1650 -3519 -4267 -1359 1454 4275 4300 1218
516 1218 -1208 -4825 -4275 -2150 1015 4518 3814 1881 -1293 -4094 -3481 -1994 2886 4603 4182 627
532 627 -2074 -5317 -5980 -1235 1987 3340 2566 2321 -2108 -4013 -3884 -1340 1758 3288 4563 572
548 572 -3364 -4496 -4292 -748 1861 4781 3520 832 -1409 -5552 -3750 -2071 2209 3965 3369 1298
564 1298 -3782 -2952 -4032 -771 2250 4058 3636 -533 -3362 -6218 -3482 493 2559 4721 4326 -752
580 -752 -2843 -4974 -3160 -946 3174 3035 3078 -633 -3998 -5210 -3683 1438 3194 5590 3173 -300
596 -300 -2588 -3915 -3903 79 2889 4509 3108 172 -3544 -4362 -3699 1918 4422 5511 2973 -1560
612 -1560 -4328 -5048 -2015 332 4067 6678 2014 -624 -4102 -5341 -1601 1748 4521 4509 3541 -2879
628 -2879 -3847 -4533 -2843 1747 4155 5268 2694 -2031 -5044 -4372 -1469 898 5165 4608 1939 -1721
644 -1721 -4340 -3352 -2330 2615 4273 4580 1176 -3109 -4170 -5546 -1455 2894 4308 5111 1058 -2506
660 -2506 -4219 -3605 -3363 2260 5464 3078 1463 -2858 -5034 -4282 -1460 2474 5371 4782 1738 -1985
676 -1985 -4196 -4741 -420 2222 5455 3691 566 -4312 -5529 -3296 -130 4098 4237 3759 495 -2122
692 -2122 -3917 -4933 -401 3024 3999 3615 -1031 -2878 -4741 -3449 203 3132 6020 2570 -958 -3866
708 -3866 -4592 -3357 570 3905 3496 3715 -360 -2906 -5512 -3778 1479 4586 5371 2243 -90 -3797
724 -3797 -6662 -2720 1502 5492 4317 3724 -974 -3939 -3942 -2603 846 3738 5021 3737 -1463 -4251
740 -4251 -5361 -2257 10 5398 5247 1234 -748 -6350 -4658 -3572 2110 4057 5369 3451 -1251
755 -1251 -4121 -4692 -1007 1018 4506 5779 2569 -1369 -4888 -4588 -2924 873 5125 4287 2212 -2476
771 -2476 -4464 -4196 -1957 2923 4554 3342 2197 -2696 -4503 -5489 -745 2063 3818 4462 1167 -1117
787 -1117 -5238 -4404 -1205 2691 4797 4103 2027 -2952 -5349 -4115 -1027 3045 4600 3016 1566 -2275
803 -2275 -4489 -4165 -725 2923 4515 3539 1455 -3210 -4192 -4208 -561 3260 4544 4465 231 -2658 -4677
820 -4677 -5054 -327 2773 4717 3495 24 -2952 -5536 -1574 -978 2542 6185 3948 -116 -3714 -4986
836 -4986 -3276 -180 3586 3058 3894 -885 -3747 -4846 -3687 539 3821 6283 3136 -915 -4511 -5410
852 -5410 -1843 1021 2946 4059 2483 -2168 -4586 -4290 -4018 1046 3580 4834 3534 90 -5658 -5485
868 -5485 -2727 675 4505 5372 2377 -1047 -4548 -4165 -3729 2132 3705 3600 2226 -1299 -3456 -4813
884 -4813 -2592 437 2817 5665 2451 -1378 -4480 -5308 -1580 1626 4775 3892 2197 -1828 -4173 -4177
900 -4177 -3438 2220 3900 4257 2373 -2305 -4175 -3746 -1394 1630 4811 4122 1936 -1548 -4653 -2806
916 -2806 -1830 2804 3689 5039 1487 -2793 -4207 -5059 -1111 1597 4402 4019 1882 -1377 -4555 -3680
932 -3680 -1191 2052 4851 3027 1139 -1606 -4527 -3772 -3047 2770 4351 4334 1253 -1417 -3468 -4608
948 -4608 -1027 1771 4513 3839 771 -2497 -5317 -2848 -90 2761 4754 3750 151 -4034 -5091
963 -5091 -3533 573 3326 4198 3807 555 -1553 -4507 -4001 -599 2183 5670 3251 272 -3231 -4538
979 -4538 -3870 -264 3375 2774 3065 1470 -3845 -4606 -2693 -55 2507 4688 3278 779 -3332 -4804
995 -4804 -2400 414 3090 4000 2981 155 -5174 -4259 -2900 397 3720 3551 3247 -679 -3072 -5396
1011 -5396 -1894 680 3639 4787 1918 -27 -4005 -5030 -2551 -1015 3426 4709 2700 -2402 -4341
1026 -4341 -4452 -2768 783 3604 4843 1608 -1346 -4171 -4415 -1384 1010 3917 3267 2643 -708 -3489
1042 -3489 -4313 -1547 2933 3787 5094 1813 -1366 -3416 -4935 -3087 2363 4784 4480 1804 -1158 -3211
1058 -3211 -3999 -1163 1785 4762 3942 2083 -2401 -5007 -3677 -3016 2130 3553 4442 454 -2286 -5062
1074 -5062 -3285 -624 1938 6304 2902 266 -2452 -4965 -3349 -2371 2898 3889 3656 2511 -3140 -4532
1090 -4532 -4053 -853 2066 5033 4155 1414 -1671 -3740 -4063 -132 3556 4688 3031 715 -3923 -3827
1106 -3827 -3185 -926 3508 4047 5134 -488 -2406 -4228 -3543 1169 2427 4557 3126 -222 -3636 -5124
1122 -5124 -4255 -1901 4083 4815 3996 970 -3691 -3565 -3376 875 2532 5085 3628 -638 -3084 -4777
1138 -4777 -3761 893 3696 4977 2480 -1157 -3886 -4466 -3175 -281 4559 3999 3549 -841 -4287 -4275
1154 -4275 -2690 610 2594 4984 2171 279 -3554 -5167 -2735 432 3686 4045 3049 -310 -3391
1169 -3391 -4354 -2074 469 3711 4763 2980 -473 -4740 -5865 -2369 594 4821 4716 2609 -1246
1184 -1246 -4441 -3741 -1502 1387 3866 4040 2830 -1902 -4040 -5914 -3500 1844 3421 5430 1198
1199 1198 -1771 -4008 -4892 -1027 2416 4730 3904 1645 -1560 -4316 -3103 -1832 3068 4174 5450
1214 5450 1592 -2391 -3178 -4634 -824 1955 5147 3543 564 -2587 -4912 -3212 -1584 2787 5280
1229 5280 3781 1797 -2541 -4733 -5169 -866 2951 4431 3988 784 -2604 -4123 -4722 -661 1972 4674
1245 4674 3787 288 -4412 -4448 -3121 -824 3126 4309 4095 -890 -3282 -4965 -4525 95 3939 5255
1261 5255 4112 1261 -2197 -5694 -2900 -558 2709 5297 3273 -484 -3269 -5942 -4619 315 2961
1276 2961 5552 3304 -1639 -3047 -5059 -3190 446 3725 5097 2802 -196 -4077 -4510 -2007 847
1291 847 3770 4488 2938 -1548 -3678 -4862 -2975 409 2334 5158 2413 -483 -3904 -4636 -1630 834
1307 834 4493 3744 1092 -1327 -4277 -4352 -3325 778 3946 4612 2743 -709 -3251 -3810 -1418 756
1323 756 4561 4851 1569 -599 -4715 -3627 -1764 2573 5288 3041 1743 -1820 -3119 -5114 -2066
1338 -2066 2003 2898 2948 2426 -1240 -3438 -3556 -1788 2044 5181 4113 1175 -1641 -4656 -2709 -2074
1354 -2074 1864 4856 3875 1904 -2273 -4543 -3632 -1909 2583 3597 4502 1005 -1977 -4425 -3136 -1473
1370 -1473 2618 4891 2913 759 -4097 -3684 -3232 -1309 2841 3853 3746 -1017 -2983 -3310 -4111 -1307
1386 -1307 1520 4616 4099 -697 -3651 -4426 -3464 -604 3118 3983 3063 254 -2099 -2469 -3758 26
1402 26 2029 3610 1979 -505 -2440 -4989 -1651 687 2049 3208 2532 94 -4218 -3643 -3526 -142
1418 -142 3739 4361 3606 -631 -3098 -4054 -3082 1147 2986 3967 1980 -697 -2958 -5249 -1201 -597 3495
1435 3495 3338 2394 -809 -3208 -3123 -1425 1489 2810 3353 3470 -822 -2839 -3414 -1367 1201 3685 4490
1452 4490 1010 -620 -4728 -3377 -2415 693 3983 3716 2163 -1801 -2073 -2176 -2041 1656 3737 3537
1468 3537 400 -1490 -3546 -3637 -910 284 4708 3922 1668 -1045 -3395 -2006 -808 3188 2956 2453
1484 2453 1651 -2023 -3033 -4300 -405 1441 4352 3557 967 -1276 -3765 -2161 -1479 1236 4939 3077
1500 3077 2269 -2021 -2826 -2651 329 2326 2860 3674 57 -2092 -3423 -2807 51 1799 3653 2163
1516 2163 1427 -3108 -2297 -1899 -1608 2193 3045 3415 -479 -3491 -1954 -3838 747 1924 3156 4164
1532 4164 14 -2428 -4284 -2698 -575 2825 4294 2739 558 -2306 -2832 -2080 10 3414 3372 2613
1548 2613 180 -2735 -3915 -1463 1798 2192 2539 748 -426 -1610 -3473 -2286 97 2951 2616 2078
1564 2078 -1418 -1976 -2699 -1930 909 1511 2178 1307 -492 -3165 -2322 -1131 124 3425 2573 2235 -1095
1581 -1095 -3667 -1820 -2492 1603 2894 3600 2827 -1855 -1836 -2689 -2157 1846 2046 2941 1368 -1392 -2856
1598 -2856 -3244 -1034 953 4081 1943 1439 -1433 -2504 -2534 -332 2685 1516 2702 739 -899 -3526
1614 -3526 -3286 91 1879 3947 2515 -65 -1827 -2853 -1945 -751 1430 3218 1484 600 -1856 -2746
1630 -2746 -2369 -1162 1565 2308 3413 -348 -681 -2502 -2240 1021 2969 2507 3065 870 -2074 -3013 -1327
1647 -1327 -522 2100 1917 2339 25 -1854 -1976 -2202 485 1450 2838 671 -221 -2147 -3308 -1837 47
1664 47 2594 3296 1321 -286 -3290 -3282 -2019 317 2710 2984 1928 -709 -2060 -3271 -2188 1063 2615
1681 2615 3147 360 -410 -2829 -2046 -1228 -3 2871 2094 1871 -1221 -3096 -3348 -1695 1923 3875 2901
1698 2901 1286 -404 -2162 -2860 -1328 1278 3368 3319 1899 -1551 -3084 -2594 -1394 1110 3446 2499
1714 2499 803 -1921 -2365 -3007 -66 1073 2310 3481 225 -1354 -3002 -2246 174 1777 4385 1882
1730 1882 546 -461 -2680 -2621 69 2615 2923 2639 -1454 -2512 -2421 -4286 185 417 3371 2595 781
1747 781 -1351 -3040 -3052 -399 2782 3172 2547 -697 -2357 -2738 -2660 -105 2388 3927 2550 -902 -1893
1764 -1893 -3730 -1420 -130 2084 3824 1503 615 -2252 -2304 -2504 319 2893 3113 2563 -718 -2748
1780 -2748 -3263 -1170 800 2866 4777 1604 -841 -2388 -3562 -2285 486 3130 2639 1406 -837
1795 -837 -3698 -2288 -1401 1987 3090 3270 2141 -1330 -2777 -3177 -1555 756 4068 4112 1781 -131
1811 -131 -4929 -2571 -1499 2026 3921 3248 2723 -1440 -3414 -3447 -1151 1552 3705 3035 1072 -1652
1827 -1652 -3190 -3395 392 2453 3690 4204 1274 -3244 -4272 -2022 -1253 1581 3451 2704 900 -864
1843 -864 -4302 -3655 1048 1754 4353 2148 -59 -1429 -5071 -3345 -231 2232 3405 3495 933 -2906
1859 -2906 -3567 -4104 -311 1844 4478 3244 -608 -1694 -5542 -2013 -618 4335 4754 2337 -63 -2014
1875 -2014 -4597 -1887 -887 3212 4590 2692 26 -3042 -3915 -3203 1213 2394 3738 3616 -1371 -2562
1891 -2562 -4270 -2582 177 3318 5313 2523 -28 -3919 -2752 -2280 327 3655 3940 2703 -1796
1906 -1796 -2967 -4817 -1800 1522 2695 4719 1178 142 -3693 -4356 -2020 2174 4817 3783 2747
1921 2747 -805 -3681 -4692 -2110 1085 3024 3613 2761 -362 -3033 -4804 -830 871 2976 3819 1562
1937 1562 -1599 -4199 -3777 -962 1377 4603 3193 1689 -761 -3179 -3476 -1265 2008 2618 5375 1300
1953 1300 -2264 -4056 -4149 -2541 887 3573 3255 1518 -2539 -3719 -2639 -1722 2805 4244 4180 891
1969 891 -2990 -4219 -4068 -305 1165 4343 3753 1808 -2490 -4412 -3452 -1527 3147 4651 3140 1686
1985 1686 -2427 -4015 -4352 -1206 2925 3783 4777 857 -970 -4173 -2745 -1927 1921 3825 3413 1285
2001 1285 -3055 -4182 -2942 -1314 2763 3790 3282 1117 -2496 -3534 -3814 -32 2497 3010 2639 -137
2017 -137 -2552 -4009 -2726 -1562 2496 4625 2230 321 -3119 -3685 -3050 -614 3038 3477 3903 -563
2033 -563 -2852 -3716 -3957 1124 2344 4024 2192 -241 -3385 -3895 -1740 -476 3624 3763 2056 6
2049 6 -3949 -3991 -2368 -403 2245 4181 2494 117 -2839 -5241 -2358 1140 3030 4287 2859 -771
2065 -771 -4458 -2548 -2644 1076 2994 4653 2174 -1055 -2155 -4264 -2463 1157 3013 3286 1777 -993
2081 -993 -2575 -3263 -1270 1038 3903 3488 2202 -1229 -5140 -4041 -1781 1603 3074 3972 685 -1142
2097 -1142 -2238 -4655 -946 319 3243 3525 679 -522 -4504 -2955 -2468 1609 3350 3407 2066 -1658
2113 -1658 -2329 -3961 -846 845 3287 3578 1498 -841 -3878 -3472 -1166 1318 4507 2258 1174 -2096
2129 -2096 -4001 -3910 -989 1494 3877 2632 1019 -1283 -3042 -2977 -995 1550 4380 3473 1050 -589
2145 -589 -3573 -1605 -1582 2214 3748 2846 1832 -2717 -4028 -3941 -1798 1719 3637 3327 2235 -2592 -3465
2162 -3465 -2505 -387 1562 3938 2505 1205 -1501 -3152 -1472 -778 3548 3453 4115 -20 -1960 -3222
2178 -3222 -2388 -63 1483 4520 3147 978 -730 -3856 -2631 -928 2921 2968 3220 808 -3414 -3787
2194 -3787 -1877 -168 2770 3040 2313 -419 -2727 -2840 -2338 -415 2162 3381 1789 557 -2325 -2717
2210 -2717 -3269 60 2976 3929 2972 -1013 -1838 -3138 -1934 218 1981 4075 1423 -376 -1743 -2574
2226 -2574 -1742 885 3397 2418 2038 -679 -2506 -2891 -3078 910 2623 3787 2106 -665 -3141 -3034
2242 -3034 -1354 135 3033 3948 1197 406 -3325 -2138 -1856 899 3350 1869 1674 -208 -1676 -2026
2258 -2026 -1079 1242 2734 3988 1255 -734 -3530 -2702 -225 392 3650 4353 1537 -1266 -2942 -1831
2274 -1831 -2914 844 1991 1979 983 -1725 -2931 -3344 -1305 609 3239 3499 643 -1102 -2825 -2968
2290 -2968 -1109 791 2939 1737 837 -2684 -3145 -2938 -1028 1627 2118 2849 670 -2075 -3035 -2159 99
2307 99 339 3127 585 562 -1990 -3865 -1860 -1480 1431 2689 2971 -570 -2488 -1703 -2827 -719 1677
2324 1677 3485 1848 -154 -1248 -1807 -1667 -40 3193 3374 1560 1631 -2538 -2813 -2185 -51 2435 2991
2341 2991 2317 -1561 -1033 -2516 -1659 600 894 3011 1043 -30 -2132 -3589 -1704 1104 1550 3110
2357 3110 1312 87 -3214 -3132 -2650 1064 1586 3335 3376 -311 -2462 -1650 -2810 856 3048 3295 2269
2374 2269 95 -2644 -2346 -1286 1277 2960 2617 2524 -695 -1626 -3151 -1096 1143 1053 2986 696 -1689
2391 -1689 -2837 -2778 -1358 281 2681 2691 279 -181 -2032 -2167 -853 894 1430 3347 1138 -568 -2345
2408 -2345 -2452 333 843 2331 3604 553 -925 -3326 -1774 -843 1577 2476 1336 1349 -2368 -3021 -2981
2425 -2981 -888 1254 2523 2240 566 -2693 -2467 -3413 -89 924 3062 1845 1081 -2348 -2725 -1508
2441 -1508 -446 1377 2313 2821 -610 -1953 -2293 -2510 -394 1475 2853 1590 -907 -1668 -3146 -1416
2457 -1416 745 1809 2499 1920 520 -2474 -2150 -2178 685 1834 1849 1999 -182 -2083 -2787 -960 1017
2474 1017 3596 1367 1387 -1368 -1762 -3114 -2082 93 2871 1159 1480 332 -851 -2145 -1677 1927
2490 1927 2206 3336 2679 517 -3084 -3427 -337 616 2212 2325 568 -1283 -2294 -857 -1087 1139
2506 1139 2176 1800 551 -1507 -1655 -3150 -243 495 2250 2830 671 -1409 -3315 -3192 -1075 1850
2522 1850 2567 1508 251 -1506 -2245 -2597 -95 2263 2220 2820 -798 -1281 -2335 -2371 562 1480 3527
2539 3527 3490 478 -1703 -3725 -1086 -1461 1801 1676 2119 1638 -1259 -2121 -1637 1739 509 3346 2535
2556 2535 -69 -1878 -2524 -2086 18 1313 2633 606 -8 -2258 -1723 -2103 -518 2179 1013 2148
2572 2148 -810 -1179 -2032 -1792 -729 2026 2998 843 -495 -2324 -2894 -1255 -304 2604 2466 1561 -530
2589 -530 -3315 -2582 -796 832 2089 2279 1360 -740 -1174 -2422 -763 945 1952 2739 1342 -1803
2605 -1803 -1840 -2697 -1581 66 1990 1553 1406 -1902 -2688 -1306 -1815 1347 859 3389 1787 -1342 -1489
2622 -1489 -1915 167 1283 1781 2099 1135 -1594 -2253 -1461 -749 2102 2527 1689 1145 -1069 -2651 -2537 -138
2640 -138 191 3026 2895 1086 -1479 -2412 -1700 -947 1007 2547 1716 932 -1520 -2344 -2213 -968 939
2657 939 2065 2995 320 -855 -2999 -2478 105 1025 3295 1906 45 -2002 -2938 -1192 -368 2712
2673 2712 2374 2082 186 -2149 -2207 -2066 560 1857 3401 1291 -277 -1787 -3111 -1309 -68 2462
2689 2462 3496 1944 596 -1960 -2346 -2226 -950 2256 1670 963 -532 -2826 -2103 -2436 863 1043 2763
2706 2763 2277 35 -1465 -2677 -1273 -209 2085 3116 1896 -719 -2283 -2730 -1821 1536 2040 2314
2722 2314 1122 -1044 -2115 -4042 -1222 350 2037 1502 1033 -267 -2291 -2120 -843 1282 2517 1556
2738 1556 1958 -1058 -2611 -2754 -662 1333 1311 3385 317 -1139 -3067 -2146 -591 -495 2969 3322 594
2755 594 -428 -2644 -1384 -1115 1667 2623 1450 707 -518 -931 -3217 -210 1084 2082 1753 452 -1631
2772 -1631 -3195 -2135 -2032 571 3589 1228 876 -844 -2012 -2249 -690 822 1804 2790 -324 -457
2788 -457 -2793 -2502 110 819 2893 1629 1396 -1510 -2224 -819 -1964 2521 2787 1703 -203 -2246
2804 -2246 -1985 -1631 -419 2192 3086 1494 -606 -1718 -3984 -2054 -95 1617 2838 1544 738 -1770
2820 -1770 -2807 -1325 846 2082 1264 763 -215 -1481 -2418 -2361 436 2945 2101 1108 45 -1498 -3807
2837 -3807 -918 59 1678 3287 1705 251 -1898 -1442 -2044 271 2807 1920 885 -410 -1764 -2616
2853 -2616 -1493 605 2022 1971 1380 222 -2290 -2800 -1551 802 2844 2529 2078 -804 -1885 -2192 -1541
2870 -1541 1291 1857 1913 -1012 -90 -3897 -2324 -607 71 2733 1870 1966 -174 -2149 -2541 -1085 550
2887 550 2294 2648 341 -1115 -2835 -2623 -765 110 3061 1680 863 -1118 -2753 -1746 -1121 961
2903 961 1746 3296 372 -1132 -1475 -1929 -1249 1298 2119 2788 -157 -1505 -3070 -1457 -798 1097 3063
2920 3063 2223 591 -598 -3119 -2248 -1848 2604 2124 2893 1172 -1214 -1969 -2621 289 938 2334 1965
2937 1965 -334 -1451 -2758 -2474 -431 2036 3210 1880 1337 -2252 -1820 -2675 596 1561 2898 2084
2953 2084 545 -1384 -3508 -1503 766 903 4383 1182 713 -1673 -3126 -734 -549 1349 2686 2357
2969 2357 -881 -1827 -2714 -1905 366 1819 3031 -199 -95 -1655 -3691 -2157 -219 2903 1443 912
2985 912 -1408 -2063 -3348 -2493 1429 2589 2546 2184 -1762 -1708 -2194 -713 930 2438 2114 1078 -1657
3002 -1657 -2732 -1893 -1462 162 2633 1903 1824 -1149 -3373 -2921 -1495 1602 1799 3681 987 -925 -3247
3019 -3247 -2325 -1409 145 3554 1294 354 -921 -2177 -1982 -2389 1287 2830 2399 1563 -1516 -3144 -2631
3036 -2631 -193 1010 3739 2810 1084 -1609 -3688 -1575 -659 2380 3440 3506 -358 -814 -2134 -1906
3052 -1906 -122 1979 3073 3447 128 -630 -3353 -2600 -367 82 3586 1685 964 -2169 -3341 -2263
3068 -2263 -2125 985 2403 2679 659 -1983 -2161 -2314 -1869 2430 2022 3224 793 -1178 -3660 -3212 90
3085 90 1798 3196 1239 800 -1440 -1456 -2355 -460 2238 2992 3654 435 -2653 -2813 -1384 1697 1928
3102 1928 2856 964 542 -2013 -2752 -607 -512 1934 3640 1702 -72 -2882 -3592 -2035 225 2746
3118 2746 1857 2368 -1273 -1967 -2931 -1759 504 3316 3456 839 -78 -3207 -2231 -1588 167 2395 2266
3135 2266 2173 -847 -818 -2267 -1699 191 2228 4423 1155 172 -3163 -2044 -1127 545 3813 3131 1390
3152 1390 -5 -2040 -2046 -2165 128 2581 2720 831 455 -3079 -3025 -704 292 1996 3588 825 -218
3169 -218 -3011 -3292 -1132 939 3439 2676 1059 -1415 -1914 -3440 -1073 1515 3352 2700 1095 -1235
3185 -1235 -2838 -3236 -334 1350 2686 2279 932 -1485 -3111 -2476 -800 1352 1315 3328 1743 -1086
3201 -1086 -2885 -3114 -539 1283 4118 1766 1453 -1369 -2887 -2070 -201 975 3278 1619 1487 -2446
3217 -2446 -1477 -2445 -671 2218 3041 2019 387 -1164 -3583 -2997 -891 568 3241 2593 1758 -2266
3233 -2266 -3341 -3618 -721 2679 2948 2518 -201 -2785 -1643 -1833 -1029 2508 2108 2080 316 -1208 -3837
3250 -3837 -1392 -1760 2637 2626 2292 1700 -2371 -1142 -2042 857 792 2712 1277 -720 -737 -2360 -2055 26
3268 26 1287 2959 2077 -310 -2425 -1919 -1174 542 3028 1952 2740 -372 -2047 -2290 -2242 1075 1722
3285 1722 2996 702 -583 -2007 -3117 -1827 242 2107 2925 1219 327 -3160 -2210 -1987 668 1744
3301 1744 1979 541 -1094 -1181 -1945 -649 313 2396 2305 765 -768 -2636 -2379 -1157 1127 2727 1721
3318 1721 451 -1072 -2557 -2079 -1837 2438 1296 2248 472 -1445 -1906 -2397 97 968 768 772 1003 -718
3336 -718 -2456 -2859 -1550 970 2158 1712 2164 -1905 -1504 -2049 -1572 568 2715 1783 94 -1074 -2803
3353 -2803 -2321 -95 1728 3112 2505 137 278 -1573 -1698 -711 1632 2537 1354 -101 -1274 -2515
3369 -2515 -2335 426 1222 2687 40 550 -1605 -2942 -1550 -134 1990 2223 2035 1350 -1318 -1691 -2232
3386 -2232 -90 1577 3008 2080 -806 -652 -2065 -2570 -673 1626 2692 811 421 -1263 -1467 -1763
3402 -1763 763 2983 2126 1415 -2076 -1985 -1915 -1270 668 1788 2112 998 -317 -2535 -1933 -1961 156 2692
3420 2692 1889 1217 1226 -1065 -423 -1472 1189 886 1971 1279 -1634 -1018 -1312 -459 975 1626 2527 709
3438 709 15 -1807 -1509 -315 487 846 1446 2159 -955 -1291 -2682 -1151 -139 375 1143 809 -549 -1904
3456 -1904 -2147 -159 -852 2722 1706 1095 -494 -1342 -1510 -295 -276 1521 1943 989 -684 -1068 -2571
3473 -2571 163 1401 1800 1347 -261 -1146 -2148 -1448 -20 -224 573 1250 1223 -1496 -1841 -2180 -637 2939
3491 2939 2139 1626 1083 -686 -2607 -1720 -302 -260 1983 615 787 -1428 -2280 -1388 -416 2502 1400
3508 1400 2629 -291 -780 -671 -760 537 295 2770 429 -311 -1040 -3097 267 -339 2139 1886 442
3525 442 129 -1572 -2134 -1879 44 1480 1306 1695 333 -705 -1969 -730 771 -314 2444 340
3541 340 80 -654 -1996 -557 -501 1304 1710 1470 286 -2667 -1262 -760 766 2342 1991 1171 -1314
3558 -1314 -1913 -2370 -1006 531 521 2089 703 249 -2896 -283 146 -590 1615 1406 931 -613 -1881
3575 -1881 -1932 -1174 387 246 1256 -104 -408 -1070 -1242 -65 944 2937 1019 1704 -446 -1561 -1721
3592 -1721 -864 1686 560 2393 710 -2679 -1226 -1598 762 786 1680 1962 -283 -531 -1452 -1118 -149
3609 -149 1283 1904 -126 447 -1768 -302 -2216 -825 1215 403 2551 -1040 -1212 -1109 -299 64 1052
3626 1052 1384 845 -225 -477 -1138 -14 -1170 1389 2297 2215 -502 -1889 -2382 -1903 238 231 2196 807
3644 807 399 -605 -2839 -347 -1110 1313 1801 1584 933 -2250 -1671 -2572 121 964 1157 1904 68 -1042
3662 -1042 -2119 -227 1248 2574 2059 115 -345 -471 -1548 -154 285 1925 735 672 -1654 -1184 -489
3679 -489 -1578 -238 1683 3196 720 -5 -1936 -2086 210 812 2158 844 -103 -271 -1915 -1299 -770
3696 -770 1766 2572 1698 1095 -2031 -1650 -1514 -229 2006 1603 2662 396 -531 -2968 -2159 -503 53
3713 53 1918 1031 -604 -302 -1247 -1765 1035 2215 980 546 -403 -243 -1587 -2698 248 758 2242
3730 2242 2085 270 -1638 -2241 -2283 -69 1338 2479 341 1125 -1699 -1561 -1540 1269 1955 1304 1638 -975
3748 -975 -972 -2118 -2549 33 1955 1878 434 -932 -2048 -2981 -591 468 1609 1435 1543 -844 -2401
3765 -2401 -2528 -1485 638 1781 2426 1353 -160 -654 -3209 -983 -49 1308 2765 613 -353 -2185
3781 -2185 -1420 -773 989 1542 1144 596 -1126 -1534 -1461 -1056 603 2365 2485 -259 621 -2014 -1372 -959
3799 -959 460 1867 1246 1705 -938 -2857 -2450 354 467 1212 2494 -546 -305 -2007 -2166 312 -421
3816 -421 2400 1171 604 -2041 -1259 -2298 -1261 979 2224 2131 145 -1873 -2989 -3613 -113 1628
3832 1628 2510 2555 203 -1101 -3066 -1199 -420 446 2877 1501 -435 -1309 -1501 -2472 118 2866 2463
3849 2463 2505 639 -1088 -1616 -1613 -498 1219 1912 1493 -96 -370 -1019 -664 -1551 2811 2041 1961 518 -1788
3868 -1788 -2580 -2181 442 1736 1885 2163 -536 -605 -2456 -2764 -355 1450 2618 869 512 -2700 -1240
3885 -1240 -1014 401 1942 1425 2975 -561 -1322 -1576 -2038 967 1865 2992 650 -252 -1271 -2527 -337
3902 -337 -376 1748 532 2485 -754 -2317 -857 -468 1112 1537 2903 674 249 -1980 -1736 -1151 258
3919 258 2262 1432 963 -392 -2204 -1308 -1529 1105 1968 1861 1985 -464 -1350 -1416 -832 -183 1501 2066
3937 2066 -104 -1122 -2401 -952 -1313 886 2195 1405 1276 -160 -1514 -1797 -1017 960 2184 2042
3953 2042 706 -1960 -2359 -1729 -908 860 3170 1442 492 615 -3243 -1680 -180 1774 2449 790
3969 790 289 -974 -2634 -1655 7 2142 1467 2253 273 -800 -2054 -675 291 958 2444 1433 825
3986 825 -1322 -2898 -2288 -979 1031 1710 2567 259 -751 -1565 -2013 310 1452 3259 2176 549
4002 549 -835 -1832 -1029 -254 1259 2148 1970 1623 -2046 -2324 -1406 -476 379 932 1820 -838 -1872 -2570
4020 -2570 -1208 -359 116 4150 885 574 -427 -1959 -2081 -582 1791 2322 2225 317 -2216 -527 -2855
4037 -2855 -451 732 1825 692 524 -1207 -2696 -242 -710 2383 1847 1496 34 -2173 -2001 -944
4053 -944 136 2169 2751 1789 -1018 -1303 -1356 -1657 612 1545 2287 689 -954 -2240 -2849 -739 -742 2171
4071 2171 737 842 -723 -2484 -2819 -1476 281 1408 3363 846 187 -864 -1993 -946 -1155 2386
4087 2386 2132 315 1011 -2724 -2034 -2645 983 1642 2093 1328 300 -1759 -1957 -922 536 2146 2351
4104 2351 661 109 -2634 -1412 187 -579 2789 970 2201 -996 -1334 -1794 -911 1225 647 2073
4120 2073 918 -189 -2137 -1896 -706 531 1864 2080 820 -396 -1281 -1858 -981 461 2273 2296 615
4137 615 -1656 -1170 -3399 -990 618 867 1963 -1165 -762 -2128 -1396 -1240 242 2552 2206 1400 -2104
4154 -2104 -1913 -1398 144 1951 2108 1644 -881 -1394 -1734 -2731 -383 777 1770 1669 -483 -531 -2819 -1579
4172 -1579 -513 1448 1319 1015 -207 -2066 -1986 -1367 1203 1154 2144 1848 -273 -451 -2316 -854 -472 1811
4190 1811 1927 853 615 -1572 -1131 -2265 -206 1866 2662 1269 -996 -161 -1661 -2222 -199 941
4206 941 889 -79 -411 -1323 -2820 -728 -398 2346 1911 845 -156 -2039 -1872 -1960 708 1273 1373 1767
4224 1767 -1449 -485 -2118 196 210 1339 4154 617 747 -2163 -963 120 1198 1000 1928 681
4240 681 -792 -3180 -1593 -283 903 2301 1829 -66 69 -2048 -1475 -594 1028 1775 1247 863 -625
4257 -625 -1685 -1014 -1465 739 1498 740 950 -701 -307 -2403 -957 1839 589 2344 92 65 -3097
4274 -3097 -1884 -646 1623 2399 1111 1350 -1628 -2029 -1857 -160 152 2235 1978 -311 -505 -2011 -1654
4291 -1654 -15 398 1684 748 562 -2208 -2075 -2131 -943 688 1217 2643 -96 -1201 -1350 -1348 -334 382
4309 382 2040 455 500 -131 -1714 -1438 -537 1979 2228 339 915 -1458 -1323 -1536 -188 2214 2692 1488
4327 1488 111 -688 -2402 -1738 260 971 1418 1230 -798 -1295 -1971 -1022 287 1613 95 698 -1488
4344 -1488 -1625 -1379 -1376 -67 1254 803 1393 -1507 -1280 -1199 -787 297 1369 1110 333 140 -2227 -1768 -1366
4363 -1366 4 1740 927 1574 -1312 -984 -2005 -1540 -123 1533 2219 371 20 -1604 -1849 -800 225
4380 225 1690 1482 1495 -2105 -1793 -1675 -1415 1005 604 1288 623 -848 -1710 -1947 -450 641 595 1367 395
4399 395 -428 -1935 -1531 -705 695 1393 1491 427 -1091 -1730 -1290 1107 2193 1526 1657 187 -280 -1948
4417 -1948 -1298 -359 525 1425 969 584 -988 -1765 -1089 279 1717 1786 1459 586 -1496 -1062 -1313 -26
4435 -26 166 1501 419 -724 -477 -931 -547 -1163 869 2611 890 -375 -2150 -2549 -1343 394 791
4452 791 1043 2240 -781 -461 -1859 -1266 -1315 1164 2167 330 970 -2172 -1550 -370 56 742 1786
4469 1786 1488 -371 -1703 -533 -1229 926 641 689 -250 -902 -878 -1258 549 -506 1771 2530 347 -1188
4487 -1188 -1711 -231 -846 -422 1908 880 1987 -787 -1588 -1757 535 395 1394 1626 789 -276 -1238
4504 -1238 -511 -1065 866 773 471 899 -457 -1027 -930 -1170 382 702 1215 19 -1330 -1001 -1670 -368
4522 -368 1051 2825 2342 389 -517 -1944 -948 -376 1130 1542 1538 954 -529 -1358 -464 -779 841 728
4540 728 1477 -835 -227 -1298 -985 487 1023 1804 368 -29 -1934 -1455 -1325 164 1928 1116 1948 -1273
4558 -1273 -239 -1027 -1344 -177 88 1018 545 55 -1275 -2641 -241 -368 931 2240 20 389 -1077
4575 -1077 -214 -302 448 1510 1162 1641 -846 164 -2640 -811 -872 1731 1169 1798 631 -1841 -1182 -766
4593 -766 650 1825 1125 1263 -1371 -1489 -1620 -174 553 376 1836 -397 -521 -1243 -1457 -427 -891 1132
4611 1132 1721 -701 242 -2226 -1431 -772 1452 2223 912 1758 -2143 -1719 -2356 1189 544 1689 960
4628 960 381 -311 -1281 -1841 -711 559 1759 1204 600 -899 -1402 -1168 -476 972 1421 1266 72 -997
4646 -997 -1569 -1718 424 -376 2427 1152 1041 -405 -1598 -102 -1668 1295 148 1468 -636 -469
4662 -469 -1159 -694 693 1069 2458 1333 -150 -987 -1555 -487 542 446 1440 588 168 -1871 -1704 -1303
4680 -1303 -276 2159 480 1811 -310 -1016 -29 308 736 72 2236 111 390 -385 -1633 -825 -507
4697 -507 1452 596 1907 1185 -1033 -1439 -2042 520 1215 1388 1398 -77 -24 -1455 -585 570 1226 2181
4715 2181 945 -543 -1268 -1809 -555 98 1111 355 1557 -355 -562 -1258 -1423 1283 397 964 1403
4732 1403 -412 -1396 -1566 -651 -663 2228 770 333 -1487 -2846 -2029 -711 1642 1272 1786 451 -499
4749 -499 -1075 -593 -317 21 -203 116 -208 -495 -1912 -1244 -576 963 1776 1638 464 -904 -1600 -1034 -490
4768 -490 922 698 1094 -604 -1063 -1431 -2051 660 211 2359 1831 651 -868 -2348 -424 -1753 1631
4785 1631 682 948 703 -1389 -1108 -1204 -127 1067 386 548 280 -345 -3071 -444 877 2009 2058 525
4803 525 262 -1596 -736 -89 -316 1757 1441 1292 -582 -1456 -1307 -48 -839 279 1518 266 -462 -1674
4821 -1674 -1143 -1672 -303 971 -685 1312 -1359 -505 -1785 -1312 536 -43 2093 1400 294 -830
4837 -830 -986 415 167 634 1415 1205 -32 -2137 -954 -897 179 1467 873 504 -997 -549 -766 -2507
4855 -2507 128 1378 1171 799 -150 -1397 -1170 -1139 -614 2135 967 891 -910 -1297 -1164 -510 1013 1588
4873 1588 1541 1308 -780 -3219 -1987 -430 -129 1867 162 773 617 -1657 -1918 -968 671 1992 836
4890 836 622 -1210 -314 -914 -188 644 540 1653 -662 -575 -2435 -1198 -1067 -478 2187 1023 1410 -1284
4908 -1284 -1488 -1822 -1156 1512 1322 1764 1123 -939 -1223 -1535 124 1122 3147 705 -653 -268 -2249
4925 -2249 -1784 -1688 1001 1279 907 110 -1685 -1343 -737 130 1192 1806 1959 -1494 -1173 -1766 -265 -10
4943 -10 1610 3178 248 -1 -2057 -1698 -1309 444 1064 706 1492 129 -796 -2194 -820 1159 275
4960 275 2048 -201 128 -486 -2381 -560 98 2309 1096 1311 29 -963 -1532 -706 637 1051 1510
4977 1510 677 -585 -1551 -1434 -385 -569 1942 1237 249 586 -2461 -1448 -1629 289 1377 2238 946
4994 946 324 -1805 -1918 -1125 2149 1236 2139 -539 -908 -602 -2060 679 551 2910 1736 1150 -1167
5011 -1167 -2634 -1113 -615 842 1136 1465 -193 -130 -1897 -1162 282 28 1605 1087 274 -335 -2286
5028 -2286 -2295 -924 694 2283 1077 641 -1482 -1935 -1591 -113 1945 1652 1296 -544 -1004 -634 -901 -872
5046 -872 908 2599 1309 562 -789 -2153 -808 -394 1718 1955 2588 315 -1960 -2074 -1972 -54 1705
5063 1705 2054 1015 778 -1725 -733 -520 51 268 2735 1823 -71 -818 -448 -1114 9 2808 1574
5080 1574 3175 -1328 -467 -2715 -1238 892 840 1197 848 303 -2468 -2001 -1053 23 1592 2382 996
5097 996 -677 -1973 -1784 -763 750 810 346 1065 -1290 -1343 -1862 -994 321 -371 1999 1120 134 -1756
5115 -1756 -1418 -819 439 1941 1888 1476 -694 -1046 -956 -1418 258 1539 2109 206 -192 -1718 -1320 -52
5133 -52 -475 1081 1232 1413 -130 -478 145 -1668 690 1539 1556 1448 -817 -1291 -2514 -824 1608 2076
5151 2076 871 635 -854 -1162 -1495 -1804 -587 2000 1353 -668 -1291 -918 -1610 -247 351 306 1630 -218
5169 -218 152 -1177 38 261 683 2223 803 876 -1043 -2265 -1731 -436 1352 2077 2073 351 -1068 -800
5187 -800 -1474 -1579 -83 2070 1413 187 -443 -1579 -795 -586 -841 681 787 883 -1332 -950 -1878 -901
5205 -901 1121 1441 1415 -1020 -1077 -1288 -1970 -111 184 2233 1135 816 -1445 -2106 -933 -509 1395 772
5223 772 1385 -473 255 -801 -875 -77 1109 1427 1238 237 -136 -2526 -674 -254 1231 1143 1448 -17
5241 -17 -1241 -975 -1240 -92 146 1314 550 -5 -369 -681 -1198 -174 1170 2443 -136 140 -1278 -1391
5259 -1391 -1470 -256 354 -577 888 1161 41 -467 -1718 798 1427 1618 1747 481 -1028 -2311 -793
5276 -793 -1446 1208 1213 584 251 -703 -830 -87 176 1764 1762 1364 -1249 -569 -1039 -1608 -119 1373 1385 660
5296 660 -770 -1552 -1305 -983 -201 1115 1788 1802 109 -1723 -1476 -408 282 523 1245 -978 -79 -764
5314 -764 -2727 214 -136 1510 1331 821 290 -1954 451 -886 499 654 1428 2409 -1167 -1129 -1834 -455
5332 -455 -315 1812 2405 1670 -87 -1679 -76 179 168 2232 1883 1265 -1823 -598 -2053 -584 848
5349 848 1031 839 -266 -649 -811 -2159 295 903 1146 1186 503 -142 -2345 -660 -199 802 626 -398
5367 -398 967 -821 -204 -1583 -140 1264 1005 700 242 -173 -1452 -1156 -363 -55 1243 -717 606
5384 606 -1038 -1512 -939 -1371 2283 1209 1476 -1088 -497 -1272 -1139 837 849 1243 543 178 -126 -940 -668
5403 -668 -198 729 2139 424 -326 -1239 330 -1849 211 722 1060 1268 93 -1313 -1866 704 -244
5420 -244 1308 1170 827 -379 -1724 -1582 -1053 -574 1137 526 401 -1061 -1475 -350 -838 1620 685 2636
5438 2636 1125 32 -305 -1233 258 219 1792 117 269 44 -1429 217 458 173 2305 1784 -659
5455 -659 157 -778 -794 -1615 276 481 1703 229 965 -722 -662 154 963 910 1673 297 -1184 -13 -1693
5474 -1693 -813 450 820 341 774 -639 -965 -1095 -396 1423 2322 1938 357 -1011 -1184 -1239 -581 1409
5492 1409 -126 542 608 -1065 -1907 -952 605 744 523 1129 172 -184 -1900 -1589 -1163 1782 411 218
5510 218 480 -1989 -642 -1103 26 1305 97 979 451 -615 -983 -1013 106 923 1077 -108 237 -958
5528 -958 -1443 -416 -1046 1223 1476 1372 -158 -1565 -842 -1674 829 1431 806 537 237 -269 -268 671 969
5547 969 1149 329 295 -1138 -2148 -566 -1158 41 -382 549 769 -220 -884 -1744 -825 -181 484 1816 315
5566 315 -102 -228 -1845 815 534 1404 538 443 411 -1449 -492 -562 1044 1123 726 953 -841 -119 -670 -553
5586 -553 696 1594 1033 310 -1162 -1686 1238 -337 1332 1101 1484 483 -2214 -623 -1291 242 1496
5603 1496 557 451 -47 -584 -1798 -1292 -774 499 1700 269 -134 -1273 -633 -519 -1375 146 1381
5620 1381 1567 801 -185 -942 -805 -564 76 581 1099 788 -876 -1992 668 -422 684 1253 630 1025
5638 1025 675 -246 -1551 -869 2370 -317 441 168 -149 -2510 -353 606 374 929 141 14 -1212 -517
5656 -517 -656 88 515 27 769 428 -986 -1362 437 1483 714 1448 1341 -409 -810 -587 204 577 857
5675 857 929 1332 -639 -2212 -273 -674 2150 1325 1140 302 -311 -1199 -845 867 260 349 1871 1088 549
5694 549 -1328 -290 637 -276 1930 -564 469 -1017 -1856 -332 -92 1654 -462 1052 49 -576
5710 -576 -147 -603 32 1085 1019 806 -1154 -1350 -1768 -1101 170 2272 282 157 -537 -2348 -508 -346
5728 -346 897 574 1089 605 -1014 -128 -882 -192 -650 96 386 329 653 -1672 -1902 417 109 311 1213
5747 1213 1827 -209 -1220 -1039 -1068 905 558 490 1380 -875 -1219 -1624 -688 184 -36 1541 1372 -609
5765 -609 -2738 218 -685 741 -90 610 1364 -497 -843 -1326 77 719 1591 1870 55 292 325 -791
5783 -791 -219 646 2687 332 1321 -427 -916 -919 -328 595 761 2611 437 -345 -866 -2103 348 294 1693
5802 1693 691 -19 -526 -888 -854 -765 1426 719 666 873 -458 103 -1493 57 -489 1617 800 -406
5820 -406 -1531 -899 -177 -809 65 1253 168 1815 -1567 -861 -684 501 1382 594 1398 894 -951 -1364
5838 -1364 -176 -130 -7 2377 1697 -456 -520 -840 -1861 -919 514 822 286 -149 -2105 -105 -336 688
5856 688 156 1830 1157 -429 -813 -1418 -509 -794 1292 1944 41 -111 -1605 -1375 -742 173 1760 415
5874 415 844 -1460 -837 -1916 -2065 998 84 1238 -7 210 -1075 -1723 -561 -1235 1594 1395 788
5891 788 31 -1198 -42 -454 318 1384 1132 1209 -744 -589 -957 -1094 -17 915 1284 462 -682 -2043
5909 -2043 300 -726 188 128 574 752 -1996 -965 -1545 -137 1302 389 1144 -357 -165 -725 -1889
5926 -1889 -517 -453 1471 633 615 -447 -1928 -235 -1422 1699 262 1577 557 -1375 -726 -2223
5942 -2223 -1405 970 1324 625 537 -147 -2226 -671 -524 -496 1971 79 537 -966 -562 255 -132 557
5960 557 314 894 211 -590 -830 -1604 234 789 2276 1145 248 -785 -2223 -832 -644 589 746 321
5978 321 211 2 -196 -517 420 595 1542 925 -178 -339 -843 556 530 468 1051 -104 -366 -2232 -759
5997 -759 -1986 -349 376 1247 1294 -1115 -785 -2099 -1527 -654 1074 1104 -157 296 -698 -1552 -1273 -523 1572
6016 1572 532 799 39 -1036 -1931 -859 886 906 2137 1736 866 -141 -2218 169 -566 776 432
6033 432 46 320 -1467 -1170 -794 -527 -224 503 1305 -514 278 -1254 -1146 917 949 1192 1149 357 -1495
6052 -1495 -1385 262 -279 1757 414 691 -609 -971 -929 -1520 508 1600 880 620 -429 -325 -1708
6069 -1708 506 -193 391 1665 929 11 -1869 -1142 529 371 1836 1532 1655 -1374 -1165 -669 458
6086 458 645 779 822 208 431 -1801 -119 -332 705 2713 1201 347 -1290 -846 -562 -848 747 357
6104 357 1227 -132 -780 -601 -1270 8 422 654 753 -468 -470 -696 -1231 -787 1282 943 1268 1807 -1396
6123 -1396 -426 -2168 -176 1197 653 1490 -68 572 -747 -774 889 792 1257 1209 -1403 -1174 -1943 -106
6141 -106 363 986 1151 1047 55 -508 -376 -583 607 114 622 1396 -88 -191 -1732 -75 412 1298 75
6160 75 1036 1469 -723 -1101 -325 -18 922 1493 670 123 -1218 -2120 101 541 1187 2185 -165 -735 -1988
6179 -1988 -1654 -108 134 854 -988 1496 -773 -108 -908 -2254 261 599 172 452 76 -1751 -1675 -831
6197 -831 -862 1835 1040 1543 262 -1119 -175 -1094 404 931 1365 -143 -927 -1041 -1658 -392 1149 1446
6215 1446 1200 -480 -827 -1172 -422 -909 1 855 781 698 -947 -315 -761 -325 1149 265 2084 -793 -220
6234 -220 -637 -1242 -85 1305 1638 1309 297 -267 -35 -789 -147 1376 1488 419 1336 -808 -355 -1974
6252 -1974 -581 1287 1412 1717 -696 135 -430 -96 -522 653 1857 487 565 -1335 -1125 -826 -617 1695
6270 1695 29 1817 901 -510 -1466 -1131 857 337 1466 268 36 -570 -861 -427 501 1436 916 1141
6288 1141 -603 -682 -1613 -440 804 363 2085 2066 319 -366 -1898 -674 670 962 857 -556 4
6305 4 -1803 149 -1139 635 845 557 1137 -1033 -618 -669 -939 -829 704 471 247 1190 -730 -1207 -754
6324 -754 395 1229 997 714 -694 -1676 -996 -1395 -666 1213 1022 1144 -592 -442 -351 -821 -929 1180 -94
6343 -94 535 -365 -1810 -954 -540 1057 -1189 565 911 -1250 -616 -391 -297 447 745 1673 4 -218 -566
6362 -566 -894 -920 1188 1065 530 630 162 -865 -1007 -234 262 117 713 131 -1740 -929 -1120 70 668
6381 668 1052 1893 -679 262 -106 -621 -612 235 1507 845 616 -794 -590 -1332 -196 795 926 1635 -187
6400 -187 -1013 -996 -1367 -455 -189 998 307 -418 -861 -1525 -370 -504 830 495 1343 763 -776 -894 -39
6419 -39 -69 434 1740 1274 -83 -327 -642 -1009 -1394 216 1016 1131 -120 -3 -136 -105 -487 576 525 871
6439 871 -417 -1020 -1541 -607 1205 -488 845 -272 -468 -1126 -84 -763 -3 1069 303 -1093 -558
6456 -558 -1015 -1826 -1130 118 497 2076 -731 159 -775 -956 374 -406 577 1936 626 -144 -1090 427
6474 427 -277 -582 1559 -460 970 -735 -29 -1098 -135 -225 106 1440 -360 -372 -1059 -517 -103 -328
6492 -328 2320 -146 680 -550 -808 -972 -757 1471 -769 647 41 -816 -1029 -1576 282 90 643 979
6510 979 -346 -228 -103 -168 -1172 414 1021 602 1836 -459 -739 150 79 1147 69 2048 247 782
6528 782 -1271 -804 337 126 676 213 -240 -371 -2493 -312 -318 567 421 1636 250 -1087 -1977 16
6546 16 -39 414 1759 369 -327 501 -320 1427 206 819 155 -524 756 -191 -356 -872 236 628 718
6565 718 67 -373 -1715 -1679 -1410 -38 1567 1193 -376 1550 -1168 -1489 90 -988 1421 1329 352 188
6583 188 -867 -626 122 141 450 1867 233 -648 -1503 -969 -562 -496 1136 288 -335 -50 -1076 -533 6
6602 6 739 949 584 230 -1467 -921 -1011 197 -151 1527 1563 -180 81 -86 -426 -978 190 1215 687
6621 687 1307 -912 -791 -985 146 908 726 1781 429 213 -170 -1379 674 -1052 -327 714 -72
6638 -72 -62 -2326 70 -379 223 1175 982 165 -1061 -823 -1841 -148 -113 1387 663 -916 -388 -673 -957
6657 -957 -1388 968 1229 373 -488 -1631 -435 70 -917 1328 773 98 -411 -1613 -1021 -876 606 -634
6675 -634 839 110 -312 -99 -833 -45 52 1123 -644 -36 -189 -812 -278 -1060 186 392 1601 1491 -292
6694 -292 -673 -1823 154 -89 332 735 464 630 -1470 -541 70 452 674 235 2341 -314 328 -1805
6712 -1805 -242 378 534 1277 1415 -477 -1508 -628 404 98 1560 1015 229 -224 -2633 -738 -1046
6729 -1046 729 210 938 -155 -84 -935 -1904 916 -242 847 2538 -392 -780 -1570 -440 -300 682
6746 682 1811 684 -93 -918 638 -245 -1300 49 867 1753 -148 -973 -2182 -585 -495 1437 2244
6763 2244 361 419 35 -1409 -600 -798 957 312 -247 152 -289 -821 -1039 -159 1023 1326 457 -1333
6781 -1333 188 -1012 406 -571 1002 1995 156 138 -1248 -202 -766 -565 728 13 1526 127 187
6798 187 -1375 -275 -81 399 1445 544 225 -164 273 497 184 1051 -61 345 -392 -882 -1150 -551 1192
6817 1192 1064 1133 -803 -1129 -594 -980 1213 962 373 707 -418 -894 627 -472 -768 926 995 1385
6835 1385 399 140 -449 -339 328 -182 -255 2086 -557 54 -936 -910 -426 1444 968 680 325 -835 -95
6854 -95 -1008 -1717 1889 958 1576 191 890 -624 -868 509 298 1300 1912 -692 -312 -1936 132 -841
6872 -841 824 764 98 -556 -2486 -593 -851 624 1281 518 292 461 -191 -2121 -177 1122 -506 1546
6890 1546 208 419 -1245 -1145 -1079 -16 1667 1072 886 451 -1293 -1340 -1123 -301 -30 1281 733 -1181
6908 -1181 -930 -1066 -130 -396 1398 367 -387 423 -506 -862 -805 37 839 1704 -112 45 -821 -1078 324
6927 324 892 1213 957 -445 285 -1106 -798 -587 143 1074 210 2400 375 -753 -432 -374 198 -137 543
6946 543 819 296 -299 -1449 -261 200 1592 -90 490 148 -1875 -467 285 1407 446 807 1366 -1145
6964 -1145 -449 -1654 -694 694 1994 1437 -613 1254 -1493 -1222 114 821 2111 2 1034 -53
6980 -53 530 -1201 -544 16 417 1443 259 91 -670 -495 -229 300 1269 1087 1127 -508 -498 651 -1026
6999 -1026 1827 1933 1284 508 -1736 -140 -387 -961 758 1491 2542 -873 849 -1605 -1523 479 1116
7016 1116 2158 291 587 -849 -366 -537 -51 -211 1289 245 123 -1617 -658 -572 -441 -45 889 1080
7034 1080 -466 -934 -2129 -344 42 -147 560 580 458 -172 -897 -1059 581 515 285 162 588 -1040 -738
7053 -738 -2 -1398 650 -300 364 427 -200 139 -1051 541 1399 1142 1713 117 708 -1608 -1602 672 1458
7072 1458 710 5 1471 -1337 -2257 -715 389 463 511 -720 -197 -202 -404 -1264 24 1562 322 920
7090 920 40 806 -1394 -514 625 305 -668 -459 -669 -596 -1065 -1008 721 534 413 -81 -495 -539 -890 -753
7110 -753 1286 717 1112 701 1192 -859 -1460 137 251 493 548 472 -513 -858 -15 -1673 1014 1816 719
7129 719 256 -154 -826 -1934 -639 576 511 1094 761 -210 -824 -224 -966 -152 745 -427 272 -1364 -1293
7148 -1293 -1224 90 781 -96 2221 -779 -400 -1587 -201 423 601 1872 75 333 -864 -841 -724 -613
7166 -613 875 1078 946 -105 -846 -787 -832 891 820 1090 2046 99 77 -362 -248 -97 663 1995 1129 306
7186 306 -841 129 -1702 -368 1596 735 1421 664 366 -1314 -967 751 -396 -185 102 1159 -463
7203 -463 -263 -146 -318 678 733 483 -416 -1667 421 -532 42 1851 1673 722 226 -742 -949 72 -36
7222 -36 2098 999 -110 -613 -2108 -507 -848 715 1158 477 2074 -506 19 -1568 -853 1267 995
7239 995 1556 -2 693 -875 -1982 -92 -545 590 350 1597 -466 -1193 -220 -796 1122 814 1311
7256 1311 361 -650 -1139 -1184 735 -170 -276 824 879 243 -1446 -937 -211 410 1208 -613 -399 -168 -103
7275 -103 -754 -370 1156 928 1435 552 -63 -823 -924 -118 1734 1188 -178 928 -871 -1673 -167 -114
7293 -114 -191 1295 1040 1520 -264 -1193 -295 114 623 1099 880 -652 -920 -1055 -556 -750 743 767 614
7312 614 179 -817 -802 -1068 -1243 -543 1019 2205 -950 9 -1122 275 261 945 869 -429 433 -874 -472
7331 -472 296 -101 1718 417 1398 55 -645 -680 409 -133 194 1260 573 -1332 -259 -645 -487 -264
7349 -264 621 1138 871 208 -2110 -943 -1042 621 82 167 97 120 -954 -2043 -648 -418 86 1016 -1801
7368 -1801 829 -880 -533 -503 -43 713 -385 -412 -828 83 -1780 -601 1554 154 895 78 -368 153
7386 153 -675 637 -201 1668 629 -53 780 -710 321 -395 -158 304 -820 408 -195 -1133 166
7403 166 284 636 817 66 99 733 -692 -93 -321 -250 1235 -379 1186 -200 -272 307 -1020 1701 -229
7422 -229 463 -718 -367 -55 -1415 966 -876 349 112 925 389 -1877 -574 -43 411 965 528 392
7440 392 -318 -616 -212 1195 -131 1353 766 -808 185 -1899 -632 -552 112 1736 237 853 -1736
7457 -1736 -978 -1014 56 -7 307 1723 806 -31 588 -1328 1278 -279 1228 -205 128 -384 -689 543
7475 543 -889 -34 1130 96 842 -1182 257 -451 109 1449 264 454 -1108 394 -534 -436 -457 365
7493 365 623 -141 935 -36 -1187 -453 714 741 732 1086 -79 -558 -590 -932 1566 -670 2075 752 -976
7512 -976 -59 -777 492 -1008 1674 568 344 -764 -905 -879 -135 1327 200 640 -1432 -426 80
7529 80 65 419 -250 790 176 -20 -319 -1150 756 -585 -587 553 -754 -656 -719 -603 -1143 -25 276 396
7549 396 899 -301 111 -1267 -896 425 -1302 1310 500 607 264 -860 613 -1409 -150 -611 855
7566 855 499 -680 -479 290 164 544 1659 245 -377 396 -1252 270 -1223 995 550 458 1154 -967
7584 -967 -219 -101 668 -95 1005 249 190 1183 -463 -1650 21 -699 592 212 -780 -1048 -798 -70 -190
7603 -190 1373 246 96 751 366 -217 -1002 158 371 1017 713 -701 366 -1981 79 1198 1170 1499
7621 1499 212 -406 -879 -266 -782 158 1437 -372 1512 -1785 -308 249 816 295 -387 1518 440
7638 440 524 -18 -884 139 -898 1417 446 735 -499 -468 -514 32 1387 -533 721 -141 -1209 83
7656 83 315 280 -154 641 -515 -202 -334 -644 -302 -618 793 242 541 280 -1302 621 -835 246 281
7675 281 58 337 -141 -569 374 353 -66 370 291 530 298 -211 -582 62 -384 1332 676 -94 720 -414
7695 -414 -145 -154 34 584 753 -191 -679 -416 -717 332 -368 252 437 217 67 -1569 -619 -1278 767 -932
7715 -932 450 1141 881 -823 -1102 -445 -448 363 899 404 -282 -1142 -893 899 -1325 1339 -206 369 -750
7734 -750 -84 -235 -387 279 93 686 -392 -66 242 -158 -4 670 1571 1443 319 -328 -927 -519 -280
7753 -280 1383 -227 -445 -45 -933 -583 -292 -280 856 -384 1448 1131 -1252 -658 -1264 -229 -528 225
7771 225 1020 773 -542 169 -405 -1124 1065 116 1386 -445 -1466 -81 -334 -404 86 191 -271 -228 -693
7790 -693 -1287 -98 -763 1059 414 -794 22 -672 117 -1799 477 1466 267 1274 -1633 -362 -64
7807 -64 1079 -845 -1089 1341 826 1235 -387 62 -136 -839 1978 1741 675 -853 52 -659 -154 451
7825 451 -894 1136 -278 128 435 -1597 364 -348 1389 -419 952 522 -1645 -430 -1205 35
7841 35 356 683 259 -1673 -214 -991 -1082 -588 -39 1385 -1000 -902 -364 -889 -611 -94 453 -171 -593 -1226
7861 -1226 -1020 -609 -673 825 781 454 143 -643 -605 -440 -61 -413 2232 702 -419 120 -1302 -754 -372
7880 -372 696 222 386 540 -1519 244 -929 641 -299 809 565 -676 271 -1263 512 -1735 358
7897 358 1047 433 642 -1299 -73 -270 443 1218 881 2216 665 -1152 8 -772 -73 -2 1663 -439
7915 -439 576 -712 -315 743 -249 -432 -65 1073 236 -1494 -123 -681 1020 184 888 1334 -1248
7932 -1248 -335 -991 478 -1032 607 1942 684 511 -675 -150 -945 1201 2138 853 735 242 579
7949 579 -544 -437 508 556 748 335 -643 -884 -783 299 -883 1022 656 645 140 -1159 -960 56 343
7968 343 244 1451 518 -74 805 -904 676 435 24 769 891 551 -1325 -607 321 616 1801 193
7986 193 1461 -1072 -347 -574 -908 895 100 1284 -132 -510 -782 -829 -202 350 1070 1365 -162 -2125
8004 -2125 -703 166 121 -228 538 896 1426 -503 -1043 -967 184 668 954 1057 57 -443 -2665 -1025
8022 -1025 -761 439 732 205 802 -757 -743 -1257 -266 1526 1119 -246 480 560 -778 -637 -371 -190 1602
8041 1602 618 285 -1133 -743 -274 -245 1287 884 362 681 -970 409 -664 757 1877 1185 352 415
8059 415 -215 -1284 -201 -1066 832 204 37 -224 -399 -455 -374 222 1180 748 658 -428 -737 -192 -1054 609
8079 609 601 1099 -246 -1345 562 -854 -549 491 1277 1606 2188 -1154 -546 -526 277 1732 -522 442
8097 442 1028 -445 594 -1175 480 -620 449 1097 475 161 -1564 -177 -913 51 1893 -354 1498
8114 1498 292 -495 -1758 -80 444 1092 1371 -1721 962 -1471 -1033 348 -342 554 545 727 78 15
8132 15 -575 480 1441 408 1575 538 -1122 -106 -1191 960 917 598 73 291 -1416 -1543 -11
8149 -11 267 1126 1751 394 1273 -513 270 -1051 -420 107 1016 1277 -69 -1095 -1445 -994 -381 -733 1677
8168 1677 -607 625 -1571 408 -538 -744 1043 330 275 -1127 -1547 -1086 -945 -39 357 281 586 1110
8186 1110 233 -1414 -171 -1316 1366 497 470 535 -382 541 -1243 108 885 576 519 -327 -243 -1700 -38
8205 -38 578 977 1774 883 868 -1715 380 622 83 1312 416 32 -929 131 130 117 1410 257 1696
8224 1696 87 -381 -1225 -662 -76 -111 833 232 -193 -13 -1638 -737 -983 516 74 1162 1250 138 974
8243 974 -472 -1370 -425 1414 1314 -972 -392 -414 -2145 -739 -1063 76 -465 553 -916 -393 -5 -222
8261 -222 -219 602 1895 619 -103 -359 -78 183 270 1259 162 1099 53 -673 -128 -730 1205 1330 -38
8280 -38 166 -565 -796 -431 -2 60 1382 1735 -893 698 -1343 36 -828 698 1342 -363 548 -1203
8298 -1203 -521 319 -415 531 -1277 513 564 -461 -283 -396 324 637 1987 -271 1060 -474 -670 -175
8316 -175 -562 1099 223 1177 7 -875 -1402 -1940 252 -1224 64 -160 -365 906 -1941 162 89 404
8334 404 955 402 267 -272 149 -1034 -1018 -6 450 1327 -693 -725 -620 343 761 241 24 -615 -8 314
8354 314 -203 -187 -957 1808 -247 552 -682 -1102 -664 -1095 -50 -184 1503 856 563 -664 -945 143
8372 143 -238 237 1198 -407 997 -270 712 -765 314 1652 1221 -73 -692 34 -1459 -311 887
8389 887 307 313 24 795 -207 -777 -33 672 1256 321 1534 -14 -733 -1169 -536 1060 630 349 -600
8408 -600 -1394 -492 -933 92 273 558 590 253 531 -1616 -1116 -1536 361 1574 387 1525 -1450 -96
8426 -96 -1044 -90 349 924 1182 350 -303 -431 -16 -514 -34 191 490 -304 -1080 73 -1042 438 520 703
8446 703 769 -435 -600 -902 -78 -253 792 1145 415 -623 56 -1632 -1280 163 -341 1119 682 1461
8464 1461 -1638 -557 -1126 230 575 -46 113 -807 -667 -1147 -139 -951 -680 398 861 -288 -1844
8481 -1844 337 1460 -594 1592 -228 1039 -743 -1101 -410 -1649 5 176 628 119 -1564 -1045
8497 -1045 -604 1125 474 1038 1622 -230 -196 -1968 156 -269 557 598 603 290 -675 876 -1405 -82 -925
8516 -925 -221 581 97 434 -606 -468 -303 -9 309 -297 744 -69 -581 -679 -1037 318 190 267 -822
8535 -822 -438 -234 -1075 -59 -601 952 547 -401 -320 -467 -314 -47 -106 -341 -19 219 292 -909 -125 339
8555 339 848 583 -429 -974 98 15 148 -279 606 1842 -795 808 -347 -1292 -179 475 716 -874
8573 -874 1635 -1065 -566 1389 -587 85 607 471 1580 31 -602 403 -650 -810 462 657 357
8590 357 95 -527 225 -869 744 -51 1024 525 -929 327 -1107 739 328 809 1185 -555 -478 -1435
8608 -1435 -180 409 -40 -64 -33 293 -292 -657 -804 393 1295 -45 1908 -315 886 -74 -985 27
8626 27 -262 1010 796 53 -317 -1019 -1150 -805 577 168 1235 26 -1227 319 -550 -866 -1 70 -98
8645 -98 -405 508 -729 -433 1750 349 1626 685 1215 190 253 -279 543 88 704 -275 -735 -874 1198
8664 1198 -485 914 -210 927 52 -395 -540 -725 1414 1279 629 252 1017 308 -737 236 -1120
8681 -1120 -423 32 174 1575 219 -17 -42 76 -715 498 891 -777 -286 -217 -287 -218 491 127 1262
8700 1262 606 -537 -155 -1003 258 355 847 846 -365 110 -732 -123 666 -689 636 250 -309 -1002 565
8719 565 -1161 -370 1063 238 915 47 -897 -447 786 -195 -514 580 751 238 394 -167 395 -343 747
8738 747 653 556 1556 -202 -1171 -107 -1170 856 895 827 528 284 -734 -194 -84 -616 897 795 -322
8757 -322 720 -13 -235 -1171 590 629 -440 -410 -977 -115 -2363 -277 -1032 1899 1300 241 525 -948
$$ [...]
16383d12
##END NTUPLES=NMR FID
##END=
