##TITLE=1H_DE-80H_X3
 200.13MHz, d2o
 8 sc
 
 19ns.26.2.2025
##JCAMPDX= 6.0         $$ Bruker NMR JCAMP-DX V2.0
##DATA TYPE= NMR FID
##DATA CLASS= NTUPLES
##ORIGIN= UXNMR, Bruker Analytische Messtechnik GmbH
##OWNER= pz
$$ XWIN-NMR		Version 3.5
$$ Tue Oct 21 12:12:09 2025 Russian Standard Time (UT+4h)  Yarkov@DPX200
##.OBSERVE FREQUENCY= 200.1313
##.OBSERVE NUCLEUS= ^1H
##.DELAY= (6, 6)
##.ACQUISITION MODE= SIMULTANEOUS
##.ACQUISITION SCHEME= undefined
##.AVERAGES= 8
##.DIGITISER RES= 18
##SPECTROMETER/DATA SYSTEM= spect
##.PULSE SEQUENCE= zg30
##.SOLVENT NAME= MeOD
##.SHIFT REFERENCE= (INTERNAL, MeOD, 0, 14.3821)
##AUDIT TRAIL= $$ (NUMBER, WHEN, WHO, WHERE, WHAT)
$$ ##TITLE= Audit trail, XWIN-NMR		Version 3.5
$$ ##JCAMPDX= 5.01
$$ ##ORIGIN= Bruker BioSpin GmbH
$$ ##OWNER= Yarkov
$$ C:/Bruker/XWIN-NMR/data/yarkov2/nmr/H-C/1/audita.txt
$$ ##AUDIT TRAIL=  $$ (NUMBER, WHEN, WHO, WHERE, WHAT)
(   1,<2025-10-21 12:11:09.95 +0400>,<Yarkov>,<DPX200>,
      <created by zg, POWCHK disabled, PULCHK disabled
       configuration hash MD5:
       00 E9 B6 7A A2 85 ED C7 34 08 36 98 17 FE 4E 26
       data hash MD5: 16K
       3C 7E CA AE BF D8 82 3C 15 DA 71 59 A1 81 5A 8B>)
$$ ##END=
$$ 
$$ hash MD5
$$ 3A 76 A7 5E 28 36 46 F1 97 9D AE 34 91 D0 5F 50
##$RELAX= 
##$RELAX= 
##$RELAX= 
##$RELAX= 
##$RELAX= 
##$RELAX= 
$$ Bruker specific parameters
$$ --------------------------
##$DU= <C:/Bruker/XWIN-NMR>
##$EXPNO= 1
##$NAME= <H-C>
##$PROCNO= 1
##$TYPE= <nmr>
##$USER= <yarkov2>
##$AMP= (0..31)
100 100 100 100 100 100 100 100 100 100 100 100 100 100 100 100 100 100 
100 100 100 100 100 100 100 100 100 100 100 100 100 100 
##$AQSEQ= 0
##$AQ_mod= 1
##$AUNM= <au_zg>
##$AUTOPOS= <>
##$BF1= 200.13
##$BF2= 200.13
##$BF3= 200.13
##$BF4= 200.13
##$BF5= 200.13
##$BF6= 200.13
##$BF7= 200.13
##$BF8= 200.13
##$BYTORDA= 1
##$CFDGTYP= 0
##$CFRGTYP= 5
##$CHEMSTR= <none>
##$CNST= (0..31)
1 1 145 1 1 1 1 1 1 1 1 1 1 1 1 1 1 1 1 1 1 1 1 1 1 1 1 1 1 1 1 1 
##$CPDPRG= <>
##$CPDPRG1= <>
##$CPDPRG2= <>
##$CPDPRG3= <>
##$CPDPRG4= <mlev>
##$CPDPRG5= <mlev>
##$CPDPRG6= <mlev>
##$CPDPRG7= <mlev>
##$CPDPRG8= <mlev>
##$CPDPRGB= <>
##$CPDPRGT= <>
##$D= (0..31)
0 0.7 0 0 0 0 0 0 0 0 0 0.03 0 0 0 0 0 0 0 0 0 0 0 0 0 0 0 0 0 0 0 0 
##$DATE= 1761034269
##$DBL= (0..7)
120 120 120 120 120 120 120 120 
##$DBP= (0..7)
150 150 150 150 150 150 150 150 
##$DBP07= 0
##$DBPNAM0= <>
##$DBPNAM1= <>
##$DBPNAM2= <>
##$DBPNAM3= <>
##$DBPNAM4= <>
##$DBPNAM5= <>
##$DBPNAM6= <>
##$DBPNAM7= <>
##$DBPOAL= (0..7)
0.5 0.5 0.5 0.5 0.5 0.5 0.5 0.5 
##$DBPOFFS= (0..7)
0 0 0 0 0 0 0 0 
##$DE= 6
##$DECBNUC= <off>
##$DECIM= 32
##$DECNUC= <off>
##$DECSTAT= 4
##$DIGMOD= 1
##$DIGTYP= 9
##$DL= (0..7)
0 120 120 120 120 120 120 120 
##$DP= (0..7)
150 150 150 150 150 150 150 150 
##$DP07= 0
##$DPNAME0= <>
##$DPNAME1= <>
##$DPNAME2= <>
##$DPNAME3= <>
##$DPNAME4= <>
##$DPNAME5= <>
##$DPNAME6= <>
##$DPNAME7= <>
##$DPOAL= (0..7)
0.5 0.5 0.5 0.5 0.5 0.5 0.5 0.5 
##$DPOFFS= (0..7)
0 0 0 0 0 0 0 0 
##$DQDMODE= 0
##$DR= 18
##$DS= 0
$$ [...]
##$SUBNAM2= <"">
##$SUBNAM3= <"">
##$SUBNAM4= <"">
##$SUBNAM5= <"">
##$SUBNAM6= <"">
##$SUBNAM7= <"">
##$SUBNAM8= <"">
##$SUBNAM9= <"">
##$SW= 18.0517328524113
##$SWIBOX= (0..15)
0 0 2 0 0 0 0 0 0 0 0 0 0 0 0 0 
##$SW_h= 3612.71676300578
##$TD= 16384
##$TD0= 1
##$TE= 0
##$TE2= 300
##$TE3= 300
##$TEG= 300
##$TL= (0..7)
0 120 120 120 120 120 120 120 
##$TP= (0..7)
150 150 150 150 150 150 150 150 
##$TP07= 0
##$TPNAME0= <>
##$TPNAME1= <>
##$TPNAME2= <>
##$TPNAME3= <>
##$TPNAME4= <>
##$TPNAME5= <>
##$TPNAME6= <>
##$TPNAME7= <>
##$TPOAL= (0..7)
0.5 0.5 0.5 0.5 0.5 0.5 0.5 0.5 
##$TPOFFS= (0..7)
0 0 0 0 0 0 0 0 
##$TUNHIN= 0
##$TUNHOUT= 0
##$TUNXOUT= 0
##$USERA1= <user>
##$USERA2= <user>
##$USERA3= <user>
##$USERA4= <user>
##$USERA5= <user>
##$V9= 5
##$VALIST= <valist>
##$VCLIST= <CCCCCCCCCCCCCCC>
##$VD= 0
##$VDLIST= <DDDDDDDDDDDDDDD>
##$VPLIST= <PPPPPPPPPPPPPPP>
##$VTLIST= <TTTTTTTTTTTTTTT>
##$WBST= 1024
##$WBSW= 4
##$XGAIN= (0..3)
0 0 0 0 
##$XL= 0
##$YL= 0
##$YMAX_a= 382338
##$YMIN_a= -250382
##$ZGOPTNS= <>
##$ZL1= 120
##$ZL2= 120
##$ZL3= 120
##$ZL4= 120
##$ABSF1= 10
##$ABSF2= 0
##$ABSG= 5
##$ABSL= 3
##$ALPHA= 0
##$AQORDER= 0
##$ASSFAC= 0
##$ASSFACI= 0
##$ASSFACX= 0
##$ASSWID= 0
##$AUNMP= <proc_1d>
##$AZFE= 0.1
##$AZFW= 0.1
##$BCFW= 1
##$BC_mod= 2
##$BYTORDP= 1
##$COROFFS= 0
##$CY= 83.5205535888672
##$DATMOD= 1
##$DC= 2
##$DFILT= <>
##$DTYPP= 0
##$F1P= 10.8118882576601
##$F2P= -7.23987719738617
##$FCOR= 0.5
##$FTSIZE= 0
##$FT_mod= 4
##$GAMMA= 1
##$GB= 0.15
##$INTBC= 1
##$INTSCL= 1
##$ISEN= 128
##$LB= 0.25
##$LEV0= 0
##$LPBIN= 0
##$MAXI= 10000
##$MC2= 0
##$MEAN= 0
##$ME_mod= 0
##$MI= 1.114404
##$NCOEF= 0
##$NC_proc= 0
##$NLEV= 6
##$NOISF1= 3.799351
##$NOISF2= 2.8
##$NSP= 1
##$NTH_PI= 0
##$NZP= 0
##$OFFSET= 14.38212
##$PC= 1
##$PHC0= -4234.144
##$PHC1= 3.42191
##$PH_mod= 1
##$PKNL= yes
##$PPARMOD= 0
##$PSCAL= 0
##$PSIGN= 0
##$REVERSE= no
##$SF= 200.129724274929
##$SI= 16384
##$SIGF1= 3
##$SIGF2= 2
##$SINO= 400
##$SIOLD= 16384
##$SREGLST= <1H.CDCl3>
##$SSB= 0
##$STSI= 0
##$STSR= 0
##$SW_p= 3205.1282051282
##$SYMM= 0
##$S_DEV= 0
##$TDeff= 0
##$TDoff= 0
##$TI= <>
##$TILT= no
##$TM1= 0
##$TM2= 0
##$TOPLEV= 0
##$USERP1= <user>
##$USERP2= <user>
##$USERP3= <user>
##$USERP4= <user>
##$USERP5= <user>
##$WDW= 1
##$XDIM= 8192
##$YMAX_p= 0
##$YMIN_p= 0
$$ End of Bruker specific parameters
$$ ---------------------------------
##NTUPLES= NMR FID
##VAR_NAME=  TIME,          FID/REAL,        FID/IMAG
##SYMBOL=    X,             R,               I
##VAR_TYPE=  INDEPENDENT,   DEPENDENT,       DEPENDENT
##VAR_FORM=  AFFN,          ASDF,            ASDF
##VAR_DIM=   8192,          8192,            8192
##UNITS=     SECONDS,       ARBITRARY UNITS, ARBITRARY UNITS
##FACTOR=    0.0002768,     1,               1
##FIRST=     0,             0,               0
##LAST=      2.2672688,     0,               0
##MIN=       0,             -250382,         0
##MAX=       2.2672688,     382338,          0
$$ Real data points
##PAGE= N=1
##DATA TABLE= (X++(R..R)), XYDATA
$$ [...]
563g138o9J054K055K585K881K812K579J352p19k091k600k768l028l003j831J58
$$ -7138 -7207 -6153 -4098 -1513 1368 4180 6759 8111 7392 5301 2701 -67 -3095 -6098 -7929 -7771
579g771J766K268K560K881K913J934M73r30j754k293k679k497j820p79Q7R64J707
$$ -7771 -6005 -3737 -1177 1704 4617 6551 7024 6094 4340 2047 -632 -3129 -4949 -5728 -5641 -4677 -2970
596b970K228K288J935J424Q30j52j320j870k376k519k298j399J63J393J908K254
$$ -2970 -742 1546 3481 4905 5735 5583 4263 2393 17 -2502 -4800 -6199 -6036 -4643 -2735 -481
612d81K685K437J260l83j425j624j770k045k132j399j65P06J144J411J961J984
$$ -481 2204 4641 5901 5518 4093 2469 699 -1346 -3478 -4877 -5042 -4336 -3192 -1781 180 2164
628B164J788J089J47j003j767k064j860k016j379n48Q62J848K007J664J721J514
$$ 2164 3952 5041 5188 4185 2418 354 -1506 -3522 -4901 -5449 -4587 -2739 -732 932 2653 4167
644D167Q93k78j430j688j725j798j765j089j36Q10J450J916J871J675J057N32
$$ 4167 5060 4782 3352 1664 -61 -1859 -3624 -4713 -4849 -4039 -2589 -673 1198 2873 3930 4462
660D462k22r59j614j877j664j283r45m32O87J330J719J773J673J459N86m19j266
$$ 4462 4240 3281 1667 -210 -1874 -3157 -4102 -4534 -3847 -2517 -798 975 2648 4107 4693 4274 3008
677C008j622j770j749j453p36J44R26J246J527J671J423J073L63l47j013j626
$$ 3008 1386 -384 -2133 -3586 -4322 -4178 -3252 -2006 -479 1192 2615 3688 4051 3704 2691 1065
693A065j613j631j231o97j6J041J592J633J544J196Q47K64o82j344j505j367j249
$$ 1065 -548 -2179 -3410 -4107 -4123 -3082 -1490 143 1687 2883 3730 3994 3312 1968 463 -904 -2153
710b153j042n56K91Q91J400J512J404J111O76m9o45j229j555j412j125p62k40
$$ -2153 -3195 -3751 -3460 -2569 -1169 343 1747 2858 3534 3485 2840 1611 56 -1356 -2481 -3243 -3483
727c483L52R47J356J379J219R54N89j0o64j206j428j250j133p98j51M67J106J307
$$ -3483 -3131 -2184 -828 551 1770 2724 3313 3303 2639 1433 5 -1245 -2378 -3176 -3327 -2860 -1754 -447
745d47J282J217P94L68r9p56j132j328j289r68o63j92N39R63J356J329J100P53
$$ -447 835 2052 2846 3214 3115 2359 1227 -101 -1390 -2358 -3021 -3213 -2674 -1711 -355 974 2074 2827
763B827K95k38r25j265j295j166q31m21N8M86J103J323J257R06O84J90l20r29
$$ 2827 3122 2884 1959 694 -601 -1767 -2598 -3019 -2961 -2475 -1372 -49 1208 2114 2798 2988 2668 1739
781A739j257j288j034p38l68J87O95J206J197J153Q45M76K5m20r04j208j182j034
$$ 1739 482 -806 -1840 -2578 -2946 -2759 -2064 -858 339 1492 2337 2813 2838 2418 1514 306 -876 -1910
799a910o57l02K48P16J144J203J113P73L32q3m15r07j216j158q32m63j99K17N89
$$ -1910 -2567 -2869 -2621 -1905 -761 442 1555 2328 2660 2577 2162 1255 39 -1119 -1951 -2414 -2613 -2396 -1807
818a807J179J218R38P33M38l7n14j026j092j120r23m40j18M08O65R94J134J050
$$ -1807 -628 590 1528 2261 2699 2662 2148 1122 30 -1090 -2013 -2453 -2571 -2163 -1498 -504 630 1680
836A680N72K56j52m48q40j175j097q51l84j5L30P44J137J063Q52N12K34j86n64
$$ 1680 2252 2508 2356 1908 1068 -107 -1204 -2055 -2439 -2454 -2124 -1380 -243 820 1672 2184 2418 2232 1668
855A668r71r90r34o30l87n1M04P21R62R98R05N49N7k85n80q11j074r04n59k06
$$ 1668 697 -293 -1227 -1857 -2244 -2295 -1891 -1170 -208 790 1695 2244 2301 2016 1436 625 -449 -1353 -1912 -2118
875b118O7L00P27R25R16P54L72K13j39o04q77r80p90n89k68M1M65Q17Q42Q56N64
$$ -2118 -2051 -1751 -1024 -99 817 1571 1943 2156 2017 1413 536 -444 -1234 -1823 -2091 -2050 -1585 -768 74 930 1494
896A494L93O2k43m81q03p60p66n32j76qL32O33R52P53N95K90J08k23o13p70p77
$$ 1494 1887 1949 1706 1225 422 -338 -1104 -1636 -1812 -1820 -1488 -855 97 850 1445 1735 1843 1620 1007 237 -540
917e40o23l00j98k5M12O65P87N59N63K79K5k97n66p21n70n91k54j19K73L85N59
$$ -540 -1163 -1463 -1661 -1686 -1274 -609 178 737 1300 1579 1604 1307 741 20 -550 -1141 -1395 -1514 -1241 -856 -297
938b97N88O27K70J43M9k27m40p17o46m42k67j84K63M74P85O73M50K21M2k07l94
$$ -297 291 918 1188 1331 1380 1153 713 -4 -650 -1092 -1359 -1543 -1280 -806 -21 652 1102 1323 1365 1158 764
959G64n60n16l88l53j79K9J97L30M79N88N01L91O2j66k95m78o94n84l87l7N3K99
$$ 764 204 -312 -700 -1053 -1232 -1203 -1006 -676 -197 391 892 1283 1345 1179 884 406 -288 -872 -1259 -1296 -1243 -944
981i44M83N63N54L44K17J7j19m12n40n38m91l02j05J50K38N22M89M36L58K06k5
$$ -944 -461 102 656 1000 1217 1234 1115 703 163 -375 -866 -1168 -1273 -1123 -885 -363 126 562 920 1126 1101
1002A101n3l75l91m74n35k35k26M6J65L86O47N28L98R1qk37k20n77m03k91j47
$$ 1101 1048 673 282 -192 -727 -962 -1188 -1142 -977 -591 56 584 982 1073 1065 828 608 31 -372 -663 -810
1023h10k8L3J84K03L65M07K72J77M2%k47l16n02m26j99r7J03K15L30M58L15J74
$$ -810 -838 -805 -621 -418 -53 354 626 803 845 845 598 282 -220 -646 -845 -942 -839 -624 -294 164 479 653
1045F53J01n1j56j97k41l16k53k06m1L8J84L34K33K36K53J15k0j85k27k46j93
$$ 653 754 703 547 350 109 -207 -460 -666 -707 -669 -485 -151 82 318 571 686 666 481 254 8 -185
1066a85k73j26j1J4J66K28K69K78K31oK0j56k79k86k58j45j8LJ48J52K18J83J30
$$ -185 -458 -584 -595 -581 -415 -187 82 360 591 585 605 449 170 -116 -374 -519 -537 -534 -386 -234 -16 167 297
1089B97Q4P5j7p7j26j98k56k12j27M4L9J53L30K32J19J71p9j24j39m8k10j60j02
$$ 297 381 456 439 362 236 38 -218 -430 -557 -513 -474 -321 9 241 360 531 452 328 189 141 -69 -229 -331
1112c31m3K0J10R7J11J88J25J57J6o4j38j85j81j74o0mN6R6N5J79P6J53Q3J1l8
$$ -331 -374 -354 -244 -147 -36 152 277 434 450 386 248 63 -118 -292 -352 -356 -300 -204 -149 30 106 259 342 353 315
1137C15j53j22j48j72p5jM0J21K10Q1J08J01J2r6kj29q3j20o7l6r6M3Q9J52J58
$$ 315 162 40 -108 -280 -355 -356 -316 -195 15 96 204 305 317 221 219 90 7 -113 -180 -216 -312 -269 -180 -28 130
1162A30Q1J08J3m2k08J6k05j37k4K5M4L3J03R7K6J37M9L4L1j45j32j13j19k8r1
$$ 130 211 319 332 290 82 98 -107 -244 -268 -243 -199 -166 -63 34 60 197 246 280 311 166 34 -79 -198 -226 -317
1187c17l5K05J17Q4J27P1Nm8k2p9n6j03o4j22k6M5J0J10J26J22J38K3j2q7j76
$$ -317 -352 -147 -30 54 181 252 257 209 187 108 52 -51 -115 -237 -263 -218 -208 -98 28 150 288 311 299 212 36
1212C6q8n9j12r6P8JJ06L9J65Q9J22k1N7p7j93r2q4j25n5J5J15Q7Q4J31L2J26
$$ 36 -52 -111 -223 -319 -241 -240 -134 -95 70 159 281 260 317 240 47 -45 -129 -254 -309 -294 -179 -92 -8 123 155 281
1238B81k1k5k1j25q5r0m8j10p0O8J17P4K08N9J4Q1m6j04j17o8p8p4q8oO5M8J46
$$ 281 260 235 214 89 4 -86 -134 -244 -314 -246 -129 -55 153 212 226 307 261 157 40 -28 -106 -180 -268 -274 -209 -161 -15
1265a5J01J24J11l4M3j59p8j41j52Lo1J3R4L2J13J00N0P9N1j9o7j02r9j82Oj28
$$ -15 86 210 321 287 330 171 93 -48 -200 -197 -258 -245 -151 -119 -6 94 144 223 274 255 188 86 -13 -195 -189 -317
1291c17L1P9J04J03R4J34K9J6q1q7m9j44q3p5k6j9Q2P5J31J23J92K5p7j5r7j75
$$ -317 -286 -207 -103 0 94 228 257 273 192 105 56 -88 -171 -246 -272 -291 -209 -134 -3 120 312 337 260 245 148 -27
1317b7q3r3j0l3J4P5Q2O2J32R7J8M9r3o5r8o7j60p5l5L1P2J37R7J20R3M4kk8r5
$$ -27 -110 -203 -213 -246 -232 -157 -75 -13 119 216 234 283 190 125 27 -40 -200 -275 -310 -279 -207 -70 27 147 240 284 282 254 159
1346A59j17j20j91Ol4MR9Q5J56J02R0R0m8k4j66p4j12n4j45L4J4P7J21Q1J31O6
$$ 159 42 -78 -269 -263 -297 -293 -194 -109 47 149 239 329 281 257 91 17 -95 -149 -294 -260 -246 -169 -48 33 164 230
1372B30M1L8p1j37r7q5r4j13J8P9M3J23L9J49Q7j8jn2q1r5j08o8p6KjJ24J33J21
$$ 230 271 309 238 101 4 -81 -175 -288 -270 -191 -148 -25 14 163 250 232 231 179 98 3 -105 -173 -249 -247 -248 -124 9 130
1400A30R7P9pr1qj47p8n7j16q7N8mJ05J34N2J30O1M7m6j08r8j30o6q1j7j0J6J78
$$ 130 227 306 299 208 200 53 -25 -82 -198 -285 -227 -231 -126 8 60 190 251 298 252 144 46 -84 -150 -231 -248 -258 -242 -64
1428f4N0J23P9M2L0k1q8j09r6j32m3n0M5J26L9O1J00J53M3k5J9j67l2j21j52k0
$$ -64 -14 109 188 230 260 239 151 42 -54 -186 -229 -279 -234 -108 -69 -8 92 245 288 263 282 115 83 -38 -190 -210
1454b10j20Q7P9K3J66R8O9J50p0j9p4j95q8j20q0l0O5J00J14J14Q7J08M5J5j01
$$ -210 -330 -243 -164 -141 25 123 192 342 272 253 179 -16 -104 -224 -304 -334 -269 -169 -55 59 146 254 299 314 213
1479B13r0j26j61q3n0NPJ52M5J57Q0J72mJj13j51n8j62r2p0%L2J63J55J07O3R2
$$ 213 123 -3 -164 -247 -297 -292 -285 -133 -88 69 149 321 317 318 205 54 -4 -166 -258 -328 -328 -296 -133 22 129 192 284
1506B84L3j04j7j39j80o1n1n9L0L1J56P6J32J02Q8k6k4o4j20r8j98k0l9o0J06
$$ 284 317 213 196 57 -123 -184 -235 -294 -264 -233 -77 -1 131 233 321 295 271 207 87 -11 -209 -229 -268 -328 -222
1531b22J27K01M3J30M2po3r4j20j87o1l9p2pJ34J27J04J19J16M3Pp9q5j42j03
$$ -222 -95 106 149 279 321 314 251 157 37 -150 -211 -250 -322 -329 -195 -68 36 155 271 314 321 242 157 15 -88
1556h8j06j14N0PL5K24J6K03L3J9Rp3q1j42j46m5j39P9l4P8J51J09J61R6J3l3
$$ -88 -194 -308 -258 -251 -216 8 24 227 260 279 288 215 134 -8 -154 -199 -338 -259 -293 -215 -64 45 206 302 315 282
1582B82q0n5j34j25j65J8p1K3J61J24J21J08Q4L4l3p5j11j69r8j13kJ3M5O1K04
$$ 282 202 147 13 -112 -277 -259 -330 -307 -146 -22 99 207 291 325 292 217 106 -63 -161 -274 -276 -263 -218 -157 47
1607D7N9J27R1J3m0j02p7j63j43o9j10M9J10L1K28O1J75k5M2k7r5j15j66j20l2
$$ 47 106 233 324 337 297 195 118 -45 -188 -257 -367 -318 -208 -177 51 112 287 262 304 277 182 67 -99 -219 -251
1632b51o3K5M0R8J41R8J21J01M2p8q4j52q0j53r9J8k2R0O8J41J43J50l8M6o4q4
$$ -251 -314 -289 -249 -151 -10 88 209 310 352 274 190 38 -42 -195 -294 -276 -298 -208 -140 1 144 294 256 302 238 154
1658A54q1j56r8r1m5N6j1J96J15J08J42l4j4m8p5q6j64p9nq5RJ16J28J13P9J14
$$ 154 73 -83 -181 -272 -317 -261 -272 -76 39 147 289 255 241 193 118 32 -132 -211 -216 -301 -292 -176 -48 65 144 258
1684B58R5p0o7p8j53j27j02n5M4O2N6R9J04J18R5k7J7q1r4j60o7k8j40K7P1P1
$$ 258 353 283 216 138 -15 -142 -244 -299 -255 -193 -137 -38 66 184 279 252 269 188 94 -66 -133 -161 -301 -274 -203 -132
1710a32O3J29J29Q0Rk1j3j52q3j39r2pn0M1M5J79J15P7Q3j6j7j04m1r8j30m5j05
$$ -132 -69 60 189 269 278 257 244 92 9 -130 -222 -229 -279 -238 -193 -14 101 178 261 245 228 124 83 -15 -145 -190 -295
1737b95M3L1O2R0J57J19J00k2p9k3j70r0m8j36L0k7N7R1R5J64L3L8P6n2q3n5j87
$$ -295 -252 -221 -159 -69 88 207 307 285 206 183 13 -77 -125 -261 -231 -258 -201 -110 -15 149 182 220 296 244 161 106 -81
1764h1m2r9m4pQ5N6R9J71L2J40k7n2q8q4q4j18j29M1l1N9J38P6J12Q9L6%k8o5
$$ -81 -123 -222 -266 -273 -188 -132 -33 138 170 310 283 231 143 59 -25 -143 -272 -231 -262 -203 -65 11 123 212 248 248 220 155
1792A55j19p6r8j08RJ7L1J14P0J19K1J20Nnj05j32j22q8o3ML3P0N5J14J63PM7
$$ 155 36 -40 -138 -246 -237 -220 -189 -75 -5 114 135 255 260 255 150 18 -104 -192 -255 -251 -218 -148 -93 21 184 191 238
1819B38k0r2qj40Qj34j20L0M7Q1J9J33R6K7Q8jj14r3q1l7j50m2L2N9Q7L0J16M8
$$ 238 218 126 118 -22 -14 -148 -268 -238 -191 -110 -91 42 138 165 253 252 138 45 -36 -73 -223 -265 -233 -174 -87 -57 59 107
1847A07J01n2L5m1o8p9n6j39m1P5j9J02L4J36J07J2Rk1k7j28j24j6p4l7j2M8O4
$$ 107 208 156 191 150 82 3 -53 -192 -233 -158 -177 -75 -41 95 202 214 223 202 175 47 -77 -93 -167 -204 -216 -168 -104
1874a04J06k6J15Q0R0j45j4l7r2o8q3n2pO4Q5R7N1J20qN7n2r2j1r0j04n7l8N8
$$ -104 2 -24 91 171 261 116 102 65 -27 -95 -178 -230 -237 -173 -88 9 60 180 172 229 177 85 74 -16 -120 -177 -215 -157
1902a57K4K4J27O2N7M5j5k2L3k09n3k9p5l9L7K7R6P5Q8J08m7K9l3n3q3p8m7m4
$$ -157 -133 -109 18 80 137 182 167 145 178 -31 -84 -113 -188 -227 -190 -163 -67 8 96 204 157 186 153 100 17 -61 -108 -152
1930a52k3R5J4K4L8J25L3Lj7p3J7j28p4j5p3J11r0R3K7J37N1J8j4rLq6p3j21M9
$$ -152 -175 -80 -66 -42 -4 121 154 157 140 67 84 -44 -118 -133 -206 -95 -185 -92 -65 72 123 141 127 118 121 35 -38 -159 -110
1959a10k2kL1J6J29N2L2J0L7k9n8k2m5j02o9N1j8O0K8L4Q0J8P1n4j5k5p2j09L2
$$ -110 -132 -134 -103 -87 42 94 126 136 173 144 86 64 19 -83 -152 -101 -119 -59 -31 3 83 101 172 118 103 78 6 -103 -71
1988g1n1j4J3kQ8L9J21l9K8PMp2r9l9j1k4n4K8M4J18pR0M2k4N0p0m4o8m9Ko7M5
$$ -71 -122 -136 -123 -125 -37 2 123 84 112 119 123 51 -48 -87 -98 -122 -176 -148 -104 14 7 97 139 115 165 95 51 -17 -66 -64 -131 -86
2020h6mOJ42J9N0O3r7O0j48j4l1j2r1k9N8K8M4M8Q7nP2j1L6p7n0r3o8n4N0k5P7
$$ -86 -90 -84 58 77 127 190 93 153 5 -9 -40 -52 -143 -172 -114 -86 -42 6 93 88 160 149 185 108 58 -35 -103 -157 -107 -132 -55
2051e5O4J5M9PoM5p9k1J8q8l2o2M8j4P3rJ05R4j02P8J2j02J1l3n4k1l9m2K3J06
$$ -55 9 24 73 80 74 119 40 19 37 -51 -83 -145 -97 -111 -38 -47 58 152 50 128 140 38 49 16 -38 -59 -98 -140 -117 -11
2081a1k0J34l4O4j1M8q8nj18l0qJ7m2m2N0M9N6N8L6Lj6n3m4l4K4m5o1j4J02pJ08
$$ -11 -31 103 69 133 122 170 82 77 -41 -71 -79 -62 -104 -146 -96 -47 9 67 103 106 90 37 -7 -41 -17 -62 -123 -137 -35 -42 66
2112F6MK4k3L6rn6l6o3Qp7%Nj3L7N1K8Q1L8k7L4rq8n9j1o7N0J5o6P5Q0OK5J00
$$ 66 70 94 71 107 98 42 6 -57 -49 -126 -126 -121 -134 -97 -46 -18 63 101 74 108 99 11 -48 -59 -126 -76 -61 -127 -52 28 34 59 159
2145A59q6L4m3k5p8k4J0j5M5r3Q3N2M6ML2m0K1k4jq7Pk7l9K1k5M5O5nnP1PK5k7
$$ 159 73 107 64 39 -39 -63 -53 -68 -23 -116 -33 19 65 69 101 61 82 58 57 -30 -23 -50 -89 -68 -93 -48 17 12 7 78 85 110 83
2178H3n2J2j40M2OJ5Pm2R5L2Kk1L3j3J6j21j4N7o5L9o8J9J10l5P5n4K0M7r1L0
$$ 83 31 43 -97 -55 -49 -34 -27 -69 26 58 60 39 72 59 75 -46 -60 -3 -68 -29 -97 -78 32 -3 72 18 38 85 -6 24
2208B4K1k8q2k7M2pl5N7K9M2J9J19j29m8L3rk8kk5pL0o4J34oo2J19n5no4QK4l6
$$ 24 45 17 -65 -92 -50 -57 -92 -35 -6 36 55 174 45 -3 30 21 -7 -9 -34 -41 -11 -75 59 53 -9 110 55 50 -14 -6 18 -18
2240a8o3J0M7q2J05K6JOM6J0q2L0n2Ml4j3M6k2j4L3L8j1M7K2J5n7m2L9k9j3l0
$$ -18 -81 -71 -24 -106 -1 25 26 32 78 88 6 36 -16 -12 -46 -59 -13 -35 -49 -16 22 11 58 80 95 38 -4 35 6 -7 -37
2271c7Nj7N0k1P4l9K2M8o9O1o5k7K9p1j6N6n7RK5L4K5L1K9m8j7m8L3nj6j1k6M
$$ -37 -32 -49 1 -20 54 15 37 85 16 77 12 -15 14 -57 -73 -17 -74 -65 -40 -6 19 50 79 31 14 -34 -1 -6 -22 -33 -59 -55
2303e5K2M5L3l8M2O4j6m7kJ5j23K2J7n9M6NJ7kM7J9L8l8l7Pj8l2l9O1J7o0P8p
$$ -55 -33 12 45 7 49 113 97 50 48 63 -60 -38 -21 -80 -34 -29 -12 -14 33 52 90 52 15 22 4 -28 -67 -6 11 -49 29 22
2335B2kk9N9l2K3j3K1p3K7l0m7rJ0Q2l0J3m4J22J2n0kk2n2L6m6M3l8nO6k3R3q9
$$ 22 20 -9 50 18 41 28 49 -24 3 -27 -74 -83 -73 9 -21 -8 -52 70 82 32 30 8 -44 -8 -54 -11 -49 -54 12 -11 82 -7
2367gM7%m3k1M8n8Qn6L5K2k8J16m2jmM8o6M8m5q3N7Nj05Q2%j8O2L3P1m5k3mJ7
$$ -7 40 40 -3 -24 24 -34 -26 -82 -47 -25 -53 63 21 20 16 64 -2 46 1 -82 -25 -20 -125 -43 -43 -61 1 34 105 60 37 33 50
2400E0q2M0m3J0MJl6O4L6K3k8rKJ3k2k4l1l4N1q1L9L5MM8Lj1L6m2K8m3K1p5J0
$$ 50 -32 8 -35 -25 -21 -20 -56 8 44 67 39 30 32 45 23 -1 -32 -66 -15 -96 -57 -22 -18 30 33 22 58 16 44 1 22 -53 -43
2433d3n3J7K8L6J9RlK6L5m2K6lk2n2Ql2m5O3mM8K7k3M2k9L3n8L9l0o9j3pOk0P3
$$ -43 -96 -79 -51 -15 4 13 10 36 71 29 55 52 30 -22 -14 -46 -91 -28 -32 16 43 20 62 33 66 8 47 17 -52 -65 -72 -66 -86 -13
2467a3N8o9R1j2k2L6n0n4N0m4p1L7l1P0QM3NK8O9j4pl6m8N6j17j6K4j1kLJ6L1
$$ -13 45 -24 67 55 33 69 19 -35 15 -29 -100 -63 -94 -24 -16 27 32 60 129 115 108 72 24 80 -37 -53 -29 -40 -42 -39 -23 8
2499HM8J4n2M0Jk5l6m5l5K1L2j8K9N0J1jO2j7o3j3l7j7k2K8l2L2k1M8J9N7n6K1
$$ 8 56 70 18 58 59 34 -2 -47 -82 -61 -29 -47 -18 32 43 42 104 87 24 11 -26 -43 -65 -37 -69 -37 -58 -10 9 66 10 31
2531C1K6Njr8N9r5qj3K6j2M9J7J8K7m7O5j7j3N2m6o3lm1R2l5J0J7K3K8l1K3K9
$$ 31 57 62 61 -37 22 -73 -81 -94 -68 -80 -31 -14 4 31 -16 49 32 19 71 25 -38 -41 -82 10 -25 -15 2 25 53 22 45 74
2563G4j3m9l0O4p7m3J4%J8KO5K3L5Plm6n3M8o1m9l1P4m8O3L7L9l6O8j0j5k3l3
$$ 74 61 12 -18 46 -31 -74 -60 -60 -42 -40 25 48 83 90 87 41 -12 36 -25 -74 -105 -31 -79 -16 21 60 24 92 82 67 44 11
2595A1rM6j36L5L6k7m6K9L4M8lpk0R1j01mrQj0K2j5k7LN5N1l7lP6o1jNq1k4k7
$$ 11 2 48 -88 -53 -17 -44 -90 -61 -27 21 18 11 -9 82 -19 -23 -32 -24 -34 -12 -27 -54 -51 4 55 18 15 91 30 29 34 -47 -71 -98
2629i8J02p2l9P2M9L8m4J04j9j8J5j7j02K6q8P3l6N4k4J0L2L3K5n1O7n7m7L1l1
$$ -98 4 -68 -107 -35 14 52 8 112 93 75 90 73 -29 -3 -91 -18 -54 0 -24 -14 18 51 76 25 92 35 -12 19 -12
2658a2m0Mk6O3rkL3M0j3J3K9m8l7%m6KJ9k6k7N9l1O8J5n2Q7k6J4l2o3MJ1K7j14
$$ -12 -52 -48 -74 -11 -20 -22 11 51 38 51 80 32 -5 -5 -51 -49 -30 -56 -83 -24 -55 13 28 -24 63 37 51 19 -44 -40 -29 -2 -116
2691a16N7M8%K2k3P2%J6j01L4k2om0N4j4o2M1MO0j0k7J00qn6Oj1l7L8j09J07o8
$$ -116 -59 -11 -11 11 -12 60 60 76 -25 9 -13 -19 -59 -5 -19 -81 -40 -36 24 14 -13 87 79 23 29 18 -19 19 -90 17 -51
2722e1lK7J1O9n5P0m8P5o4l3n2qJ4NP4n9K9K5M0Jp1J1L3K0r9L2p1K7J8k8O4J9
$$ -51 -54 -27 -16 53 -2 68 20 95 31 -2 -54 -62 -48 -43 31 -28 1 26 66 67 -4 7 40 60 -39 -7 -78 -51 -33 -61 3 22
2754B2l0NN0J1Nl3oMj22O4m6JO7j6j9O5R7n4m8n0J01l6j8k9M2j30R3k3L9j6O6
$$ 22 -8 -3 47 58 63 30 24 28 -94 -30 -76 -75 -8 -24 -43 22 119 65 17 -33 68 32 14 -15 27 -103 -10 -33 6 -10 56
2785E6m2oL0l2nRj2%n7J8K4J3J5o5P4N9l3l0J2k7K3l0pqj02J08k2L3j6rJ17p6
$$ 56 14 8 38 6 1 10 -2 -2 -59 -41 -17 -4 11 -54 20 79 46 16 28 1 24 -6 -13 -21 -123 -15 -37 -4 -20 -29 88 12
2817A2OL2j25Q5L9n2o5Q4k4o4Q6j6M5l0O3K1l1n7pm5j5J4j4K6m4Q2rN5l3P2j43
$$ 12 18 50 -75 10 49 -3 -68 16 -8 -72 14 -2 43 13 76 97 66 9 2 -43 -58 -44 -58 -32 -76 6 -3 52 19 91 -52
2848e2N2j5N2o7j6l6L3K4J9M1J8L4j6l4k5lk1l4L0nO0r7KM7j4O1M5m5K1NOq0K5
$$ -52 0 -15 37 -30 -46 -82 -49 -25 -6 35 53 87 71 37 12 9 -12 -46 -16 -21 39 -58 -56 -9 -23 38 83 38 59 64 70 -10 15
2881A5l1k9n1L1N0M3jjK1l4L7pj5l8K3j6J2jl4kNK6N2J9l3k2Qpo3O5o5M9k2l2
$$ 15 -16 -45 -96 -65 -15 28 27 26 47 13 50 43 28 -10 13 -3 9 8 -26 -28 -23 3 55 74 41 19 27 20 -43 22 -43 6 -16 -48
2915d8M4K6K3p3O9l8L5nJ4m7j2k7k2l0M9J6J7pQ8p8j5N4L0j5m0K2om9N3k2n1L0
$$ -48 -4 22 45 -28 41 3 38 33 47 0 -12 -39 -61 -91 -42 -26 -9 -16 72 -6 -21 33 63 48 8 30 24 -25 28 6 -45 -15
2947a5K4qrJ6m5J14j26K7M2j12O3j3l7Q6K6J5LJ8l6j1o5N8o1j8J4K6L2k6N2Mj
$$ -15 9 1 -8 8 -37 77 -49 -22 20 -92 -29 -42 -79 7 33 48 51 69 33 22 -43 15 -46 -64 -50 -24 8 -18 34 38 37
2978C7j2N0j7j7o1Rk3J0k6J8J2k7Q7n4N3kO4n7q4K4m6J3j4j2K7lK6M7j4jK1L6
$$ 37 25 75 58 41 -20 -11 -34 -24 -50 -32 -20 -47 40 -14 39 37 101 44 -40 -16 -62 -49 -63 -75 -48 -51 -25 22 8 7 28 64
3010F4k6l5j1n3L1k1J6LJ0K6QJ8j3K0J2K5p6j2J7No3L1k3R7l0n6N5M8J9m2j2k7
$$ 64 38 3 -8 -61 -30 -51 -35 -32 -22 4 12 30 17 37 49 74 -2 -14 3 8 -55 -24 -47 50 20 -36 19 67 86 44 32 5
3042ErQl9pK1Pm2L9M8j0M4Mrl2j9J6r5L5Pm4Q6m5N4K4J7m1M0m4m2j8L4m3P6p9
$$ 5 -4 4 -35 -42 -21 -14 -56 -17 31 21 65 69 60 28 9 25 -70 -35 -28 -72 14 -31 23 47 64 23 63 19 -23 -41 -7 -50 26 -53
3076e3rK1J12n7K4M4n8K2j3j3j2Ro3j0k2L4L6%K1K5K5p8M9moqp2K7J0%j2RN7n6
$$ -53 -62 -41 71 14 38 82 24 46 33 20 8 17 -46 -56 -78 -44 -8 -8 13 38 63 -15 34 30 24 16 -56 -29 -19 -19 -31 -22 35 -21
3110b1N1j9P9k3p1Q4j02K5q1O4ql4%L7M1Pk1K0%k6O6n7l5Mn4J1NmL9P3km3K4N4
$$ -21 30 11 90 67 -4 80 -22 3 -78 -14 -22 -56 -56 -19 22 29 8 28 28 2 68 11 -24 -20 -74 -63 -58 -62 -23 50 48 5 29 83
3144H3n5k1M8n8m1J7j2k9k8Q3N1Kk7K7j2J6qo5L5j1o3k8M1O9J6P1m1o9N2k6j7
$$ 83 28 7 55 -3 -44 -27 -39 -68 -96 -13 38 40 13 40 28 44 36 -29 6 -5 -68 -96 -55 14 30 101 60 -9 43 17 0
3175@K1o8k4J9L5k6n2R4l7O1l1N9m5oK1K0n2k9J7m8mL2QN4L9Onm7J8n9J4k2p8
$$ 0 21 -47 -71 -52 -17 -43 -95 -1 -38 23 -8 51 6 0 21 41 -11 -40 -23 -71 -75 -43 -35 19 58 64 59 12 30 -29 -15 -37 -115
3208a15J9K6K4P6l2k2nM7L6J6m3kj2rl9J5oL3j2l7j0Q5qj7K9l4M4q7J2jj0L5r
$$ -115 -96 -70 -46 30 -2 -24 -29 18 54 70 27 25 13 4 -35 -20 -26 7 -5 -42 -52 33 25 8 37 3 47 -40 -28 -29 -39 -4 -13
3241a3RM7j7J7j9k1j0K4kn6JJ0n6rJ6N7J1N8l7L0l9O1n5kpl9Pk9kQ9q0R5K4r2
$$ -13 -4 43 26 43 24 3 -7 17 15 -41 -40 -30 -86 -95 -79 -22 -11 47 10 40 1 62 7 5 -2 -41 -34 -63 -65 24 -56 39 63 -29
3275b9M7J8l1J7n5O3Qr6p0L6Q8kJ4OJjK0M1o1o1k6M3J8Qn5J6O8l0J9Om5P7Mk4
$$ -29 18 36 5 22 -33 30 38 -58 -128 -92 -4 -6 8 14 15 14 34 75 14 -47 -73 -30 -12 -4 -59 -43 25 -5 14 20 -25 52 56 32
3309C2j0j2k5k4j8M4o6J45m5N6o0P6j16O0m6KMjj0k4kO1k0k1O2k7Pj2J3j7l2l5
$$ 32 22 10 -15 -39 -57 -13 -79 66 21 77 17 93 -23 37 -9 -7 -3 -4 -14 -38 -40 21 1 -20 42 15 22 10 23 6 -26 -61
3341f1J7k0J0J1K9o6N7M9j3NL7j8J7nj03L9k2k2N3J3n6Q3l6O7k9Rj6p4J02r5P6
$$ -61 -44 -64 -54 -43 -14 -80 -23 26 13 18 55 37 54 49 -54 -15 -37 -59 -6 7 -49 34 -2 65 36 45 29 -45 57 -38 38
3372C8n6k7Jj6M2L1JOJ3L3k2o0j1K8l1jM2m4l0lJ7k9J23K6r1L2l8K9n1mO9o2K3
$$ 38 -18 -45 -44 -60 -18 13 14 20 33 66 44 -16 -27 1 -30 -31 11 -33 -63 -66 -49 -78 45 71 -20 12 -26 3 -48 -52 17 -45 -22
3405b2qN4l1J7j4M2rln1rP2p6j3J2k2k3M4L1K1l2P1m7M4p1N1l7l0L6k1J3k1J1
$$ -22 -30 24 -7 10 -4 38 29 26 -25 -34 38 -38 -51 -39 -61 -84 -40 -9 12 -20 51 4 48 -23 28 -9 -39 -3 -24 -11 -32 -21
3437b1M9r1Q7r8J11k5Kpl3P3m6Pq7K4Q2On2MM8k1Jl2M4l3L0j10M9J7L6RJ4j2L8
$$ -21 28 -63 24 -74 37 12 14 7 -26 47 1 8 -79 -55 27 33 -19 -15 33 12 13 -19 25 -8 22 -88 -39 -22 14 23 37 25 63
3470F3o4O4p4Ol3Okl2MO3J7o0M4K5l6K8L6p3O5o4L4k1K9m4RLm2Q9kqk2JK6j7m7
$$ 63 -1 63 -11 -5 -38 -32 -34 -66 -62 1 18 -42 2 27 -9 19 55 -18 47 -17 17 -4 25 -19 -10 -7 -49 40 38 30 8 9 35 18 -29
3505b9M6L1m1K2p4RL8L0j2pPqk3K5j3l0L3k1R5j09QL1j7J1K4J5%j6M0r6N5n2J
$$ -29 17 48 7 29 -45 -36 2 32 20 13 20 12 -11 14 1 -29 4 -17 78 -31 -23 8 -9 2 26 41 41 25 65 -31 24 -28 -27
3538b7J0QPj7J2KkK1L8j06O8%j1K9p1QK0J7Nqk3M4k3K7J7k2J6j3k1J7J9p1J3k4
$$ -27 -17 -9 -2 -19 -7 -5 -7 14 52 -54 14 14 3 32 -39 -31 -11 6 11 3 -20 24 1 28 45 23 39 26 5 22 41 -30 -17 -41
3572d1L7k5L2MJ5O2q6MJ6LK5p0RK6j4K2l0k8O1rJ4q4J08m5J2l2j7J7pL8m0M6l6
$$ -41 -4 -29 3 7 22 84 -2 2 18 21 46 -24 -15 11 -3 19 -11 -39 22 13 27 -57 51 6 18 -14 -31 -14 -21 17 -23 23 -13
3605a3M3jLK7n9Mrm0j9K8KN0j0N6n5kj7k1L0pp1K7o7Q5J8J3lL3m0pnJ1K3jk5J6
$$ -13 30 29 32 59 0 4 -5 -45 -64 -36 -34 16 6 62 7 5 -12 -33 -3 -10 -81 -54 -121 -36 -18 -5 -8 25 -15 -22 -27 -16 7 6 -19 -3
3641cj3L3L2mq4M4M2o1Mm1R6K1m3J0k8mK8k7OM9q4PJ6LJ5PJ4n0j9J7k0K4K4k2
$$ -3 -16 17 49 45 -39 5 47 -14 -10 -51 45 66 23 33 5 1 29 2 8 57 -27 -20 -4 -1 14 21 35 -15 -34 -17 -37 -13 11 -11
3675a1J7Ll8L4MK3L6o7kPj1k5O0n3M8m8Nl1O3k%oM9k7j9k0L5j9j9J3K6l9%l3O4
$$ -11 6 9 -29 5 9 32 68 1 -1 6 -5 -30 30 -23 25 -23 -18 -49 14 12 12 6 55 28 9 -11 24 5 -14 -1 25 -14 -14 -47 17
3710A7K3m0K0nkn5R9o4lJ7m5NL6k8m9O3K1K7nn4L2nKm9K6l2kP7k7Qkj7P3n7l8
$$ 17 40 0 20 15 13 -42 57 -7 -10 7 -38 -33 3 -25 -74 -11 10 37 32 -22 10 5 7 -42 -16 -48 -50 27 0 8 6 -11 62 5 -33
3745c3O2k0K5n0M0oj0J1Lo9P9l3M3o4N5n2N4o6j3j5O2k2K8j5K2q3P8L0q3L6nM6
$$ -33 29 9 34 -16 24 18 8 19 22 -47 32 -1 42 -22 33 -19 35 -31 -44 -59 3 -19 9 -6 16 -67 11 41 -42 -6 -11 35
3777C5k3jp7Q8l0j2lOM8kk9nl3J4nO0m0L2l1J7N3j00R6m1NKo2O0l6L0ok1k1nN5
$$ 35 12 11 -66 22 -8 -20 -23 -17 31 29 0 -5 -38 -24 -29 31 -9 23 -8 9 62 -38 58 17 22 24 -38 22 -14 16 10 -11 -32 -37 18
3812A8k4Pj4j5O7Lj9k4lJ6l4mK5N4Lq6mK6J5J9l8L7j4j0r4R8n6l4MO1nK2j1J1
$$ 18 -6 1 -13 -28 39 42 23 -1 -4 12 -22 -26 -1 53 56 -30 -34 -8 7 26 -12 25 11 1 -93 5 -51 -85 -81 -20 -25 -3 -14 -3
3846cP3j1j7n1k6lL9o4J0Q0Pqm8P9ML7o7j2l0N2l8OJm0N2LK7Npj1n0%N1l0n8k9
$$ -3 70 59 42 -9 -35 -38 1 -63 -53 27 34 26 -22 57 61 98 31 19 -11 41 3 9 10 -30 22 25 52 57 50 39 -11 -11 40 10 -48 -77
3882g7J28p1K9pL3l5j1L6k8j4K8k5K4mj0l7ML4l4K2J01q7M6j4qm5N7l6KM0o9j2
$$ -77 51 -20 9 2 35 0 -11 25 -3 -17 11 -14 10 6 -4 -41 -37 -3 -37 -15 86 -1 45 31 23 -22 35 -1 1 41 -28 -40
3914d0L0M7q5P7j5K9l8K4j9jj2L4j01J0M6ooJ2j6N6k0J9m0L7jo4L9j3j6P3n2K5
$$ -40 -10 37 -48 29 14 43 5 29 10 9 -3 31 -70 -60 -14 -20 -26 -14 -30 26 6 25 -15 22 21 -43 -4 -17 -33 40 -12 13
3946A3P2m5jJ3l2J5k5n5L6k1J3L7n2L1k7L7L8L7l5j9M0q0mj9kQO6q3K2K6J3O4
$$ 13 85 40 39 52 20 35 10 -45 -9 -30 -17 20 -32 -1 -28 9 47 84 49 30 70 -10 -14 -33 -35 -27 39 -44 -22 4 17 81
3978H1q7Qj5J4j3oL2j00M8loj8J05k5rLN4Mo0L1j9m3l2j4L0J6L6m2K4m9M8K3n7
$$ 81 -6 2 -13 1 -12 -18 14 -86 -38 -41 -47 -65 40 15 6 9 63 67 7 38 19 -24 -56 -70 -40 -24 12 -30 -6 -55 -7 16 -41
4011d1N1k3J5o1O6k8n4Q5j3j1jM2n3J20o4n0QjKq0N0L0M2k5K4l2R4p4J9k7k8o2
$$ -41 10 -13 2 -59 7 -21 -75 10 -3 -14 -15 27 -26 94 30 -20 -12 -13 -11 -91 -41 -11 31 6 30 -2 92 18 37 10 -18 -80
4043h0O5j9O2p1L4k3K8mOK5pJM7qj1p1%J9M0j6m8P7m4O8j8l8L4K7m8l2m5J5P7
$$ -80 -15 -34 28 -43 -9 -32 -4 -8 -2 23 16 17 64 56 45 -26 -26 -7 33 17 -31 46 2 70 52 14 48 75 27 -5 -50 -35 42
4076D2m3j6L0mK8m1NK1k6MpK4l6o5Q6L4k4k2m7R7qoK4rp6M5o5M9l4J8j5J7j7J2
$$ 42 -1 -17 13 9 37 -4 1 22 -4 0 -7 17 -19 -84 2 36 12 -10 -57 40 32 26 50 41 -35 10 -55 -6 -40 -22 -37 -20 -37 -25
4110b5J5QP7l5k7n0L7j0n1JkK8j1N6K9l8Nj1O2l3n6L4K8k1j3J4j3j2M2j1M6n6
$$ -25 -10 -2 75 40 13 -37 0 -10 -61 -60 -62 -34 -45 11 40 2 7 -4 58 25 -31 3 31 10 -3 11 -2 -14 28 17 63 7
4142GK1j0j7%j5j4Q3p4j7K5j8N8l8j1O4J6l8L3n5K6Nm2nK9l6k9P2K0rk8l5R9n9
$$ 7 28 18 1 1 -14 -28 55 -19 -36 -11 -29 29 -9 -20 44 60 22 55 0 26 31 -11 -16 13 -23 -52 20 40 31 3 -32 67 8
4175HJ4j8p6M5L4k8K3m8L7L2joj1nK7j0m3P3q4M2l8K6K9k5j5M6Nn1P3m0k6oj4
$$ 8 22 4 -72 -27 7 -21 2 -46 -9 23 22 16 5 0 27 17 -26 47 -37 5 -33 -7 22 -3 -18 28 33 -18 55 15 -11 -17 -31
4208c1Rj6Nj2M1l4K7J1lM8m0J7l0J0M2k0n6J7k7N6j4P6l1K2k6j2J8l4no4L1NN1
$$ -31 -22 -38 -33 -45 -4 -38 -11 0 -3 45 5 22 -8 2 44 24 -32 -15 -42 14 0 76 45 67 41 29 47 13 8 -56 -25 -20 31
4241C1k9j0P0j19R0l0J9k3mj3qml1P0qj8nM1LJ6rrn3M9q0O2p7P7p7K0J1O0m0P1
$$ 31 2 -8 62 -57 33 3 22 -1 -5 -18 -26 -30 -61 9 1 -17 -22 19 22 38 29 20 -33 16 -64 -2 -79 -2 -79 -59 -48 12 -28 43
4275D3L9r8M7qK3m6j0m1RL9j9K1J2n3pL4K2k5lN0o2J0j3k5N2J6l0M1m3LO1k4K4
$$ 43 82 -16 31 23 46 0 -10 -51 -42 -3 -22 -1 11 -42 -49 -15 7 -18 -21 29 -33 -23 -36 -61 -9 7 -23 18 -25 -22 39 15 39
4308C9Qn9Jj8pK1J2q0J06K0J2m2oj4N9q0M1Mk4k0Lk1lR0k9j1kK8j2o0J1K4m5M0
$$ 39 47 -12 -11 -29 -36 -15 -3 -83 23 43 55 13 7 -7 52 -28 13 17 -7 -27 -24 -45 -48 42 13 2 0 28 16 -44 -33 -9 -54 -14
4342a4j9K8ql1J17q2j2m4J30k9j0J0j2k9K8j7k3K6Jl7RM5l9JJ3J4lo1L1J8m2K8
$$ -14 -33 -5 -13 -44 73 -9 -21 -65 65 36 26 36 24 -5 23 6 -17 9 10 -27 -18 27 -12 -11 2 16 13 -48 -17 1 -41 -13
4374a3K3ql3%L1kL5n6N8m9k1J4O5q2l5K8J7OO4k2L0p4j6M9m2J14j09k4K2J4k7
$$ -13 10 2 -31 -31 0 -2 33 -23 35 -14 -35 -21 44 -38 -73 -45 -28 -22 42 20 50 -24 -40 9 -33 81 -28 -52 -30 -16 -43
4405d3N7p0P2OL3j5j2K6o3Rj5l2M9j9M3lj7k2N1k0K0j8l8M6j3k1nj7M8Nl5J7J7
$$ -43 14 -56 16 22 55 40 28 54 -9 0 -15 -47 2 -17 26 23 6 -16 35 15 35 17 -21 25 12 -9 -14 -31 17 22 -13 4 21
4438B1j9oQl3KLl4M8j7K8m5L3o7R7jpk8O2l8J3m6L1OqOK3n6K4lK5J1j6KJl4j6
$$ 21 2 -4 4 -29 -27 -24 -58 -10 -27 1 -44 -11 -78 19 18 11 -17 45 7 20 -26 5 11 3 9 32 -24 0 -3 22 33 17 19 20 -14 -30
4474c0L3K5j5L2j24O9LNM7q5L7qK4m2pM7%l4J1k7O1l0o7R2j9K6QQl0k6k0O6o3
$$ -30 3 28 13 45 -79 -10 -7 -2 45 -40 -3 -11 13 -29 -36 11 11 -23 -12 -39 22 -8 -75 17 -2 24 32 40 10 -16 -36 30 -33
4507c3L6o0M2K2K4j5j7n8j0J09k4n5j2L6ml2L7N1k2N0j5l1M5m4J3K3j01L7k6K2
$$ -33 3 -57 -15 7 31 16 -1 -59 -69 40 16 -39 -51 -15 -19 -51 -14 37 15 65 50 19 64 20 33 56 -45 -8 -34 -12
4537a2mP3p0N0k7Lk2k8J08j00P8q5L4L6o3k9LO0M1j4K9o6J9p3N4J0m6Q2p5K9k1
$$ -12 -16 57 -13 37 10 13 -9 -37 71 -29 49 -36 -2 34 -29 -58 -55 5 46 32 61 -5 14 -59 -5 5 -41 41 -34 -5 -26
4568b6L0m6M3k1P7j3k7k3L8L1m8nk6O0j1l6M5k5k4pJ8lL9p5J0m1R3p1L8K2KJ1
$$ -26 4 -42 1 -20 57 44 17 -6 32 63 15 10 -16 44 33 -3 42 17 -7 -14 4 1 40 -35 -25 -66 27 -44 -6 16 18 29
4600B9l1Qn9R6n0l3J2J2M3lo0k7R4MKk1LM2l1m1L7n9K6KJ3m2O4p0O8n6N0l0j4
$$ 29 -2 6 -53 43 -7 -40 -28 -16 27 24 -36 -63 31 35 37 16 19 61 30 -11 26 -33 -7 -5 8 -34 30 -40 28 -28 22 -8 -22
4633b2K5l2N9m6L9K8m4l6P5k1o7L2pPM9k1J4n0M1j5j5M6r3K6ROk9M7K8L0J2j2
$$ -22 3 -29 30 -16 23 51 7 -29 46 25 -42 -10 -17 -10 39 18 32 -18 23 8 -7 39 -54 -28 -19 -13 -42 5 33 63 75 63
4665F3l6K1k8n5lk2M4L0n5jM5j1pm5M4L5k2J6l0%m8Q3l4K1k4M6J6j0qk8PL5m5
$$ 63 27 48 20 -35 -38 -60 -16 14 -41 -42 3 -8 -15 -60 -16 19 -3 13 -17 -17 -65 18 -16 5 -19 27 43 33 25 -3 4 39 -6
4698fJ9J2j0j5M7lk5K0m2K0k1MJ1l7K2l4N9%Ol2L5j4j0Pk7K8k4J0J5l8J3m3R1
$$ -6 13 25 15 0 47 44 19 39 -3 17 -4 0 11 -26 -4 -38 21 21 27 -5 30 16 6 13 -14 14 -10 0 15 -23 -10 -53 38
4731C8k9J2n1M7K2J8l4OJ3l7K8J2l1j3k9O5k7k4L3O5j33M5Q9q6%K3kN5p2J0oj2
$$ 38 9 21 -30 17 39 57 23 29 42 5 33 45 14 1 -28 37 10 -14 19 84 -49 -4 85 -1 -1 22 20 75 3 13 7 -5
4763em3Q0l1J2j0k8Q5q2M1J5n0QlK0ll4O1J7J8r1M9k6NL1o3j1J3NN7p4N7m6O0
$$ -5 -48 32 1 13 3 -25 60 -22 19 34 -16 -8 -11 9 6 -28 33 50 68 -23 26 0 5 36 -27 -38 -25 -20 37 -37 20 -26 34
4796C4k2J7J9rk8Kj2n5RL9k1L0j2n8Q5%j5mL1ro5O3k6qj3M5PPnn0O6l0j5J3j0
$$ 34 12 29 48 39 11 13 1 -54 -45 -6 -27 3 -9 -67 18 18 3 -1 30 21 -44 19 -7 -15 -28 17 24 31 26 -24 42 12 -3 10 0
4831@K1p7J9K6mj7PoK0ML3RRl3m0lj2L0J4l6kJ4J1m6P5lm1O0J9p2L0qn0N7j7J
$$ 0 21 -56 -37 -11 -15 -32 -25 -31 -11 -7 26 35 44 11 -29 -32 -44 -14 0 -36 -38 -24 -13 -59 16 13 -28 32 51 -21 9 1 -49 8 -9 -8
4867hQ8o3l9L4J9qK5r2K7Km2O9k2k6N1K6l6J3l0L7k8M6j7j6qnrOjN6n2j6R7p2
$$ -8 80 17 -22 12 31 23 48 -44 -17 -15 -57 12 -10 -36 15 41 5 18 -12 25 -3 43 26 10 2 -3 -12 -6 -7 49 -3 -19 78 6
4901Fk3N2l6k5M3n3P8j3k4k2O0o9P1Pm5k7Q1l4K5q2K4J8m1K9PM0j8rj8K0m9O4
$$ 6 -17 35 -1 -26 17 -36 42 29 5 -17 43 -26 45 52 7 -20 61 27 52 -30 -6 12 -29 0 7 47 29 20 2 22 -27 37
4933C7m3Q0r6L2K9o7L4J0M5l8l5O3o3K2j8L5l2M4m4n0L2OK5KO0m8Rk7j9L6k7k7
$$ 37 -6 74 -22 10 39 -28 6 16 61 23 -12 51 -12 10 -8 27 -5 39 -5 -55 -23 -17 8 10 70 22 31 4 -15 21 -6 -33
4965c3M3m1qk2N9l7M7j9P3o4pJ5k0K1l3K2Ql0k7K2J3lML3l5K9J0Jm1N1kk0L1l0
$$ -33 10 -31 -39 -61 -2 -39 8 -11 62 -2 -9 6 -14 7 -26 -4 4 -26 -53 -31 -18 -21 -17 16 -19 10 20 21 -20 31 29 9 40 10
4999A0l3K3LK2p0N0j5j0P5l6r4M5J6J9J5qO2k8l8%lJ3oJ1L6n9L5l3N6r1QQ1l5
$$ 10 -23 0 3 25 -45 5 -10 -20 55 19 -75 -30 -14 5 20 12 74 46 8 8 5 18 12 23 59 0 35 2 58 -33 -25 56 21
5032B1J7M6j02M9L7Lo4k8K7m9L9J9k9j5J13o9J5q1N4j2K3J1k2k7J1O9k3m7oP3
$$ 21 38 84 -18 31 68 71 7 -21 6 -43 -4 15 -14 -29 84 15 30 -51 3 -9 14 25 3 -24 -13 56 33 -14 -20 53
5062E3o3O3m7j2M4k2K2l3j2j5oL9j9L1k3qMJ3J2L7J0m5k6k1j9Q7k2nO3n8Jk3L7
$$ 53 -10 53 6 -6 38 16 38 5 -7 -22 -28 11 -8 23 0 -8 -4 9 21 58 68 23 -3 -24 -43 44 22 17 80 22 23 0 37
5095C7n4K1m7Q7l0pn6L3j5OO3q0N3k6O6k8m4M1o6L7RJ3l8J6LojN1r4K5L5K3J8
$$ 37 -17 4 -43 44 14 7 -49 -16 -31 -25 38 -42 11 -15 51 23 -21 20 -46 -9 0 13 -25 -9 -6 -12 -13 38 -56 -31 4 27 45
5128D5rm7O7m7j7P8m4p9R1k5m5P1Qm8K8l7N9l4rM5n2P8l7k1j6K4j2K3l2J0Ll9
$$ 45 36 -11 56 9 -8 70 26 -53 38 13 -32 39 47 -1 27 -10 49 15 6 51 -1 77 40 19 3 27 15 38 6 16 19 -20
5160b0Q5r7O6o0M1kNK9j13O0K6n3L6k4K5j0n2M1K2l1K3j8O1m4N6k2p6Q8o5K6k2
$$ -20 65 -32 34 -26 15 13 18 47 -66 -6 20 -33 3 -21 4 -6 -58 -17 5 -26 -3 -21 40 -4 52 30 -46 42 -23 3 -19
5191a9jMN6l0RJ6l2oK3l2l5R1p9L0l5Q8p2L2qL5o4N3L5r9J9N3l2K5q7K5mJ05m2
$$ -19 -20 -16 40 10 19 35 3 -3 20 -12 -47 44 -35 -5 -40 48 -24 8 0 35 -29 24 59 -40 -21 32 0 25 -62 -37 -41 64 22
5224B2l0L1mJ8J8m1mj8K7o9P6n7K3n8R6l7J8oK7n3M0qJ5k2k6Pl5N2pj3J4P6r7
$$ 22 -8 23 19 37 55 14 10 -8 19 -50 26 -31 -8 -66 30 -7 11 5 32 -21 19 11 26 4 -22 -15 -50 2 -5 -18 -4 72 -25
5257b5K5J9joKl1j8j8J4MK6K7l5L0L4k5lOJ3k7J6j8k8P0m9k5O0m1PrP1n3j1mj7
$$ -25 0 19 18 12 14 -17 -35 -53 -39 -35 -9 18 -17 13 47 22 19 25 38 11 27 9 -19 51 2 -23 37 -4 3 -6 65 12 1 -3 -20
5292b0K5l9M2n6QK7kM0j1K6Lj06N2j3l8J11o4O0n0k7O9M2k0l5j2JM1m8J6qk5l
$$ -20 5 -34 8 -48 -40 -13 -15 25 14 40 43 -63 -11 -24 -62 49 -15 45 -5 -32 37 79 59 24 12 13 54 6 22 14 -11 -14
5324a4k0J3o4K6R9k2j3KNjk3L4o2M6J0l3kN0m0oj4mM8j3J0J9n6K2m6O8k8jj0N3
$$ -14 -34 -21 -85 -59 40 18 5 7 12 11 -12 22 -40 6 16 -17 -19 31 -9 -15 -29 -33 15 2 12 31 -25 -3 -49 19 -9 -10 -20 33
5358C3lJ8n7J9lJ5J5k0J8p1K1N3l7Ook3M9l3L2m6O5n4j6rM8l4Oo0M1L2J1L0m5
$$ 33 30 48 -9 10 7 22 37 17 35 -36 -15 38 1 7 1 -22 27 -6 26 -20 45 -9 -25 -34 14 -20 -14 -74 -33 -1 10 40 -5
5391eJ1RJ7l7l5L7k5LN7n1K4l4OL5N0n3nj6L4j6o0L7K5j0k4M0J6j3j4k3J6Kj2
$$ -5 6 15 32 -5 -40 -3 -28 -25 32 -19 5 -29 -23 12 62 9 4 -12 22 6 -54 -17 8 -2 -26 14 30 17 3 -20 -4 -2 -14
5424a4q1O7M2N2q1Nn9J22K0l7n9K1nPP2q2K2o1L0J5Lm0J3k4N3K6k8J9k2m9J6K9
$$ -14 -95 -28 14 66 -15 -10 -69 53 73 36 -23 -2 -7 0 72 -10 12 -49 -19 -4 -1 -41 -28 -52 1 27 -1 18 -4 -53 -37 -8
5456hJ8J8l5l3L1j4J3l9L4N1k8k9L1L1m3j4j7J2qRrRJ3P8p8J2j2j1N4l3Jrj6K1
$$ -8 10 28 -7 -40 -9 -23 -10 -49 -15 36 8 -21 10 41 -2 -16 -33 -21 -29 -20 -29 -20 -7 71 -7 5 -7 -18 36 3 4 -5 -21 0
5490@mJ6k0l0RN5m6Mk2N5m2L6m6J2NK4k2J4l1QK9L2l5N4p1ppJ5J4K0k2oo2O1j5
$$ 0 -4 12 -8 -38 -29 26 -20 -16 -38 17 -25 11 -35 -23 -18 6 -16 -2 -33 -25 4 36 1 55 -16 -23 -30 -15 -1 19 -3 -9 -71 -10 -25
5525b5PK5J2Po0M6l4J6k3P4j16J00m3Nk5M0M0l8MPM9q5K0M5p4O4o2L3nKj3m6M1
$$ -25 -18 7 19 26 -34 12 -22 -6 -29 45 -71 29 -14 -9 -34 6 46 8 12 19 68 -17 3 48 -26 38 -24 9 4 6 -7 -53 -12
5558a2kj8K5o8O1OJ5j3MJ7k7lK1J5J0M8r8k8M5J4j0L9mqn8rM6nj7j6KL7qMkm9
$$ -12 -14 -32 -7 -75 -14 -8 7 -6 -2 15 -12 -15 6 21 31 79 -19 -47 -2 12 2 41 37 29 -29 -38 8 3 -14 -30 -28 9 1 5 3 -46
5594d6L6J1K1lk2M5o9N8n7M3K9l7m6O0m2K8Qk2PM0o1K9j7K4ORm1k0j6OJ8N4j7
$$ -46 -10 1 22 19 -3 42 -27 31 -26 17 46 9 -37 23 -19 9 17 -5 2 42 -19 10 -7 17 23 32 -9 -29 -45 -39 -21 33 16
5627A6n1J1J4N5m7n5J3M7j1K7m7L2N6l1j9jk4kj1l1Q9L9q9M6J5m0m5O1k2j7K3
$$ 16 -35 -24 -10 45 -2 -57 -44 3 -8 19 -28 4 60 29 10 9 -15 -17 -28 -59 30 69 -20 26 41 1 -44 17 -5 -22 1
5658AK4Jm0qK6k4J6K2q1N2K4o4N7j6J2n6M1%RO5j8l3L7l9j5k1l3N2J0M1J8j07
$$ 1 25 26 -14 -22 4 -20 -4 18 -63 -11 13 -51 6 -10 2 -54 -13 -13 -4 61 43 10 47 8 -7 -28 -61 -9 1 42 60 -47
5690d7L1K0rj8P4o0k7K1rK4qL1l6K2k5L5l0J9K0l7K3L9o2J9j5k8L8m4L0L5k8n
$$ -47 -16 4 -5 -23 51 -9 -36 -15 -24 0 -8 23 -13 9 -16 19 -11 8 28 -9 14 53 -9 10 -5 -33 5 -39 -9 26 -2 -7
5722gLnPPj0j2K8m1M2k5M5n7K4k2M8%n4L8O3l0J3p7lJ7J4l7O4pk0K5k4k4K3J0
$$ -7 -4 -9 -2 5 -5 -17 11 -30 12 -13 32 -25 -1 -23 25 25 -29 9 72 42 55 -22 -25 -8 6 -31 33 26 6 31 7 -17 6 16
5756A6m9mO6k8jL6n2L5L7o4K2Mk5M8j6lJ5m4k3J8k4P2o7N0n2l3K3N4j0J7m4K9
$$ 16 -33 -37 29 1 0 36 -16 19 56 -8 14 18 -7 41 25 22 37 -7 -30 -12 -36 36 -31 19 -33 -66 -43 11 1 18 -26 3
5788Cj9K5o0L8k5L6J7n4N1Jl3k9O5n4J3O4n0J6n2j5R8q1j9L1L5l7J0N2n0K5m8
$$ 3 -16 9 -51 -13 -38 -2 15 -39 12 13 -20 -49 16 -38 -25 39 -11 5 -47 -62 36 -45 -64 -33 2 -35 -25 27 -23 2 -46
5819d6J2K2j7M3k5P6l8n6J4J2O7k3mq2L7M6l1l7K4L9j7m0ML6k6M8m8M7l8kK4n0
$$ -46 -34 -12 -29 14 -11 65 27 -29 -15 -3 64 41 37 -45 -8 38 7 -30 -6 33 16 -24 -20 16 -10 38 -10 37 -1 -3 21 -29
5851b9RoO7o1K2J5L9j26P8O0n1p7Q4k7OJ3K1n2J2K1l7MM1q0J06o7J8J3m2O8q7
$$ -29 -20 -26 41 -20 2 17 56 -70 8 68 17 -60 24 -3 3 16 37 -15 -3 18 -19 -15 26 -54 52 -15 3 16 -26 42 -45
5882d5N7prj9K6Lm6KM4j6rj4qK0M3k0k1K4J8j8M4j00M5K5l2N5l4k3O5k0j4p4O3
$$ -45 12 5 -4 -23 3 6 -40 -38 6 -10 -19 -33 -41 -21 22 2 -19 5 23 5 49 -51 -6 19 -13 42 8 -15 50 30 16 -58 5
5915EK8j5m5k8L7RlM8m4J4j5K5KLl8LK6k4M8j3m3L2j0J1l2jPK5k3m3L9L3k0p3
$$ 5 33 18 -27 -55 -18 -9 -12 36 -8 6 -9 16 18 21 -17 -14 12 -12 36 23 -20 12 2 13 -19 -20 -13 12 -11 -54 -15 18 -2 -75
5949g5J08n6%J9J4K6p1M2j3J9L3j2l6j5M6nl1K6K8n0l7P0k3k1L9J6k4l6J5P5k9
$$ -75 33 -23 -23 -4 10 36 -35 7 -6 13 46 34 -2 -17 29 24 -7 19 47 -3 -40 30 7 -14 25 41 17 -19 -4 71 42
5980D2J8p5O7m8O6j00N6k0nK6n4P8n1k3J9J0J1m8RJ2O4n9M3o3N9k4k8JK1mL1p1
$$ 42 60 -15 52 4 70 -30 26 6 1 27 -27 51 0 -23 -4 6 17 -31 -22 -10 54 -5 38 -25 34 10 -18 -17 4 0 31 -40
6012d0j1N5l2N9MJ4k5ll2K2P3p4j0rl4O2L5o0jJ1j2j1J4J2Pmn8M2K9n1M9k7rj
$$ -40 -51 4 -28 31 35 49 24 21 -11 11 84 10 0 -9 -43 19 54 -6 -7 4 -8 -19 -5 7 14 10 -48 -6 23 -28 21 -6 -15 -16
6046a6M0om6NNmM3l9kJ6J1JnJ0J0m8K3Lk3K4k7L4p5N3j6olK6K6K6K0l5K7n1N7
$$ -16 24 18 -28 -23 -18 -22 21 -18 -20 -4 7 8 3 13 23 -25 -2 1 -22 2 -25 9 -66 -13 -29 -35 -38 -12 14 40 60 25 52 1 58
6081E8m6J0l2k6L0J0M5q3k8O1J2k1k1NJ8J8q4R9k7l4O2Qqm7K3j7kj9L0L2k6J6
$$ 58 12 22 -10 -36 -6 4 49 -34 -62 -1 11 -10 -31 -26 -8 10 -74 25 -2 -36 26 34 26 -21 2 -15 -17 -36 -6 26 0 16
6113A6l8J0j8L2L1o9jl1Q4m1j8lL0Nmk2M7m4N5l4M0pk2J1l2J5l3N3k0K7m5L4J5
$$ 16 -22 -12 -30 2 33 -36 -37 -68 16 -25 -43 -46 -16 -11 -15 -37 10 -34 21 -13 27 20 -2 9 -23 -8 -41 12 -8 19 -26 8 23
6146B3m3R0r0O4l2j8qJ1mK2J3rQn1L4k9ML0k6j9K1kM4l6k2K4m7PQ0n1J4k3k8R5
$$ 23 -20 70 -20 44 12 -6 -14 -3 -7 15 28 19 27 -24 10 -19 -15 15 -11 -30 -9 -11 33 -3 -25 -1 -48 -41 39 -12 2 -21 -49 46
6180D6o1j4M5LM5q0j4J5K7K0l5j1mP0m0j6pl7R7k9k1RK4o9MQ1n1J2QQ5j12kl0
$$ 46 -15 -29 16 19 64 -16 -30 -15 12 32 -3 -14 -18 52 12 -4 -11 -48 49 20 -1 8 32 -37 -33 48 -3 9 17 102 -10 -12 -42
6213d2K5K0Lj4Qn5R4Nj24K7RR9o7l2P3p2R6l2o3O7K1kk5j2J8Qk4qM5k8m9L0j7
$$ -42 -17 3 6 -8 0 -55 39 44 -80 -53 -44 55 -12 -44 29 -43 53 21 -42 25 46 44 19 7 25 33 9 1 46 18 -31 -1 -18
6246a8J5m0N4k6K2Rl3rL6pk4M8JOm2kL0l3rM8n1K1J7J8j1K8m5L1J5j8q6Q6p9L0
$$ -18 -3 -43 11 -15 7 16 -17 -26 10 3 -21 27 28 34 -8 -10 20 -13 -22 26 -25 -4 13 31 20 48 3 34 49 31 -55 31 -48 -18
6280a8L2n0N5l3KMLk1K5J7m0J2N7m5K6l5L4j8rM1m4j0K3J6Ko1L7K5J9m5m3J9J8
$$ -18 14 -36 19 -14 -12 -8 -5 -26 -1 16 -24 -12 45 0 26 -9 25 7 -2 39 -5 -15 8 24 26 -35 2 27 46 1 -42 -23 -5
6313eK9n2kQ2p9pM0LK1m5K2N9l1n8P1J3n3Jl8PN7n4JK5M4L4o7n8J29r2M4k8L2
$$ -5 24 -28 -30 52 -27 -34 6 9 30 -15 7 66 35 -23 48 61 8 9 -29 -22 35 -19 -18 7 51 85 18 -40 89 -3 41 13 45
6346D5jj9Pk7okk0M8L0o2P2k2l2jM4m3oMJ2l5J4J5lK2n7L3l4k5P7l6k6M2N9r4
$$ 45 44 25 32 5 -1 -3 -23 25 55 -7 65 43 11 10 54 11 5 9 21 -14 0 15 12 34 -23 10 -24 -49 28 -8 -34 8 67 -27
6380b7J2l3K7P3j2n2K8p6L5J8M7L7q1Pkm9P5n3N3n5K3M5r4Q2Ln7N2Lrp6M1J3j3
$$ -27 -15 -48 -21 52 40 -12 16 -60 -25 -7 40 77 -4 3 1 -48 27 -26 27 -28 -5 40 -54 28 31 -26 26 29 20 -56 -15 -2 -15
6413a5j2M2l4O5m6J9Pk2J3K1o9J4K5KoM9n8j3Q8l4l1lJ6l2jj2K7L5o9M0j9NK1
$$ -15 -27 15 -19 46 0 19 26 4 17 38 -31 -17 8 10 4 53 -5 -18 70 36 5 2 18 -14 -15 -27 0 35 -34 6 -13 -8 13
6446A3n4JN9K4p0K7j2j3L2J7j5m9JO0j1m1P2l6om5R1l3j1N6o1O0l1K6k9m7PqJ7
$$ 13 -41 -40 19 43 -27 0 -12 -25 7 24 9 -40 -39 21 10 -31 41 5 -1 -46 45 12 1 57 -4 56 25 51 22 -25 -18 -26 -9
6479iM1j4q6Q0Pk3K3k2k3K8J9L0l7Jk6k8l2M6JL6j0M3n1J6l6O8l0l7P2k7k7j1
$$ -9 32 18 -68 12 19 -4 19 -3 -26 2 21 51 14 15 -11 -39 -71 -25 -24 12 2 45 -6 10 -26 42 12 -25 47 20 -7 -18
6511a8J8K7p3O5j9J6K0l7%J9m2Q8q7k0J6J1MPj6M1k4l1M0Rm9K3N3j1l3K4m9N4
$$ -18 0 27 -46 19 0 16 36 -1 -1 18 -24 64 -23 -43 -27 -16 -12 -5 -21 20 -4 -35 5 14 -35 -12 41 30 -3 21 -28 26
6543B6n1MK2j1k1QKjJ0L9l9K7m4N7k1%j1j3l0R5o9nP4m9pJ1j6N7l7JL0k8k8j2
$$ 26 -25 -21 1 -10 -31 -23 -21 -22 -12 27 -12 15 -29 28 7 7 -4 -17 -47 48 -21 -26 48 -1 -8 3 -13 44 7 8 38 10 -18 -30
6577c0P6n7L5Rp6M1n0K8L1j8k4R1k6k9j6K3mj9L7k5j0L6m6K5N7m4l8O0q6P9k9
$$ -30 46 -11 24 33 -43 -2 -52 -24 7 -11 -35 56 30 1 -15 8 4 -15 22 -3 -13 23 -23 2 59 15 -23 37 -49 30 1
6608Ak4M9n3Qj5jQ5l7m3Q4p2jJ9k6N1kJ5o6J0N3p3K9rL0j5J4Rk9pj0J5K6q6O6
$$ 1 -23 26 -27 -19 -34 -35 50 13 -30 54 -18 -19 0 -26 25 23 38 -28 -18 35 -38 -9 -18 12 -3 11 20 -9 -16 -26 -11 15 -71 -5
6642eM0n2N8n2J1P6q3ML1j4K9o0j7oj7P3rk3n1N8l5N2l1KM9K3l8Nn3J1Pm6L5M3
$$ -5 35 -17 41 -11 0 76 -7 -3 28 14 43 -17 -34 -40 -57 16 7 -16 -67 -9 -44 8 -23 -21 28 51 13 18 -35 -24 -17 -63 -28 15
6676A5LK6Ro5L0r8J1PN9J7Nm0L5Nl5N4p3N5n7M4L8oj2lm2k7pJ5O5j7Pm1K6jK0
$$ 15 18 44 53 -12 18 -80 -69 -62 -3 14 19 -21 14 19 -16 38 -35 20 -37 7 45 39 27 24 -18 -45 -52 -37 28 11 18 -23 3 2 22
6711B2rn4RM9r3J07J2n1m5N2K6Nn0L8qk0lLLL4l1Pj7L8k3L5n2K3l%Jl8OMP0p1
$$ 22 13 -41 -32 17 -76 31 43 -8 -53 -1 25 30 -20 18 10 -10 -13 -10 -7 27 -4 3 -14 24 1 36 -16 7 4 4 5 -33 -27 -23 47 -24
6747b4L3L7p0L5m5L1K0p5Q8Kj2k7K0Jj3l8J9K4oj3L2Op1K2PMN1k8l5L0K2n3N5
$$ -24 9 46 -24 11 -34 -3 17 -58 30 32 20 -7 13 14 1 -37 -18 6 0 -13 19 25 -46 -24 -17 -13 38 10 -25 5 27 -26 29
6780B9m5O0j3n8J4K1%L8m1l5L8o4L2K4J5k6l4J2nLO4q7L7N7n3K3n9M2jk9M0JK4
$$ 29 -16 44 31 -27 -13 8 8 46 5 -30 8 -56 -24 0 15 -11 -45 -33 -38 -35 29 -58 -21 36 -17 6 -53 -11 -12 -41 -1 0 24
6813B4k0m9L0LN7l8k5K7qL3n6M7l0PJ1k7M8j9k2N0r7O5Qj7jL7n0NJKk7jQJ9Nl9
$$ 24 4 -45 -15 -12 45 7 -18 9 1 34 -22 25 -5 2 13 -14 34 15 -7 43 -54 11 19 2 1 38 -12 -7 -6 -4 -31 -32 -24 -5 0 -39
6849c9N1N3j6q1N3qJ9J7l5j8m7O6m5M3n2QN7n0l4Q0m6N3k8k0j6M2m6%O4m6O9m6
$$ -39 12 65 49 -32 21 13 32 49 14 -4 -51 15 -30 13 -39 -31 26 -24 -58 22 -24 29 1 -19 -35 7 -39 -39 25 -21 48 2
6881Bl3M7mq3J17o1j1M5J2m4K8m8N4o4K3M3K7k4k2j5j2Q1j07J9J9J2pko2M7P4
$$ 2 -31 16 12 -71 46 -15 -26 19 31 -13 15 -33 21 -43 -20 23 50 26 4 -11 -23 58 -49 -30 -11 1 -6 -8 -70 -23 51
6912E1j33P5m4M0RK2k2mm4Q8n9J8K2%Poq4P0l1RqN1l%o6N4L8n4oJ4M8n1kl6Q7
$$ 51 -82 -7 -51 -11 -2 20 -2 -6 -50 38 -21 -3 19 19 26 20 -64 6 -25 -16 -24 27 24 24 -42 12 50 -4 -10 4 52 1 -1 -37 50
6947E0o8m2O6J1Ml9k6L4L4r7Q0j3nM9l0NN7o9l7K3J6L6j3l4K0J6L5m9j9n1M2J1
$$ 50 -18 -60 6 17 21 -18 -44 -10 24 -73 7 -6 -11 38 8 13 70 1 -36 -13 3 39 26 -8 12 28 63 14 -5 -56 -14 -3
6979cM7%j00J06l6j1K9m0j9K9k0JK0o6M7L2m8M0rmJ2M5n6j0L2p1L4j2MO0lj4l1
$$ -3 44 44 -56 50 14 3 32 -8 -27 2 -18 -17 3 -63 -16 16 -32 8 -1 -5 7 52 -4 -14 18 -53 -19 -31 -27 33 30 16 -15
7012a5m7M8Rm4LN5Jj9Pk3Qkm1O1J3l8P0k8n5K2qj3%K4J3Rk1M1k7J9k1k4J8L3J7
$$ -15 -62 -14 -5 -49 -46 9 10 -9 -2 -25 -17 -19 -60 1 14 -24 46 18 -37 -15 -23 -36 -36 -12 1 10 -11 30 3 22 1 -23 -5 28 45
7047D5n5L8m4M1K4p8Qj1K8NJ8l1m5O0j1L5l6Q8o5p3N6j0J4k5K0M4l9l2j5M8l8
$$ 45 -10 28 -16 25 49 -29 -21 -32 -4 1 19 -12 -57 3 -8 27 -9 79 14 -59 -3 -13 1 -24 -4 40 1 -31 -46 2 -36
7078c6L1o2M6M5JRj9Jj3kPJ5l4l3R3n4J6Jn9M4m9MK6K4J4J5l2j0o2O3k5L7K3j18
$$ -36 -5 -67 -21 24 25 34 15 16 3 1 8 23 -11 -44 49 -5 11 12 -47 -3 -52 -48 -22 2 16 31 -1 -11 -73 -10 -35 2 25 -93
7112i3P0J7k2qM1rPqOk8L3%J0kMo1J09p6JmK7J9j7m5j3PRM1j0L6n0J1M0r7M0P5
$$ -93 -23 -6 -28 -36 5 -4 3 -5 1 -27 6 6 16 14 18 -43 66 -10 -9 -13 14 33 16 -29 -42 -35 -26 15 5 41 -9 2 42 -55 -15 60
7148F0n6M8J5m1M8r2M9J2n6jj6P7n3q6Q4L9n3M3jlp4L2N9l7rK5jm8N8k0O4o3j1
$$ 60 4 52 67 26 74 -18 31 43 -13 -14 -30 47 -6 -92 -8 31 -22 21 20 17 -57 -25 34 -3 -12 13 12 -36 22 2 66 3 -8
7181hJ6%Jk3Kl7N5p3J06l4J0Jj9j7M7q0M2J0k8O8n5m1J06j1j4j6l8J1K4K1l0K5
$$ -8 8 8 9 -14 -12 -49 6 -67 39 5 15 16 -3 -20 27 -53 -11 -1 -29 39 -16 -57 49 38 24 8 -30 -19 5 26 -4 21
7213B1rol2j1Q1K6q3J5l1MrP8Mn0JRj3j7M0M0r7O9Nj9K8j00M8k9M3J0o7N7k2K0
$$ 21 12 6 -26 -37 44 70 -13 2 -29 -25 -34 44 48 -2 -1 8 -5 -22 18 58 -39 30 35 16 44 -56 -8 -37 6 16 -51 6 -16 4
7247Dl3L6j3o7Q5n7P3l1k2P1k4j0j3m6Q4p6K4J5qK7rl4L7k8N8m1j3k3M4j0J4N
$$ 4 -29 7 -6 -73 12 -45 28 -3 -25 46 22 12 -1 -47 37 -39 -15 0 -8 19 10 -24 13 -15 43 2 -11 -34 10 0 14 19
7279A9J1m6n0N8j1NoJ4Qp2P2Qml7P1m1m4J1j1M1P8j7r1N2k9p1J13j0r4M3j3N6
$$ 19 30 -16 -66 -8 -19 -14 -20 -6 2 -70 2 10 6 -31 40 -1 -45 -34 -45 -4 74 57 -34 18 -11 -82 31 21 -73 -30 -43 13
7311A3j3J7j9J2j9L0Qmm6mmP0j4l0K3l4N6j8k6k3O7q5M0l0M9m1k6L1N0l4J1j9
$$ 13 0 17 -2 10 -9 21 29 25 -21 -25 -29 41 27 -3 20 -14 42 24 -2 -25 42 -43 -3 -33 16 -25 -51 -20 30 -4 7 -12
7343a2j8L2L0j3Nm5nJ6k6j8Q9J0J3j25M6N8k3JKj0M5r4J6N3Ln2J8k4J6k4P0p6
$$ -12 -30 2 32 19 24 -21 -26 -10 -36 -54 35 45 58 -67 -21 37 14 15 17 7 52 -42 -26 27 30 -22 -4 -28 -12 -36 34 -42
7375d2lR0p7P1k4l3MRJ3jl6N0J8k6o5J08o3P4l9n9O4k0m1j2J4Q4l9rn5j7J03r6
$$ -42 -45 45 -32 39 15 -18 -14 -5 8 7 -29 21 39 13 -52 56 -7 67 28 -31 33 13 -28 -40 -26 58 19 10 -45 -62 41 -55
7407e5R6Op0M8j3l0l9J22j26O5m2pM5Ro1Q1j2L3j4o5l0Q2opl2J2O6r4M1%Nk8O
$$ -55 41 47 -23 25 12 -18 -57 65 -61 4 -38 -45 0 9 -52 29 17 50 36 -29 -59 23 17 10 -22 -10 56 -38 3 3 8 -20 -14
7440a4Pj8O6M0j07N7k5l8N3J9m5k2J9L0m6k2N1Op4L8Q1k7o6L1j7l4N1k9J5N3K6
$$ -14 -7 -25 41 81 -26 31 6 -32 21 40 -5 -27 -8 22 -24 -46 5 11 -63 -25 56 29 -37 -6 -23 -57 -6 -35 -20 33 59
7471E9m4K3l9k8J5N5l1K8nk7K2j4m3K8nOm4J9J6LMQk3N9k7k7P3m2l1rL3Qj5Rj
$$ 59 15 38 -1 -29 -14 41 10 38 33 6 28 14 -29 -1 -6 0 -44 -25 -9 -6 -2 6 -17 42 15 -12 61 19 -12 -21 12 20 5 14 13
7506A3k0j5k1P3o7Q3q7J1mLO5k2Lj5k8N4l6K4l2J3J7l3L6q5M6K4Nl9P4L1m9J9
$$ 13 -7 -22 -43 30 -37 46 -41 -30 -34 -31 34 12 15 0 -28 26 -10 14 -18 -5 12 -21 15 -70 -24 0 5 -34 40 71 22 41
7538D1o8N2j2j0o7N4M5m0Km5M8m2R7o6MK2l7N1n1%k0L8m2N2l4K8Qk0m2N4j8K8
$$ 41 -27 25 13 3 -64 -10 35 -5 -3 -48 0 -42 55 -11 -7 15 -22 29 -22 -22 -42 -4 -46 6 -28 0 8 -12 -54 0 -18 10
7570A0jjmKJ7n4L4m3L4J1L3m2j4RO8q4L6j2M4n1J0K7n8L2l3O5j6m8P3m2O9r5%
$$ 10 9 8 4 6 23 -31 3 -40 -6 5 38 -4 -18 -9 59 -25 11 -1 43 -8 2 29 -29 3 -30 35 19 -29 44 2 71 -24 -24
7603b4M9o4N4n3K7K0K5n0L0Ll3k7J9pM7qj6jrJ3J7m4J8K4k1j3l2N4o9J04nk0k1
$$ -24 25 -39 15 -38 -11 9 34 -16 14 17 -16 -43 -24 -31 16 8 -8 -9 -18 -5 12 -32 -14 10 -11 -24 -56 -2 -71 33 28 8 -13
7636a3NJ0n7M0k7O6j3N5j02J2K2P1j02P3Kj8n9P4n7kM0ro0j0P7k0J0n0M6Oj5J3
$$ -13 -8 2 -55 -15 -42 24 11 66 -36 -24 -2 69 -33 40 42 24 -35 39 -18 -20 20 11 -49 -59 18 -2 8 -42 4 10 -5 8
7668HM2m2j0k8M9Qk2m1K9k3j5N4p6Q8p4Q1j5o5Q9q2N7m7N9J3Ro2LK7j0j5J6oQ
$$ 8 50 8 -2 -30 19 27 5 -36 -7 -30 -45 9 -67 21 -53 28 13 -52 37 -45 12 -35 24 37 46 -16 -13 14 4 -11 5 -1 7
7701Gk0J1L4q5J9N9k5n1P2q4L6j6K9N6o6N1k1M9n0j3k6PP2p2J1K0n9P2j3J4j6
$$ 7 -13 -2 32 -53 -34 25 0 -51 21 -63 -27 -43 -14 42 -24 27 6 55 5 -8 -34 -27 45 -27 -16 4 -55 17 4 18 2
7732Bqo9R3P0j11O4n1N3o5L9Pnm2P9j31J2O6Mk0M0l3K1j4m8O3m0j9M3nL7pl6q6
$$ 2 -6 -75 18 88 -23 41 -10 43 -22 17 24 19 -23 56 -75 -63 3 7 -13 27 -6 15 1 -47 16 -24 -43 0 -5 32 25 -11 -97
7765i7J06o9J5K8Q6q4L6p8R3rj6j01J03j1j4Mj8M9m9M3m4M6l9L2j02M5M2rMJ6
$$ -97 9 -60 -45 -17 69 -15 21 -57 36 27 11 -90 13 2 -12 -8 -26 23 -26 17 -27 19 -20 12 -90 -45 -3 -12 -8 8
7795HJ7k8L4o3nk4L2L0j8m3R4m8J6J4k0m4O9k9l8R1o9Q2q1j6J00j25P0J4Qk4M
$$ 8 25 -3 31 -32 -37 -61 -29 1 -17 -60 34 -14 2 16 -4 -48 21 -8 -46 45 -24 58 -23 -39 61 -64 6 20 28 4 8
7826Hk4k1PJO0n6L2mLl1Ok7M8k7J4j9NoJ5J7M4n1L1k7k5R2n2o4J03l0k8m0K2R
$$ 8 -16 -37 -30 -29 31 -25 7 3 6 -25 -19 -46 2 -25 -11 -30 -25 -31 -16 1 45 -6 25 -2 -27 65 13 -51 52 22 -6 -46 -24 -15
7860a5P3k8p8J4k5M9K0p4N7O5o4L0nj9L4pk8j4J4Km7O7k5J3n6N3k5M8l4n2K7k0
$$ -15 58 30 -48 -34 -59 -10 10 -64 -7 58 -6 24 19 0 34 27 -1 -15 -1 1 -46 21 -4 9 -47 6 -19 29 -5 -57 -30 -50
7892e0O5k4M7K3r4J8j0L8J9r2M7J6jj8Rk7M0j0N2n2L0nm7N5p5J4j1K5j1N8m0K9
$$ -50 15 -9 38 61 -33 -15 -25 13 32 -60 -13 3 2 -16 -7 -34 6 -4 48 -4 26 21 -26 29 -46 -32 -43 -18 -29 29 -11 18
7924A8j1l3j5O4L7n5m0N5k9Ko2Q4k5j1L4l9l7N3k6k5N5J4J1m8J2PN1o9J7M8n8
$$ 18 7 -26 -41 23 60 5 -35 20 -9 -7 -69 15 -10 -21 13 -26 -63 -10 -36 -61 -6 8 19 -29 -17 -10 41 -28 -11 37 -21
7955b1k0L3L0l3qM8m7L1k5l2N4MJ5Ln6k8R3p4O3k6K9k7k9J9p2O4J3L5p9K2nJ2
$$ -21 -41 -8 22 -11 -19 29 -18 13 -12 -44 10 14 29 32 -24 -52 41 -33 30 4 33 6 -23 -4 -76 -12 1 36 -43 -21 -26 -14
7987a4l6L3L6k8%K3pl5J5k9J9N9n8K4m2M7m1O1n9M4l2K1pLN1n4j3K3rl2J1J7L9
$$ -14 -50 -17 19 -9 -9 14 7 -28 -13 -42 -23 36 -22 2 -40 7 -34 27 -32 12 -20 1 -6 -3 48 -6 -19 4 -5 -37 -26 -9 30
8020C0k8l9L5Qj5jl1J06n5K7k5n3K6%k5L0jOj2m2Q3lM0q6N6m6L9l5J1N5k6j1r
$$ 30 2 -37 -2 6 -9 -10 -41 65 10 37 12 -41 -15 -15 -40 -10 -11 -5 -17 -59 24 21 61 -25 31 -15 24 -11 0 55 29 18 9
8053Ik4N1q4N7k0K1k5M9m2lN0j2p8P1j3K4m4O9l4kll2mj1K9j6K6l6J2N0m2k3L2
$$ 9 -15 36 -48 9 -11 10 -15 34 -8 -11 39 27 -51 20 7 31 -13 56 22 20 17 -15 -19 -30 -1 -17 9 -27 -15 35 -7 -30 2
8086BPm4J9L8j7j9Mk3J3L3J2n6n6Q7J9j8k1K1j6l8O6K7n4j6L1j6J3M6n1Ll8M7
$$ 2 9 -35 -16 22 5 -14 -10 -33 -20 13 25 -31 -87 0 19 1 -20 1 -15 -53 13 40 -14 -30 1 -15 -2 44 -7 -4 -42 5
8118EjnmNM2l2m2jJ8oM0l8L9j8J4o1K7L3n5O9n4L7%l2kMN1n5J8k5J8J0M5q7M9
$$ 5 4 -1 -5 0 42 10 -32 -33 -15 -21 19 -19 20 2 16 -45 -18 15 -40 29 -25 12 12 -20 -22 -18 33 -22 -4 -29 -11 -1 44 -43 6
8153FlL7l4k9J2KK1k3j5nJ8J0l1K0k0kK0j0J0qjK2L8p4M5k9M2j9L7m5KoJ6rK0
$$ 6 3 40 6 -23 -11 -9 12 -11 -26 -31 -13 -3 -34 -14 -34 -36 -16 -26 -16 -24 -25 -3 35 -39 6 -23 19 0 37 -8 -6 -12 4 -5 15
8188A5m3M5k
$$ 15 -28 17 15
8191A5
$$ Imaginary data points
##PAGE= N=2
##DATA TABLE= (X++(I..I)), XYDATA
0@%%%%%%%%%%%Qj6J6j6K4l2L5m3N6o7P5q9J07j30J53j77K07k34K68l09L52m00
$$ 0 0 0 0 0 0 0 0 0 0 0 0 8 -8 8 -8 16 -16 19 -24 32 -35 40 -49 58 -72 81 -96 111 -123 145 -164 188 -212
33b12M55n17N82o54P33q19R12j015J133j261J395j541J703j882K076k288K522
$$ -212 243 -274 308 -346 387 -432 480 -535 598 -663 732 -809 894 -988 1088 -1200 1322
50A322k780L063l374L723m111M547n042N610o268P037p954R074j0472J2273j4703
$$ 1322 -1458 1605 -1769 1954 -2157 2390 -2652 2958 -3310 3727 -4227 4847 -5625 6648 -8055
65h055J8177k3594L3308n6225K16104K02623j98084j22220j51468q0067q0110
$$ -8055 10122 -13472 19836 -36389 179715 382338 184254 62034 -89434 -169501 -249611
76b49611p71L4872Q5382O2416N9035L9467N7579N0457M8460Q869k7194p4193q7646
$$ -249611 -250382 -215510 -130128 -67712 -8677 30790 88369 138826 187286 196155 168961 94768 7122
89G122r2467p4115n3827m937M6264Q5709Q0670N9801L8959L2182J4260q968k8455
$$ 7122 -85345 -159460 -213287 -218224 -171960 -86251 -5581 54220 93179 125361 139621 130653 102198
102A02198k9827l4484m8065o1728n0659k0813J1788L3870N2273O4180O0823L6008
$$ 102198 72371 37887 -10178 -71906 -122565 -143378 -131590 -97720 -45447 18733 79556 115564
114A15564M307j8647k7912l0195l0228k9936l0351l0475k4379r327J0138K8019
$$ 115564 119871 101224 73312 43117 12889 -17047 -47398 -77873 -102252 -111579 -101441 -73422
126g3422M5096O0607O4084M1719p19l9370n6121n5200m8562l5875j0981J9907
$$ -73422 -28326 32281 96365 138084 137365 97995 41874 -13326 -61888 -97763 -108744 -88837
138h8837L8743L6872K4995J7666J6519J4763Q844q5j0354k2224l2718l7217l3519
$$ -88837 -50094 -13222 11773 29439 45958 60721 69565 69480 59126 36902 4184 -33033 -66552
151f6552k2337l793K0152M0346M5523L5010J8547N001o508j8605k6847k5284j7410
$$ -66552 -88889 -92682 -72530 -32184 13339 48349 66896 71897 65389 46784 19937 -5347 -22757
164b2757j1983j1387r033r65R267J7214K3242K8079K7302J6750J72j3649k1342
$$ -22757 -34740 -46127 -55160 -56125 -46858 -29644 -6402 21677 48979 65729 65901 52252 30910
177C0910k4749k4590j8974q651Q01N703Q012J1278J4809J6898J7436J6477J1078
$$ 30910 6161 -18429 -37403 -46054 -45253 -39550 -31538 -20260 -5451 11447 28883 45360 56438
190E6438o10j4543k4006k7064k5959k0790q723Q119K1440K4964K1227J6413J1736
$$ 56438 55828 41285 17279 -9785 -35744 -56534 -65257 -57138 -35698 -10734 10493 26906 38642
203C8642N025l579r723j1843j2817j4826j5953j3247o782J631J1055J9805K3795
$$ 38642 43667 40088 30365 18522 5705 -9121 -25074 -38321 -45103 -43472 -32417 -12612 11183
216A1183K1169J2994L428n923j4547k0103j9523j3608o602j585K413O965J0937
$$ 11183 32352 45346 48774 42851 28304 8201 -11322 -24930 -31532 -33117 -30704 -23739 -12802
229a2802J1924J1378J0790R001M199l464j0471j4583j5897j5020j0484k282O149
$$ -12802 -878 10500 21290 30291 34490 31026 20555 5972 -9925 -24945 -35429 -37711 -31562
242c1562J1684J3365J2772J0735P238K841j239m254o809r059j0508j0493q663
$$ -31562 -19878 -6513 6259 16994 24232 27073 25834 21580 14771 5712 -4796 -15289 -23952
255b3952n148M24P230J2668J4232J2809R227M219k056q318j1991j2139j0115p838
$$ -23952 -29100 -28676 -21446 -8778 5454 18263 27490 31709 29653 21335 9344 -2795 -12910 -20748
269b0748n139j485K949O956R605J0947J1077R503N442k95o477j1351j3636j2838
$$ -20748 -25887 -27372 -24423 -17467 -7862 3085 14162 23665 29107 28812 22335 10984 -2652 -15490
283a5490r428m314J231O431J0125J1515J0562Q136N250J941j856o046r172j0630
$$ -15490 -24918 -29232 -28001 -21570 -11445 70 10632 18768 24018 25959 24103 18057 8885 -1745
297a745j0315q456n090l22M941R537J1478J0829Q158M304O6m290p616r344q999
$$ -1745 -12060 -20516 -25606 -25928 -20987 -11450 28 10857 19015 23319 23385 19095 11479 2135 -6864
312f864p302n087k580O33M335P520R257R264P896N214J230l249p264r502r710
$$ -6864 -14166 -19253 -21833 -21200 -16865 -9345 -88 9176 17072 22286 23516 20267 13003 3501 -6209
327f209q036n005j576K046N089P347Q325P786N795L537Q52k357n972q535r022
$$ -6209 -14245 -19250 -20826 -18780 -13691 -6344 1981 9767 15562 19099 19951 17594 11622 3087 -5935
342e935p622n256k472J273N483Q387Q852P444N270K936k84l705o386p338p041
$$ -5935 -13557 -18813 -21285 -20012 -14529 -6142 2710 10154 15424 18360 18076 14371 7985 647 -6394
357f394o122m173j365J908M800P222Q241P443N056K096p72l852o872q420p543
$$ -6394 -12516 -16689 -18054 -16146 -11346 -4124 4117 11560 16616 18712 17940 14088 7216 -1204 -8747
372h747m929k624o18J957N368P521P193N349L714K137n36m086o782p409o439m846
$$ -8747 -13676 -16300 -16918 -14961 -9593 -2072 5121 10470 14184 16321 15785 11699 4917 -2492 -8931 -13777
388a3777k717L4L038N512O910P038N588L152P60j186l529n921p113o476l974j841
$$ -13777 -16494 -16460 -13422 -7910 -1000 6038 11626 14778 15538 14352 10823 4902 -2211 -8687 -12661 -14502
404a4502j50K109N117P228O813M783K693J006j347m436o395o435n154l745k068
$$ -14502 -14652 -12543 -7426 -198 6615 11398 14091 15097 13750 9314 2919 -3516 -8670 -12415 -14483
419a4483L40K967M899N694N545M728L044Q72j469l579n319o111n311l389j306
$$ -14483 -14143 -11176 -6277 -583 4962 9690 12734 13606 12137 8558 3239 -2872 -8183 -11572 -12878
434a2878L54K461M976O352N573L493J667O06j495m305n961n461l659k137r69N82
$$ -12878 -12524 -10063 -5087 1265 6838 10331 11998 12604 11109 6804 843 -4618 -8277 -10414 -11383 -10801
450a0801L083M786N039M156K828J417l16j968l324m540n009m165k028R5J279K536
$$ -10801 -7718 -2932 2107 6263 9091 10508 10192 8224 4900 360 -4649 -8814 -10842 -10747 -9468 -6932
466f932M236N597N148K713K69j101k317m016n279m836k860r14N51K233L533M231
$$ -6932 -2696 2901 8049 10762 11031 9930 7613 3597 -1682 -6518 -9378 -10292 -9741 -7508 -3975 256
482B56L998L075K303P90j202k913l625l813m151l883k248J99K231L458M363N132
$$ 256 4254 7329 9632 10422 9220 6307 2682 -1131 -5282 -9165 -11413 -11214 -8983 -5525 -1162 3970
498C970M540K627L44j412l095m537n325m418k496p71M59K016L911M751M060K796
$$ 3970 8510 11137 11481 10069 6974 2437 -2888 -7306 -9802 -10573 -10114 -8098 -4187 564 4624 7420
514G420J774P26q86k789l617l751l594l150j648K13J653K693L492M441M057K349
$$ 7420 9194 9920 9034 6245 2628 -1123 -4717 -7867 -9515 -9302 -7649 -4956 -1464 2977 7034 9383
530I383P5j295k368l603m356l879k211l52R08K119L035L371K611J881J195K68
$$ 9383 9458 8163 5795 2192 -2164 -6043 -8254 -8606 -7698 -5579 -2544 827 3438 5319 6514 6782
546F782j032k141k247k073k087k374j758nJ694K341K595K769K851J832J71j439
$$ 6782 5750 3609 1362 -711 -2798 -5172 -6930 -6935 -5241 -2900 -305 2464 5315 7147 7318 5879
562E879k556l057l006k075j139j20P31J835K819K775J804Q74M29O7r71k379k823
$$ 5879 3323 266 -2740 -4815 -5954 -6074 -5343 -3508 -689 2086 3890 4764 5193 5260 4289 1910 -913
579i13k102j308r19m02O89J901K584K455J951J550O68o03j637k332k708k585j968
$$ -913 -3015 -4323 -5242 -5644 -4955 -3054 -470 1985 3936 5486 6154 5551 3914 1582 -1126 -3711 -5679
596e679p70N32J597K178K776K591J757N91k11r75j678k373k191j493q68o32j91
$$ -5679 -6449 -5917 -4320 -2142 634 3225 4982 5573 5362 4387 2709 336 -1855 -3348 -4216 -4848 -5039
613e039R25J947K344J904J500J297Q35n68j893k482k410j817j285n60M44J360
$$ -5039 -4114 -2167 177 2081 3581 4878 5713 5145 3252 770 -1640 -3457 -4742 -5302 -4858 -3498
629c498K035K217J954J215L11M3l58j220k060k238j560o91m02J7Q49J850K308
$$ -3498 -1463 754 2708 3923 4234 4277 3919 2699 639 -1599 -3159 -3850 -4252 -4235 -3386 -1536 772
646G72J814J031M95M7p72j419j882j735j446q45k06N83J119J628J922J632J165
$$ 772 2586 3617 4112 4159 3387 1968 86 -1649 -3095 -3940 -4146 -3563 -2444 -816 1106 2738 3903
663C903K13n46j080j358j872j681j004j65K49O63J152J599J554J181N12J27k88
$$ 3903 4116 3570 2490 1132 -740 -2421 -3425 -3590 -3341 -2678 -1526 73 1627 2808 3320 3447 3159
680C159r10j602j630j412r07l36K90Q36J378J645J477J053L40k12o06r94j333
$$ 3159 2249 647 -983 -2395 -3302 -3638 -3348 -2512 -1134 511 1988 3041 3381 3169 2563 1569 236
697B36j526j357n95q8M20O28J178J533J674J018L65j78o95j057j515j524j217
$$ 236 -1290 -2647 -3242 -3330 -2910 -2282 -1104 429 2103 3121 3486 3308 2613 1556 41 -1483 -2700
714b700n29M3M38Q77J260J464J320R57L57l31p08j224j444j504j138o57J21O88
$$ -2700 -3229 -3186 -2748 -1871 -611 853 2173 3130 3487 3156 2448 1224 -220 -1724 -2862 -3519 -3398 -2710
732b710J014J414J476J253O40Q4l94q42j111j381j375r82m00K79N80J044J397
$$ -2710 -1696 -282 1194 2447 3087 3171 2777 1935 824 -557 -1932 -2914 -3314 -3035 -2455 -1411 -14
749a4J478J170O25m4n17q91j257j367j176p91k82L40O92R95J258J261R97O24k6
$$ -14 1464 2634 3259 3215 2698 1807 550 -817 -1993 -2784 -3066 -2726 -2034 -1039 219 1480 2477 3101 3075
768C075o37q07j185j386j249q13k06M14P69J056J231J280J013M70j72n53q69j150
$$ 3075 2438 1631 446 -940 -2189 -3002 -3208 -2794 -2025 -969 262 1542 2555 3025 2853 2300 1431 281
786B81j289j178p36r5L34P79J054J285J340Q21M56j56o42j009j053j249j000o80
$$ 281 -1008 -2186 -2922 -3017 -2683 -1904 -850 435 1775 2596 3052 2896 2254 1245 192 -1057 -2057 -2737
804b737j08M48Q09R78J092J110R53M15k76p67r13j093j154r91n70N9N77P02J011
$$ -2737 -2845 -2397 -1588 -610 482 1592 2545 2960 2684 1917 1004 -89 -1243 -2234 -2804 -2745 -2168 -1466 -455
823d55J126R81P43K46k30n73r23j091j004q64m65r0N04Q29J030J043Q73O66K15
$$ -455 671 1652 2395 2641 2411 1838 915 -176 -1180 -2044 -2509 -2599 -2095 -1266 -236 807 1680 2346 2561
842B561l52o36q57r19r50p69m49N3M68O77Q72J038Q47O48N7k73n70q79r58r11
$$ 2561 2209 1573 716 -203 -1153 -1922 -2371 -2318 -1850 -1173 -301 737 1584 2232 2289 2016 1446 567 -391 -1302
862a302o36l10J36N72O36R11Q39O97N47J87m14o53p38q98q10o65l18L30N65P38
$$ -1302 -1938 -2248 -2112 -1540 -904 7 846 1543 2090 2277 1863 1210 472 -426 -1236 -1901 -2219 -1889 -1324 -586
882e86P15Q33O62L55q3l83n64p12q22p31m76j24K04M20P39Q43P84N45L16l2m81
$$ -586 129 962 1624 1979 1896 1513 949 237 -585 -1316 -1792 -1916 -1712 -1292 -553 290 1074 1619 1935 1903 1422
903A422p34p67o83n89m04k5L02N76N75O46O65O48K48j74l75o48o34p60o81l79
$$ 1422 688 -79 -762 -1351 -1755 -1780 -1478 -902 -327 319 984 1632 1880 1706 1331 683 49 -711 -1392 -1771
923a771P1K81M44O62P46O67L23J92n7l36n65p62o37o17l10j07M26N27N86O74N89
$$ -1771 -1700 -1419 -975 -313 433 1100 1423 1615 1558 1222 657 -105 -742 -1359 -1669 -1776 -1350 -823 -237 437 1026
944A026M83P5k58m40m18m56o11n30k36%K01L07M70O61P19L68J95j45l36n51o49
$$ 1026 1509 1584 1326 886 468 12 -599 -1129 -1365 -1365 -1164 -857 -387 274 993 1361 1556 1411 1075 524 -125
965a25n74m57j85K1L98M44M46K85M32L46J18j39l27l02m67m44l90k49O9L16K91
$$ -125 -699 -1156 -1341 -1320 -922 -478 -32 253 685 1031 1149 1010 683 381 -86 -530 -920 -1169 -1100 -784 -493
986d93L92M74L34L09l8r8l05l60m31l55k87j16L8L20L29M33L79K95J83j04k89
$$ -493 -101 373 707 1016 978 880 575 215 -216 -571 -858 -974 -936 -616 -287 146 525 820 1003 899 610
1007F10l31l30k84k73j44l3K03J29K07K92K69L18K05N3k07l03k68n25l07k34l4
$$ 610 279 -51 -335 -608 -752 -785 -582 -453 -246 46 315 633 838 891 684 381 113 -412 -719 -953 -987
1028i87K81L72L08M31K10J05O3n6k73l38j86k16k07j88j21J48K65L18L29K65K16
$$ -987 -706 -334 -26 405 615 720 783 727 454 116 -70 -286 -493 -681 -802 -654 -389 -71 258 523 739
1049G39P3j33k15k63k99l54j72j54J41O9K30K76K87K42J65K3Nk88k25l03k04j67
$$ 739 812 679 464 201 -98 -452 -624 -778 -637 -568 -338 -62 225 467 632 655 660 372 147 -156 -360 -527
1071e27q1J08Q7K11K82J38Q3J98N2q5j02j19k98k26j99j31P5R1K50K87K19J64
$$ -527 -608 -500 -413 -202 80 218 301 499 551 466 364 245 -53 -279 -478 -609 -534 -443 -193 94 313 477
1093D77J6n0r0k17j60j24r0q0p2J4K5K07J40J86J42O4Q8p1k37j89j60j77l8RM4
$$ 477 493 443 353 136 -24 -148 -238 -318 -390 -376 -351 -144 -4 182 324 388 476 405 168 -21 -181 -358 -396 -387 -343
1118c43K13P5J96O4J13P2n2%j46r0k66j73n8K0K1K08J27J71J22M7o1N0j36j44
$$ -343 -130 -55 141 205 318 390 338 338 192 102 -164 -337 -395 -375 -354 -146 -19 152 274 321 260 310 174 30
1142C0n0j38q6p5OQ4L6J53J82J50OQ7o7j04j99j39j55M2p4lJ16J49N9R8R1Q5J8
$$ 30 -20 -158 -244 -319 -313 -229 -193 -40 142 292 298 385 318 214 15 -124 -279 -237 -311 -314 -198 -49 10 108 199 284 302
1169C02j0Nk05j50j36j29l3J19M4P2K08R8K9L7j0r1n1p2j80q6L2q9J6R1M6J74
$$ 302 292 297 92 -58 -194 -323 -356 -237 -193 -121 87 185 214 251 241 150 99 27 -153 -239 -207 -296 -280 -189 -143 31
1195C1Q6J62Jmj06q7k04L1j49Nm2J18O8O4J05J15R4K1j6r7o5j42j29j01n3M4L6
$$ 31 117 279 280 276 170 83 -121 -90 -239 -234 -276 -158 -90 -26 79 194 288 309 293 196 131 -11 -140 -241 -294 -250 -214
1222b14O9J21J74R7l8O5l1j48Nj15q4j38n7k6N8N7J86J21R4N0N4o6j03o7j23o0
$$ -214 -145 -24 150 247 209 274 243 95 100 -15 -99 -237 -294 -320 -262 -205 -19 102 196 246 300 234 131 64 -59 -119
1248a19o6l6K9j1J11J25R8P7Q7pM0j40r7j44j84o7J0Q1L8P8J22N3J66M3j08Qq
$$ -119 -185 -221 -192 -203 -92 33 131 208 295 288 328 188 91 -53 -237 -304 -294 -213 -175 -97 25 78 244 287 179 187 179
1275A79j56j00j09q7l7K1Q6N4J78J41N0J04l6q7j66L7k10qr4k8K2N8Q1Q6J45J10
$$ 179 23 -77 -186 -273 -310 -289 -203 -149 29 170 220 324 288 201 35 72 -138 -146 -240 -268 -246 -188 -107 -21 124 234
1301B34J17n9n0q4k16n3j27q2P5L4N9kK09J10M0L5K5m0j11j41j22p3n8K1O0Q8
$$ 234 351 292 242 158 -58 -111 -238 -320 -245 -211 -152 -154 55 165 205 240 265 225 114 -27 -149 -222 -280 -259 -199 -111
1327a11jJ95J11M6M0l4l9p8r9j26j3j56j9J4O3J55J44R5J01Nm1r0j08l8j66q5
$$ -111 -112 83 194 240 280 246 207 129 30 -96 -109 -265 -284 -270 -207 -52 92 187 288 293 252 162 54 16 -150 -235
1353b35k2N4J6N7J32R9kJ17Q3Pp9j32j05m6j63j08M0J05R0K6J96O6L2M8Jp7j08
$$ -235 -257 -203 -187 -130 2 101 99 216 299 306 227 95 -10 -56 -219 -327 -287 -182 -92 -66 130 196 228 276 277 200 92
1380I2p5j69k0j44K2L7R9Q2J48J08Q6%l7o3j09q7j45l3r6N6J8R7Q8J52J03K9K4
$$ 92 17 -152 -172 -316 -294 -257 -158 -76 72 180 266 266 229 166 57 -30 -175 -208 -304 -248 -230 -133 -45 107 210 239 263
1407B63K2p4j25j39j01r7M8oN0J1J71P9R0N9P8q2q7j77q4j42m6k3M0L2J08J45
$$ 263 285 211 86 -53 -154 -251 -203 -209 -159 -148 23 102 192 251 329 247 160 -17 -101 -243 -289 -312 -272 -240 -132 13
1433A3J38P8M2pq0q1j10p4j22k2m1M3P4R8J24J48K3P5Jp8r7j13j36r1r7QJ11P8
$$ 13 151 229 271 264 184 103 -7 -81 -203 -225 -266 -223 -149 -51 73 221 244 319 320 242 145 32 -104 -195 -292 -284 -173 -95
1461i5J04R8J24L1j5J6j05j87Mj22p2p1k7R2J45L9J34J11P5mmr2j64r2j02o1l7
$$ -95 9 107 231 262 247 263 158 -29 -25 -147 -219 -290 -317 -225 -80 -41 93 204 279 275 271 179 15 -77 -179 -240 -277
1488b77J2M5J84M8J00J66M5nn1j15j03j82n3n8p7M2J54k8J37K20P3n3P1lj89q3
$$ -277 -265 -220 -36 12 112 278 323 318 267 152 49 -133 -186 -244 -321 -279 -125 -153 -16 204 277 224 295 292 103 20
1514B0j28r7q0k8M8Q9J13J70K5J61J3l4n5j37n5r9j02j23NMJ23J16P9J40Q6Q2
$$ 20 -108 -205 -285 -313 -265 -176 -63 107 132 293 306 272 217 80 25 -74 -176 -299 -294 -290 -167 -51 28 168 254 336
1540C36k3j23l8j06j80j27p7j8M0K03J19J04P9J38J8o0k6j98j33p8j55nm3N9J11
$$ 336 313 190 152 46 -134 -261 -338 -356 -316 -113 6 110 189 327 345 285 259 61 -72 -150 -305 -310 -353 -294 -183
1565a83J63Q6J21J07L2l7m2j89j08j24j28n3M6Q1O4J87J47M1J29po2p4j88q8k7
$$ -183 -20 66 187 294 326 289 247 58 -50 -174 -302 -355 -309 -228 -164 23 170 211 340 333 271 197 9 -79 -106
1590a06j04j66P9P2J43M6J36J41M6R9j28o8j38j95l7j20N9q1R1J48J31O5N1J21
$$ -106 -210 -376 -297 -225 -82 -36 100 241 287 386 258 190 52 -143 -180 -300 -241 -322 -231 -83 48 113 164 285
1614B85mRj59p8q9j99l0pk6J49N3P1J69J11M4L2j12r4j17j63o7j29K9N6J02J41
$$ 285 281 290 131 53 -36 -235 -265 -272 -298 -149 -96 -25 144 255 299 331 219 125 8 -155 -222 -351 -322 -266 -164 -23
1640b3J13Q6J04N0m1r1j09n8j60n7q5l6MQ4K01P0R9R6N1Lj13p4r8j43j04o5PM6
$$ -23 90 176 280 330 289 198 89 31 -129 -186 -271 -307 -303 -219 -18 52 151 247 298 301 188 114 16 -127 -231 -296 -289 -243
1668b43M9J79Q2J20N1Q0k0j11j27q8j31j32J4j2L1R7J18J41R9M6P8r4%j34r5j11
$$ -243 -194 -15 67 187 238 318 298 187 60 -28 -159 -291 -277 -289 -258 -161 -43 98 197 243 321 227 227 93 -2 -113
1694a13j92R2r0R6K1J74Q4J01J07Qj6n8j02j45j38q8j8m3J10J25J42P4O6N7L5
$$ -113 -305 -213 -303 -207 -186 -12 72 173 280 288 272 214 112 -33 -171 -259 -277 -320 -210 -85 57 131 197 254 289
1719B89m2r1q6j17j03q1r3K1M4J20J37J42L8J00n3M1j19j17j11j38n1K4nR2Q5
$$ 289 247 156 70 -47 -150 -231 -324 -303 -259 -139 -2 140 178 278 225 266 147 30 -81 -219 -270 -246 -251 -159 -74
1744g4P3J85K6K2L3k5r0j48m0j26K0j28K2L7K11O0N4J11K3lrq9j01j45r2m1m1
$$ -74 -1 184 210 232 265 240 150 2 -38 -164 -144 -272 -250 -213 -2 58 112 223 246 243 234 145 44 -101 -193 -234 -275
1771b75N6N5O4J38J52OK0j0j9r3r7j75lk0p4O9L8O4J39J14L8P1J1n4o4j37q3j44
$$ -275 -219 -164 -100 38 190 196 216 206 187 94 -3 -178 -181 -201 -275 -206 -168 -104 35 149 187 258 269 215 151 14 -69 -213
1799b13%oRJ07O6P4J24O0Oj5j2j24q9m0j58rrmJ02Q1O3J59Q6k1o2l3j08j4j35
$$ -213 -213 -219 -210 -103 -37 37 161 221 227 212 200 76 -13 -53 -211 -220 -229 -233 -131 -50 13 172 258 237 175 142 34 20 -115
1828a15j23L0J3M5L3J10N3K04k9K2ro2n9j91r7k6j6K2J0P0J77N8PQ9m8Mm2n5j54
$$ -115 -238 -208 -195 -150 -117 -7 46 250 221 243 234 172 113 -78 -175 -201 -217 -195 -185 -115 62 120 127 216 168 172 130 75 -79
1857g9j05J3p6L4pQ5O3J19J03J02ok5n8j73m5p6j3q8k0J15K7J47R0J5L6Rl9l1
$$ -79 -184 -171 -247 -213 -220 -135 -72 47 150 252 246 221 163 -10 -55 -131 -144 -232 -252 -137 -110 37 127 142 178 187 148 117
1885A17m7j16r5l4j7k4N0Q0M9J18R7M6l8m2j06Lj07j20J2%kO6O3O8J22k7P5pl5
$$ 117 70 -46 -141 -175 -192 -216 -166 -86 -37 81 178 224 186 144 38 41 -66 -186 -174 -174 -176 -110 -47 21 143 116 191 184 149
1914A49n9l8j05m8j9k5J%J54M6Q7L8Nj8o5k8r2q2n2n9M3k2N5R6J18K3J3P4j30
$$ 149 90 52 -53 -101 -120 -145 -144 -144 10 56 143 181 186 168 103 75 -17 -99 -151 -210 -167 -189 -134 -38 80 103 116 190 60
1943F0P0j04j07o9k9RkQ4M0R6N8j5J06m9j9l9l8j42m4qj7J3M9K5J55J7M5L1n6
$$ 60 130 26 -81 -150 -179 -170 -172 -88 -48 48 106 91 197 148 129 90 52 -90 -134 -142 -159 -146 -97 -72 83 100 145 176 120
1972A20Kj20Or3k9r5N2M6O2P0L0L4L1K1m4Rp0p6l2j3m6K2J2m0J54N8L9M6m8O8
$$ 120 122 2 8 -85 -114 -209 -157 -111 -49 21 51 85 116 137 93 102 32 -44 -76 -89 -135 -113 -101 -141 13 71 110 156 108 176
2002A76p5n3m3r2m2K6n2O9N9J5J07L2L2m9J3q9l2r9Qj06K3K6L6L9O6J00L2LM9
$$ 176 101 48 5 -87 -129 -103 -155 -86 -27 -12 95 127 159 110 123 34 2 -97 -89 -195 -172 -146 -110 -71 -5 95 127 130 179
2031A79p9pr0q6pj8l9K9LP9K9J09k0O8k7n9K7l1j44m8KNJ1K8M0R5oM5N8l7p3K9
$$ 179 100 93 3 -83 -90 -108 -147 -118 -115 -36 -7 102 82 150 123 64 91 60 -84 -132 -130 -125 -114 -86 -46 49 43 88 146 109 36 65
2063F5n6n3m1n7O2j9m9J93J7J1K1O2j5q9j0m3o3q1l0N1J6P0K8K5R9l9M1j6n4m1
$$ 65 9 -44 -85 -142 -80 -99 -148 45 62 73 94 156 141 52 42 -1 -64 -145 -175 -124 -108 -38 -10 15 114 75 116 100 46 5
2093En5Mm3j9j7j6J05P9n4Q4N7rok6n2r1Nj0l4j7Q1L1j2N9K6J0N1m7Rj6j21pl0
$$ 5 -50 -46 -89 -108 -125 -141 -36 43 -11 73 130 121 115 89 37 -54 -49 -59 -93 -110 -29 2 -10 49 75 85 136 89 98 82 -39 -46 -76
2126g6j7LO2m5R7pM1N7jm7k8n9m3lj8n2Q4J9NK8N2j0L1K6Lr7n4O9j11Q1j22M0
$$ -76 -93 -90 -28 -73 24 17 58 115 114 67 39 -20 -63 -66 -84 -136 -52 -33 -28 0 52 42 73 99 102 5 -49 20 -91 -10 -132 -92
2158i2N3orR2M4J1mk2np5J5k2m2J9l7M7Q6j3K3lK0K7o9K6o4Pq1L8J4J9j5KP5P
$$ -92 -39 -45 -54 38 82 93 89 67 62 -13 2 -20 -62 -43 -80 -33 53 40 63 60 80 107 38 64 0 7 -74 -36 -22 -3 -18 -16 59 66
2192F6J9n4L6k4k9k3j2l5o7R0J7n3J01k4M6k9O3k3J7k7n5m3K8j4o5J00J3l8O5
$$ 66 85 31 67 43 14 -9 -21 -56 -123 -33 -16 -69 32 8 54 25 88 65 82 55 0 -43 -15 -29 -94 6 19 -19 46
2221D6Qk7L5k8m7P0q6k3j9J4k6NM1KR1o0jJ7O0n6mJ0o5J7k1K7OJ6rL0L8nOk7n7
$$ 46 54 27 62 34 -13 57 -29 -52 -71 -57 -83 -78 -37 -35 56 -4 -5 12 72 16 12 22 -43 -26 -47 -20 -14 2 -7 23 61 56 62 35 -22
2256b2K4l5pk7LN3l3L6oPM0L7p4P8p0j7mk0K1l2KLl2Q2M9J6o3N4k0L6r1J3lqm1
$$ -22 2 -33 -40 -67 -64 -11 -44 -8 -14 -7 33 70 -4 74 4 -13 -17 -37 -16 -48 -46 -43 -75 7 56 72 9 63 43 79 -12 1 -2 -10 -51
2291e1M0L4k0K4L3M6q1J8L2k1l4q7j0K7k0J2J8M3qM2L8l3o6L5j8mj8J4o8K6k7
$$ -51 -11 23 3 27 60 106 25 43 75 54 20 -67 -77 -50 -70 -58 -40 3 -5 37 75 42 -24 11 -7 -11 -29 -15 -83 -57 -84
2322h4N8K7O0ONl8jK9l8k2m4N7m2j9O5k0NK7rN2rl6Qp7j7K3n3J0L7K2l3J5J1K7
$$ -84 -26 1 61 67 72 34 33 62 24 2 -42 15 -27 -46 19 -1 4 31 22 74 65 29 37 -40 -57 -34 -87 -77 -40 -18 -51 -36 -25 2
2356BM1j0j5km6j7L3n5L7kJ7%N8oJ4O9o1m0J3qm8L2o1LJL8M3NN8J1n1n4l6O9l7
$$ 2 43 33 18 16 -30 -47 -14 -69 -32 -34 -17 -17 41 35 49 118 57 17 30 22 -26 6 -55 -52 -51 -13 30 35 93 104 53 -1 -37 32 -5
2391ep8K7J2m0O0rL6J7j6R4r1M7L3o2l7j6jJk5M5K1n0R8lppj1j1j3K0o1m5L8o8
$$ -5 -83 -56 -44 -84 -24 -33 3 20 4 98 7 54 87 25 -12 -28 -29 -28 -53 -8 13 -37 61 58 51 44 33 22 9 29 -32 -77 -39 -107
2425a07J32k2k4Q8o4P0o9N3l3m9K7m1Rqj3JO7M2k6L4j9N7j00J9oJ1q9J4k9K1o
$$ -107 25 3 -21 67 3 73 4 57 24 -25 2 -39 -30 -38 -51 -50 17 59 33 67 48 105 5 24 18 29 -60 -46 -75 -54 -60
2456f0N2j8Q1RJ6p7K1k2l4l9K7M2l1JN5N3n1K7PMj5N5o9l5n3l6MM2L0kJ1L1O2
$$ -60 -8 -26 55 64 80 3 24 2 -32 -71 -44 -2 -33 -32 23 76 25 52 59 63 48 103 34 -1 -54 -90 -86 -44 -14 -16 -5 26 88
2489H8m8K5r2L2K4q7O6n0j1%n5N0M2R8k5j0N0m9m2Rm0pn0M3K4J5J3Nj5K5j1J1
$$ 88 40 65 -27 5 29 -58 8 -42 -53 -53 -108 -58 -16 82 57 47 97 48 6 15 -25 -32 -82 -39 -15 0 13 18 3 28 17 28
2521B8O6o9l7o3K8o5M0J9k2J02j2J7PJ7L6p1oNn2L0r3R0o4KO6K0J1K9N6l1J5m3
$$ 28 94 25 -12 -75 -47 -112 -72 -53 -75 27 15 32 39 56 92 21 15 20 -32 -2 -95 -5 -69 -67 -1 19 30 59 115 84 99 56
2553E6m5q9L2J4Qj00O3P7j7M6lJ5Mm9L1K6j33J4j2l0j7L0K4nK9P5k1N5l4Qk3k5
$$ 56 11 -78 -46 -32 -24 -124 -61 16 -1 45 42 57 61 12 43 69 -64 -50 -62 -92 -109 -79 -55 -60 -31 44 23 78 44 52 29 4
2585DJoj0m5rL3J7K4N4M0n4L3j1o3k4j6qjn7P0j5P7o2JO1n0M2m3M1J9n8m6k3J8
$$ 4 5 -1 -11 -56 -65 -32 -15 9 63 103 49 82 71 8 -16 -32 -40 -41 -98 -28 -43 34 -28 -27 34 -16 26 -17 24 43 -15 -61 -84 -66
2619f6qK6L7j3Q8J3J6l6o1J4o1N1O6j72O6J1J0NJ2j5L6%N4o2j5j6K4o0K8l4P4
$$ -66 -74 -48 -11 -24 64 77 93 57 -4 10 -51 0 66 -106 -40 -29 -19 -14 -2 -17 19 19 73 11 -4 -20 4 -56 -28 -62 12
2650A2m5PJ7J6RM8j7JJ1p6M6l2Pj0l5rM5l7N7N7l4jM0r7N6k4J2l6n4QL1J8j8j0
$$ 12 -33 -26 -9 7 16 64 47 48 59 -17 29 -3 4 -6 -41 -50 -5 -42 15 72 38 37 77 -20 36 12 24 -12 -66 -58 -27 -9 -27 -37
2684c7L9N5l7N8oj05J2j7m2L6m5O0J7J5j0K3K9J0jj4J5q2L5J0o0j8O4j25J18O9
$$ -37 2 57 20 78 72 -33 -21 -38 -80 -44 -89 -29 -12 3 -7 16 45 55 54 40 55 -27 8 18 -42 -60 4 -121 -3 66
2714F6r9L5N7o0J9k0K6m6pl9kM3L7l2L0Lj9K5qOm6N3k6J3q0J0K6qJ07m3K3M7n9
$$ 66 -33 2 59 -1 18 -2 24 -22 -29 -68 -70 -27 10 -22 8 11 -8 17 9 15 -31 22 -4 9 -71 -61 -35 -43 64 21 44 91 32
2747C2j5l2L9L3o9J0L3m6l4M9J8MM8m4M4j7j0l5n2O0n6k0mKM6K7lJ8rj6lj1lK6
$$ 32 17 -15 24 57 -12 -2 31 -15 -49 0 18 22 70 26 70 53 43 8 -44 16 -40 -60 -64 -62 -16 11 8 26 17 1 -2 -13 -16 10
2781A0l2Rl8M6p3P0K8O1n8NJM5m6JJ4r9%J9k6N1L9J7k3j7L2j2L4l3o8p7P0p7J37
$$ 10 -22 -13 -51 -5 -78 -8 20 81 23 28 29 74 28 29 43 -56 -56 -37 -63 -12 27 44 21 4 36 24 58 25 -43 -120 -50 -127 10
2814A0m4nLN1J3L9o5J9j7PJ5o0njj0qQ0k7J03l1qmK3o0M6m4k9j2L3k8J8k3K5J
$$ 10 -34 -39 -36 15 28 67 2 21 4 11 26 -34 -39 -40 -50 -58 22 -5 98 67 59 55 78 18 64 20 -9 -21 12 -16 2 -21 4 5
2848EJ7M8m9J6J2q1N3lm4j9Q8n1J7ON2j3k6j5N5l3l7l3K0J6l1J5m6O0L1J8j7M9
$$ 5 22 70 21 37 49 -32 21 18 -26 -45 43 -8 9 15 67 54 28 13 68 35 -2 -35 -15 1 -30 -15 -61 -1 30 48 31 80
2880H0Ol2J5n6l1o2M7L4r6R8J0k5L0J1J4nN3j11Mk5qQj0KR1l3L9j4L6q2J3kJ3
$$ 80 86 54 69 13 -18 -80 -33 1 -95 3 13 -12 18 29 43 38 91 -20 -16 -41 -49 -41 -51 -49 42 9 48 34 70 -12 1 -1 12
2913A2ok8K5KL2n0O5m6OJ05J0j14K7M0j8n9o7O4k0o0L3mN7N3l0j0O5j7j06K7N
$$ 12 6 -22 3 5 37 -13 52 6 12 117 127 13 40 80 62 3 -64 0 -20 -80 -47 -51 6 59 29 19 84 67 -39 -12 -7
2944gn0N3l3l2N5M1l9O6l6K1N3o2m5O0l2j06L2R7n2jR0m8n3O0J7k8K2l8K9m3j9
$$ -7 -57 -4 -37 -69 -14 27 -12 54 18 39 92 30 -15 45 13 -93 -61 36 -16 -17 73 25 -28 32 49 21 43 5 34 -9 -28
2975b8J6l3kO4m7N4J6KK3m1l1Rl3J3k0k7j0rQ0j3M0N0o9P2p2l4N5l1k1Qm6J1M4
$$ -28 -12 -45 -47 17 -30 24 40 42 65 24 -7 2 -31 -18 -38 -65 -75 -84 -4 -17 23 73 4 76 4 -30 25 -6 -27 -19 -65 -54 -10
3008a0L8RRj8JK6m8Jm3k3j4L8K5m8O5m6jL3K8K3K0jp7mm3ML7N3n2Q4l5M9k0PN
$$ -10 28 37 46 28 29 55 7 8 -35 -58 -72 -34 -9 -57 8 -38 -39 -6 22 45 65 64 -13 -17 -60 -56 -19 34 -18 66 31 80 60 67 72
3043G2q6P1Nm5l8k4N1K5n6NM3Rj4N1m0Nk5J5l9l2R0j04RNl3J50p8R0o0L0l0JJ
$$ 72 -14 57 62 17 -21 -45 6 31 -25 -20 23 32 18 69 29 34 9 24 -15 -47 43 -61 -52 -47 -80 70 -8 82 22 52 22 23 24
3076B4q2J7k7k5P6J6QO9k4lJ4J3Po6m4K8J6r0N7l0kK0N7rkO4lp5M8n1m1JK3j4
$$ 24 -58 -41 -68 -93 -17 -1 7 76 52 49 63 76 83 17 -27 1 17 -73 -16 -46 -48 -28 29 20 18 82 79 4 52 1 -40 -39 -16 -30
3110c0K3N3m1j1P6k5Qkk6m9l5k6J3M2K5j3O3M0m8Qk2N5o8jl6N3m5j2K2jo2N6L4
$$ -30 -7 46 5 -6 70 45 53 51 25 -24 -59 -85 -72 -30 -5 -18 45 85 37 45 23 78 10 9 -27 26 -19 -31 -9 -10 -72 -16 18
3143A8J0L6J0pJ5j52R2m9l8N1o3J4O0JJ9NJ1J04o2l8ln6K4Pn6mJ3N3LJ9j7J01
$$ 18 28 64 74 67 82 -70 22 -27 -65 -14 -77 -63 -3 -2 17 22 33 137 75 37 34 -22 2 9 -47 -51 -38 15 18 37 20 121
3175A21q0o9P9n9J1m5k8L8lJ8lM8O0p0L8l8L9q1O9o5K1n4L5m3j7P1J3k5J0M2J4
$$ 121 41 -28 51 -8 3 -42 -70 -32 -35 -17 -20 28 88 18 56 18 57 -24 45 -20 1 -53 -18 -61 -78 -7 6 -19 -9 33 47
3206D7K4Rp6l3N0k0n1L3m5L7QN4j1n1J26o3rK1l1l8k7P2n8mK1O7j9L3k9L4o5J0
$$ 47 71 80 4 -29 21 1 -50 -17 -62 -25 -17 37 26 -25 101 38 29 50 19 -19 -46 26 -32 -36 -15 52 33 66 37 71 6 16
3238A6p2N1m9l0J4P6j8j0K1P8ll6L6n6Pk0n8j2K5N1m2N0Q1j30N9MjK1n9qN0l1
$$ 16 -56 -5 -54 -84 -70 6 -12 -22 -1 77 74 38 74 18 25 5 -53 -65 -40 11 -31 19 100 -30 29 33 32 53 -6 -14 36 5
3270ELj03M9J0k4J04n6M6K8j9Kl9M8j16lJ1m8N9PLJ5P0j9RK5n3j2Qnj1l1lk0P5
$$ 5 8 -95 -46 -36 -60 44 -12 34 62 43 45 6 54 -62 -65 -54 -102 -43 -36 -33 -18 52 33 42 67 14 2 10 5 -6 -37 -40 -60 15
3304A5k0K1K1JK2M3n2o0J1o4O5o8O5mk8N9k0Ql6L4mJ9l0m0j6oO3J5q6LJ01n3j
$$ 15 -5 16 37 38 60 103 51 -9 2 -62 3 -65 0 -4 -32 27 7 15 -21 13 9 28 -2 -42 -58 -64 -1 14 -72 -69 32 -21 -22
3337b2P7Nm1kjK5n3o0N7k1n2M7N4n0N9K0p0N9n6L6l1K8Jm6p1P6j8OL9j2Q4p1p
$$ -22 55 60 19 17 16 41 -12 -72 -15 -36 -88 -41 13 -37 22 42 -28 31 -25 11 -20 8 9 -37 -108 -32 -50 -44 -5 -17 67 -4 -11
3370a1RL0ql3Q1o6m5L1L3k0pM7l8MPJ8m8Q6m9k0m8K1J8n4M0K5j2jM9j7rm2Q5j16
$$ -11 -2 28 20 -13 68 2 -43 -12 21 1 -6 41 3 7 14 32 -16 70 21 1 -47 -26 -8 -62 -22 3 -9 -10 39 22 13 -29 56 -60
3404f0J7Ll4M5O2m9QQK5K7jm3J8LJ9q8K5nJ0O8j6j1k6jNj1QLJ5l6Lk3KN1k0j2
$$ -60 -43 -40 -74 -29 33 -16 -8 0 25 52 51 8 26 29 48 -40 -15 -20 -10 58 42 31 5 4 9 -2 6 9 24 -12 -9 -32 -30 21 1 -11
3440a1M2k7J9m4J14p1k7M0l3l7PJ3L2Pk3L2l7K8l4j7Q5k8j4m4L5l0j7k2N6J9l9
$$ -11 31 4 23 -21 93 22 -5 35 2 -35 -28 -15 17 24 1 33 -4 24 -10 -27 58 30 16 -28 7 -23 -40 -62 -6 13 -26
3471b6L0OJ0K0j7n7P4j7o3RK7m7P1j06N3J4J1J0Kn2J03l1Nm3K2l6J8n3N1J1k8
$$ -26 4 10 20 40 23 -34 40 23 -40 -31 -4 -51 20 -86 -33 -19 -8 2 4 -48 55 24 29 -14 8 -28 -10 -63 -12 -1 -29
3502b9Q9m3oL0o1K2J0Rk5j3J5k6L4p9Q8Rj7KK0k9qRj1K3p6Q9o4P9k1j8K2p0N9
$$ -29 60 17 11 41 -20 2 12 21 -4 -17 -2 -28 6 -73 15 24 7 9 29 0 -8 1 -10 13 -63 26 -38 41 20 2 24 -46 13
3535A3j4L7N2Lj25QO3k2m1j5K8N8n2k5R5n2K5J4k2k2j0mn9L7M8n1ML9k4L5lJ9
$$ 13 -1 36 88 91 -34 -26 37 15 -26 -41 -13 45 -7 -32 63 11 36 50 28 6 -4 -8 -67 -30 18 -33 -29 10 -14 21 18 37
3567C7o8J9J6%q7J07k3m2L2J5m0M6N4L0q3qm9L9%km1j4NL3J6L2k1LLJ8K8r0J3
$$ 37 -31 -12 4 4 -83 24 1 -41 -9 6 -34 12 66 96 13 5 -44 -5 -5 -7 -48 -62 -57 -24 -8 24 3 6 9 27 55 -35 -22
3600b2L2L8n4J0j4k7l2N3rK1LLK0m9%J1pk3J5M8n2O2k8MLOK8J5l2j2PLq3R1p9
$$ -22 10 48 -6 4 -10 -37 -69 -16 -25 -4 -1 2 22 -27 -27 -16 -23 -46 -31 17 -35 27 -1 3 6 12 40 55 23 11 18 21 -62 29 -50
3635e0j4M1nO7qk9K6j5pn5J4LO5j10L3J7M5n0%kL0J3Mm1PN8m4M0m6j5M2l3N5K7
$$ -50 -64 -23 -28 39 31 2 28 13 6 -49 -35 -32 33 -77 -44 -27 18 -32 -32 -34 -4 9 13 -28 -21 37 -7 33 -13 -28 14 -19 36 63
3669F3K0l5Jpj7Qm7J4K0l9KL1M4p1J6J0k1J8N1r4K6%j0k1O5k2k0L7Lm5L0L4p2
$$ 63 83 48 49 42 25 33 -14 0 20 -19 -17 14 58 -13 3 13 -8 10 61 -33 -7 -7 -17 -38 27 5 -15 22 25 -20 10 44 -28
3702b8R1j01M5PRk3lj1J8J9L1%jkO2k4m3o4lL5m1L9q1M8J8l5O8m7J8k3PrK6L4
$$ -28 63 -38 7 14 23 0 -3 -14 4 23 54 54 53 51 113 89 46 -18 -21 14 -27 12 -69 -21 -3 -38 30 -17 1 -22 -15 -24 2 36
3736C6n6j3K2j0l4j7N1l3J01k0K1n4JQK0K3l6J8j8pk6K1l5J02m9J4N2l1j1l0k2
$$ 36 -20 -33 -11 -21 -55 -72 -21 -54 47 27 48 -6 -5 3 23 46 10 28 10 3 -23 -2 -37 65 16 30 82 51 40 10 -12
3767a2j4J1k1J8J4jj0J7lJ7o2K6O3n3oJ1Rl8oN8Km6P1k2j9L8j9k4K6m2J7j9mJ4
$$ -12 -26 -15 -36 -18 -4 -5 -15 2 -1 16 -46 -20 43 -10 -16 -5 4 -34 -40 18 20 -26 45 23 4 42 23 -1 25 -17 0 -19 -23 -9
3801iPK1m0K8O4k4onj5k0J3j9J3n9K1K3o1R8n6J2M6k6K5k9m3M9LnN0m6l6J00k1
$$ -9 -2 19 -21 7 71 47 41 36 21 1 14 -5 8 -51 -30 -7 -68 30 -26 -14 32 6 31 2 -41 8 11 6 56 10 -26 74 53
3834E3rj5L1k6J3j4n1N0j3J8m2Pk8J3L8Mrn4J3M7oKl4k5K9l3O0j2l5Q7q5P9l7
$$ 53 44 29 60 34 47 33 -18 32 19 37 -5 2 -26 -13 25 29 20 -34 -21 26 20 22 -12 -37 -8 -41 19 7 -28 59 -26 53 16
3867A6m7O7p8O6n8K9l0M8K4n1N0N3n0L3k2n7K9o1N3%l6M7l2PK2l8O3L6l0Qr6J7
$$ 16 -31 36 -42 24 -34 -5 -35 13 37 -14 36 89 39 72 50 -7 22 -39 14 14 -22 25 -7 0 22 -16 47 83 53 61 -35 -18
3899a8j3m9K3N1M7mm4J6JQ3o6m9P6p8K4n0L5om7Q5l1P0R6o5p6K9M2n3n9N0n1K9
$$ -18 -31 -80 -57 -6 41 37 -7 9 10 93 27 -22 54 -24 0 -50 -15 -21 -68 17 -14 56 152 87 11 40 82 29 -30 20 -31 -2
3931bJ6n9j1O2K6j3Oj3RMm5N4j0n7J7pJ1L4l0J7mL3n2L3j6J6l4J0QMj6J8rm4J12
$$ -2 14 -45 -56 6 32 19 25 12 21 25 -20 34 24 -33 -16 -23 -12 22 -8 9 5 38 -14 19 3 19 -15 -5 3 7 -9 9 0 -44 68
3966F8nn0%KL4n0n0P6p7P2m9M2J5jj7oK2%pl5J7j8l7L1l8J6L8k3L1K0O6l7J4l0
$$ 68 63 13 13 15 49 -1 -51 25 -52 20 -29 13 28 27 10 4 26 26 19 -16 1 -17 -54 -23 -61 -45 -7 -30 1 21 87 50 64 34
4000C4l9m1OK8jJ5n6K6O7j2l6M2J0qLk2k3Rm7J36j56j2M4K7L1n1J3J0kM9j8l3
$$ 34 -5 -46 -40 -12 -13 2 -54 -28 39 27 -9 33 43 35 38 16 -7 2 -45 91 -65 -77 -33 -6 25 -26 -13 -3 -5 44 26 -7
4032gK4o4J7N1k3l9O0M2l2K7m4nN2l2L3q1j7O8l8k9L8j2K1RJ2k7J2k9LL4o6N%
$$ -7 17 -47 -30 21 -2 -41 19 61 29 56 12 7 59 27 60 -21 -38 30 -8 -37 1 -11 10 19 31 4 16 -13 -10 24 -42 -37 -37
4065c7k7M8j7K3j2N2MJ5m1j3l4J6lK7j8j5NL9N9j5n2j6L9M3o9J9k1o6P1m2O0N
$$ -37 -64 -16 -33 -10 -22 30 34 49 8 -5 -39 -23 -26 1 -17 -32 -27 12 71 56 4 -12 27 70 1 20 -1 -67 4 -38 22 27
4097B7j9K3M0n6J3m1M1m7L4rj4k2qL6m6k2J37o3K8j4K4l5MJ1%l9N1n2k4M3K9j2
$$ 27 8 31 71 15 28 -13 28 -19 15 6 -8 -30 -38 -2 -48 -70 67 4 32 18 42 7 11 22 22 -17 34 -18 -42 1 30 18
4129A8K0M9k3o3LK4O1p3k7l7M1K1o5O4Oj8JPJ2m2M5m0RJ1o5Q3l8LJ8j2M5l1L9
$$ 18 38 87 64 1 4 28 89 16 -11 -48 -7 14 -51 13 19 1 2 9 21 -21 24 -16 -7 4 -61 22 -16 -13 5 -7 38 7 46
4162D6j6j4JJ0K9p0%kJ0PL7J0j1j0l0lM0k2M4qn4m8K2l2N5M5n4O5k6N3m7kl9j6
$$ 46 30 16 17 27 56 -14 -14 -16 -6 1 38 48 37 27 -3 -6 34 12 56 48 -6 -54 -32 -64 -9 36 -18 47 21 74 27 25 -14 -30
4196c0O1p2oP4m2K8rJ1J1OK9j18P6K5k0j0k7l0J0J2L2j0Rk7P0j4j7n0M4Km0kn
$$ -30 31 -41 -47 27 -15 13 4 15 26 32 61 -57 19 44 24 14 -13 -43 -33 -21 11 1 10 -17 53 39 22 -28 16 18 -22 -24 -29
4229b9Jm2N3O9p2J2QM1l8K8j1l2J5k5j8L7Rk3j0O3kl7K0L8nm6J5l0N0p7L5M1J7
$$ -29 -28 -70 -17 52 -20 -8 0 41 3 31 20 -12 3 -22 -40 -3 6 -17 -27 36 34 -3 17 55 50 4 19 -11 39 -38 -3 38 55
4262E5k8j8o3P9n0L3k8J8JN1o7l7L1PM9k8k4M2O0p9l0Q7l6j03N4O7q9M9MJ1n0
$$ 55 27 9 -54 25 -25 8 -20 -2 -1 50 -17 -54 -23 -16 33 5 -19 23 83 4 -26 61 25 -78 -24 43 -46 3 7 18 -32
4293c2P5rl3N6n8k4j1J04o6j1ml8QK7K5KK4L3r8L1PMj4k6qJ7jK0J4N0m7K7k0N
$$ -32 43 34 1 57 -1 -25 -36 68 2 -9 -13 -51 -43 -16 9 11 35 68 -30 1 8 12 -2 -28 -36 -19 -20 0 14 64 17 44 24 29
4327B9J2j2n5Mj0M4j1k4P6n0M5rj1M9K2j24O3m0l8M5%J3p3Q1j9k4O3l1K3m7k2
$$ 29 41 29 -26 -22 -32 12 1 -23 53 3 48 39 28 77 99 -25 38 -2 -40 5 5 18 -55 26 7 -17 46 15 38 -9 -31
4358c1J5PqK5j7K2p8J09l1l6K5j3O0l7k0P4q5Nj6O0Mj2Rj2jL8Rk2q6J29r6QK3
$$ -31 -16 -9 -17 8 -9 13 -65 44 13 -23 2 -11 49 12 -8 66 -19 -14 -30 30 34 22 31 19 18 56 65 43 -43 86 -10 -2 21
4391B1j2K8m8pjK6j15J39n9K8j8m4L5j1O9mp8J7L2J6O0o1j6j1O9n1L6P0j81O0
$$ 21 9 37 -11 -18 -19 7 -108 31 -28 0 -18 -62 -27 -38 31 27 -51 -34 -2 14 74 13 -3 -14 55 4 40 110 -71 -11
4421a1%n3M2M7J0k3JPM2Lo2Op9P1n0Nl9Q7nM%J2Jk9k4L9Ml6J7L2l4m5N0NP7j18
$$ -11 -11 -64 -22 25 35 12 13 20 62 65 3 9 -70 1 -49 -44 -83 4 -1 3 3 15 16 -13 -37 2 6 -30 -13 19 -15 -60 -10 -5 72 -46
4457d6R0k9j2L5o5jJ08p5o0O0k8Rj5K1oJ4Q0j13O8n4k2J4l6J5L8j0K0n3N7lk9
$$ -46 44 15 3 38 -27 -28 80 5 -55 5 -23 -14 -29 -8 -14 0 80 -33 35 -19 -41 -27 -63 -48 -10 -20 0 -53 4 1 -28
4488b8O0k2O8j18N1m9N9Kk8K0Ml1K7kl7K7Rqk7mj9K9knL8o1PO7n4N5k9l7%M4m
$$ -28 32 10 78 -40 11 -38 21 23 -5 15 19 -12 15 13 -24 3 12 4 -23 -27 -46 -17 -19 -24 14 -47 -40 27 -27 28 -1 -38 -38 6 2
4523BJ2p6L1qO6n1L9J5l3j8M6j0m8J0j0L5k3kM4k3L5qj9K0n6J04j10J2%M9L5n9
$$ 2 14 -62 -31 -39 27 -24 15 30 -3 -21 25 15 -33 -23 -33 2 -21 -23 21 -2 33 25 6 26 -30 74 -36 -24 -24 25 60 1
4555Al0K2j3l7J8P9j7k1mk3%P5r6RO4l7nK2j3j2K6n0L8j2j6JJ5l3K7O9l3K0Qn2
$$ 1 -29 -7 -20 -57 -39 40 23 2 -2 -25 -25 50 -46 -37 27 -10 -15 7 -6 -18 8 -42 -4 -16 -32 -31 -16 -49 -22 47 14 34 42 -10
4589a0L8l1j2N0k8j6M8l5j4k4M1j2nK3j2M0n3Q%J0l5N0j10J25l0l1K6L6o2j4J16
$$ -10 28 -3 -15 35 7 -9 39 4 -10 -34 7 -5 -10 13 1 41 -12 -4 -4 6 -29 21 -89 36 6 -25 1 37 -25 -39 77
4620G7p8L7j1m2j2N1p2L1PK6m6P0l7PK4mk8oK3jj0K8o1N8k6p5P1rj5J7J9J6j5
$$ 77 -1 36 25 -17 -29 22 -50 -19 -12 14 -32 38 1 8 32 28 0 -6 17 16 6 34 -27 31 5 -70 1 -8 -23 -6 13 29 14
4653A4k5M1J3m4Po0L7Ql7L7PJ9%l0J6J4nn0O5Lj5oNJ0K0n0k6L6l3j4Q1n2L4k7
$$ 14 -11 30 43 -1 6 -54 -17 -9 -46 -9 -2 17 17 -13 3 17 12 -38 27 30 15 9 14 24 44 -6 -32 4 -29 -43 38 -14 20 -7
4687gnl2LQ8q3N1m9j3Q7p9N4kj3o4K9M5n2O4n1lJ3J2K0J2J0M8r4J8Rm3O5l6J1
$$ -7 -12 -44 -41 47 -36 15 -34 -47 40 -39 15 13 0 -64 -35 10 -42 22 -29 -32 -19 -7 13 25 35 83 -11 7 16 -27 38 2 13
4720A3m1M7n2N8k6L2j9lj5K4m0M9q2j4N2l6Q0r7J07l9K6k5J1J5m1Q1p2M2o1L5
$$ 13 -28 19 -33 25 -1 31 12 9 -6 18 -22 27 -55 -69 -17 -53 27 -70 37 -2 24 -1 10 25 -16 65 -7 35 -26 9
4750ILMj0k2N0JJ0l7O5j16oP7l9j1rM0PK0o5K9L4Pk0k2Rl7JN0mo0nK0O2o9N3o1
$$ 9 12 16 6 -16 34 35 45 8 73 -43 -49 28 -11 -22 -31 9 16 36 -29 0 34 41 21 -1 8 -29 -28 22 18 -42 -47 -27 35 -34 19 -42
4786d2R5p4J1J7k2L1K0K5m9J7l4P1k2p%j1Ml1k3KKoL6j3k2K1k5M8oj5K4Kk6k6
$$ -42 53 -21 -10 7 -15 16 36 61 12 29 -5 66 44 37 37 26 30 -1 -24 -22 -20 -26 10 -3 -25 -4 -29 19 13 -2 22 24 -2 -28
4820b8p6O2K3J5L6m8K5K4k2Q0p9J1m5N1j3m8M8o4N1j9kM1m6K6LNQJ1m1M3%k5J1
$$ -28 -104 -42 -19 -4 32 -16 9 33 11 91 12 23 -22 29 16 -32 16 -48 3 -16 -18 23 -23 3 6 11 19 30 -11 32 32 7 18
4853A8LkJ2k1j0M0n4Qn6P2j5J8O4j20J5k5O8k1k1M1LlP4m4k2j1J9m4lm5O0p9J04
$$ 18 21 19 31 10 0 40 -14 -6 -62 10 -5 13 77 -43 -28 -53 15 -6 -27 14 17 14 88 44 22 11 30 -14 -17 -62 -2 -81 23
4886B3j6K8n2O1J5l1K0l6n2K9k2P1r3JO9j4l3MR0m8rj9K4o6M6K6O5n8N2o2pj0
$$ 23 7 35 -17 44 59 28 48 12 -40 -11 -33 38 -55 -54 15 1 -32 -28 62 14 5 -14 10 -56 -10 16 81 23 75 13 6 -4
4918dL5L1nr1K3K0N9o9j2M3nk0kj5M5J7rl1k6L4plm0l8M1L5m1j9P6jl6Nl1N0J7
$$ -4 31 62 57 -34 -11 9 68 -1 -13 30 25 5 3 -12 33 50 41 10 -16 18 11 8 -32 -70 -29 6 -35 -54 22 21 -15 -10 -41 9 26
4953B6J4q8oMM2ok1N6m3L4L3m9J2m6P1j7Jl9J0n3J8L8pM3k4j0OJ2m9J9L1m5L3
$$ 26 40 -48 -54 -50 -8 -14 -35 21 -22 12 45 -4 8 -38 33 16 17 -22 -12 -65 -47 -9 -16 27 3 -7 -1 11 -38 -19 12 -33 0
4986@k0K1k8N5p7M3J9m0J2K1J7l5oK7l3L4k9J9M6k3k0j0LN4jo6K9j5l9K0kL0k0
$$ 0 -20 1 -27 28 -49 -6 13 -27 -15 6 23 -12 -18 9 -24 10 -19 0 46 23 3 -7 -4 50 49 -17 12 -3 -42 -22 -24 6 -14
5019a4l3K2N5l4lP8p1j0N0o2j8jO4k7j6L0qnRj5K0RJp3M1L1J3mL0q5Mj4J12n1
$$ -14 -47 -25 30 -4 -7 71 0 -10 40 -22 -40 -41 23 -4 -20 10 2 -3 6 -9 11 20 21 -52 -11 20 33 29 59 -26 -22 -36 76 25
5053B5m5K3L8ll9Lj9q9J06K2j8l2J4O6q5M5p7L4qlOJ9lk5N9n0K2K8n0J7PL4l0
$$ 25 -20 3 41 38 -1 2 -17 -106 0 22 4 -28 -14 52 -33 12 -65 -31 -39 -42 -36 -17 -20 -45 14 -36 -14 14 -36 -19 -12 22 -8
5086hN7K3n5q8R6j5L2o6N4Ok5jj5K8l3K2k4M0m0O3n8mk8k4O4kL0l3k2J6J7k6k2
$$ -8 49 72 17 -71 25 10 42 -24 30 36 11 10 -5 23 -10 12 -12 28 -12 51 -7 -11 -39 -63 1 -1 29 -4 -26 -10 7 -19 -41
5119d1k0L4j9M2M3j0kM6l3l9l1L4OlQL2k6o1oN2J8k0OM4n2J2N2n8k8j4J3LO9p4
$$ -41 -61 -27 -46 -4 39 29 27 73 40 1 -30 4 10 7 15 47 21 -40 -46 6 24 4 10 54 2 14 66 8 -20 -34 -21 -18 51 -23
5153b3JL6k6O1q0N1pL1o8J8L8L5o2m1M9j2k1M9k6m8K5N6m1oR0j01J9PJ3j6l1J1
$$ -23 -22 14 -12 49 -31 20 13 44 -24 -6 32 67 5 -36 13 1 -20 29 3 -45 -20 36 -5 -11 79 -22 -3 4 17 1 -30 -19
5185a9P8o7Rn7M8K0j9Ll2k2P0m4K0J8k1K8j8k5J4Nk8M5mk8N6K0m0k9L0L5k8j4
$$ -19 59 -8 1 -56 -8 12 -7 -4 -36 -58 12 -32 -12 6 -15 13 -5 -30 -16 -11 -39 6 2 -26 30 50 10 -19 11 46 18 4
5217DL7k1n5L0M1m4K4j2k3K1j6j1O4l5j3n7P4jl0m4Q4J0q7N7pOJ1k9lM6PQJ3q8
$$ 4 41 20 -35 -5 36 -8 16 4 -19 2 -14 -25 39 4 -9 -66 8 7 -23 -67 17 27 -60 -3 -10 -4 7 -22 -25 21 28 36 49 -39
5251c9MR8o1j2L7m9O0k8L6mqPo6L0k3L2M6jKr6O0n7K1K7J4j9n9Q0l0N3k9m2PM7
$$ -39 -35 63 2 -10 27 -22 38 10 46 42 34 41 -25 5 -18 14 60 59 61 -35 25 -32 -11 16 30 11 -48 32 2 55 26 -16 -9 38
5285C8j2n8k1N6M0j6j1M3LJ7l3l8k1pO2o1QO5j1l4l3J4K4mK2r8L9Pj3K1N4k3j6
$$ 38 26 -32 -53 3 43 27 16 59 62 79 46 8 -13 -20 42 -19 -11 54 43 9 -24 -10 14 10 32 -66 -27 -20 -33 -12 42 19 3
5318CK0j0Ml4K9J6pp2L5L7Mm6J7Kl6L9J6j3k6J2J9j7QK7Jl7K6m1P2o0qQM2J0p2
$$ 3 23 13 17 -17 12 28 21 -51 -16 21 25 -21 -4 -2 -38 1 17 4 -22 -10 9 -8 0 27 28 -9 17 -24 48 -12 -20 -12 30 40 -32
5353c2L0m0K1J4j3M8%k3K3p9mQ9j1j0M2Jn8M0l8K0Pl7K9L3n6k1k7M0MM7k3k0O2
$$ -32 -2 -42 -21 -7 -20 28 28 5 28 -51 -55 34 23 13 55 56 -2 38 0 20 27 -10 19 52 -4 -25 -52 -12 -8 39 16 -4 58
5386E8Mm7l1k3N3J5o3O4oM4m7j9j3K1j1k3J3j4j3k3M9l3K2K4kM9m5l1L8k5j6r
$$ 58 62 15 -16 -39 14 29 -34 30 24 68 21 2 -11 10 -1 -24 -11 -25 -38 -61 -12 -45 -23 1 -1 48 3 -28 10 -15 -31 -40
5418d0P3nn4J8M8k4K8K1j3n5nK1NL2n1nJ1o4N4J8o8R1lL2k9Rm3j7M1r1M8Mo4J08
$$ -40 33 28 -26 -8 40 16 44 65 52 -3 -8 13 18 50 -1 -6 5 -59 -5 13 -55 36 33 65 36 45 2 -15 26 -65 -17 -13 -77 31
5452C1K0l4NJ4n6R7p8M4p0ll4J05o3K6l5K4j2m0P6N9q0oL4k5l8rN0n%J3J3n2O6
$$ 31 51 17 22 36 -20 77 -1 43 -27 -30 -64 41 -22 4 -31 -7 -19 -59 17 76 -4 -10 24 -1 -39 -48 2 -3 -3 10 23 -29 37
5485C7m4rL6k0j5Lj9QJ6k6rLqN9j5K1jl5P7l0j6n2J0m2R7om6O2j8j4n4Q9n9L8
$$ 37 -7 -16 20 0 -15 -12 -31 -23 -7 -33 -42 -39 -47 12 -3 18 17 -18 59 29 13 -39 -29 -71 26 20 -26 36 18 4 -50 39 -20 18
5519A8l0nl6O6j4n8L9rqJ7J4l5N2m1m3N4K3m8O9n3M4n1K7O8p3mnlK8o7L4O7M8
$$ 18 -12 -17 -53 13 -1 -59 -20 -29 -37 -20 -6 -41 11 -30 -73 -19 4 -44 25 -28 16 -35 -8 60 -13 -17 -22 -25 3 -64 -30 37 85
5552H5q3J6Pk0MJ2l8J02j04O2r7M1M9o8J5Kj0J6l2M2QRm2QJ7NL5m0K0k7MK3m1
$$ 85 2 18 25 5 9 21 -17 85 -19 43 -54 -13 36 -32 -17 -15 -25 -9 -41 1 9 18 -24 -16 1 6 41 1 21 -6 -2 21 -20
5585b0L3m4M3j3L2Qo1JK6M4p4j5rL8J6k4L5j4L2q7L0J0j3L0L2j8l3j7K1J3p3P2
$$ -20 13 -31 12 -1 31 39 -22 -21 5 49 -25 -40 -49 -11 5 -19 16 2 34 -53 -23 -13 -26 4 36 18 -15 -32 -11 2 -71 1
5617ARk8J3m2Q1k2m7K6j3N9mpJ6k8qK8m1JK3j3M4m6l4L6O9q3k3J2L5m0J12q4M
$$ 1 10 -18 -5 -47 34 12 -35 -9 -22 37 33 26 42 14 6 34 -7 -6 17 4 48 2 -32 4 73 -10 -33 -21 14 -26 86 2 6
5650FK8r1Q7r4N9NK8k8Oo5L6L5j1k9K2O0n2K6Pl9l7O7k9j3lJ0POM6l5k7L4k2J8
$$ 6 34 -57 30 -64 -5 0 28 0 6 -59 -23 12 1 -28 -6 54 2 28 35 -4 -41 26 -3 -16 -19 -9 -2 4 50 15 -12 22 0 18
5684A8m0k1L8N4o1l1N8m1J6L3l1K1j2mj7PpO9l5pJ5n1J4J0L4Lm4l2O5kJ5k7oq
$$ 18 -22 -43 -5 49 -12 -43 15 -26 -10 23 -8 13 1 -3 -20 -13 -20 49 14 7 22 -29 -15 -5 29 32 -12 -44 21 19 34 7 1 -7
5718gOK2m8N7l4N9q8O9n1RJ5j7J0m1K5Lk6N7M8r0J2M9o1K8k6pJ0Pj9J4mLJ6K1
$$ -7 -1 21 -27 30 -4 55 -33 36 -15 -6 9 -8 2 -39 -14 -11 -37 20 68 -22 -10 39 -22 6 -20 -27 -17 -10 -29 -15 -19 -16 0 21
5752B1K8o7P2n5K0%Mm1oNoJ9J7M5k9n5rJ9j8L8K0mlm0m9Q2K6j0k5L2m8J8l7L6
$$ 21 49 -18 54 -1 19 19 23 -18 -24 -19 -25 -6 11 56 27 -28 -37 -18 -36 2 22 18 15 -25 -74 8 34 24 -1 31 -17 1 -36 0
5786@P6r7Mj8K2k8O6m0mN9j9Rok3L2kKp3O5n8L2j1K0k7j6O8k2rk0l2Q5J4n3Pl
$$ 0 76 -21 -17 -35 -13 -41 25 -15 -19 40 21 30 24 1 33 31 33 -40 25 -33 -1 -12 8 -19 -35 33 11 2 -18 -50 35 49 -4 3 0
5821@j6qL4l9LL0L3p1M6%k2m4M7nK3kQm5KN2p0N7%j2m5L1J5j0K7l6J0K1m2O3n1
$$ 0 -16 -24 10 -29 -26 4 37 -34 12 12 -10 -54 -7 -12 11 9 17 -28 -26 26 -44 13 13 1 -44 -13 2 -8 19 -17 -7 14 -28 35 -16
5856a6M3j9L0q6O0o3M6l7M6l7L2k8J2lOj3L4PLJ9j7J7mn3K3L6j0oK7OLo0J0K1
$$ -16 27 8 38 -48 12 -51 -5 -42 4 -33 -1 -29 -17 -20 -14 -27 7 14 17 36 19 36 32 -21 2 38 28 22 49 55 58 -2 8 29
5890B9m1K9mM9o0mk8k2N9N7r7N4j4k3K0lL1n3lO4l0oR3n8J6k3m5N1%o2QJ3j5m
$$ 29 -12 17 13 62 2 -2 -30 -52 7 64 -33 21 7 -16 4 1 32 -21 -24 40 10 4 97 39 55 32 -13 38 38 -24 -16 -3 -18 -22
5924b2KrOk7J00J7m8ql4K7k0J4l6K9m9K4mk0J6K4j4j1J2K2q0N9Nm1L3k9J01k6
$$ -22 -20 -29 -23 -50 50 67 19 11 -23 4 -16 -2 -38 -9 -58 -34 -38 -58 -42 -18 -32 -43 -31 -9 -89 -30 -25 -66 -33 -62 39 13
5956A3K4k3l3M9J7m0OJ0m2n4R5m5l1J11m8j3M3m9J1M6q0R4m0k8K4Jk9K4l7L1j2
$$ 13 37 14 -19 30 47 7 13 23 -19 -73 22 -23 -54 57 9 -4 39 -10 1 47 -33 61 21 -7 17 18 -11 13 -24 7 -5
5987eM2n7L0%n4O3j6J7n4K5n9N8M8p0O8kl3N5n7L6j5n7P9p2L3mmP0m3k4RJ1L2
$$ -5 37 -20 10 10 -44 19 3 20 -34 -9 -68 -10 38 -32 36 34 1 56 -1 35 20 -37 42 -30 3 -1 -5 65 22 -2 7 18 50
6020E0p8J7J1J6l7KPJ0mk0k0Q6j9k1j9K0L2J0p0N7K5r8L3nK5J7o0J8Q0p7K6k9
$$ 50 -28 -11 0 16 -21 -19 -12 -2 -6 -26 -46 40 21 0 -19 1 33 43 -27 30 55 -43 -10 -15 10 27 -33 -15 65 -12 14 -15
6052a5J09j08J1o8O0K4m3O0k0jm6N5m9N3nk0Ln6L4Rrl9J08n9MLj4J6krN8J2l8
$$ -15 94 -14 -3 -71 -11 13 -30 30 10 9 -37 18 -31 22 17 -3 0 -56 -22 -13 -22 -61 47 -12 -8 -5 -19 -3 -5 -14 44 56 18
6085A8l9L5m3j4N7m3N7n7rJ5M4j4J9qp2Q2%m8M2k6n1J2L2M0k0Ml3j5J8K6K8p6
$$ 18 -21 14 -29 -43 14 -29 28 -29 -38 -23 21 7 26 18 -54 28 28 -20 22 -4 -55 -43 -11 29 9 13 -20 -35 -17 9 37 -39
6117c9M2NLJ1Nj8oJ4m1qQ7o6J9j8k8N7L5n8O0n0%J9J0m5J4k4J4L5l9P4n9Rm3Q
$$ -39 3 8 11 22 27 9 3 17 -24 -32 55 -11 8 -10 -38 19 54 -4 56 6 6 25 35 -10 4 -20 -6 29 -10 64 5 14 -29 -21
6151b1l5P1Jj9K6j9oj0J4kk3N2j5j4k4P8rn0L3j8k5K6k9J4J8N9o9N9m4k5K7lJ1
$$ -21 -56 15 16 -3 23 4 -2 -12 2 0 -23 29 14 0 -24 54 45 -5 28 10 -15 11 -18 -4 14 73 4 63 19 -6 21 18 29
6184B9j8j1K5Ll6k8J1N7l7p6R2K0n3k7P3k0l9Q5q7K9jjQL3Rj5n1L3J2J2mq0M8
$$ 29 11 0 25 28 -8 -36 -25 32 -5 -81 11 31 -22 -49 24 4 -35 50 -37 -8 -9 -10 -2 31 40 25 -26 7 19 31 27 -53 -5
6217eNj8M7j6nL5j9k9L0n0N5pnk0j6pN6n2M4o6J2j1O2l6M6lk6J5k1J9k7K8rk6
$$ -5 0 -18 29 13 8 43 24 -5 25 -25 30 23 18 -2 -18 -25 31 -21 23 -43 -31 -42 20 -16 30 27 1 16 -5 14 -13 15 6 -20
6251b0LJ4nK5l2qL0N7Km2j1k7J0K7Qj7lj5K7j2n2Q5om7J5K0rk6n9J17p6J9m3J00
$$ -20 -17 -3 -8 17 -15 -23 7 64 66 24 13 -14 -4 23 31 14 11 -4 23 11 -41 44 38 -9 6 26 17 -9 -68 49 -27 -8 -51 49
6285D9j10M8rJ3j4M2k7kL3n7mlN3j2J3k9J2J6k0K6m3K8J8l4k6K5J0K8k4N5m2k8
$$ 49 -61 -13 -22 -9 -23 19 -8 -10 23 -34 -38 -41 12 0 13 -16 -4 12 -8 18 -25 3 21 -13 -39 -14 -4 24 0 55 13 -15
6317a5K0rRj7k1K3j1M3m3L5n0R3l7K0l7JM0j0r3Q6j8J3l5K3m1K9kK9l3m7N3O2
$$ -15 5 -4 5 -12 -33 -10 -21 22 -21 14 -36 57 20 40 3 4 44 34 -59 27 9 22 -13 10 -31 -2 -4 25 -8 -55 -2 60
6349F0p3K5J7k2k6J7L4ml8L3l7k2L4pmN4jn3O6r3l5Q9j7K5j6ORJ5k5Nj2J9m4L2
$$ 60 -13 12 29 7 -19 -2 32 28 -10 23 -14 -36 -2 -9 -13 41 40 -13 53 -40 -75 14 -3 22 6 12 21 36 11 16 4 23 -21 11
6383A1J8pnM3o6M1n4jK4k7J0Q0rp8M5n6O4q4P2o9J9M4q2Q8j3Q5j05j8M4k7M3k1
$$ 11 29 22 17 60 -6 35 -19 -20 4 -23 -13 67 58 -20 25 -31 33 -51 21 -48 -29 15 -67 21 8 93 -12 -30 14 -13 30 9
6415IPj9L6l3jL8k4K5j2k4J1Nm0j3N1l2M3n2MR1r4k3L3N0j7p1Oj6N3%rj8ll2Q5
$$ 9 16 -3 33 0 -1 37 13 38 26 2 13 18 -22 -35 16 -16 27 -25 -21 70 -24 -47 -14 36 19 -52 -46 -62 -9 -9 -18 -36 -39 -71 14
6450A4J5k6l8rj3jR9n8P0p3K1j2J8KM6q8R8m5Qj2m0K4K5Mn4R3o5n8Q8Jm6K1M8
$$ 14 29 3 -35 -44 -57 -58 41 -17 53 -20 1 -11 7 9 55 -33 65 20 28 16 -24 0 25 29 -25 68 3 -55 33 34 -12 9 57
6483E7l2j25J00J6jk7j2j2N6l4J6M6p2J3Jm0R5l6onOM2lk3L2o7J2k0M6nJ9n7J3
$$ 57 25 -100 0 16 15 -12 -24 -36 20 -14 2 48 -24 -11 -10 -50 45 9 3 -2 4 46 43 20 52 -15 -3 -23 23 18 37 -20 -7
6516gJ0K3n4j8O6k1J3Qn5K4M0n9L3k0M7o3K0J3LQL1o3qK6J3n0J5K2jL5o4rL1m2
$$ -7 3 26 -28 -46 20 -1 12 20 -35 -11 29 -30 3 -17 30 -33 -13 0 3 11 42 -21 -29 -3 10 -40 -25 -3 -4 31 -33 -42 -11 -53
6550e3O4m3J20p0JK3m3O6q4L7j7mmJj3M7k5k9M6k6l4RO0m4K6Lk7K8l8j2J3j1L3
$$ -53 11 -32 88 18 19 42 -1 65 -19 18 1 -3 -7 -6 -19 28 3 -26 20 -6 -40 -31 29 -15 11 14 -13 15 -23 -35 -22 -33 0
6583@K9n4O8Qo2L7m5L6No0P6K9n3L5m4K2L2m8l9N6K3m3J8nj0m0J6Pk6J1J4k4N6
$$ 0 29 -25 43 51 -11 26 -19 17 22 -38 38 67 14 49 5 27 59 11 -28 28 51 8 26 21 11 -29 -13 -6 -32 -21 -7 -31 25
6616B5nn2L1n7j7J06j03K2Q3p0O6rm3P1q7M8k0O2n4nN0n3J1J5l9Q3m9k3l2N8n4
$$ 25 20 -32 -1 -58 -75 31 -72 -50 33 -37 29 20 -23 48 -39 9 -11 51 -3 -8 42 -11 0 15 -24 59 10 -13 -45 13 -41
6647d1N6k8L4k4j6L9m0J1K8l9J1QPJ2k6j3J8m5kP1j7L7k6m4K8l6R3n0KJ0l0J1
$$ -41 15 -13 21 -3 -19 20 -20 -9 19 -20 -9 -1 6 18 -8 -21 -3 -48 -50 21 4 41 15 -29 -1 -37 56 6 8 18 -12 -1
6679ak1K9m8R2lj23K4N8nN5n2l6L1K5m3L2m4oN9q3N0K0l0O4l5m4K6J8k3K1k9K2
$$ -1 -22 7 -41 51 48 -75 -51 7 2 57 5 -31 0 25 -18 14 -30 -36 23 -60 -10 10 -20 44 9 -35 -9 9 -14 7 -22 0
6711@k8K1j4K0M9Ok4l1K0m2L9j3ll4M4q3J11p6M3j7K0j8L7k2j2m5M6J8m0L1J7
$$ 0 -28 -7 -21 -1 48 54 30 -1 19 -23 16 3 0 -34 10 -73 38 -38 5 -12 8 -10 27 5 -7 -52 -6 12 -28 3 20
6742B0l7J3m1M2K6n6J3j1L7qk8O5Kk6K4oj1Jm5O2n3O8n4kl9O5K0m8Qjj1M4l0k4
$$ 20 -17 -4 -45 -3 23 -33 -20 -31 6 -2 -30 35 37 11 35 29 18 19 -26 36 -17 51 -3 -5 -44 21 41 -7 1 0 -11 33 3 -21
6776b1K9l4k6N5k9N1l8QJ7j5L5n7N6k4l1QJ5L2m2O2o1J9MK2l5K2k2L2k1J4l2K
$$ -21 8 -26 -52 3 -26 25 -13 -5 12 -3 32 -25 31 7 -24 -16 -1 31 -11 51 -10 9 13 35 0 22 0 32 11 25 -7 -5
6808eo0Q2K5o5N0K5k3j0n9O7J5j13R0L0q4M7k2L2k4k8K2pJ8j1J2o6J12o8j4L3
$$ -5 -65 17 42 -23 27 52 29 19 -40 27 42 -71 19 49 -35 12 -10 22 -2 -30 -8 -15 3 -8 4 -62 50 -18 -32 1
6838AL1kj7%k1j8N2lm4J3N6p7L1j0J8L3l4mJ1n2N0l6j0L8n1M3Jp1N3J0k1N5J1
$$ 1 32 30 13 13 -8 -26 26 23 -21 -8 48 -29 2 -8 10 43 9 5 16 -36 14 -22 -32 6 -45 -2 -1 -72 -19 -9 -30 25 36
6871C6ql9j2L8J8kq3M4P0n4l8R4o9kJ2OJ2n0K2K2j1j3J4Kj3K8o8j9P8l3m6N8L0
$$ 36 28 -11 -23 15 33 31 -52 -8 62 8 -30 64 -5 -7 5 11 23 -27 -5 17 6 -7 7 9 -4 24 -44 -63 15 -18 -64 -6 24
6904B4J7n2m6P8m7NL0k8Q8m6l8N2n9j2P8lM4j10J2M6l3p6J10j7j5QO3l0r5P9m3
$$ 24 41 -11 -57 21 -26 -21 9 -19 69 23 -15 37 -22 -34 44 41 85 -25 -13 33 0 -76 34 17 2 10 73 43 -52 27 -16
6935a6j4LL0K1n1M1l5L7j8ML7k7m7M2J5j5l1L0M3jok6Kkk2L3k5rL5n9oN3M4M1
$$ -16 -30 -27 3 24 -27 14 -21 16 -2 2 39 12 -35 7 22 7 -24 6 49 48 42 16 18 16 -6 27 2 -7 28 -31 -37 16 60 101
6969A01j20J4Q9l5l7k1j3O0m1Mk7O8J7j13O2l5k4M3J1pm3K3rnj1N1Nj8j8M8k7
$$ 101 -19 -5 84 49 12 -9 -22 38 -3 1 -26 42 59 -54 8 -27 -51 -8 3 -4 -47 -24 -33 -38 -49 2 7 -11 -29 19 -8
7000hJ9pRo6Q1m0j3J4j5O1qK4j03K5P0J2l4Rm9Q2pr0N9j8j6oNm5R9n0nj8M1K8
$$ -8 11 4 13 -53 28 -12 -25 -11 -26 35 27 51 -52 -27 43 55 21 30 -19 63 56 -34 25 7 -9 -15 -10 -55 44 -6 -11 -29 12 40
7034D0J0p0JO7m4J4q9Q5OK4n2K2j6O1kr4N8m5L3m0j8L5l8N6k6OM5j0kk9l0N6j6
$$ 40 50 -20 -19 48 4 18 -71 14 20 44 -8 14 -2 59 57 -37 21 -24 9 -31 -49 -14 -52 4 -22 -16 29 19 17 -12 -42 14 -2
7067bm3N3k1L1n3K5J1l7K5jo2N9l2M8l5M3K0Pm3M3m1j3N4m6r%O5l6mlm2KN2n1
$$ -2 -45 8 -13 18 -35 -10 1 -36 -11 -12 -74 -15 -47 1 -34 9 29 36 -7 36 -5 -18 36 -10 -19 -19 46 10 6 3 -39 -37 15 -36
7101c6N0n1L4O6j11N1m0R0p6J8m1P0k1j9L8k5m7J8L9j7qL0l1K4ok7M0j1k1J1K
$$ -36 14 -37 -3 63 -48 3 -37 53 -23 -5 -46 24 3 -16 22 -3 -50 -32 7 -10 -18 12 -19 5 -1 -28 12 1 -20 -9 -7
7132gJ9l4N5l8%M3n9M5l2j9L2J2l0Rk4N7Kp9J1L7Rk4O9j2j06J04o6rL4K0k1K6
$$ -7 12 -22 33 -5 -5 38 -21 24 -8 -27 5 17 -13 -4 -28 29 31 -48 -37 0 9 -15 54 42 -64 40 -26 -35 -1 19 -2 24
7164B4Nl9M8km4L4m1O3n7M2Rk3J2rL7n9Ro4M9P9j6j01P2n6K8l8MPJN7q7M7l2O1
$$ 24 29 -10 38 36 -8 26 -15 48 -9 33 42 19 31 22 59 0 9 -55 -6 73 57 -44 28 -28 0 -38 -34 -27 -26 31 -56 -9 -41 20
7198B0l1K2j8J8k8L9p2N1K9K7p4O1q2M1pLn9M5M4k0j1Q6p3L2n4L5j8J8M1o0kk8
$$ 20 -11 11 -7 11 -17 22 -50 1 30 57 -17 44 -38 3 -4 -1 -60 -15 29 9 -2 84 11 43 -11 24 6 24 65 5 3 -25
7230b5M9n1K4K6j14R5k8J1nN8l7p3N0M3l9N0l2o8M7N0%q7R5q0oP9k6L1k8K8m8
$$ -25 24 -27 -3 23 -91 4 -24 -13 -18 40 3 -70 -20 23 -16 34 2 -66 -19 31 31 -56 39 -41 -47 32 6 37 9 37 -11
7261a1Q4j02M7K5o3L2pMJ8p2k5O6J7L2p3j4N0m0K8l2J4J6J3K9o6j2O4m6J5lJ8
$$ -11 73 -29 18 43 -20 12 5 9 27 -45 -70 -4 13 45 -28 -42 8 -32 -4 -36 -22 -6 7 36 -30 -42 22 -24 -9 -12 6
7292Fk0pPM1l0l3J8M4L4n8M9Pk7k2L3l4l4M1MJ3o2O1j6n3K0J4L3p1L6j0L3k1j2
$$ 6 -14 -21 -14 27 -3 -36 -18 26 60 2 51 58 31 9 42 8 -26 15 19 32 -30 31 15 -38 -18 -4 29 -42 -6 -16 17 -4 -16
7325a6k8K8M6n9qN3J6l9%%l8M3rj3J2N8l2K0m7j5J7mM9Pn4Ql6L7L6l6O0n7K4n9
$$ -16 -44 -16 30 -29 -37 16 32 -7 -7 -7 -45 -2 -11 -24 -12 46 14 34 -13 -28 -11 -15 34 41 -13 -5 -41 -4 32 -4 56 -1 23 -36
7359c6M2M4o4J3%O2n5k5J1K3pn6P3q3P1j8j6N1K9q6J9k2O7%K4m7qK6J7l6k1j1
$$ -36 6 50 -14 -1 -1 61 6 -19 -8 15 8 -48 25 -58 13 -5 -21 30 59 -27 -8 -30 37 37 61 14 6 32 49 13 -8 -19
7391a9N2Kl0J8n2j2M3Oj4K4m1J2nJ3L0k6m7M1M3n6K2No4M0mN4n8KK9kj8L9mK6
$$ -19 33 35 5 23 -29 -41 2 8 -6 18 -23 -11 -16 -3 27 1 -46 -5 38 -18 4 9 -55 -15 -19 35 -23 -21 8 6 -12 27 23 49
$$ [...]
8191c9
##END NTUPLES=NMR FID
##END=
