##TITLE=1H_DE-80H_X3
 200.13MHz, d2o
 8 sc
 
 19ns.26.2.2025
##JCAMPDX= 6.0         $$ Bruker NMR JCAMP-DX V2.0
##DATA TYPE= NMR SPECTRUM
##DATA CLASS= NTUPLES
##ORIGIN= UXNMR, Bruker Analytische Messtechnik GmbH
##OWNER= pz
$$ XWIN-NMR		Version 3.5
$$ Thu Apr 30 11:23:59 2026 Russian Standard Time (UT+4h)  Yarkov@DPX200
##.OBSERVE FREQUENCY= 200.1313
##.OBSERVE NUCLEUS= ^1H
##.ACQUISITION MODE= SIMULTANEOUS
##.ACQUISITION SCHEME= undefined
##.AVERAGES= 8
##.DIGITISER RES= 18
##SPECTROMETER/DATA SYSTEM= spect
##.PULSE SEQUENCE= zg30
##.SOLVENT NAME= DMSO
##.SHIFT REFERENCE= (INTERNAL, DMSO, 0, 17.9946)
##AUDIT TRAIL= $$ (NUMBER, WHEN, WHO, WHERE, WHAT)
$$ ##TITLE= Audit trail, XWIN-NMR		Version 3.5
$$ ##JCAMPDX= 5.01
$$ ##ORIGIN= Bruker BioSpin GmbH
$$ ##OWNER= Yarkov
$$ C:/Bruker/XWIN-NMR/data/yarkov2/nmr/H-C/1/pdata/1/auditp.txt
$$ ##AUDIT TRAIL=  $$ (NUMBER, WHEN, WHO, WHERE, WHAT)
(   1,<2026-04-30 11:22:30.65 +0400>,<Yarkov>,<DPX200>,
      <created by zg, POWCHK disabled, PULCHK disabled
       configuration hash MD5:
       00 E9 B6 7A A2 85 ED C7 34 08 36 98 17 FE 4E 26
       data hash MD5: 16K
       30 85 F2 C1 B6 19 BF 80 62 B0 E1 A1 3E C0 31 66>)
(   2,<2026-04-30 11:22:45.20 +0400>,<Yarkov>,<DPX200>,
      <Start of raw data processing
       efp BC_mod = 2 LB = 0.25 FT_mod = 6 PKNL = 1 PHC0 = -5300.516 PHC1 = 11.42193 SI = 16K 
       data hash MD5: 16K
       42 0F DA 73 4B 0F 9C 11 B5 5A FB 2F 6E 7C 85 DC>)
$$ ##END=
$$ 
$$ hash MD5
$$ 38 AE 7E 0E F6 E3 5A DC 02 30 64 32 72 1C F1 F9
##$RELAX= 
##$RELAX= 
##$RELAX= 
##$RELAX= 
##$RELAX= 
##$RELAX= 
$$ Bruker specific parameters
$$ --------------------------
##$DU= <C:/Bruker/XWIN-NMR>
##$EXPNO= 1
##$NAME= <H-C>
##$PROCNO= 1
##$TYPE= <nmr>
##$USER= <yarkov2>
##$AMP= (0..31)
100 100 100 100 100 100 100 100 100 100 100 100 100 100 100 100 100 100 
100 100 100 100 100 100 100 100 100 100 100 100 100 100 
##$AQSEQ= 0
##$AQ_mod= 1
##$AUNM= <au_zg>
##$AUTOPOS= <>
##$BF1= 200.13
##$BF2= 200.13
##$BF3= 200.13
##$BF4= 200.13
##$BF5= 200.13
##$BF6= 200.13
##$BF7= 200.13
##$BF8= 200.13
##$BYTORDA= 1
##$CFDGTYP= 0
##$CFRGTYP= 5
##$CHEMSTR= <none>
##$CNST= (0..31)
1 1 145 1 1 1 1 1 1 1 1 1 1 1 1 1 1 1 1 1 1 1 1 1 1 1 1 1 1 1 1 1 
##$CPDPRG= <>
##$CPDPRG1= <>
##$CPDPRG2= <>
##$CPDPRG3= <>
##$CPDPRG4= <mlev>
##$CPDPRG5= <mlev>
##$CPDPRG6= <mlev>
##$CPDPRG7= <mlev>
##$CPDPRG8= <mlev>
##$CPDPRGB= <>
##$CPDPRGT= <>
##$D= (0..31)
0 0.7 0 0 0 0 0 0 0 0 0 0.03 0 0 0 0 0 0 0 0 0 0 0 0 0 0 0 0 0 0 0 0 
##$DATE= 1777533750
##$DBL= (0..7)
120 120 120 120 120 120 120 120 
##$DBP= (0..7)
150 150 150 150 150 150 150 150 
##$DBP07= 0
##$DBPNAM0= <>
##$DBPNAM1= <>
##$DBPNAM2= <>
##$DBPNAM3= <>
##$DBPNAM4= <>
##$DBPNAM5= <>
##$DBPNAM6= <>
##$DBPNAM7= <>
##$DBPOAL= (0..7)
0.5 0.5 0.5 0.5 0.5 0.5 0.5 0.5 
##$DBPOFFS= (0..7)
0 0 0 0 0 0 0 0 
##$DE= 6
##$DECBNUC= <off>
##$DECIM= 32
##$DECNUC= <off>
##$DECSTAT= 4
##$DIGMOD= 1
##$DIGTYP= 9
##$DL= (0..7)
0 120 120 120 120 120 120 120 
##$DP= (0..7)
$$ [...]
##$SUBNAM2= <"">
##$SUBNAM3= <"">
##$SUBNAM4= <"">
##$SUBNAM5= <"">
##$SUBNAM6= <"">
##$SUBNAM7= <"">
##$SUBNAM8= <"">
##$SUBNAM9= <"">
##$SW= 18.0517328524113
##$SWIBOX= (0..15)
0 0 2 0 0 0 0 0 0 0 0 0 0 0 0 0 
##$SW_h= 3612.71676300578
##$TD= 16384
##$TD0= 1
##$TE= 0
##$TE2= 300
##$TE3= 300
##$TEG= 300
##$TL= (0..7)
0 120 120 120 120 120 120 120 
##$TP= (0..7)
150 150 150 150 150 150 150 150 
##$TP07= 0
##$TPNAME0= <>
##$TPNAME1= <>
##$TPNAME2= <>
##$TPNAME3= <>
##$TPNAME4= <>
##$TPNAME5= <>
##$TPNAME6= <>
##$TPNAME7= <>
##$TPOAL= (0..7)
0.5 0.5 0.5 0.5 0.5 0.5 0.5 0.5 
##$TPOFFS= (0..7)
0 0 0 0 0 0 0 0 
##$TUNHIN= 0
##$TUNHOUT= 0
##$TUNXOUT= 0
##$USERA1= <user>
##$USERA2= <user>
##$USERA3= <user>
##$USERA4= <user>
##$USERA5= <user>
##$V9= 5
##$VALIST= <valist>
##$VCLIST= <CCCCCCCCCCCCCCC>
##$VD= 0
##$VDLIST= <DDDDDDDDDDDDDDD>
##$VPLIST= <PPPPPPPPPPPPPPP>
##$VTLIST= <TTTTTTTTTTTTTTT>
##$WBST= 1024
##$WBSW= 4
##$XGAIN= (0..3)
0 0 0 0 
##$XL= 0
##$YL= 0
##$YMAX_a= 96921
##$YMIN_a= -87741
##$ZGOPTNS= <>
##$ZL1= 120
##$ZL2= 120
##$ZL3= 120
##$ZL4= 120
##$ABSF1= 0
##$ABSF2= 0
##$ABSG= 0
##$ABSL= 0
##$ALPHA= 0
##$AQORDER= 0
##$ASSFAC= 0
##$ASSFACI= 0
##$ASSFACX= 0
##$ASSWID= 0
##$AUNMP= <proc_1d>
##$AZFE= 0.1
##$AZFW= 0.1
##$BCFW= 0
##$BC_mod= 2
##$BYTORDP= 0
##$COROFFS= 0
##$CY= -3
##$DATMOD= 1
##$DC= 0
##$DFILT= <>
##$DTYPP= 0
##$F1P= 0
##$F2P= 0
##$FCOR= 1
##$FTSIZE= 16384
##$FT_mod= 6
##$GAMMA= 0
##$GB= 0
##$INTBC= 1
##$INTSCL= 3.241238e-09
##$ISEN= 128
##$LB= 0.25
##$LEV0= 0
##$LPBIN= 0
##$MAXI= 10000
##$MC2= 0
##$MEAN= 0
##$ME_mod= 0
##$MI= 1.114404
##$NCOEF= 0
##$NC_proc= -8
##$NLEV= 6
##$NOISF1= 3.799351
##$NOISF2= 2.8
##$NSP= 0
##$NTH_PI= 0
##$NZP= 0
##$OFFSET= 17.99462
##$PC= 1
##$PHC0= -5300.516
##$PHC1= 11.42193
##$PH_mod= 1
##$PKNL= yes
##$PPARMOD= 0
##$PSCAL= 0
##$PSIGN= 0
##$REVERSE= no
##$SF= 200.129505105149
##$SI= 16384
##$SIGF1= 3
##$SIGF2= 2
##$SINO= 0.751879
##$SIOLD= 32768
##$SREGLST= <19F.Aceton>
##$SSB= 0
##$STSI= 16384
##$STSR= 0
##$SW_p= 3612.71676300578
##$SYMM= 0
##$S_DEV= 0
##$TDeff= 16384
##$TDoff= 0
##$TI= <>
##$TILT= no
##$TM1= 0
##$TM2= 0
##$TOPLEV= 0
##$USERP1= <user>
##$USERP2= <user>
##$USERP3= <user>
##$USERP4= <user>
##$USERP5= <user>
##$WDW= 1
##$XDIM= 16384
##$YMAX_p= 386576962
##$YMIN_p= -1237442
$$ End of Bruker specific parameters
$$ ---------------------------------
##NTUPLES= NMR SPECTRUM
##VAR_NAME=  FREQUENCY,     SPECTRUM/REAL,   SPECTRUM/IMAG
##SYMBOL=    X,             R,               I
##VAR_TYPE=  INDEPENDENT,   DEPENDENT,       DEPENDENT
##VAR_FORM=  AFFN,          ASDF,            ASDF
##VAR_DIM=   16384,         16384,           16384
##UNITS=     HZ,            ARBITRARY UNITS, ARBITRARY UNITS
##FACTOR=    0.220516191357247, 1,           1
##FIRST=     3601.25426897493, 0,            0
##LAST=      -11.4624940308486, 0,           0
##MIN=       -11.4624940308486, -1237442,    0
##MAX=       3601.25426897493, 386576962,    0
$$ Real data points
##PAGE= N=1
##DATA TABLE= (X++(R..R)), XYDATA
$$ [...]
7306 301238 305075 349863 458393 194667 105928 397774 417541 68495 116807 601398 470220
7295 470220 178478 -27109 188234 499525 558501 384304 181056 -114248 -195989 310408
7285 310408 421929 350648 155137 115756 50834 196699 345723 112096 110950 118350 36843
7274 36843 180064 248618 181273 101330 112813 188095 361189 335925 274241 249481 384946
7263 384946 559850 454833 182201 377609 557698 602671 489286 201694 103445 6558
7253 6558 79886 -17101 -56598 44093 244465 220199 376893 473249 376472 263317 321793
7242 321793 467147 511063 647207 366443 157924 392806 476465 306078 235941 417025
7232 417025 184115 162862 140940 242980 8296 -64265 97010 353396 596000 347993
7222 347993 242366 219527 139218 257822 310705 267138 118914 32678 287377 472649 312730
7211 312730 308397 374815 115137 103456 308506 166023 156085 381568 223689 203022 213378
7200 213378 -56898 85393 115209 74003 -39200 83784 -68590 288928 644748 715686
7190 715686 526933 514483 387096 540243 751627 732166 659005 280482 371848 494260
7180 494260 413013 235941 277391 190054 124727 191309 456969 221664 450000 611237 600538
7169 600538 429016 523971 280989 467335 205222 -72173 242090 576013 744829 453781
7159 453781 401784 585781 377403 355477 548913 553900 481641 373588 376389 631087 593611
7148 593611 130584 179568 150810 483217 369871 32955 413599 631748 169823 295075
7138 295075 361740 360917 166620 83987 198366 132429 274226 451417 450408 581487 471200
7127 471200 134553 106951 528052 434662 503774 552657 403527 489006 367588 297938 435413
7116 435413 616371 488272 463208 560314 633201 670196 454151 425768 481728 544287 514648
7105 514648 429593 639507 367354 284687 362985 309412 305120 533637 504551 647597 491995
7094 491995 377081 307325 260162 460492 138401 101565 302596 384564 782690 729585 464394
7083 464394 511946 458164 564877 266007 527965 589552 571737 611373 634965 542243 190862
7072 190862 56365 233157 457508 193050 -27884 222137 468630 705405 833074 368497
7062 368497 121893 143908 163727 277385 522765 584351 462978 242184 296774 379976 268206
7051 268206 646578 660997 315442 377224 268272 571382 635980 391646 363761 597735
7041 597735 248307 407287 246449 41159 61242 178930 171421 229815 366710 170787
7031 170787 148398 182457 150089 -94657 28980 173358 192210 48574 87662 306580 217420
7020 217420 378895 394717 234883 179506 62416 311699 327953 71843 351320 242108
7010 242108 71402 144156 47273 287989 433363 145728 95262 -139199 162790 427739
7000 427739 298014 453867 538392 460077 364562 425691 277413 392301 471481 342585 -52053
6989 -52053 283758 478694 245297 361697 420122 241080 559776 376083 531392 512380
6979 512380 469611 545427 471442 345038 359202 402755 415741 422796 458818 502333 407940 255747
6967 255747 248129 585579 613347 152044 167299 556932 263845 425496 535348 329742
6957 329742 123500 470 -57990 -71031 364078 777035 733154 551527 528617 441696 614003
6946 614003 934920 912399 614839 329462 252251 508528 596060 324726 139704 -71878
6936 -71878 -69121 200026 509366 383564 458392 354897 706027 711094 305714 143293 315834
6925 315834 754359 727087 563888 422384 327045 275362 613622 796559 758861 469617
6915 469617 441383 286266 237919 43876 291022 315394 157494 549860 584990 480530
6905 480530 446636 407654 73733 405622 532622 168679 265894 163908 126994 250695
6895 250695 295013 284420 394599 496695 428823 345738 222147 233383 17159 181726 490673
6884 490673 389514 386636 609829 461744 227132 435659 328356 312154 381732 523976
6874 523976 282937 163835 273668 314164 446896 575748 591581 390923 443587 388844
6864 388844 541807 539328 157464 338651 547678 578526 227219 259286 391179 508547
6854 508547 404515 276155 403542 506707 511692 567435 727487 530944 571978 550298 552048
6843 552048 747561 577337 418627 208580 143249 214377 290161 348612 -121006 -22638 121069
6832 121069 414389 567352 553798 648635 636479 367073 393691 193654 403145 573198
6822 573198 608609 543529 370076 87675 292112 300998 405492 585068 534751 442100 593856
6811 593856 751964 657491 568944 695276 475948 587075 679062 644505 659688 513052 586053
6800 586053 551396 535104 206812 246002 337957 326281 390742 477471 316315 315052 341762
6789 341762 618246 688279 619944 416069 549899 480367 620481 851263 437629 313367
6779 313367 509007 698184 790080 810291 637656 719381 591260 440996 764399 434932
6769 434932 413525 641402 544103 599039 538178 725336 697844 824101 857005 755123 604292
6758 604292 892668 936250 699642 734434 691698 538607 348760 587488 532751 473399 501971
6747 501971 529828 454237 324170 349025 522231 600025 672712 669785 893008 821366 775222
6736 775222 719877 652232 588068 666380 772895 631300 699381 1100916 1060047 971380 833578
6725 833578 846083 908160 908170 688268 762428 706026 676307 836792 927532 940478 1052482 828216
6713 828216 662147 702251 640086 752357 706010 577422 746631 666106 742611 631867 595195
6702 595195 969630 854255 1161473 1073662 829061 763059 967995 623106 621699 730037
6692 730037 992867 1272589 992505 825100 687550 852675 696381 636035 478582 545917
6682 545917 600934 684042 886777 987859 926592 869588 982014 905652 979379 1014818 991718
6671 991718 928551 1013406 1128970 1207019 1276483 1447366 1297794 963048 1066287 995922 1130268
6660 1130268 1104238 1160218 1065808 966415 1021116 1019360 1215265 1087316 1373252 1303796 1288254
6649 1288254 1227228 1198599 1289265 1271051 1269106 1482141 1516152 1388222 1291210 1264435 1072492
6638 1072492 939533 1017358 1157973 1355075 1349456 1513303 1567407 1417383 1206337 1127576
6628 1127576 1058547 1155165 1139038 1171498 1561212 1415706 1446907 1610352 1639442 1090371 1216925
6617 1216925 1095381 1035075 1138672 1154581 1153711 1194304 1154757 1355147 1413589 1324713 1401670
6606 1401670 1197177 1217562 1386161 1421868 1410167 1158698 1318145 1327891 1258935 1403809 1279560
6595 1279560 1062989 1144056 1316935 1208935 1142181 1352097 1452797 1378636 1476984 1017637
6585 1017637 1202455 1471991 1351057 1131182 1262330 1303087 1125876 1271671 1548944 1573981
6575 1573981 1599807 1527755 1351005 1389055 1545420 1192944 1322889 1508720 1563091 1220725
6565 1220725 1063850 1378939 1510089 1275883 1258922 1660513 1557775 1511487 1698560 1682086
6555 1682086 1796738 1837963 1653322 1645158 1825294 1675660 1713586 1864380 1687974 1589693
6545 1589693 1605060 1723184 1538110 1519356 1582911 1587114 1668362 1773272 2016707 1831186 1907661
6534 1907661 1951694 1891499 1860507 2030961 1891375 1725270 1785001 2007663 2239670 2057214
6524 2057214 1771325 1680153 1919974 2091144 2257967 2113102 2186582 2447000 2235763 2256350
6514 2256350 2333013 2493403 2517239 2768816 2665217 2754159 3040413 2573644 2749376 2874380
6504 2874380 2743107 3037239 3188073 3155218 3494051 3630900 3665614 3646325 3699696 3784608
6494 3784608 3728683 3973757 4227273 4119888 4012865 4270041 4372232 4212188 4757328 4815215
6484 4815215 4695625 4882996 4982842 5269451 5293565 5397901 5667324 5976845 6338982 6317476
6474 6317476 6361360 6740893 6877894 6981018 7384595 7501711 7454461 7865221 8163691 8342358
6464 8342358 8667559 8657640 8719812 8961854 9282359 9476291 9812557 10074954 10438439 10824691
6454 10824691 11014842 10933339 11316928 11586072 11837836 12148277 12685532 13033049 13254047 13452557
6444 13452557 13629106 13882403 14301478 14612000 14603713 14798030 15044278 15333311 15540110 15879488
6434 15879488 16093500 16555120 16597022 16659209 16789195 17237167 17407067 17610537 18044560 18308608
6424 18308608 18234872 18635835 19251314 19542855 19544445 19820552 20157829 20370905 20829414 21262567
6414 21262567 21260246 21361300 21554608 21940378 22198161 22402891 22684986 22725095 22830025 23277522
6404 23277522 23618896 23737802 23769574 24098683 24350789 24466127 24857773 25077838 24846285 24702650
6394 24702650 25008457 25232106 25479537 25683507 25702345 25369060 25304560 25357030 25542762 25697604
6384 25697604 25698287 25288967 25622532 25623149 25927863 25800568 25873481 25862461 25890197 26200682 26470831
6373 26470831 26678941 26611993 27032867 27335858 27738647 27985480 28420397 28699706 29275377 30139157
6363 30139157 31086794 31554708 32443204 33404671 34268631 35622449 36895578 38415150 39920811
6354 39920811 41559303 43746709 45791026 47943428 50273691 52368048 54839019 57370974
6346 57370974 59900879 62291385 64218489 65920619 67819169 68977755 69944719 70609449
6338 70609449 70772619 70817316 70510964 69636837 68920958 67915928 66918072 66343516 65442661
6329 65442661 64608093 64091450 63881670 63081755 62361760 61968787 61477155 60583653 59325888
6320 59325888 58169589 56821131 55417135 53800838 52378748 50835299 49042333 47440154
6312 47440154 45817175 44174924 42708621 41246516 40035256 38995928 37666718 36507109
6304 36507109 35590266 34606601 33430599 32761885 31821514 30493519 29437752 28767537 28053540
6295 28053540 27138552 26313607 25524491 25027462 24558009 24162930 23567619 23143999 22871176
6286 22871176 22242281 21612263 20950555 20439989 19669787 18948325 18265842 17360412 16695363
6277 16695363 16097351 15349339 14661294 14204452 13549402 12886053 12503183 11784745 11266131
6268 11266131 10876377 10539332 10061994 9746062 9372467 9203175 8871743 8623832 8286130
6259 8286130 8082191 7998825 7979614 7798759 7467729 7428480 7361952 7320999 7331284 7047677 6959529
6248 6959529 6653624 6612412 6368844 6121693 6131403 5980943 5947401 5535272 5447835 5637901
6238 5637901 5246374 5078387 5091514 5148452 5123171 5054538 4865453 4739103 4853144 4593143
6228 4593143 4494541 4355218 4446932 4405200 4338531 4372430 4216627 4109944 3981663 3911304 4109496
6217 4109496 4241737 4286365 3999306 3816862 3622111 3593379 3457637 3112498 3138329 2977462
6207 2977462 3187759 3092807 2988887 3078452 2758139 2597996 2305859 2165158 2189108 2182861
6197 2182861 2180276 2299246 2354486 2312746 2242174 2042191 1785224 1818131 1975605 1821560 1803794
6186 1803794 1881381 1836321 1768392 1570090 1387666 1346150 1384751 1306526 1512155 1524265 1611407
6175 1611407 1611232 1557219 1535513 1544195 1409838 1763551 1699386 1370326 1258455 1706942 1548404
6164 1548404 1282863 1231722 1320847 1486808 1381315 1496315 1334914 1432614 1494903 1343104
6154 1343104 1307066 1115439 1203461 1169800 1027834 941162 1070737 1072455 1102555 1266822 1159081
6143 1159081 1187744 1280196 1369011 1317125 1283845 1291690 1093302 954272 976002 1322536 1163244
6132 1163244 1094082 1258809 1000423 951758 1078773 971465 930638 823871 967121 992046
6122 992046 908962 848981 1337882 1208154 979263 1039514 892402 895619 677469 847051 993227
6111 993227 1181148 1262677 999400 865003 866397 654833 964222 811570 962991 1029969
6101 1029969 1061246 934965 777008 819905 855471 675297 458428 566302 569617 483960 699485
6090 699485 619493 884980 718242 890693 493865 474483 720084 767283 870796 928410
6080 928410 962612 771742 703655 1117335 991224 775018 914332 863074 902020 1194070
6070 1194070 900150 666297 849274 863352 953339 760887 479506 737095 819390 496637
6060 496637 709459 773429 606256 601566 780381 940152 933135 1089982 903969 863167 822819
6049 822819 734188 1053795 814238 673071 741841 1009993 856303 817540 699900 673904
6039 673904 557871 450088 759209 962930 565959 662135 652210 701551 892641 831309 766446
6028 766446 909869 1017962 969085 976263 1038024 1008520 1129009 1249258 1216880 921349 884787
6017 884787 998698 1062734 1323074 1271965 1257679 901736 768961 906331 797142 1004109
6007 1004109 1217873 1086345 1073787 1032558 1126931 1167835 1205568 1163992 1053625 945595 912121
5996 912121 790050 793363 679710 568319 745954 883383 801137 916857 1044870 934935
5986 934935 1047897 851825 859529 1039973 1086901 807690 713885 913760 1306881 1205042
5976 1205042 949574 909120 887870 723485 791928 960104 829907 762774 717487 741699 1117402
5965 1117402 1234763 946797 1123522 1071280 992252 1104692 1002241 907526 983707 871727
5955 871727 479054 584197 667610 617677 713752 760172 915581 692766 502256 784408
5945 784408 1009173 857184 734746 728216 410859 830245 1031295 987680 852126 1073794
5935 1073794 1222433 1131560 1212263 1061821 962479 623583 537566 969225 1080823 957128
5925 957128 1044001 915757 964428 1066653 752353 433377 404984 658250 679271 730998 908610
5914 908610 894667 795459 590739 471998 676785 717025 790582 769581 601684 693445 806717
5903 806717 651614 723872 526034 342959 634597 653209 794399 817122 827808 732836 1091354
5892 1091354 870717 867923 892187 778728 643557 672543 710327 638633 1229980 1154108 1034724
5881 1034724 991462 926668 1013170 837804 994751 957915 968801 885775 955043 896765 867278
5870 867278 958025 998502 875074 885752 1136624 1164114 978661 905683 1111789 1182435 715025
5859 715025 969103 1093283 923882 935857 966302 1226587 1344212 1263011 1059139 992274
5849 992274 884136 988126 1201180 1131276 1109799 1198254 1290137 1299538 1293466 1279033 1247701
5838 1247701 1286758 1225873 1059435 992424 1006253 1185844 1223017 1267896 1453390 1329977 1265949
5827 1265949 1272852 1584981 1716890 1539889 1657812 1529288 1395795 1464137 1235012 1385969
5817 1385969 1583154 1650040 1732704 1755293 1759356 2028367 2051054 2473142 2056158 1933038 1877193
5806 1877193 1921149 2038647 2062828 2248217 2021674 1934881 2182620 2377786 2340852 2304964
5796 2304964 2156895 2435117 2587310 2697619 2936508 2957648 2958162 3081392 3218702 3490674
5786 3490674 3613423 3604029 3725244 3929194 4172044 4307817 4492345 4798654 5309796 5823201
5776 5823201 6250864 7017466 7640272 8665917 9764210 11155257 12537442 14168963 16339708
5767 16339708 18917511 23393283 31292395 43419795 56885773 69439035 77438568 78430477
5759 78430477 75162278 68551198 58630493 47930585 38915811 31431284 25042395 19930454
5751 19930454 15836657 12989563 11179751 9756032 8956891 7803355 6976021 6352568 5588123
5742 5588123 5233609 5265243 5180248 4940332 4692257 4546996 4304781 4137974 4090376 3717930
5732 3717930 3592316 3574741 3333627 3181882 3212695 3236155 3044266 2892731 3022087 2725346
5722 2725346 2591412 2538150 2753004 2796634 2429152 2165477 2099274 2338618 2345497 2085940
5712 2085940 1913196 1905250 1931712 1958715 2025265 1771622 1747266 1855932 2016987 2202720 2095382
5701 2095382 1871758 1927054 2118271 2048660 1994170 1838743 1727820 1809601 1785308 1741157 1535517
5690 1535517 1748466 1755036 1321047 1182921 1506953 1704425 1366028 1407158 1554070 1545054
5680 1545054 1377593 1387149 1195625 1299255 1536626 1615950 1417961 1382186 1371889 1231191
5670 1231191 1459515 1114202 1129512 1166037 1192281 1280598 1396520 1779479 1710346 1511659
5660 1511659 1734150 1349042 986955 1043597 914777 1045374 1307275 1250059 1088012 967582
5650 967582 977823 941110 1408443 1726331 1551455 1449559 1388373 1346208 1452037 1512857 1529844
5639 1529844 1561083 1272654 1408302 1173058 1142057 1365877 1422671 1465616 1486422 1742699
5629 1742699 1762424 1472353 1452904 1176616 1186443 1156963 1489640 1535862 1546279 1252557 937637
5618 937637 1128780 1462706 1488070 1185445 1262342 1222043 1368590 1076468 1096769 1241942
5608 1241942 1361551 1167568 1223757 1422249 1579783 1805514 1604493 1335802 1301524 1211806
5598 1211806 1251829 1511197 1406582 1706599 1752742 1524119 1398261 1450461 1598648 1426490
5588 1426490 1212425 1205566 1167693 977477 1082404 1294264 1039165 979279 957777 1231353
5578 1231353 1527681 1546215 1559610 1705232 1439422 1147929 1466902 1463467 1328955 1177214
5568 1177214 1434334 1581896 1427642 1374434 1410666 1199900 1294171 1531116 1287930 1335841
5558 1335841 1489278 1534728 1498678 1636024 1774861 1633620 1415431 1450635 1513901 1437035
5548 1437035 1435679 1355147 1506575 1555503 1580775 1733838 1837755 1779333 1492388 1680730 1784536
5537 1784536 1742298 1427093 1188781 1559402 1497305 1590140 1529582 1704963 2002170 1846190
5527 1846190 2024255 1911158 1882367 2052551 2021455 1988086 2023357 1961388 1864574 1734113 1765327
5516 1765327 1935629 1736551 1659638 1665098 2011148 1974201 2083030 1915221 1799648 2002373
5506 2002373 2137446 2170609 2156872 2371689 2275137 2165694 2178525 2169554 1959695 2018181 2231676
5495 2231676 2295688 2148331 2179600 2262862 2428788 2572815 2860201 2726517 2340541 2375483
5485 2375483 2412336 2532512 2808726 2736304 2581692 2634490 2624329 2299686 2515124 2786140
5475 2786140 2462368 2737761 2915759 2942311 2968877 3059914 3056871 3122267 3248748 3234521 3191808
5464 3191808 3136303 2993721 2945493 3000741 2978433 2975072 2931000 2541959 2915155 3262038 3119415
5453 3119415 3246153 3237839 3558086 3496483 3404300 3363021 3180697 3385743 3499485 3558819 3958681
5442 3958681 4101015 4103400 4294624 4433264 4731880 4333042 4161042 4420264 4074126 3813319
5432 3813319 4256873 4514692 4567628 4799392 4648569 4633642 4732417 4865676 4795735 4966285
5422 4966285 5358203 5218053 5323448 5326776 5501765 5465920 5594183 5453216 5352451 5387881
5412 5387881 5424711 5784405 6157829 6158468 6255014 6420141 6691838 6718253 6741281 6983828 6643288
5401 6643288 6829887 6835006 7028637 7158529 7267257 7345955 7294009 7462164 7574044 7924680
5391 7924680 8366744 8368496 8447559 8493731 8970911 8949265 9110104 9109564 9218294 9416174 9543808
5380 9543808 9557599 10015294 10243555 10445979 10365454 10372324 10900997 11059420 11482145 11695115
5370 11695115 11549345 11625334 11699479 11669887 12110172 12356927 12501145 12875232 13036161 13288339
5360 13288339 13275478 13284235 13423048 13249970 13435372 13689915 13903438 14161583 13962419 14038688
5350 14038688 14051530 14227088 14236078 14085283 14194526 14612249 14581637 14132138 14137036 14090236 14013610
5339 14013610 14245442 14449111 14228089 14303068 14397702 14436946 14469386 14670774 14741197 14866959
5329 14866959 14603395 14594418 14946668 15121190 15224380 15411789 15600603 15672443 15386615 15256433
5319 15256433 15437987 15894098 16150290 16257368 16559014 16916243 17260404 17517719 17331466
5310 17331466 17547524 17673792 18040648 18286004 18385951 18446429 18739535 18991179 19146168 19235332
5300 19235332 19358632 19711630 19810754 19626195 19778786 19961685 19953349 20104245 20292324 20208795
5290 20208795 20333522 20310104 20323959 20631257 20778050 20664373 20300702 20273817 20261544 20311862
5280 20311862 20386506 20461381 20664711 20731115 20788128 21045676 21098663 21082044 21175671 21225946 21492689
5269 21492689 21606379 21897384 22099669 22272994 22586119 22727426 22912081 23260439 23726980
5260 23726980 23995019 24147152 24194985 24690834 25036215 25221755 25894673 26201250 26396534 26716652
5250 26716652 26911255 27451386 27990452 28440085 28941850 29792813 30149335 30571280 31167558
5241 31167558 32279312 33156027 33844624 34484051 35140775 35755965 37104757 38448880 39521952
5232 39521952 40664249 41418930 42359824 43698033 45197620 46427022 47777736 49433147
5224 49433147 51041347 52658567 54373237 56462730 58532640 60416074 62596962 65282359
5216 65282359 67788165 70291380 73049769 76122055 79125437 82255464 85693026 89223419
5208 89223419 92707011 95939377 99606234 103204087 107084682 111277176 114976141 118612719
5200 118612719 122270191 125868609 129212847 132216760 135052450 137096748 138799694 140303452
5192 140303452 141375180 141754518 141478124 140697035 139214297 137282168 135335424 133071165
5184 133071165 130407869 127530664 124421062 121091405 117808960 114159665 110559663 107195388
5176 107195388 103829553 100681903 97797720 94541733 91329730 88365081 85467855 82865988
5168 82865988 80466313 78014428 75922502 73615135 71636798 69927110 68173077 66505606
5160 66505606 64932061 63593248 62257162 60652821 59385439 58195571 57128959 56586938
5152 56586938 55265924 54217690 53166949 52367975 51727239 51201893 50485769 49673412 49018173
5143 49018173 48397396 47772568 47540661 46759189 46182037 45908779 45465378 45050620 44355927
5134 44355927 43978104 43580674 43217195 42939179 42687466 42296097 41733846 41257122 40805667
5125 40805667 40240128 39684866 39106712 38979044 38456085 37933940 37747145 37488250 36667037
5116 36667037 36152154 35734812 35005437 34744446 34031965 33502213 33654591 33013584 32835556
5107 32835556 32433546 32032433 31393466 31200394 31138550 30598973 30408754 30247736 29959313 29616895
5097 29616895 29035685 28684894 28761583 28496192 28177636 27715070 27533981 27399575 26973914 26417792
5087 26417792 26140998 26009887 25931929 25792049 25521163 25323793 25236275 25011733 24678654 24491714
5077 24491714 24439775 24137997 23801729 23759230 23965814 23852477 23392313 22962663 22926464 22673982
5067 22673982 22456069 22288215 22138852 21672938 21505660 21474317 21414632 21309069 21132769 21176349
5057 21176349 20844998 20562913 20722554 20813585 20410758 20140172 20155555 20021097 20065432 19910994
5047 19910994 19962672 19812404 19944110 19879535 19651272 19682124 19794003 19726071 19449151 19279205
5037 19279205 19192069 19243281 19520265 19294656 19239700 19159603 19339640 19085662 18706354 18651860
5027 18651860 18414439 18490963 18255827 17878886 17726781 17758501 17643331 17546786 17460164 17338629
5017 17338629 16870979 16537548 16366841 16560154 16289051 16151075 16350290 16156216 15655616
5008 15655616 15597848 15680543 15593640 15525392 15260277 15143164 15264132 15237471 15286162 15081304
4998 15081304 15164178 14796907 14975289 15309557 15438654 15739178 15896064 15990468 16222248 16355650
4988 16355650 16357162 16203255 16162648 15981040 15611456 15270385 14993232 14619056 14331962 13871494
4978 13871494 13690006 13257109 13060681 13244962 12806317 12427176 12175626 12195809 11920979 11538565
4968 11538565 11384872 11058043 10828367 10550592 10405851 10273837 10035757 9953440 9518726 9342341
4958 9342341 9532926 9088369 8471008 8309608 8097584 8117973 8248332 8264270 8021160 7686787
4948 7686787 7713006 7598202 7597705 7633687 7211256 7104865 7118620 6734546 6797481 7033998 7093237
4937 7093237 6894450 6773438 6866545 6890829 6638499 6416817 6377891 6225178 6382248 6340246
4927 6340246 6188999 5786628 5692052 5560686 5697175 5556710 5488425 5015126 5145010 5077616
4917 5077616 4862080 4502963 4202901 4351551 4364028 4187233 4076474 4286092 4071192 3949271
4907 3949271 3885804 3513136 3599717 3848514 3675065 3471382 3741792 3747426 3547847 3274511
4897 3274511 3229260 3151616 3137109 3484927 3398315 3160226 3033595 2996026 2774595 2967457
4887 2967457 3030621 2997786 2826934 2815967 2801087 2762473 2922345 2817210 3097047 2937295
4877 2937295 2538523 2535458 2906297 2921454 2863181 2817281 2614002 2640377 2641503 2796956 2730831
4866 2730831 2853275 3002923 2943246 3141532 3051470 2884236 3072331 3031917 3047641 3098081
4856 3098081 3319616 3474677 3685006 3913010 4364522 4899902 5073980 5265929 5659889 5722681
4846 5722681 5755746 5630494 5995723 6238830 6523396 6420889 6434829 6943755 7213628 7659637
4836 7659637 8509282 9095245 10356153 11704235 13010329 15614199 19780520 26978169 36599556
4827 36599556 46072249 53825305 56580506 55472919 51644589 45533354 38294202 30950200
4819 30950200 25422475 20624145 16627580 13250991 10852647 9236554 8155149 7415609
4811 7415609 6657101 6123210 5866287 5195248 4631070 4429437 4550046 4400653 4306968 4187112
4801 4187112 3888249 3654998 3875946 3628196 3413521 3118995 3081431 2749872 2376756 2678844
4791 2678844 2857022 2771679 2713970 2676800 2436453 2118961 2040318 2275717 2388435 2261728
4781 2261728 2085882 2072472 1871293 1776886 1681671 1701175 1963486 2026344 1688703 1715891 1818968
4770 1818968 1746033 1604025 2048691 1978776 2046157 1892187 1611144 1624788 1872415 2012991
4760 2012991 2054390 1809047 1589012 1634994 1666547 1652643 1499284 1302646 1276777 1239569 1388322
4749 1388322 1481646 1345568 1476117 1477312 1541620 1456352 1369963 1170916 1297019 1548162 1482880
4738 1482880 1668587 1592768 1672349 1646315 1415905 1175254 987562 1090573 1255278 1498772
4728 1498772 1409694 1442268 1445223 1417382 1243213 1491112 1513627 1692815 1690956 1422858 1370253
4717 1370253 1414731 1181899 1483488 1462305 1002566 1293956 1183379 1374592 1387009 1249682
4707 1249682 1464453 1540980 1437161 1159039 1340347 1380700 1314146 1467324 1448178 1451965 1519100
4696 1519100 1419377 1214207 1210865 1145976 1210372 1414713 1410447 1281594 1125890 1130702 1415945
4685 1415945 1579646 1571810 1527565 1737789 1594358 1328893 1507650 1618912 1797858 1397498
4675 1397498 1506407 1557124 1964941 1951082 1821093 2135247 2050361 2008221 1661836 1672090
4665 1672090 1952624 1886229 2045496 2157667 2124824 1987572 2074754 1900301 1982161 2036194
4655 2036194 2198913 2368149 2227800 2348501 2042934 2009302 2151486 2412792 2361175 2576374
4645 2576374 2588634 2752953 3049810 3124456 3306773 3398778 3480388 3894661 4446582 4591948
4635 4591948 4605087 5084530 5518731 5869401 6166521 7040801 8385549 10681983 13491778
4626 13491778 16406778 18764628 19615434 19788367 19342742 17995615 16090340 14481797 13111985
4617 13111985 11896647 11244062 10790426 10588121 10861552 11534844 12770860 14095247 15767808
4608 15767808 17696222 19262172 20657233 21844818 23020665 24510619 26485557 28927428
4600 28927428 31520691 33910174 35520859 36576261 36973492 37675640 39077175 40751791
4592 40751791 42908356 44858240 45698894 45604140 44798095 43561536 42172197 40748639 39978036
4583 39978036 39650990 38749222 37211123 35106822 32430525 30433598 28537606 26542609
4575 26542609 25073103 23634044 21844319 20132697 18242039 16352004 14658019 13075309
4567 13075309 11360048 9978497 8754298 7760016 6781178 6265627 6006198 5371480 4734839
4558 4734839 4652434 4756588 4445742 4416577 3989112 3706318 3907462 3682683 3316448 3248530
4548 3248530 3387524 3090468 2921426 2987521 2931635 2931067 2801211 2764652 2695058 2357894 2361213
4537 2361213 2438034 2269193 2357703 2406229 2486648 2512798 2335087 2048647 1895258 2017481
4527 2017481 2273630 2207638 1972954 2010924 2315455 2146285 2261256 2099821 1848720 2320409
4517 2320409 2556973 2672457 2543316 2636718 2895995 2908669 3108568 2907992 2906061 2518180
4507 2518180 2438232 2318393 2072454 2170191 2037341 2052916 2152986 1983198 2037243 2054777
4497 2054777 1856245 1917047 1709522 1655355 1749915 1800318 1606833 1471395 1804532 2021944
4487 2021944 2078514 1827591 1722140 1795613 1761408 1697246 1848573 1872925 1608190 1667556 1526893
4476 1526893 1480957 1592280 1780185 1689459 1301111 1399811 1414668 1567483 1522467 1277824
4466 1277824 1407938 1373627 1420588 1346225 1212194 1158863 1219661 1232100 1403611 1503244 1313880
4455 1313880 1435563 1353319 1005831 1314318 1612293 1262241 1082040 1169056 1315692 1306886
4445 1306886 1411582 1741838 1455153 1648573 1731942 1627275 1320762 1558391 1625833 1519958
4435 1519958 1803605 1821582 1840854 1434395 1438181 1467699 1362886 1298136 1389647 1279528 1170645
4424 1170645 1179158 1326163 1414638 1183726 1077857 1075121 1222123 1259171 1104804 1070995 1111235
4413 1111235 1229776 1308054 1520351 1224328 1255883 1241827 949395 1314155 1533358 1461452
4403 1461452 1654434 1587511 1458380 1437868 1648700 1697825 1647252 1557052 1402982 1605445
4393 1605445 1680123 1653420 1812381 1919442 1533565 1700505 1940345 1721921 1654979 1711613
4383 1711613 1741187 1696260 1510801 1512174 1768143 2043407 1992551 1965206 1668326 1931415 1929502
4372 1929502 1924487 2344365 2132223 2206062 2029410 1935292 1956117 2047282 2227292 2223131 2324789
4361 2324789 2504951 2694405 2495274 2552390 2346888 2313682 2612716 2970483 3040137 2886994
4351 2886994 2783158 2973655 3065508 2909018 3125041 2941982 3114784 3021526 2942202 3067692
4341 3067692 3321691 3365856 3405657 3408497 3564884 3857943 3813550 3780747 3729809 3996262 4223396
4330 4223396 4261303 4236461 4750605 4955232 4713538 4806564 4912063 5101873 5126815 5246138
4320 5246138 5397697 5556650 5758433 5710981 6095040 6319691 6364428 6337946 6446690 6851261
4310 6851261 7041104 7120297 7236820 7568417 7783925 8078553 8198559 8501812 8452211 8578489
4300 8578489 8825548 9013694 9387096 9430742 9722185 9787267 9852355 9807618 9927424 10148108
4290 10148108 10391940 10686580 11169816 11405536 11197571 11393639 11897448 12114549 12146893 12547467
4280 12547467 13225149 13721945 14089524 14090760 14580001 14915285 15222686 15172624 15317847 15827119
4270 15827119 16096260 16086016 16390301 16282289 16645338 17107004 16906424 17161755 17539790 17866298
4260 17866298 17990237 18155302 18248534 18523921 18766268 18983466 19489084 19752625 20093424 20604312
4250 20604312 21335614 22200226 23107759 24195503 25403251 26435856 27980819 29866787 31837155
4241 31837155 34000953 36145245 38858750 41525108 44593307 48703359 53364074 59083278
4233 59083278 67033775 79156610 100562482 135573403 179001399 220622108 252690100
4226 252690100 261078412 252389559 234122317 205699683 172491352 142941382 118074474
4219 118074474 97319118 80765993 67367484 57523336 51645217 47881992 44393672 41255850
4211 41255850 38479667 36099272 33995551 32397438 30951582 29954223 28900104 28189747
4203 28189747 27216723 26680444 25887303 25373346 24876809 24412539 23915627 23463103 22941898
4194 22941898 22453618 21707171 21300510 20727051 20041191 19560443 19234581 18766206 18591628
4185 18591628 18441822 18086136 17807325 17371059 16618968 16527518 16456947 15849089 15151852 14884692
4175 14884692 14698803 14715822 14442835 14289664 14424636 14345158 14113649 14017509 14026091 13940710
4165 13940710 13666639 13227535 13322264 13336107 13152068 12789198 12659955 12464516 12339104 12241144
4155 12241144 11853072 11532845 11220790 11101778 11136387 11132341 11136576 10964222 10902282 10661529
4145 10661529 10714805 10678965 10487407 10235592 10078072 9776455 9285811 9146684 8806309 8617605
4135 8617605 8560556 8270217 7576301 7613011 7795521 7751070 7597370 7560582 7165658 6767686
4125 6767686 6296951 5804058 5760070 5578294 5566784 5593498 5627933 5336482 5045994 4936440
4115 4936440 4803504 4722114 5003757 4692152 4459278 4307640 4226625 4091494 3830034 3931728
4105 3931728 4159527 4167307 3956993 3973254 3807738 3914653 3744355 3756341 3613059 3562315
4095 3562315 3682799 3669139 3355613 3571950 3665648 3869245 3976447 4007863 4318981 4135770
4085 4135770 4018392 3982624 3891564 3678998 3701762 4118191 4319487 4059227 4267654 4067273
4075 4067273 4046749 4249310 4304417 4205192 4368140 4282919 4382336 4700150 4827481 5088402
4065 5088402 4957167 5221061 5588896 6020281 6246451 6702399 7543361 8847951 10726000
4056 10726000 12517668 13785838 14699437 14374079 13218855 12466637 11254841 10124345 9077795
4047 9077795 8359714 7791865 7112491 6972104 7065897 6428086 6435019 6452170 6282407 6199807
4037 6199807 6042063 6153786 6277084 6527466 6297320 5966800 5941496 5947511 5905860 6103906
4027 6103906 5843421 5663185 6010646 6192083 6112615 5915021 5883083 5864630 6016029 5997067
4017 5997067 5800058 6062854 6151509 5932928 6220059 6268239 6305327 6132491 6227803 6612615
4007 6612615 6562279 6528094 6772115 6864972 6652715 6645525 7077390 6863564 6840411 6880404 6951836
3996 6951836 7133130 7039486 6982973 6911992 7141279 7233859 7316461 7473809 7291317 7252459 7640830
3985 7640830 7843146 7736903 8004209 8240740 8218037 8502925 8914630 8774341 8890296 9560868
3975 9560868 9846123 9810692 10123656 10725373 11338183 11638674 12126979 12695816 13083760 13544017
3965 13544017 14485686 15538054 16340579 17255422 17848409 18458441 19535539 20520131 20912686
3956 20912686 21734358 22597294 23912229 25265691 26819261 29101669 31778776 34107109
3948 34107109 35665374 36677858 37522599 37780533 38144076 38595596 39032091 39024657 38940260 39156355
3938 39156355 39315591 39337955 39338774 39090527 38973469 38976642 39003517 39307419 39651503 39616108 40227190
3927 40227190 41169045 41727394 42874561 43834038 44792274 45714862 46967241 48214063 49487483
3918 49487483 50568987 50855093 50207030 48936814 47810158 46437532 45040681 43936927
3910 43936927 42823114 42018301 41691388 41113244 40318393 39598683 38797803 38136536 37455613
3901 37455613 36179906 35410786 34690611 33687261 32691851 31882056 31404909 30728554 30254835
3892 30254835 30427540 30587811 30807175 30979013 30999758 31208632 31624688 31597572 31899431 32424800
3882 32424800 32579451 32615269 32612814 32681118 32829309 33142978 33328237 33583412 34202168 34678584
3872 34678584 34864861 35096712 35322040 35723972 36420889 36734198 37056430 37468403 37426014 37659574
3862 37659574 37829674 37939670 38218747 38627516 38938603 39138869 39518096 40148528 40927396
3853 40927396 41325833 41911189 42848542 43478614 43653564 43835872 44607641 44785976 44658259
3844 44658259 44117555 43680843 43455402 42793236 42072132 41429197 40840196 40332783 39768488
3835 39768488 39291843 38769745 38273756 37843946 37257941 36856213 36674563 36458298 36235066
3826 36235066 36374862 36103855 35960228 35674766 35180514 35033332 34735178 34525783 33671824
3817 33671824 33090942 32549931 32376548 31989680 31669774 31586901 31237867 30881264 31096023 30811264
3807 30811264 30435926 29920846 29562995 29204329 28729242 27702756 26938556 26471702 25833505
3798 25833505 25400606 24694735 24514473 24309863 23923929 23477562 23139099 23130786 22925677 22936216
3788 22936216 23071653 23260252 23468650 23058894 23253415 23293843 23291337 23337408 23560317 23483519
3778 23483519 23472562 23535910 23664633 23323580 23467040 23706034 23657243 23624720 23571677 23468860
3768 23468860 23496604 23551045 23307028 23151635 22794103 22535300 22113152 21936413 21873132 21404287
3758 21404287 21064817 20613624 20392388 19937007 19503498 19077932 18363730 18063639 17982676 17562883
3748 17562883 17150251 16968515 16736233 16476806 16106444 15822941 15608561 15426075 15337917 15160450
3738 15160450 15473046 16020036 15918282 16002783 16078760 16128437 16457571 16779722 17143596 17754952
3728 17754952 18068762 18807061 19305892 19614095 20284897 21008841 21509311 21808592 22266401
3719 22266401 22559598 22795548 23132314 23286762 23470010 23356387 23457852 23470857 23354610 23527063
3709 23527063 23565389 23504640 23354187 23518494 23136210 22823851 22599633 22186819 21475504 20914159
3699 20914159 20236577 19769811 19035779 18134304 17392647 16595057 15718021 15047992 14716390
3690 14716390 14304779 13679992 13372478 13278845 12830571 12581878 12373307 12026791 11873828 11731454
3680 11731454 11525398 11511108 11822210 12092886 12102645 12311963 12173345 12333655 12271823 11735818
3670 11735818 11773569 11990976 11555985 11526139 11720977 11517264 11406522 11033180 10785021 10599360
3660 10599360 10712324 10597199 10310528 9630671 9212372 9058895 8786744 8908412 8562178
3651 8562178 8292461 8276436 8111613 8079682 7876277 7856465 7905701 7700082 7512492 7636301
3641 7636301 7928064 7787021 7703122 7713946 7820708 7906507 8017578 7944027 8056264 8543718
3631 8543718 8734155 8744328 8435523 8430665 8747965 8964456 8726763 8719451 8677907 8562327 8698267
3620 8698267 8552263 8723653 8980214 9032730 8820750 8642893 8610058 8652324 8653674 8693476 8827416
3609 8827416 8936208 8905602 8597048 8507633 8682401 8626104 8739824 8760537 8743255 8450743
3599 8450743 8513814 8386693 8328955 8347367 8562303 8589535 8578498 8679867 8660086 8822127 8852456
3588 8852456 8733777 9056163 8948921 9198268 9277976 9320327 9695962 9640881 9822370 9968735
3578 9968735 10072103 10336037 10469612 10377344 10422463 10503116 10761506 10730022 10932713 10766728
3568 10766728 10773099 10540168 10719078 10891065 10841707 10905248 10825562 10759111 10831134 10902615 10957208
3557 10957208 10885630 10925062 10790965 10859391 10958162 10941848 10705452 10654630 10973976 10867128
3547 10867128 10807906 10718521 10652931 10669737 10313063 9941094 9893111 9626907 9493430 9169165
3537 9169165 9140523 8951366 8810074 8688359 8639127 8576240 8706140 8538707 8210140 8376514
3527 8376514 8637459 8372710 8036439 7867492 8180415 8272693 8407555 8239835 8127775 8003815
3517 8003815 7954170 8222097 8179308 8167567 7830177 7780158 7942706 8137669 8480415 8252808
3507 8252808 8075862 7945997 7843542 8035644 7688306 7970682 8147317 7909829 7751281 7935604
3497 7935604 7982367 7970359 7811765 8286111 8374628 8118742 8066427 7867791 7581477 7766100
3487 7766100 7771056 7971758 7857129 7815533 7979931 7972446 7810368 7684943 7456969 7618908
3477 7618908 7727046 7554409 7546606 7738706 7793494 7731250 8118336 8160097 8075609 8189353 8538326
3466 8538326 8671629 8909515 9185479 9603157 9923082 10215378 10795294 11235143 11536374 11646079
3456 11646079 11980878 12791237 13015884 13071657 13396307 13793760 14108740 14135011 13626194 13371027
3446 13371027 13385194 13403540 13506453 13386009 12784117 12933897 12839981 12615544 12651214 12491248
3436 12491248 12477973 12596053 12709829 12848743 13341064 13773602 13952075 14087721 14171385 14851160
3426 14851160 15592985 16049989 16776848 17783271 18418807 19444164 20480004 21011451 21956684
3417 21956684 22649510 23389347 23568272 23936986 24334518 24772203 25078497 25026438 25269930 25367380
3407 25367380 25706526 25914798 25887862 25530971 25607547 25503218 25167520 24878589 24279566 23548857
3397 23548857 23449306 23058218 22613419 22435168 22115028 21950972 21913397 22246801 22272376 22415278
3387 22415278 22708982 23458507 23791026 24335029 25251306 26344451 27583476 28942123 30469424
3378 30469424 31888557 33116066 34830619 36876098 38674235 40421712 42058429 43734089
3370 43734089 44993406 46192731 46848781 47238532 47495595 47289935 46606763 45649753 44601238
3361 44601238 43111373 41468801 39965253 38600877 37281150 35683449 34238623 32836891
3353 32836891 31638981 30666463 29719818 29172484 28772571 28459433 28235577 27871053 27535348
3344 27535348 27492518 27692500 28058333 28066531 28055163 28366940 28562932 29042304 29483889 29717018
3334 29717018 30133936 30134641 30474358 31061558 31399048 31195993 31090640 31236353 31382073 31697132
3324 31697132 31867614 31935034 32252629 32203398 32570509 33179503 33505647 34157315 34747332 35808966
3314 35808966 36910556 37924856 39289118 41095158 43105379 45692673 48286724 51239178
3306 51239178 55091807 59623958 64871756 70878370 78239287 86552970 96196929 106427234
3298 106427234 116556519 126065642 133655788 138229668 140085911 140084417 138589701 136579539
3290 136579539 134228823 132763069 132578922 133556740 135627373 137669311 138986510 138898512 136346315
3281 136346315 132056891 125656652 117648360 109286170 100876581 92389013 83831102 76083544
3273 76083544 69281655 63612264 58341826 53686583 50001369 46769538 43701650 41272176
3265 41272176 39395286 37420404 35711012 34440627 33116885 32075516 31563453 30946940
3257 30946940 30661574 30109202 30209632 30331335 30448036 30926026 31414659 31677564 32459612
3248 32459612 33365784 34575865 36162530 37886268 40056148 42720949 45577907 47979463
3240 47979463 49943346 51029860 51511443 51013213 50047914 48410614 46690565 44938577 43228043
3231 43228043 41420652 39827851 38782965 38268195 38136912 38516689 38856949 39327676 40383724
3222 40383724 41828384 43589193 46045850 48736343 51723149 55494112 60075307 65402394
3214 65402394 71538983 78819494 87390904 96514404 106458645 117452719 128764289 140184230
3206 140184230 151202554 161118037 169677124 175945766 180486644 183116005 184302895 184351420
3198 184351420 183163029 180563109 176679939 170795561 163075342 154016353 143517039 131922202
3190 131922202 120201977 108952451 98207011 88356297 79243513 71542494 64967163 59263422
3182 59263422 54049299 49770781 45876931 42801921 40277116 37991788 36110951 34531988
3174 34531988 32839654 31518339 30523364 29334423 27977113 26989617 26079901 25142356 24294093
3165 24294093 23425338 22589651 21934063 21369730 20652189 20408014 20082086 19346676 19168787
3156 19168787 18942725 18583041 18533779 18422070 17980370 17612930 17697852 17643768 17466348 17331484
3146 17331484 17057653 17178618 17234332 17293150 17267308 17148347 17142729 17082776 17267114 17205970 17284968
3135 17284968 17355350 17531282 17719774 18078581 18475942 18597098 18901532 19281553 19664016 20340054
3125 20340054 21271820 21800447 22433007 23437695 24178604 25102884 26602517 28110088 29651857
3116 29651857 31105679 32748748 34790684 37581540 40756443 43878659 47257439 51507020
3108 51507020 56417362 61767606 67372876 72956866 78240367 82960235 86648770 88574721
3100 88574721 89613697 89826660 89549971 89230930 88813172 88957160 89803101 91837180 95511130
3091 95511130 100058456 106119780 113889617 123465790 134529059 147090050 161353050 176493134
3083 176493134 192264938 207769907 221864977 233675817 242054159 245584146 244586011 238742995
3075 238742995 228185495 214415011 198160338 180499894 162627494 145551204 129720697
3068 129720697 115563290 102960069 91595545 82080581 73915718 67068915 60560698 55241327
3060 55241327 50775351 46512406 43173271 40086202 37522278 35339706 33300875 31407019
3052 31407019 29600052 27956424 26554713 25276527 24040418 22955472 22258813 21320748
3044 21320748 20550560 19518647 18359270 17589366 17156155 16424986 15594877 14999735 14411340
3035 14411340 13953932 13388582 13030584 12876922 12247747 11750517 11409292 11149012 10995464
3026 10995464 10614297 10248675 9978116 9620351 9467722 9131597 9023549 9010307 8872276 8780531
3016 8780531 8234952 7999094 7780860 7703906 7469340 7299295 6922629 6749837 6776943 6351003
3006 6351003 6328430 6214882 6068340 5841306 5789868 5435660 5408862 5333788 5501241 5616285
2996 5616285 5452919 5568594 5157866 4903471 4682409 4699295 4746026 4688739 4522632 4370735
2986 4370735 4300589 4270293 4209276 4151023 3786396 3455555 3419379 3603862 3781450 3491120
2976 3491120 3245305 3238067 3474175 3316781 3219018 3170206 3225740 3237626 3135730 3059110 2967727
2965 2967727 3086277 2908229 2986398 2663860 2651038 2898496 2881050 2694043 2461202 2736896
2955 2736896 2488691 2230527 2225679 2293089 2434350 2258057 2238595 2427697 2382481 2116026
2945 2116026 2091784 1940227 1585287 1567728 1594081 1657903 1831171 1570507 1550013 1660889
2935 1660889 1611073 1816881 1715484 1607112 1544719 1518468 1433237 1555449 1542879 1771935
2925 1771935 1916096 1874716 1670250 1563157 1752292 1613193 1623304 1864279 1897871 1980966
2915 1980966 2058770 1875293 1990399 1832907 1740875 1594246 1438827 1333564 1193837 1216391
2905 1216391 1211772 1008610 1038566 973802 961481 857611 577945 585434 489835 468457 605447
2894 605447 611507 713335 512416 412793 699601 788027 713898 622543 398303 272546 385385
2883 385385 436108 616670 592142 539869 557606 392423 412751 417332 337547 443590 604563
2872 604563 497801 577104 497670 605793 779943 585452 294569 554098 379274 182355
2862 182355 219575 93348 328836 305767 220335 392261 215592 84709 329058 286148
2852 286148 437887 558564 648926 543100 442538 331266 483237 564638 380902 60295
2842 60295 80308 121854 128397 310738 232430 464988 632454 708686 730725 464839 230948
2831 230948 310440 412057 400823 423320 481569 546878 500093 411129 423382 550668 544188
2820 544188 665948 896282 875757 859429 655670 684952 455604 291232 232673 253651 366319
2809 366319 487164 788447 683752 644210 498834 784332 978227 1050038 885931 1005792
2799 1005792 1099651 1186513 1224444 1219030 1647687 1505388 1181195 1316950 1374630 1215799 1120585
2788 1120585 1033499 1069295 917895 751569 737012 592437 586497 824398 855680 697676 345874
2777 345874 427495 543857 516322 551539 387864 361037 303487 303503 295057 246024 469360 327205
2765 327205 467718 449031 319165 342145 -9994 38079 4422 -39430 2542 156132 285891
2754 285891 488919 348245 218690 374529 264843 -186558 -31882 194203 354427 219894
2744 219894 72815 86671 378893 377575 129070 70920 -96714 119984 257910 162705 34373
2733 34373 27619 -67355 -16152 -59854 -147532 197876 352359 237689 -172720 -206911 71308
2722 71308 -153085 -181278 -178891 -395351 -312275 -216948 -242989 -294342 -263212 -101546 26567
2711 26567 385270 431769 287571 -13286 -68057 27225 153112 156452 209646 -110196 -150953
2700 -150953 108301 208871 375388 181041 33206 20873 158084 237909 -34469 75391
2690 75391 314165 205045 87778 37459 153761 28477 406148 332622 24025 22218 198681
2679 198681 273217 405123 647016 288172 148352 -8909 -63027 175416 351291 87806
2669 87806 122650 145720 379807 476285 390255 160802 -31333 237708 467885 373096 355032
2658 355032 208323 61536 187926 324170 242885 264966 191427 260314 285348 19379 -21092
2647 -21092 -15846 -110318 -219825 -338990 -222223 -169037 -333789 -181219 182694 127810 115628
2636 115628 148883 84810 117298 190347 28061 76945 -90275 143683 193985 -3847 209666
2625 209666 231004 86987 44509 172747 -221992 -139163 228098 316999 -27013 -5947 -151658
2614 -151658 -114130 450121 445288 214174 263268 228803 486796 397468 -80335 100040 357000
2603 357000 457572 316007 166836 403305 394091 517184 329172 427019 716851 856321
2593 856321 922403 1136876 1339944 1681754 1772243 1728975 2064539 2144318 2068283 1718842 1268875
2582 1268875 937368 702880 599630 569033 417451 403404 293485 114056 327251 552777
2572 552777 368567 127866 127008 197804 302296 200034 201789 143974 -78885 -3878 96680
2561 96680 205390 79650 13574 120617 412038 432155 295793 450633 497470 405035 125121
2550 125121 275214 300940 426503 481766 571719 321585 -45345 -7312 125350 160913 149297
2539 149297 388695 627353 561483 703443 602345 346554 239135 600784 829994 686735
2529 686735 268723 328138 552300 614121 627216 478924 467284 407726 630681 439324 638202
2518 638202 521630 414198 273121 563990 206285 210479 470438 611038 566554 375763
2508 375763 572180 519343 683834 673950 782562 714987 782304 901936 919760 680626 800287
2497 800287 731041 853970 792062 569437 625477 708993 814826 890281 925250 869660 685498
2486 685498 326394 431234 380651 425893 608939 695997 867682 727040 768420 851681 908857
2475 908857 931511 983185 958482 892332 808446 732716 857546 866834 881498 1042741 1285838
2464 1285838 983990 738959 809452 843028 589467 790078 852735 1142973 1188214 1139034
2454 1139034 1167690 800893 694334 1079888 994665 886751 924676 1005404 943039 905941 1069625
2443 1069625 921241 919492 1126954 1085343 1047966 1038209 1074537 1083646 1001526 1105331 1055905
2432 1055905 1096392 1423652 1371841 1239678 1803303 1544182 1399608 1642770 1723061 1679444
2422 1679444 1549753 1809434 1905978 1667902 1644292 1610109 1562607 1583806 1682170 1719580 1572364
2411 1572364 1874844 2103058 2161398 1963576 1759363 1888940 1973690 2118624 2185453 2305646
2401 2305646 2522341 2607632 2630663 2708840 3390030 3796052 3898443 3756980 3763114 3871790
2391 3871790 3992136 4027167 3813931 3718127 3884878 3521844 3588205 3985714 3975465 3902729
2381 3902729 4019736 4010996 3721696 3684840 4133499 4246927 4339838 4667181 4930917 5000091
2371 5000091 5178503 5825289 5973023 6135873 6213210 6500537 6866464 7013849 7319073 7412866
2361 7412866 7478047 7802732 8235618 8764423 8849956 9030447 9213948 9227096 9655165 10164813
2351 10164813 10465431 10759870 11490276 12217871 12908645 13549156 14483807 15537514 16702040
2342 16702040 18663775 21410116 24122596 27430057 31528926 35156660 38824891 41643644
2334 41643644 44991683 48162058 51876370 56842269 63854768 72660554 84766126 102273385
2326 102273385 131646912 181385655 247070946 311799780 365402923 386576962 377773955
2319 377773955 353066829 313378140 263054817 214871096 174934574 140138934 112266068
2312 112266068 89644821 73051017 62584744 56027041 51250696 47541996 43281831 39026171
2304 39026171 35197661 32114831 29111174 26789658 24463939 22619397 20769795 19229290
2296 19229290 17845180 17085794 16030021 15274592 14645700 14082194 13171452 12474145 11938032
2287 11938032 11181496 10516026 10145801 9308453 9053039 8857983 8461538 8236077 8080123
2278 8080123 7782214 7355058 6924973 7102703 7207016 6850852 6442800 6101183 6028969 5817763
2268 5817763 5766187 5617663 5432412 5448488 5239956 5508202 5172803 4845284 4978055 4700033
2258 4700033 4275959 4008272 3673629 3527959 3373155 3191005 3280243 3017701 2807936 2505142
2248 2505142 2161323 2220125 2175777 2138967 2025424 2030806 2220344 2445571 2609238 2477693
2238 2477693 2728200 3008925 2756002 2830977 2596211 2031860 1783510 1722532 1765099 1627457
2228 1627457 1320154 1603665 1869984 1910686 1990778 1904261 1900481 1557669 1364232 1445420 1425162
2217 1425162 1319557 1239417 1532687 1985835 1453923 1139979 1234026 1358835 1316479 1212216
2207 1212216 1337172 1378422 1553806 1667160 1341926 1375393 1520189 1606115 1383605 1160462
2197 1160462 1255470 985385 861631 1110725 1053038 991827 1092628 997546 728188 612921
2187 612921 906174 899583 838969 909270 704137 588696 643321 406227 453652 377014 455609
2176 455609 348473 -86686 -108087 336463 365290 233715 377451 162417 408779 376435
2166 376435 374089 221782 88334 269458 287524 143733 229524 128750 406128 136842
2156 136842 86345 -290370 -255923 -285219 -71686 121564 105646 256488 -8552 -202263
2146 -202263 -58955 -175849 -173340 16822 75762 134507 267987 74997 11908 114677 196422
2135 196422 335158 393554 252370 179794 219061 212937 -73517 -76032 -39084 32790 181952
2124 181952 155963 462458 287839 138109 -251218 -300545 -86624 -155282 -204942 -56403
2114 -56403 66184 149958 91076 216036 20335 -180784 -87837 40277 -198331 107581
2104 107581 188732 251399 -62207 1699 -198689 -152086 93044 181992 198490 -124135 -19484
2093 -19484 76441 289278 14213 -111407 22827 131705 319000 225371 -193582 46750
2083 46750 404815 163965 85292 357723 344101 249655 153446 -56022 38706 -40907 157685
2072 157685 128131 -52264 66772 -11568 55559 -22155 -91980 -170311 -290122 -134256 -223017
2061 -223017 -117381 -2288 130972 363122 537812 605840 615636 1143210 1416450 1124653
2051 1124653 1365182 1775980 1636377 1511960 1233804 961867 797368 725371 479767 28683
2041 28683 -99988 236923 352205 155685 -22705 -48678 -6774 898 -232668 -442260 38209
2030 38209 168752 228897 91761 266188 113605 -19803 125828 -16931 -297273 -379762
2020 -379762 -348746 -345908 -250268 -115269 -145178 -152173 -284455 -265103 -144050 -131449 -202919
2009 -202919 -397634 -240726 38184 -16548 -117586 -117812 -278434 -195216 62586 162534 -88558
1998 -88558 -321767 -195525 -326793 -484700 -491191 -348389 -286438 -291950 -467697 -500275 -195436
1987 -195436 -319803 -480096 -441197 -215088 -273775 -381529 -189277 -71923 -134774 -202689
1977 -202689 -194605 -177342 -245750 -338701 -206131 -71544 -88991 -345905 -353659 -91674 -275608
1966 -275608 -239066 -93744 -339593 -631571 -541386 -559082 -322032 -457485 -486649 -365971
1956 -365971 -149364 -383223 -340290 -426202 -282094 -148108 -258630 -272696 -462669 -289795
1946 -289795 69264 -54489 -89476 12219 -70853 -42271 2593 -133618 -66267 -132288 73538
1935 73538 189102 57208 322513 205020 189388 270596 246201 12309 -13958 -28215 -101197
1924 -101197 -108893 -391675 -300030 -300073 -184282 -228111 -3932 -188057 -272787 58342 -100725
1913 -100725 85617 -352026 -389384 -167682 -288840 -302641 -374327 -294913 -55237 -208648
1903 -208648 -173889 -143960 -70172 -88195 -131349 -93175 -335383 -468440 -434993 -324611 -372233
1892 -372233 -36934 170984 75624 -302400 -222496 18566 -200297 -272953 177846 365336
1882 365336 249383 -15920 -286275 -367730 -393696 -265359 -408266 -91786 -132883 -300504
1872 -300504 -307051 -518361 -462913 -531849 -263272 160398 111840 205695 45162 -152339 -350791
1861 -350791 -202837 -92832 -283 72948 226222 211971 134796 -58917 -263666 -410824
1851 -410824 -206145 -99478 16013 24426 -37469 -156410 -215978 -359213 -700683 -738373 -460792
1840 -460792 -323853 -339254 -264612 -290305 -408694 -553075 -113005 173120 -47297 -92192
1830 -92192 -96801 -168305 -385353 -350100 -448364 -314658 -502639 -510160 -669097 -312065 -290097
1819 -290097 -564308 -456617 -374998 -197211 -408531 -283555 -335054 -253783 -160976 -155275 -158753
1808 -158753 -193383 -328463 -183241 -77508 -13435 -84282 -199094 -213287 -307303 -267814 -226169
1797 -226169 -209591 -56474 -323465 -408124 -224599 -450838 -604899 -272041 -1381 -141600
1787 -141600 -499502 -300759 -311678 -392627 -255853 -208797 -200425 -56223 -121325 -122956 50795
1776 50795 -15805 -190357 -272013 -293366 -172372 -311017 -81855 146786 -40851 -171007
1766 -171007 -83048 -132319 -176669 -503819 -544533 -421841 -259018 -338239 -557552 -68525 128768
1755 128768 -52015 -217656 -205653 -46008 23806 -52107 139657 179234 -295927 -201557 100975
1744 100975 -219182 -139462 -186887 -367311 -121728 -301992 -231442 -301491 -464167 -143682
1734 -143682 112971 101547 -204478 -96882 -98673 -228391 -116357 -304786 -337204 -233376
1724 -233376 -204009 -224545 -1334 -16965 -197951 -189921 -195874 47897 167906 53797 95608
1713 95608 82558 -53386 21054 56046 214870 170532 162327 59048 151352 -121620 -137990
1702 -137990 5321 -152242 -236427 -197961 -169056 -169296 -253072 -290729 -34565 -52390 -2461
1691 -2461 85636 -122391 26567 -187736 -467946 -387679 -227675 -384848 -565974 -303319
1681 -303319 46536 214163 236466 186786 98720 -202772 -316115 -239812 -185344 -47695 -155543
1670 -155543 -265343 -242943 -379695 -306719 66116 28314 -53076 -86666 -28523 -354484 -356493
1659 -356493 -327297 -374358 -385629 -300427 -282886 -235179 -304573 -435313 -380261 -38642 -317402
1648 -317402 -649668 -500457 -249940 -271062 -304387 -380737 -292237 -140822 -230319 -1061 -165687
1637 -165687 -187761 -203772 -179435 -213732 165249 330493 -1906 -147842 83791 54321 -184033
1626 -184033 -254567 -80183 194974 142661 233415 448516 347928 -139395 -133549 10511 -43093
1615 -43093 151746 241966 -106708 -216380 -242693 -74734 -197928 -38621 122054 155787
1605 155787 46863 -44752 152673 140609 38256 -63284 66513 330302 352644 139689
1595 139689 122924 -93792 -263435 -298283 -127488 -152668 13983 -78409 -78269 -70003 17095
1584 17095 256970 336422 -20385 -309704 -121807 90694 -52219 -147032 -29745 -15539
1574 -15539 -82862 -84678 -68763 -8624 -63763 -161869 -15168 130748 -404244 -281995 -171462
1563 -171462 101645 183829 -206142 -360272 -245562 -85314 -86028 -87990 -273557 -196519 -190445
1552 -190445 24338 15888 -212313 21656 -54539 -57980 -263682 -468153 -101081 -82666 -98169
1541 -98169 -293559 -253098 -218262 -274836 -134803 -156162 -189530 -33640 -165799 80281 -113590
1530 -113590 -221806 -372674 -245744 -173055 -267422 141212 157077 16921 -298441 -330089
1520 -330089 -81421 45322 30181 145819 110239 -266713 -544050 -353131 -343391 -5521
1510 -5521 106881 -31904 -56655 -291017 -317226 -192496 62888 114807 -295966 -330689 -59238
1499 -59238 57767 93835 -33814 -215331 -544150 -453117 -458327 -410489 -243259 -225895 -202706
1488 -202706 -135002 -51342 -160546 -313743 -185556 -261926 -117570 -356781 -189689 -7784
1478 -7784 40109 -22175 -178866 -153303 -317469 -213511 -142470 -47520 -86136 -211845 -207188
1467 -207188 -22213 36798 14326 -107953 -200048 -129468 -284386 -348422 1015 228119 235022
1456 235022 21293 -184775 96647 125421 -45750 185307 -52775 -148374 120057 -366769
1446 -366769 -294133 -501797 -343386 -576697 43005 -22145 -153739 -320962 -185559 -163489
1436 -163489 -549195 -305006 -289789 -238227 -358504 -224206 -145504 -207701 -377743 -229654
1426 -229654 -363584 -136944 -171266 4753 -49795 -31753 198435 -138220 -454793 -448109 -434530
1415 -434530 -196751 -408059 -267814 -303629 -307069 -536275 -375998 -320330 -96147 -11184 39028
1404 39028 36100 -17691 -61033 46310 -122448 -168400 -14185 -156940 -472184 -213713 19699
1393 19699 -89476 -130920 -98611 -179556 -46916 -933 -261759 -197580 -135648 83711 34058
1382 34058 -117178 -111395 55142 -161973 -104753 -113932 -232210 48574 -248061 -244354 -300067
1371 -300067 -185012 1664 -28825 38677 -163674 -231055 -128762 -184846 -6222 -115328
1361 -115328 -168891 -236832 -272086 -206683 -55685 180113 48568 -254495 -189707 75025 -156040
1350 -156040 51310 116705 -74155 67318 -248306 -553813 -429956 -192797 -196216 -367732
1340 -367732 -148809 -213962 -103227 -168495 -337904 -441483 -230289 -167268 -264344 -357745 -487211
1329 -487211 -635685 -184004 -27991 -349193 -509165 -489086 -380417 -248979 119979 267511
1319 267511 -109041 -32561 -86627 -216056 23149 -84108 -329886 -114302 455 60875
1309 60875 -61408 -227314 -275541 -343094 -141822 -135117 -440531 -307844 -249166 109687 20607
1298 20607 -127946 -84036 -53445 -128643 -14172 -33335 -6489 15746 -132645 82560 -186813
1287 -186813 -222850 -300694 -100586 68986 156344 168910 7454 -43709 35444 198330 -46365
1276 -46365 -125289 -52285 -160406 -31317 95245 117167 -137748 -331322 -108097 -155204 -28177
1265 -28177 -10798 59704 -61521 -32083 21489 409046 246464 -96411 10001 -127696 -375899
1254 -375899 -322348 -238292 -86126 214813 384481 416556 218100 -132007 -211449 -52216
1244 -52216 -237411 -42823 -59337 -48084 -283532 -240149 67970 128012 119936 -131986 -264438
1233 -264438 -130235 25035 175473 116703 9564 -37635 -18 13430 83046 -94211 90423
1222 90423 26924 -44733 52619 -204522 -134457 9703 -124564 -275300 -431546 -75791 -157726
1211 -157726 -109647 -126917 -106871 -124992 -114543 -82341 -476 -203411 -261929 -322249 -257950
1200 -257950 -221996 -200272 -88322 21034 -104672 -118864 152030 -122696 -189646 -230192 -180160
1189 -180160 -170574 -261247 6580 -83285 -256647 -277534 -282820 -364974 -145278 -90167 -211176
1178 -211176 -189085 -4638 214637 103943 -49021 103629 25463 -112086 104100 329505
1168 329505 178370 -24859 63032 37486 -232923 -228184 190726 79667 -24816 177440
1158 177440 175127 -69761 -77375 -155927 -258863 -383470 -372421 -274563 -219352 -339148 -302950
1147 -302950 -283763 -47938 -142985 30408 -59778 135746 125069 64583 -95184 44574 -143149
1136 -143149 -185187 -140028 -449858 -306592 -236306 -200439 -253767 242349 307912 58703 -56761
1125 -56761 47942 -25525 81374 184732 98108 -19771 -67755 99290 114196 39094 -115047
1114 -115047 -11440 -66602 -16156 -275563 -118683 143541 -28756 -254784 -196877 -238548
1104 -238548 -244063 -213867 -378240 -289382 187248 243040 247032 140734 114004 76665 -127025
1093 -127025 9051 60278 100375 -98473 -223263 -21803 124864 135794 416696 284506
1083 284506 110827 154412 44041 -273240 -81157 174025 87646 211385 17144 -83464
1073 -83464 -167657 -96919 -152919 -276302 -119825 -91654 -59385 -209449 -280209 -305123 -34253
1062 -34253 -162992 -169207 -436998 -506374 -187071 244677 288551 -98269 -44523 -41818 -19970
1051 -19970 11927 -209321 -97837 -104575 -112316 213354 -80663 -554068 -505829 -363464 -423272
1040 -423272 -474228 -244394 -26701 -27608 -47191 -85304 -118379 -105553 -177051 27589 -87252
1029 -87252 -120953 -229662 -174950 -411686 -266685 -212716 -220620 -416257 -391458 -228303 -237824
1018 -237824 -420051 -443167 -110543 -172945 9197 -47607 -238231 -116015 -71221 -405783
1008 -405783 -487549 -413789 -361992 -32563 199969 135288 -91106 -105095 3529 -104480 186181
997 186181 -85563 -112164 -409 -52518 33004 106434 -20483 26867 -172834 -190764 -208782
986 -208782 -107094 -211671 -429227 -469134 -467929 -305550 -449704 -414450 -335535 -129752 55014
975 55014 -164295 -285800 -306123 -474533 -367034 -381890 -398924 -265648 -390243 -165572 -102235
964 -102235 56243 -105718 -236608 -62575 85715 68898 -159308 -5318 30983 -497332
954 -497332 -474356 -155996 -100126 1960 -28882 274708 474506 46643 -237934 -266359 -373949
943 -373949 -333575 -26845 -120673 -166787 -80168 12395 -9158 -269427 -256531 -396015 -375355
932 -375355 -169 165332 -85556 -103550 -195748 -18266 -91966 -229222 -210575 -345574 -234822
921 -234822 1816 330870 200689 241211 259996 101529 256466 277671 220097 108263 -325175
910 -325175 -407816 -358288 -338827 -149272 -172346 -108413 -339885 -582885 -449548 -490506 -403799
899 -403799 -273651 83652 273187 48455 71954 89225 76950 -7763 -118017 -444212 -356090
888 -356090 -103087 134191 239844 484116 471362 276302 62514 132841 164351 -189209
878 -189209 -325860 -180329 -300431 -182984 136972 194419 18786 -192960 -367402 -556873
868 -556873 -410902 -55932 -198695 -246747 -284609 -308820 -46096 -151397 -120023 -248317 -357004
857 -357004 -600486 -514001 -156000 59692 -74513 7379 -84430 -630971 -478085 -380481 -167377
846 -167377 21813 -139176 -297809 -38672 29240 -121266 -218207 -313950 -156230 107599
836 107599 57081 87554 211270 74232 63065 59878 261803 247969 -51922 -253289 -313572
825 -313572 -175515 -262097 -265510 110508 24964 -369004 -140801 -102641 -171456 -156801 -111487
814 -111487 -3914 -163511 -70280 -62452 -284327 -301244 -182132 -113224 21982 147280 29119
803 29119 -37058 63142 13395 -263465 -164729 -21942 -369512 -455187 -207029 -90477 -170637
792 -170637 16400 -257654 -245333 -187307 133239 -130279 -243876 -220890 -481638 -278835
782 -278835 -198836 -57480 14375 -94059 60753 -164407 -169886 -291081 -304892 -250640 -495734
771 -495734 -334701 -208911 -196519 45563 98858 234319 151339 140077 5131 -278597 -338811
760 -338811 -321782 -323864 -221829 -155760 -280709 -226190 -150957 -127684 -276430 -229614 72313
749 72313 171966 175630 23632 -163847 -376857 -638725 -548802 -504790 -239863 -64208 -95184
738 -95184 -279465 -202963 -162595 -185731 -107962 -245488 -137750 -95389 -135187 10134 -272653
727 -272653 -130100 88401 29749 -59405 290379 225336 -57353 -125775 124387 158801 -54075
716 -54075 -199474 -271700 -129493 -173615 -238390 -324179 -487393 -229420 -247079 -248233 -382230
705 -382230 -236870 -59466 -120143 -194501 -398181 -554426 -287660 -137982 -186677 -296078
695 -296078 -238689 51170 -59871 -224395 -209113 -368717 -281755 -420070 -156898 63919
685 63919 -137551 -424010 -293032 -162787 -141009 -150088 -370712 -208287 -44714 92556 -295324
674 -295324 -362590 -226814 -89795 -133271 -102369 -584286 -546075 -514068 -330733 9110 -141616
663 -141616 69997 126693 165169 -41552 -31805 223106 247419 38831 -73589 13459 -207197
652 -207197 -268066 -282353 -303812 -386537 -369890 -126536 -146597 32870 8258 71728 236175
641 236175 74751 33697 179957 -99937 -126428 6033 103847 456421 330773 56938
631 56938 -67672 49748 -91100 -54441 -152184 -284097 -474551 -512734 -663362 -222391 -120068
620 -120068 -173277 80068 -77210 -37717 68228 270338 -99055 -471629 -580965 -439776
610 -439776 -50598 105075 -141852 -308265 -348414 -177189 -16102 -155676 -100430 -141200
600 -141200 -126753 -75756 -106286 -211439 -351259 -223367 -147689 -310224 -111311 55829 -114576
589 -114576 -114605 113990 150763 103737 113896 56752 -69151 21391 -44640 36035 103760 -292962
577 -292962 -347705 -54855 -96146 -86266 41519 1752 -64568 -3641 -118633 -27755 -130790
566 -130790 15302 -31823 -56190 52376 -189747 -328070 -240136 -39824 77468 95851 57780
555 57780 3025 -191974 31351 -14613 -293587 -278214 -136057 -133596 -179678 -266966 -318623
544 -318623 -219241 36806 192526 -68161 -152624 -148394 275342 197625 68267 216126 -26906
533 -26906 193934 -72466 -461889 -492001 -394442 -176701 -330256 -402469 -279177 -358513 -411687
522 -411687 -152323 -332211 -283906 130521 154840 -9870 -124363 56200 -234096 -2169
512 -2169 -172927 -180752 98178 -370600 -594856 -127399 -185539 -313666 -330367 -174048 -160221
501 -160221 -97857 94227 -64534 -290497 -41465 117734 35088 -205459 -424030 -313100
491 -313100 -416376 -447420 -157280 -311159 -274233 -140116 21042 -96984 122818 27939
481 27939 62363 166708 23361 -48716 31857 28188 -149080 -20541 -175725 -334621 -210134
470 -210134 -207803 -135986 -131171 -168338 -173688 -164873 59509 -58941 -147555 -247448 -94684 -138431
458 -138431 -181994 -25576 -110837 -239468 -256092 -172365 -262383 -334798 -161768 -213523 150866
447 150866 17317 -222943 -106366 115008 300004 -103807 -179337 188752 225907 156464
437 156464 -44369 -247867 -407966 -289556 -191867 -263203 -327336 -280802 52906 165257 54725
426 54725 -106668 -218349 -112385 -114894 190737 162239 176065 159009 140331 207166 -41111
415 -41111 -159183 -34008 -8168 16562 -52702 -11199 -74750 70428 -31831 -72155 -166333
404 -166333 -73380 -52728 -254602 -204347 -112061 -146401 -291302 -399315 -351914 -234616 -279840
393 -279840 -226256 -20241 -119746 -176295 -166538 -341675 -173507 -23856 33736 205770 248615
382 248615 229676 -133232 -215323 -169421 -100228 -88719 -228005 -277512 -232383 -64906 -33765
371 -33765 -272954 -545671 -344801 -526335 -476523 -320554 -171249 -154296 -230386 -366458 -429230
360 -429230 -262594 -73613 -258663 -137579 -248286 -43738 -86315 -310010 -179748 -33472
350 -33472 78352 -155253 48571 -71151 -194309 -360509 -293202 -274950 120485 450444
340 450444 47919 -68308 -204234 -3965 166064 81164 218936 164922 10796 41901
330 41901 144211 143042 111633 159362 13927 -168107 -129061 -162892 -61644 -16468 -151124
319 -151124 -189740 -122538 117803 -196252 -431704 -246007 98583 177304 72150 6239 54312
308 54312 145160 88186 -52697 14514 -27341 -162233 -240688 -16883 254351 166579 160360
297 160360 242960 207336 28008 38548 -335707 -264883 -25777 23914 124453 -146401 -122802
286 -122802 -26641 -68585 -152536 -7945 91726 -30059 -8067 52121 54364 101548 -264954
275 -264954 -66486 -63779 -207915 -99868 55075 77164 220547 73166 -133774 -210603 -176119
264 -176119 -108237 -309336 -342362 -357308 -390777 -318787 -343714 -266168 -128757 -201114 -227410
253 -227410 -183479 35056 -5153 -201897 -338171 -27035 -82332 -59336 150950 -21009 77882
242 77882 17637 59202 -51019 -22459 211799 191243 124388 -50695 82622 231440 125857
231 125857 54012 21095 -155692 -353859 -392167 -180371 -220609 -86210 28784 -155100 17027
220 17027 -176684 -38818 157831 -157232 41117 27070 82832 81045 26388 -110724 -343562
209 -343562 -69730 -39284 -341323 -435887 -347651 -152348 -282098 -391015 -529359 -418371
199 -418371 -185762 120956 30988 -80306 -53851 -51940 22812 215504 295860 92937 -145082
188 -145082 -173658 -67254 13737 -186644 -31592 -722 -37597 -48207 -59885 23826 -44404
177 -44404 -151558 -150390 -31806 191055 541 -375819 -394188 -402664 -322863 -369180 -451896
166 -451896 -300968 -219550 -265461 -265295 -235144 -235029 -215210 -108767 -121543 -406336 -195209 -69055
154 -69055 137180 170558 -96197 -180411 -153333 86939 88164 -167181 41636 228027 -41779
143 -41779 115542 -40322 -163136 -171584 -178994 -160639 -157460 -220512 -158542 -97928 -69218 -20278
131 -20278 -3883 -112670 -17329 -220429 -265521 -422751 -408464 -228924 -57813 11006 -84888
120 -84888 -233416 -260105 -159184 -119473 -244562 -93878 125139 -32875 -154619 -526158
110 -526158 -397398 -323945 -337267 -321609 -105858 -272024 -342584 -66574 -236841 -69357 14603
99 14603 132247 118560 22525 -120922 -122306 -385885 -452927 -281347 -269000 -480832 -270513
88 -270513 -248832 -526666 -524372 -440716 -321077 -230027 -300589 -291662 -438996 -515438 -408073 -109356
76 -109356 -240958 -217547 -193711 -388706 -301899 -371195 -445967 -306366 -213659 -266071 -244243
65 -244243 -262760 -174171 -330917 -448679 -745799 -627416 -368529 -277789 -406181 -410669 -391575
54 -391575 -280138 -185222 -287042 -187856 -32098 -259751 -298680 -360032 -261544 -193828 -296221
43 -296221 -212893 -318892 -361736 -370706 -186153 -261954 -475961 -325479 -226304 -365771 -414287
32 -414287 -452131 -561647 -518213 -398188 -187359 -334930 -408986 -513011 -338125 -334739 -640887
21 -640887 -491469 -444912 -508339 -537870 -620546 -511637 -407822 -235902 -211636 -188833 -288691
10 -288691 -480739 -428639 -343641 -389761 -401477 -556228 -555527 -387308 -384904 -410369
0 -410369
$$ Imaginary data points
##PAGE= N=2
##DATA TABLE= (X++(I..I)), XYDATA
16383 -1798913 -1964369 -1953102 -1949196 -1960952 -2015406 -1885216 -1757417 -1790185 -1945806 -1797092
16373 -1797092 -1706150 -1577924 -1365615 -1359861 -1456619 -1365931 -1338672 -1519078 -1436018 -1276385 -1010904
16362 -1010904 -1062770 -1127512 -1275587 -1307781 -1058561 -978825 -959339 -1052364 -905931 -872600 -836739
16351 -836739 -883862 -935630 -817869 -906465 -750301 -770123 -789552 -884983 -684148 -521912 -313755
16340 -313755 -499195 -859048 -701348 -515587 -502852 -608350 -441871 -312767 -353818 -232325
16330 -232325 -396467 -293385 -372015 -435057 -435878 -506312 -234635 -156903 -102767 -106784 -276737
16319 -276737 -122212 -23597 -28658 140955 -22361 -9729 76800 196665 175574 287944 284782
16308 284782 313189 469444 572574 353285 366021 541566 642757 634274 608208 561826 497962
16297 497962 448486 499435 730580 822110 853853 825921 833398 740542 814942 581204 736687
16286 736687 893525 788395 751045 941007 740157 785141 832380 755517 1080137 1218295
16276 1218295 1267317 1078259 1211380 1094937 953556 960172 1155356 1342983 1328348 1061101
16266 1061101 1043596 1042835 1190804 1309022 1363535 1181068 1242124 1053179 1178812 1186018 1212322
16255 1212322 1451929 1381903 1363004 1402760 1229003 1421312 1724431 1556072 1406688 1560767
16245 1560767 1543132 1345543 1668431 1616056 1885400 1984252 1908548 1846888 1781374 1700363 1522623
16234 1522623 1582188 1638327 1942943 1916253 1768007 1766601 1742808 2147797 1946002 1908839 1897712
16223 1897712 1750871 1913956 1789515 1800236 1736062 1820692 2198043 2120345 2161931 2034644
16213 2034644 2034773 2145880 2451902 2512561 2220487 2156976 2405733 2440055 2288559 2183114
16203 2183114 2295084 2504903 2700390 2352025 2134341 2329172 2599199 2232173 2230437 2267399
16193 2267399 2143377 2494247 2376387 2570232 2392157 2618023 2637901 2362023 2195939 2281157
16183 2281157 2539531 2660508 2525579 2469358 2709635 2503281 2387778 2668623 2612510 2813739
16173 2813739 2701710 2231571 2157761 2540512 2982602 3008285 2717695 2794029 2533067 2373264
16163 2373264 2643088 2791776 2786426 2618689 2602836 2615511 2840784 2714841 2608942 2675056
16153 2675056 2831195 2767734 3026727 3103501 3236886 2939838 2986565 3101175 3069479 2724954
16143 2724954 2603471 2427542 2303003 2468030 2797715 2806323 2833395 3032770 2683834 2544233
16133 2544233 2595758 2751078 2692849 2817589 2819762 2903455 2866989 2892496 2788220 2817529 2925568
16122 2925568 2823541 2875347 3115711 3080181 3100326 2881493 2875889 2905380 3076422 2884531
16112 2884531 2576701 2690010 2581335 2598659 2817658 3010460 3036261 2834214 3054316 2979179
16102 2979179 2700339 2752709 2895873 2979359 3118247 3138265 3027532 3125980 3120900 2935551
16092 2935551 2867225 2974096 2937554 2955812 3165888 3131344 3187346 3241602 3153902 3209022 3348739
16081 3348739 3205703 3200733 3073897 2963748 2857380 2815643 3000588 3028206 2891010 2888588
16071 2888588 2910423 2688303 2836563 2937514 2994284 3177006 3175207 2983369 2797493 2586957
16061 2586957 2791701 2757646 2769733 2778578 2908411 3023948 3231742 3137466 3285710 3206640
16051 3206640 2926700 3168438 3056637 2784727 2831679 3037789 2962796 2923128 2884733 3033185
16041 3033185 2951234 2969491 2931638 2935138 3236363 3277725 3077235 2987458 2852536 2717732 2915691
16030 2915691 2950972 2925511 2944244 3267711 3334059 3226519 3169346 2833677 2829407 2912654 3136368
16019 3136368 3086192 3107039 3216956 3286157 3027808 3024684 3202063 2956815 2753220 2788531
16009 2788531 2783019 2890848 2899480 2963018 2842236 2776270 3081755 2767212 2762502 2554818 2717370
15998 2717370 2823164 3061400 3032108 2825947 2778206 2834405 2928357 3145982 3312109 2889839
15988 2889839 2719268 3045435 2953124 2669946 2968761 3294383 3265196 2864376 3030061 3246909
15978 3246909 3022888 3145785 3402095 3387596 3169861 2774302 2870514 3059817 3376521 3177044
15968 3177044 2933923 3081670 3058149 3017901 2931974 2984491 3244073 3284843 3064050 3096555
15958 3096555 3122251 3177597 3098115 2764264 2557619 2740997 2588021 2775929 3074905 2977880
15948 2977880 2833683 2745579 2657967 2948348 3071126 2976028 3416444 3482676 3321622 3062804
15938 3062804 3068409 2903188 3122920 3084576 2877594 2733031 2828838 3176161 3052424 2944579
15928 2944579 2962973 2950616 2852717 2829607 2833435 2859814 2829716 3040043 3139894 3477291 3189094
15917 3189094 3014368 2963055 2754700 2817173 3028000 3233604 3073319 2894890 2976884 3287188
15907 3287188 3014124 3129381 3178440 2977243 3038857 2965067 2941187 3111582 3153998 3171064
15897 3171064 2996815 3258262 3045650 3026487 2984607 2981732 3194961 3116425 3073085 3050305 3036625
15886 3036625 3148400 3168589 3294239 3287807 3326180 3329506 3196982 3290019 3242581 3110826 3089204
15875 3089204 3050207 2903569 3095908 3094814 3039854 2836187 2911740 3030222 3279255 3298659
15865 3298659 3283195 3321518 3291192 3015328 3187768 3327745 2927119 2967625 2992922 2893609
15855 2893609 3091472 3102203 3203887 3073527 2835325 2626785 2902668 2865732 3090203 3153485
15845 3153485 3225780 3395888 3306233 3060086 3031734 3039156 3113640 3041490 3251430 3656724 3502402
15834 3502402 3293673 3454172 3656131 3250419 2859625 2841360 3173742 2929681 2824759 2843750
15824 2843750 2814483 2966395 2982706 3175097 3138039 2998108 2973360 3022645 3194772 3320504
15814 3320504 3329857 3385406 3181420 3268704 3406561 3029143 2994203 2934352 2969358 3010872 2991293
15803 2991293 2770903 3126777 3205902 3005834 2979644 2893267 3044981 2969000 3060278 3240609
15793 3240609 3001044 3177324 3262367 3057723 3107611 3231702 3077396 3033982 3079138 3103759
15783 3103759 2909455 2908467 3133516 3169754 3001401 3168385 3313164 3362635 3039040 2975872
15773 2975872 2809277 2901963 3036357 2975911 2967129 2918930 2890834 2991030 3025617 3151565 3286221
15762 3286221 3470308 3504188 3275618 3002765 3238930 3415204 3163260 3024016 3011573 3058205
15752 3058205 2902383 2880172 3141672 3105930 2856920 2765885 3069503 3111262 3154053 3354571
15742 3354571 3301929 3325286 3279950 3135272 3046610 3138932 3143059 2956841 2968926 3110132 3037402
15731 3037402 3032370 2951253 2871103 2898315 3065287 3039154 2827359 2778857 3026933 3075189 3116254
15720 3116254 2965816 3047355 3227574 3430781 3445593 3271859 2858347 2925038 3220538 3283151
15710 3283151 2989492 3162137 3385716 3430539 3214507 3149124 3163771 3264011 3230779 2824701
15700 2824701 3166347 3490434 3237687 3279302 3094347 3266288 3123123 3034988 3005660 2731309
15690 2731309 2969816 3389507 3331483 3389751 3250902 2936079 3082391 3105183 3072165 3201943
15680 3201943 3098517 3001065 3367019 3276987 3154063 3016150 2880658 2855969 2835315 2963261
15670 2963261 3007284 3069906 3059752 3276511 3009539 2876341 3161333 3297535 3401125 3404076
15660 3404076 3480717 3417788 3190986 3262087 3200437 3183547 3056282 3064744 3118191 3129587 3218179
15649 3218179 3150095 3311666 3065629 3143141 3185998 3156486 2974518 2999451 2884523 3125613
15639 3125613 3231204 3257123 3455258 3469101 3543133 3210597 2754054 2861000 2987611 2946641
15629 2946641 2998240 3296160 3288122 3205689 3188118 3428171 3513425 3204851 3148795 3009626 3364247
15618 3364247 3339339 3440309 3475364 3325103 3463939 3440925 3257721 3140891 3145621 3160315
15608 3160315 3055748 2795782 2893874 3375334 3264449 2930211 3087913 3153568 3268489 3122538
15598 3122538 3252377 3099543 2879199 2848067 2798505 2805586 3333985 3446578 3234530 3346012
15588 3346012 3175264 2948153 3290667 3451888 3469271 3221764 3237887 3349553 3604309 3495912
15578 3495912 3410399 3332603 3300756 3396495 3416665 3305295 3199505 3392734 3521751 3326441
15568 3326441 3097725 3258982 3078102 3212641 3048846 2880277 2821395 3025759 3128336 3349482
15558 3349482 3253497 3166676 3267920 3048681 2955031 3164671 3294813 2964092 2967518 3193088
15548 3193088 3069269 2945676 3164799 3116776 2957632 2756706 2816950 2659182 2857417 2787648
15538 2787648 2820866 3000401 3171423 3437798 3335346 3216631 3264143 3493705 3208469 3169140
15528 3169140 3516520 3343941 3287644 3416179 3296100 3430470 3474803 3294098 3205641 3291590
15518 3291590 3016330 2901580 3328997 3402017 3072767 3268126 3323361 3248909 3101136 3162354
15508 3162354 3166155 3441559 3302056 3432549 3315778 3117462 3251436 3124029 3082737 3483619
15498 3483619 3354348 3010488 3076191 3279594 3417902 3258621 3315954 3242001 3184035 3424949
15488 3424949 3314217 3007306 2812445 2964509 3194914 3346601 3128850 3205014 3286298 2974816
15478 2974816 2968979 3114058 3086213 2940138 3068885 3117759 3195186 3188287 3194454 3245382 3499939
15467 3499939 3134082 3046859 3225917 3212227 3319416 3024093 3499410 3055159 2978361 3057979
15457 3057979 3153326 3469691 3283490 3087828 2913758 2612595 2634224 3173790 3275416 3316266
15447 3316266 3214442 3049941 3117262 3255274 3285726 3489969 3452756 3235959 3238859 3404914
15437 3404914 3242808 3169924 3041920 3139021 3099716 3043355 2963743 3072168 3342624 3334109 3223634
15426 3223634 3186724 3087083 3320460 3273796 3145208 3097630 3094590 3273814 3209812 3405190 3659003
15415 3659003 3514550 3296965 3147737 3055080 3019130 3215822 3328326 3084665 3068420 2909228
15405 2909228 2720638 2845399 2856967 3084929 3218834 3157737 3232177 3279117 3183200 3247593
15395 3247593 3301336 3188306 3123496 3073105 3251143 3220742 3088969 3283981 3182821 3214548
15385 3214548 3380695 3165408 2946171 3190032 3362573 3467852 3296446 3231672 3137652 3271903
15375 3271903 3222690 3189884 3398121 3429530 3383259 3507557 3336037 3276790 3330012 3280189 3192534
15364 3192534 3232905 3347253 3465546 3667000 3450686 3060259 2972349 3186426 3351968 3428625
15354 3428625 3303735 3102601 3067221 3228445 2991367 2908176 3289158 3531071 3374951 3275202
15344 3275202 3214432 3318645 3265983 3090384 3525019 3581448 3436659 3412799 3279362 3241043
15334 3241043 3445349 3452276 3422854 3289946 3362983 3262834 3038167 3049545 3018730 3021904 3135813
15323 3135813 3391622 3397334 3494659 3498802 3548442 3595219 3271843 3191841 3551958 3287692 3307567
15312 3307567 3143663 3148264 3308294 3229601 3252669 3195156 3157626 3232144 3255703 3189403 3048725
15301 3048725 3463664 3569746 3490928 3570354 3490858 3479801 3300311 3201686 3299786 3380547 3439791
15290 3439791 3362121 3438687 3133527 3340321 3457141 3377375 2988273 3264540 3255804 3275759
15280 3275759 3518305 3229340 3323457 3217792 3355083 3413821 3553850 3401267 3321326 3331377
15270 3331377 3349205 3411047 3393206 3605389 3633020 3330054 3424509 3315588 3115636 3186644
15260 3186644 3122782 3409415 3291286 3324026 3196404 3228607 3393377 3246211 3463525 3386443
15250 3386443 3093476 3215298 3542726 3461317 3439143 3327772 3091635 3162253 3265894 3325109
15240 3325109 3210042 3438630 3568647 3472350 3389686 3246759 3330121 2973040 3096784 3491633
15230 3491633 3625344 3604354 3490740 3552199 3592997 3265844 3071065 3035457 3000540 3116408
15220 3116408 3206128 3392478 3527515 3333923 3171547 3396761 3352291 3190846 3220549 3343709
15210 3343709 3419523 3201431 3605706 3592080 3339444 3274535 3599378 3230621 3275500 3373625
15200 3373625 3415889 3610004 3272717 3230629 3120740 3453619 3550508 3410852 3486466 3337242
15190 3337242 3420462 3522235 3373417 3066135 3039850 3259689 3425908 3183846 3077545 3251325
15180 3251325 3208909 3155168 3225108 3409994 3351789 3331902 3477628 3340500 3300631 3368598 3213871
15169 3213871 3362887 3384964 3670129 3744640 3240757 3064499 3305665 3418536 3234286 3424611
15159 3424611 3457855 3477200 3641358 3549697 3425695 3187751 2963914 3411345 3520751 3352311
15149 3352311 3524336 3322430 3324099 3287471 3271338 3332306 3134041 3164567 3258347 3128954 3040999
15138 3040999 3319270 3178114 3138952 3281001 3251549 2990508 3277146 2987162 2885533 3235848
15128 3235848 3199695 3256849 3390589 3420461 3467912 3402775 3166588 3283925 3374341 3214204
15118 3214204 3472408 3511728 3478837 3439580 3151687 3387577 3181777 3092817 3225087 3177400
15108 3177400 3293219 3359990 3031258 3340755 3168922 3276114 3310936 3208563 3148751 3349025
15098 3349025 3681883 3641012 3455132 3452140 3516623 3623614 3454033 3395000 3405715 3410280 3495518
15087 3495518 3330697 3551691 3492747 3134750 3147780 3279630 3383579 3454483 3495206 3288507
15077 3288507 3417644 3324285 3127024 3306755 3341747 3174751 3268733 3477198 3506183 3068330
15067 3068330 3500849 3862078 3752940 3405079 3364141 3436649 3374710 3207584 3393329 3428372
15057 3428372 3283252 3466117 3388530 3152518 3150757 3387445 3494053 3418420 3292825 3232585
15047 3232585 3306310 3596571 3506019 3696808 3550895 3392449 3445474 3167333 3331238 3789814
15037 3789814 3490413 3332801 3421310 3323035 3091130 3391247 3166132 3340151 3440276 3259109
15027 3259109 3173816 3136384 3190834 3300867 3343989 3490634 3301671 3302169 3267944 3244656 3301378
15016 3301378 3544472 3657109 3526434 3442383 3352937 3256101 3037564 3300769 3241832 3353039
15006 3353039 3423425 3418088 3389512 3334634 3424280 3492824 3502428 3283361 3501985 3462153 3243376
14995 3243376 3316444 3421221 3582971 3490929 3324365 3203418 3288679 3340741 3604134 3831408
14985 3831408 3440175 3214591 3385803 3679776 3660333 3045607 3176979 3365670 3535803 3774143
14975 3774143 3488444 3279607 3128131 3422397 3505631 3351026 3511763 3654799 3378630 3321751
14965 3321751 3596782 3668035 3290801 3377734 3418799 3397678 3411260 3229877 3425005 3348017
14955 3348017 3484889 3525995 3553896 3483782 3551634 3807390 3661243 3610055 3658019 3882758
14945 3882758 3664733 3728514 3545005 3193218 3141699 3396169 3621010 3422464 3356579 3448754
14935 3448754 3632049 3174178 3102077 3541409 3747053 3537350 3712135 3829842 3787627 3686786
14925 3686786 3385631 3292219 3564589 3530181 3610254 3620924 3683094 3796206 3563253 3475906
14915 3475906 3093787 3120092 3404033 3379118 3470866 3538819 3385617 3344211 3441476 3700011
14905 3700011 4027593 4286646 4002065 3680567 3703230 3450304 3343241 3542733 3616189 3578314
14895 3578314 3473200 3528019 3810372 3719087 3637428 3402631 3118815 3416590 3633729 3428635
14885 3428635 3428686 3675640 3495400 3390212 3594245 3687118 3556982 3545270 3626568 3748447 3830237
14874 3830237 3574189 3448611 3404576 3304789 3533581 3686355 3391067 3235425 3284371 3437519
14864 3437519 3417701 3555387 3496126 3508357 3504941 3706358 3490303 3403010 3577567 3712866
14854 3712866 3620412 3634707 3614592 3526476 3598379 3206515 3432263 3561234 3489713 3587974 3755532
14843 3755532 3557932 3709122 3549553 3461770 3455692 3441761 3461445 3609600 3633669 3500547
14833 3500547 3577572 3611346 3461849 3510080 3472393 3649347 3705017 3732811 3867137 3660616
14823 3660616 3915270 4006002 3900758 3828841 3755522 3725891 3671714 3783351 3924879 3670898
14813 3670898 3634858 3507039 3462696 3702907 3776495 3368936 3296488 3362230 3634954 3696710
14803 3696710 3560338 3351143 3378602 3591104 3722234 3871437 3629793 3960252 3822905 3448428
14793 3448428 3275818 3330572 3838217 3653046 3527302 3401445 3579664 3534953 3390194 3106675
14783 3106675 3143838 3421059 3507311 3439157 3491709 3747649 3521003 3457234 3437285 3390699 3256560
14772 3256560 3370019 3363182 3261536 3360897 3229085 3234140 3348211 3217229 3493355 3570679
14762 3570679 3372763 3575841 3779815 3935770 3955844 3529933 3313840 3365225 3379108 3691597
14752 3691597 3866325 3896955 3783278 3484258 3516240 3470775 3469967 3116311 3086619 3338715 3617100
14741 3617100 3758154 3632808 3525932 3404349 3446918 3586778 3673432 3727527 3484694 3611854
14731 3611854 3450623 3632311 3680633 3348150 3217870 3352493 3366874 3558062 3561267 3342688
14721 3342688 3473659 3545052 3456329 3371090 3424057 3821796 3808953 3634543 3518271 3418850
14711 3418850 3641061 3460659 3522696 3436665 3730164 3702453 3513838 3475345 3349524 3618903
14701 3618903 3640369 3529385 3389947 3492615 3423011 3395510 3400160 3469437 3604747 3613842 3424260
14690 3424260 3138368 3454992 3652631 3544515 3791201 3750431 3550987 3638630 3756604 3600606
14680 3600606 3021452 3464342 3609953 3382703 3357202 3523528 3620663 3370747 3124203 3151885
14670 3151885 3578257 3614369 3497287 3213669 3259440 3867989 3679007 3778896 3487902 3112575
14660 3112575 3428976 3687829 3727874 3638669 3383353 3586849 3730654 3567913 3828846 3970114
14650 3970114 3830588 3844081 3585538 3527494 3594602 3697063 3798695 3422408 3135378 3390272
14640 3390272 3539012 3632633 3666329 3784747 3619274 3470984 3538266 3584717 3558189 3589032
14630 3589032 3383283 3153242 3162799 3134586 3512768 3613623 3572602 3358735 3434777 3569602
14620 3569602 3205498 3507191 3655516 3499227 3442854 3332572 3464510 3557511 3735372 3971223
14610 3971223 3905176 3609553 3400653 3384527 3704485 3773075 3690282 3682839 3735227 3541480 3501148
14599 3501148 3178560 3531002 3710329 3635289 3534319 3424608 3388400 3384817 3498923 3689571
14589 3689571 3852058 3808351 3744929 3509363 3579316 3617665 3856489 3728427 3483040 3740833
14579 3740833 3685729 3796026 3732929 3798280 3671745 3592099 3750267 3918170 3943101 3625238
14569 3625238 4036463 3955328 3773144 4013867 3887515 3374628 3310596 3562193 3398567 3725628
14559 3725628 3912981 3850767 3880549 4118132 4140263 3979016 3840096 3631628 3661172 3504428
14549 3504428 3838179 4066985 3772388 3551647 3646313 3474741 3496760 3611751 3637719 3871862
14539 3871862 3497634 3368173 3430795 3387962 3399675 3752347 3851294 3625939 3445537 3686435
14529 3686435 3722056 3338341 3497047 3500092 3498512 3671449 3738441 3809052 4023457 4025170 3823285
14518 3823285 3678837 3946506 3789602 3230491 3533066 3744246 3655580 3754219 3880996 3722795
14508 3722795 3648579 3783924 3918018 3904282 3941088 3954370 3820180 3771037 3806696 3699469
14498 3699469 3864244 3747891 3556613 3682370 3692855 3695373 3617680 3679518 3547020 3464302
14488 3464302 3494487 4045408 3918707 3799656 3591772 3572740 3713603 3542099 3555887 3317397
14478 3317397 3583105 3836141 3883678 3838805 3749189 3763903 3476878 3462514 3705878 3366235
14468 3366235 3409918 3542119 3744411 3850538 3622953 3579735 3348452 3207618 3163185 3446372
14458 3446372 3514347 3576190 3672109 3762026 3656109 3595206 3663995 3702461 3560009 3382005 3500094
14447 3500094 3694348 3325629 3432258 3548281 3291116 3347884 3566720 3790976 3727633 3838042
14437 3838042 3992709 3869108 3786872 3764173 3721713 4144866 4083548 3628151 3584273 3774282
14427 3774282 4101881 3961358 4003022 4236422 4034302 3991639 3837981 3914991 3730313 3997177
14417 3997177 3794306 3720176 3863972 3876166 3753081 3813981 3887049 3493043 3690597 3708960
14407 3708960 3707790 4077000 4024405 3711119 3540236 3586634 3526754 3681046 3609368 3469748
14397 3469748 3529307 3551355 3625391 3694305 3571726 3690868 3842700 3768770 3737409 3799776 3670110
14386 3670110 3686619 4033388 4129308 4168522 3989065 3820482 3591866 3697539 3971346 4047202
14376 4047202 3925810 4019687 3839302 3997677 3715210 3675359 3880469 3768688 3866708 4009152
14366 4009152 3761198 3822307 3665674 3365297 3463342 3828434 3851987 3548636 3813685 3772241
14356 3772241 3548736 3955497 4066172 4070569 3694147 3798980 3872414 3940154 4203640 4103041
14346 4103041 3923397 3630163 3676486 3586095 3696201 3751898 3704986 3680255 3720501 3655783 3545745
14335 3545745 3439060 3448923 3460691 3793065 3703008 3410653 3566236 3634469 3772524 3717184
14325 3717184 3438025 3692758 3817722 3888210 3681523 3645298 3741731 3870885 3933287 3739194
14315 3739194 3693622 4195061 4175115 3960300 3756284 3846905 3891459 4176063 3932443 3617377
14305 3617377 3606202 3614362 3770110 3984779 3933466 3896458 4153239 4042338 3986408 3810706
14295 3810706 3700746 3406877 3248607 3303082 3382807 3513200 3689971 3607293 3799362 3876401
14285 3876401 3908767 4010562 3623985 3425483 3457582 3503392 3806956 3758047 3635603 3623382
14275 3623382 3522034 3399845 3382210 3624761 3856062 3651136 3729591 3736628 3713569 3536739
14265 3536739 3643237 3770602 3648271 3745296 3581574 3731885 3599328 3411485 3600662 3570445
14255 3570445 3586948 3480707 3533231 3878489 3788923 3942751 4148903 3986254 3883728 3971765
14245 3971765 3838061 3619038 3596007 3497586 3642094 3641997 3671201 3731368 3743605 3737561 3701380
14234 3701380 3664548 3812931 3699212 3407476 3779755 3795158 3823920 3869799 3598926 3639183
14224 3639183 3769770 3637570 3861271 3897382 3351962 3709422 3725582 3612054 3857544 3821560
14214 3821560 3544656 3735005 4035943 3985030 3817033 3967867 4012147 4018817 3872195 3687515
14204 3687515 3921625 3911951 3874992 3789262 3817547 3878254 3949171 3999513 4345545 4070815 3633784
14193 3633784 3766488 3775413 3610314 3628946 3533925 3564217 3457496 3490557 3788930 4016596
14183 4016596 4075140 4071737 3881602 3937957 4007825 3804966 3596204 3435281 3682006 3742838
14173 3742838 3585400 3767144 4038682 4030040 4052348 3882803 4112567 3896259 4028577 3949037
14163 3949037 3880749 3763705 3720339 3756952 3659509 3991563 3798789 3693629 3835515 3852614
14153 3852614 3900905 4027174 3935893 4204855 4352783 4290824 4230632 4263053 4100480 3975326
14143 3975326 4054255 4003932 3803954 3851468 3886774 3693429 3656319 3639574 3796893 3876595 4025213
14132 4025213 3956760 3613922 3520162 3676229 3848895 3804076 3607368 3752851 3666457 3592355
14122 3592355 3719008 3514304 3497459 3700498 3837803 4146191 3977912 3997125 4243154 3844603
14112 3844603 3918975 3665789 3824614 3750535 3756928 3854074 4003111 3885925 3888814 3974090 3810645
14101 3810645 3807801 3747682 3828003 3749891 3709556 3560892 3569216 3819739 3898763 3938465 3896486
14090 3896486 3644034 3663044 3606539 3631301 3817941 3984795 3735623 3834490 4030070 3776109
14080 3776109 3648614 3670490 3695386 3728426 3744557 3813118 3813806 3882625 3800690 3909904 3860848
14069 3860848 3482150 3627588 3677739 3805118 4073791 4313912 4080806 3966324 3661306 3636645
14059 3636645 3950406 3966774 4223647 4000675 3937296 3699967 3759728 3994511 3993152 3824141
14049 3824141 3973350 4161750 4062054 4107014 4031991 4192750 4481544 4096468 4142115 4103331
14039 4103331 3738239 3712231 3945066 3983611 3684651 3731171 3829483 3833886 3729883 3904493
14029 3904493 3967060 3937731 3772065 3646345 3682667 4168841 4460514 4184995 4008430 4162147
14019 4162147 4232508 4240476 3975239 3944013 3880194 3845175 3826053 3816185 3955479 4034590 3882651
14008 3882651 4176288 4218200 4067821 4077947 4043403 3859506 3931349 3940487 3842868 4231078 3974996
13997 3974996 3988774 4002728 4033795 4160552 4085436 4055288 4083077 4181904 4260724 4138263 3875276
13986 3875276 3944400 3916861 3850474 4115596 3994735 3933498 3824319 3712709 3882502 3878787
13976 3878787 3678603 4018152 4013692 4064439 4196516 3892303 3948064 4237589 3825192 4043814
13966 4043814 4155427 4085360 3662040 3592388 3569695 3650009 4101993 4003507 3885176 3933016
13956 3933016 3846845 3712760 3694603 3727700 3694657 3599393 3620551 3660188 3845486 4080854 4197291
13945 4197291 4272848 4165491 3930583 3925858 3784903 3870756 3908190 3938496 3811580 3629120
13935 3629120 3716726 3718630 3674123 3651320 3735393 3926927 4099779 4266628 4162679 4083361 4045189
13924 4045189 4114286 3788820 3740468 3847402 3786141 3798231 4086980 4170050 4348892 4167292
13914 4167292 3919824 3796121 3972382 3907456 3938855 3846379 3936987 4011004 3992991 3850103
13904 3850103 4047727 4228794 4313596 4255644 3848948 3844735 3918222 4037567 4058203 3958916 3793124
13893 3793124 3671994 3758153 4049626 3982312 3870899 3753555 3895813 3985784 3801661 3978021
13883 3978021 4430813 4260065 3945754 3854633 3910314 3921669 3972035 4051622 4094842 4319833
13873 4319833 4151046 3919184 4080045 4256875 4418217 4210566 4167162 4290608 4472375 4356975
13863 4356975 4074970 3893838 3986769 4131028 4054446 3982371 4002674 4220725 4158855 4235343
13853 4235343 4244011 4061839 3681226 3517639 3795958 3813445 3807495 3700980 3869729 3803520
13843 3803520 3885280 3904508 3935835 3788283 3886513 4011389 4119926 4120753 4020297 3922069 3915890
13832 3915890 4146721 3924621 3906089 4087316 4150464 4183669 4076029 4028401 3867101 3965853
13822 3965853 4114399 4398116 3964320 3995533 4363251 4211548 4409737 4554293 4486259 4272578
13812 4272578 4115749 4371335 4699620 4381969 4369645 4008437 3773472 3707705 3805813 3735727
13802 3735727 3900200 3872030 3589544 3847523 3923399 3951079 4054038 3952668 3923211 3752342
13792 3752342 3671606 3665722 3779054 3845396 3639439 3805767 4032289 4107588 3812411 3742713
13782 3742713 3973704 3991103 3889920 3996950 3941770 3869576 3907763 3754500 3747123 3751367 3957679
13771 3957679 3983275 4081225 4220973 4225425 4072249 3966081 4029983 4008784 3915853 3947988 3865337
13760 3865337 3927306 3768539 4030378 4090891 4111199 4236679 4172311 3931223 3889333 3893494 3905509
13749 3905509 4044015 4057652 4102745 4361916 4168060 4270761 4195107 3864048 3704822 3816611
13739 3816611 3819862 3813729 3991581 3967288 4185300 3837822 4218749 4304955 4008644 3772447
13729 3772447 4092598 4220630 4039674 4031600 4221455 4167800 4141568 4087596 4034064 4064741 4306100
13718 4306100 4135906 4095362 4068092 4139109 4275798 4200450 4126266 3928721 3887561 3989082
13708 3989082 3917444 3988322 4199287 4013995 3980350 4012508 4234457 4137022 3800563 3744702
13698 3744702 3802806 3863610 4081661 4064743 3866201 3952894 3924881 4066245 4192757 4200990 3948931
13687 3948931 4163570 4334147 4333409 4343376 4250874 4131771 4022365 4105510 4055917 3945176 3893999
13676 3893999 3997770 3950574 3929212 3937088 4001904 4040118 3992891 3890702 3828717 3963910 4107065
13665 4107065 4213275 4076167 4110183 4245010 4199770 4168655 4054706 4149744 3979789 4108227
13655 4108227 4202575 4047033 4064468 3975364 3870653 3985883 4127400 4158398 4214625 4225064
13645 4225064 4065164 3988168 4056644 4241307 4233014 4118572 4112388 4272935 4348437 4161338 4188350
13634 4188350 4253473 4155727 4378808 4461721 4219226 4160417 3989687 3992813 4018487 3933613 4214959
13623 4214959 4597010 4546397 4308776 4491843 4212027 4064639 3877508 3812935 3917639 3951720
13613 3951720 3873942 4070730 4206732 4257074 4121049 4347794 4139476 4173177 4311547 4417351
13603 4417351 4478914 4309209 4480290 4542436 4402948 4297247 4120545 4131277 3822704 3933588
13593 3933588 4299943 4329962 4274754 4175782 4299369 3998838 4310942 4600543 4590839 4371781
13583 4371781 4246147 4382424 4466303 4315541 4442476 4455329 4444094 4235838 4667137 4649790
13573 4649790 4301197 4292389 4248422 4066646 4171084 4245201 4201300 4037078 4058344 4183039
13563 4183039 4296417 4096224 4178173 4177234 4050387 4111199 4105754 4257535 4066029 4031066 4089406
13552 4089406 4458791 4509481 4214453 4167669 4205080 4143043 4204479 4154792 4346312 4643843
13542 4643843 4524312 4285681 3963042 4090458 4212843 4220341 4138903 4131933 4093052 4296906
13532 4296906 4401740 4587716 4400313 4140027 4107673 4150085 4169772 4296916 4187258 3869910
13522 3869910 4100847 3911788 3847735 4177494 4223062 4202487 4241982 4110483 4203914 4222687
13512 4222687 4050989 4020151 4052980 4012107 4054459 4137190 4261659 4181781 4263956 4066855 4196876
13501 4196876 4408384 4381807 4285947 4078851 4092819 4262602 4344592 4058718 3974202 4009179
$$ [...]
##END NTUPLES=NMR SPECTRUM
##END=
