##TITLE=1H_DE-80H_X3
 200.13MHz, d2o
 8 sc
 
 19ns.26.2.2025
##JCAMPDX= 6.0         $$ Bruker NMR JCAMP-DX V2.0
##DATA TYPE= NMR SPECTRUM
##DATA CLASS= NTUPLES
##ORIGIN= UXNMR, Bruker Analytische Messtechnik GmbH
##OWNER= pz
$$ XWIN-NMR		Version 3.5
$$ Tue Apr 28 12:17:38 2026 Russian Standard Time (UT+4h)  Yarkov@DPX200
##.OBSERVE FREQUENCY= 200.1313
##.OBSERVE NUCLEUS= ^1H
##.ACQUISITION MODE= SIMULTANEOUS
##.ACQUISITION SCHEME= undefined
##.AVERAGES= 8
##.DIGITISER RES= 18
##SPECTROMETER/DATA SYSTEM= spect
##.PULSE SEQUENCE= zg30
##.SOLVENT NAME= CDCl3
##.SHIFT REFERENCE= (INTERNAL, CDCl3, 0, 17.9021)
##AUDIT TRAIL= $$ (NUMBER, WHEN, WHO, WHERE, WHAT)
$$ ##TITLE= Audit trail, XWIN-NMR		Version 3.5
$$ ##JCAMPDX= 5.01
$$ ##ORIGIN= Bruker BioSpin GmbH
$$ ##OWNER= Yarkov
$$ C:/Bruker/XWIN-NMR/data/yarkov2/nmr/H-C/1/pdata/1/auditp.txt
$$ ##AUDIT TRAIL=  $$ (NUMBER, WHEN, WHO, WHERE, WHAT)
(   1,<2026-04-28 12:16:49.56 +0400>,<Yarkov>,<DPX200>,
      <created by zg, POWCHK disabled, PULCHK disabled
       configuration hash MD5:
       00 E9 B6 7A A2 85 ED C7 34 08 36 98 17 FE 4E 26
       data hash MD5: 16K
       2A DD 2B F1 26 A5 97 59 7C 54 3D EC 62 DC 19 43>)
(   2,<2026-04-28 12:16:52.81 +0400>,<Yarkov>,<DPX200>,
      <Start of raw data processing
       efp BC_mod = 2 LB = 0.25 FT_mod = 6 PKNL = 1 PHC0 = -5300.516 PHC1 = 11.42193 SI = 16K 
       data hash MD5: 16K
       98 E8 83 7F F4 73 8B E1 72 59 EF 8C FA 2B E6 45>)
(   3,<2026-04-28 12:16:56.79 +0400>,<Yarkov>,<DPX200>,
      <abs ABSG = 5 
       data hash MD5: 16K
       4C 91 28 55 8B B5 B5 B3 DD 64 28 A3 C4 D4 EE 9F>)
$$ ##END=
$$ 
$$ hash MD5
$$ E4 24 FC 3C 11 EE 88 8E CB 17 69 DD 97 04 99 DE
##$RELAX= 
##$RELAX= 
##$RELAX= 
##$RELAX= 
##$RELAX= 
##$RELAX= 
$$ Bruker specific parameters
$$ --------------------------
##$DU= <C:/Bruker/XWIN-NMR>
##$EXPNO= 1
##$NAME= <H-C>
##$PROCNO= 1
##$TYPE= <nmr>
##$USER= <yarkov2>
##$AMP= (0..31)
100 100 100 100 100 100 100 100 100 100 100 100 100 100 100 100 100 100 
100 100 100 100 100 100 100 100 100 100 100 100 100 100 
##$AQSEQ= 0
##$AQ_mod= 1
##$AUNM= <au_zg>
##$AUTOPOS= <>
##$BF1= 200.13
##$BF2= 200.13
##$BF3= 200.13
##$BF4= 200.13
##$BF5= 200.13
##$BF6= 200.13
##$BF7= 200.13
##$BF8= 200.13
##$BYTORDA= 1
##$CFDGTYP= 0
##$CFRGTYP= 5
##$CHEMSTR= <none>
##$CNST= (0..31)
1 1 145 1 1 1 1 1 1 1 1 1 1 1 1 1 1 1 1 1 1 1 1 1 1 1 1 1 1 1 1 1 
##$CPDPRG= <>
##$CPDPRG1= <>
##$CPDPRG2= <>
##$CPDPRG3= <>
##$CPDPRG4= <mlev>
##$CPDPRG5= <mlev>
##$CPDPRG6= <mlev>
##$CPDPRG7= <mlev>
##$CPDPRG8= <mlev>
##$CPDPRGB= <>
##$CPDPRGT= <>
##$D= (0..31)
0 0.7 0 0 0 0 0 0 0 0 0 0.03 0 0 0 0 0 0 0 0 0 0 0 0 0 0 0 0 0 0 0 0 
##$DATE= 1777364209
##$DBL= (0..7)
120 120 120 120 120 120 120 120 
##$DBP= (0..7)
150 150 150 150 150 150 150 150 
##$DBP07= 0
##$DBPNAM0= <>
##$DBPNAM1= <>
##$DBPNAM2= <>
##$DBPNAM3= <>
##$DBPNAM4= <>
##$DBPNAM5= <>
##$DBPNAM6= <>
##$DBPNAM7= <>
##$DBPOAL= (0..7)
0.5 0.5 0.5 0.5 0.5 0.5 0.5 0.5 
##$DBPOFFS= (0..7)
0 0 0 0 0 0 0 0 
##$DE= 6
$$ [...]
##$SUBNAM3= <"">
##$SUBNAM4= <"">
##$SUBNAM5= <"">
##$SUBNAM6= <"">
##$SUBNAM7= <"">
##$SUBNAM8= <"">
##$SUBNAM9= <"">
##$SW= 18.0517328524113
##$SWIBOX= (0..15)
0 0 2 0 0 0 0 0 0 0 0 0 0 0 0 0 
##$SW_h= 3612.71676300578
##$TD= 16384
##$TD0= 1
##$TE= 0
##$TE2= 300
##$TE3= 300
##$TEG= 300
##$TL= (0..7)
0 120 120 120 120 120 120 120 
##$TP= (0..7)
150 150 150 150 150 150 150 150 
##$TP07= 0
##$TPNAME0= <>
##$TPNAME1= <>
##$TPNAME2= <>
##$TPNAME3= <>
##$TPNAME4= <>
##$TPNAME5= <>
##$TPNAME6= <>
##$TPNAME7= <>
##$TPOAL= (0..7)
0.5 0.5 0.5 0.5 0.5 0.5 0.5 0.5 
##$TPOFFS= (0..7)
0 0 0 0 0 0 0 0 
##$TUNHIN= 0
##$TUNHOUT= 0
##$TUNXOUT= 0
##$USERA1= <user>
##$USERA2= <user>
##$USERA3= <user>
##$USERA4= <user>
##$USERA5= <user>
##$V9= 5
##$VALIST= <valist>
##$VCLIST= <CCCCCCCCCCCCCCC>
##$VD= 0
##$VDLIST= <DDDDDDDDDDDDDDD>
##$VPLIST= <PPPPPPPPPPPPPPP>
##$VTLIST= <TTTTTTTTTTTTTTT>
##$WBST= 1024
##$WBSW= 4
##$XGAIN= (0..3)
0 0 0 0 
##$XL= 0
##$YL= 0
##$YMAX_a= 201062
##$YMIN_a= -213936
##$ZGOPTNS= <>
##$ZL1= 120
##$ZL2= 120
##$ZL3= 120
##$ZL4= 120
##$ABSF1= 17.90205
##$ABSF2= -0.1498432
##$ABSG= 5
##$ABSL= 3
##$ALPHA= 0
##$AQORDER= 0
##$ASSFAC= 0
##$ASSFACI= 0
##$ASSFACX= 0
##$ASSWID= 0
##$AUNMP= <proc_1d>
##$AZFE= 0.1
##$AZFW= 0.1
##$BCFW= 0
##$BC_mod= 2
##$BYTORDP= 0
##$COROFFS= 0
##$CY= -3
##$DATMOD= 1
##$DC= 0
##$DFILT= <>
##$DTYPP= 0
##$F1P= 0
##$F2P= 0
##$FCOR= 1
##$FTSIZE= 16384
##$FT_mod= 6
##$GAMMA= 0
##$GB= 0
##$INTBC= 1
##$INTSCL= 3.241238e-09
##$ISEN= 128
##$LB= 0.25
##$LEV0= 0
##$LPBIN= 0
##$MAXI= 10000
##$MC2= 0
##$MEAN= 0
##$ME_mod= 0
##$MI= 1.114404
##$NCOEF= 0
##$NC_proc= -8
##$NLEV= 6
##$NOISF1= 3.799351
##$NOISF2= 2.8
##$NSP= 0
##$NTH_PI= 0
##$NZP= 0
##$OFFSET= 17.90205
##$PC= 1
##$PHC0= -5300.516
##$PHC1= 11.42193
##$PH_mod= 1
##$PKNL= yes
##$PPARMOD= 0
##$PSCAL= 0
##$PSIGN= 0
##$REVERSE= no
##$SF= 200.129523630091
##$SI= 16384
##$SIGF1= 3
##$SIGF2= 2
##$SINO= 0.751879
##$SIOLD= 32768
##$SREGLST= <19F.Aceton>
##$SSB= 0
##$STSI= 16384
##$STSR= 0
##$SW_p= 3612.71676300578
##$SYMM= 0
##$S_DEV= 0
##$TDeff= 16384
##$TDoff= 0
##$TI= <>
##$TILT= no
##$TM1= 0
##$TM2= 0
##$TOPLEV= 0
##$USERP1= <user>
##$USERP2= <user>
##$USERP3= <user>
##$USERP4= <user>
##$USERP5= <user>
##$WDW= 1
##$XDIM= 16384
##$YMAX_p= 408749649
##$YMIN_p= -2475352
$$ End of Bruker specific parameters
$$ ---------------------------------
##NTUPLES= NMR SPECTRUM
##VAR_NAME=  FREQUENCY,     SPECTRUM/REAL,   SPECTRUM/IMAG
##SYMBOL=    X,             R,               I
##VAR_TYPE=  INDEPENDENT,   DEPENDENT,       DEPENDENT
##VAR_FORM=  AFFN,          ASDF,            ASDF
##VAR_DIM=   16384,         16384,           16384
##UNITS=     HZ,            ARBITRARY UNITS, ARBITRARY UNITS
##FACTOR=    0.220516191357247, 1,           1
##FIRST=     3582.72874216655, 0,            0
##LAST=      -29.9880208392287, 0,           0
##MIN=       -29.9880208392287, -2475352,    0
##MAX=       3582.72874216655, 408749649,    0
$$ Real data points
##PAGE= N=1
##DATA TABLE= (X++(R..R)), XYDATA
$$ [...]
3815A351375J05922j17885m89314J6714J02996o6388J30384l20469j34771L62450
3805I41014K28901R9511m8410j28111L39590M5592l52936l05558J88969P8786
3795A087348q1888l45617n01910R5043J51398k89037J37453M18197M27574P004
3785A105565m44854m27960K50429M13872k18208K09713r6932l72045m06012P9307
3775I2875l36157j7905K19502N20191K94822j91645m61813J57562P3771J58356
3765E09559j52864o3334R2399J13187l09757r02000k32752M84914J32770j64623
3755d92501Q6762N76531K20639l50487O5139O0074k9493J53712k08788J7746m2562
3744E6772k25612l84209m26530N03236o1878o6824K44084J88664L29763J55775
$$ plain form
3815 1351375 1457297 1339412 850098 866812 969808 903420 1033804 713335 578564 941014
3805 941014 1169915 1269426 1221016 1092905 1432495 1478087 1125151 819593 1008562 1087348
3795 1087348 1005460 659843 157933 252976 404374 115337 252790 670987 1098561 1105565
3785 1105565 660711 232751 483180 897052 678844 888557 791625 419580 13568 92875
3775 92875 -243282 -261187 -41685 478506 773328 581683 119870 277432 351203 509559
3765 509559 356695 293361 385760 498947 189190 -712810 -945562 -460648 -327878 -492501
3755 -492501 -405739 170792 391431 40944 106083 166157 136664 290376 81588 99334 56772
3744 56772 -168840 -553049 -979579 -476343 -538221 -605045 -360961 -172297 157466 313241
3734C13241r0415n07730m4919L03532L7366m50663J29924K41678p3965j25042
3724b66993k51260p565l16301K19126L83306M0988J69595J81493l96341m60081
3714g04033K94192M03678o5430q6057J92644J93866O989n26010n45405N05608
3704c29958M46631j919l92601M7995O35489o9531p34560l70168L17327N51793
3694A00498k48700j52124M61677M05334j57365p00788p4632o1694M17981m1910
3684e1723r0580K36234L08565J47n59321j06153L49529k45234l33826L07149R0844
3673i4369N5310j92896k25577J02759L39707P2959l43700Q3487P92002j67831
3663D21851o31274j82913L27491N01342j25728n71362j95718L13422J41666k93251
$$ plain form
3734 313241 222826 -284904 -329823 -26291 11075 -439588 -309664 -67986 -141951 -266993
3724 -266993 -518253 -525818 -842119 -622993 -239687 -198699 -29104 152389 -243952 -704033
3714 -704033 -409841 -6163 -71593 -157650 34994 228860 235849 -290161 -835566 -329958
3704 -329958 116673 114754 -277847 -229852 405637 336106 -398454 -768622 -451295 100498
3694 100498 -148202 -300326 161351 566685 409320 -291468 -366100 -427794 -9813 -51723
3684 -51723 -142303 93931 402496 402643 -156678 -262831 86698 -158536 -492362 -185213 -94369
3673 -94369 -39059 -231955 -457532 -354773 -15066 57893 -285807 -202320 589682 421851
3663 421851 -209423 -392336 -64845 436497 310769 -260593 -456311 -142889 -1223 -294474
3653b94474q8682J2174O80748J82947n89025j26020M78976K29159m71164l34639
3643c20000n8877m5303Q0437l9644k6269K85433J34043j84256n13939j30000O44398
3632a73977K3285j90087K84377L18677j63150l12400o6694J271j85175m9049J70628
3621c42294J43878L58471J6840l73309j53599r2292j63888j92069M53481O90620
3611C45839j92694l23247k38260J81016n22715k11023J22182M91860K58317k54285
3601c43010k25178k24295J9775J62725J21922j8634M09548M7585l42726j06341
3591d98629j35077l82527l54050P18529P86018m2156l28507n84653N1838P8777
3581f90437o02738K61994P16476P64423J83426p51011k09920j31406k17501m02795
$$ plain form
3653 -294474 -383156 -370982 309766 492713 -96312 -222332 256644 485803 14639 -320000
3643 -320000 -378877 -424180 -343743 -383387 -409656 -124223 9820 -174436 -688375 -818375 -173977
3632 -173977 -150692 -340779 -56402 262275 99125 -213275 -279969 -278698 -463873 -512922 -342294
3621 -342294 -198416 160055 176895 -196414 -350013 -442305 -606193 -798262 -344781 345839
3611 345839 153145 -170102 -408362 -227346 -750061 -961084 -838902 -347042 -88725 -343010
3601 -343010 -568188 -792483 -772708 -609983 -488061 -506695 -97147 -49562 -392288 -498629
3591 -498629 -633706 -1016233 -1370283 -651754 134264 92108 -236399 -821052 -769214 -690437
3581 -690437 -1293175 -1031181 -314705 449718 633144 -117867 -327787 -459193 -676694 -1079489
3571a079489l40552R45381Q29538Q8176r07970l91053J24818K7480K19222Q2431
3561d02018M43135K16089K72727l10455o71522m27283Q1571J13190L88498L21086
3551B5018L22467J56477k12153q52237m93662J64470O32649O65506P6386k52964
3541B31957j3791j49026l79511l48628J1156K46771K54990O56403n4020k4494
3531D31807m58099J5000j56450k8469M66041L31346J57250J29776q5620o96807
3521A05775r9552J26703P3482N05354R00424O64065M34470L66931O49283J221858
3511D948793J520849R46350k01753p24484m53342q40398j282022r86422q76069
3502B051502k43739j18604N58273M83945j32535k83519j95278l21738l13929K29556
$$ plain form
3571 -1079489 -1420041 -474660 354878 443054 -464916 -855969 -731151 -703671 -484449 -402018
3561 -402018 41117 257206 529933 219478 -452044 -879327 -797756 -684566 -296068 25018
3551 25018 347485 503962 291809 -560428 -1054090 -889620 -256971 408535 484921 231957
3541 231957 218166 69140 -310371 -658999 -647843 -401072 -146082 510321 456301 431807
3531 431807 -26292 -11292 -167742 -196211 269830 601176 758426 888202 802582 105775
3521 105775 6223 132926 206408 711762 1612186 2276251 2710721 3077652 3726935 4948793
3511 4948793 6469642 7415992 7214239 6489755 6036413 5196015 3913993 2927571 2051502
3502 2051502 1807763 1689159 2247432 2731377 2598842 2315323 2120045 1798307 1484378 1713934
3492A713934N10434P05253K43050K33461j12014J08280M00837M94691Q55819K567109
3482G720854L300514L858119M028979L159840R72727k094837l426117l035383
3474A4484696k065328j837455j791286j700956k094100j405610n23767O2273M439
3465C132906j20493N76723Q735m95075n16132l12735j77307P73077Q52305N99019
3455D321023P28448O02366K65099N09500J531223K523643M254727M956211M670148
3446B4362388O67866k964043m162824l977352k679387k429778j693222q34613
3438F289035o66493n57857p99948j551849p59591K3721N13611J941k00530M57167
3428B749207L15388l69372q63737l68611M65174P97278M18260K07813P12544P90537
$$ plain form
3492 1713934 2224368 2929621 3172671 3406132 3294118 3402398 3803235 4297926 5153745 7720854
3482 7720854 11021368 14879487 18908466 22068306 23041033 20946196 17520079 14484696
3474 14484696 12419368 10581913 8790627 7089671 4995571 3589961 3066194 3128467 3132906
3465 3132906 3012413 3589136 3597871 3102796 2586664 2273929 2096622 2869699 3722004 4321023
3455 4321023 5049471 5651837 5916936 6426436 7957659 10481302 14736029 19692240 24362388
3446 24362388 25030254 22066211 17903387 13926035 11246648 8816870 7123648 6289035
3438 6289035 5622542 5064685 4264737 2712888 1953297 1977018 2490629 2492570 2292040 2749207
3428 2749207 3064595 2695223 1831486 1462875 1928049 2725327 3143587 3351400 4063944 4854481
3418D854481J93354M92070J232825J717399O35877o20296j162644j156169j270500
3409D916397j495979j054582m52373l03211L10651L50094n73157p33979p24292
3400B39569m8558k38388K97590L35083K60289J74807L17809l27783n22739o29599
3390a41920R6801Q51135J14790O3846Q1173q9206l23513p23420m2308L48896N82377
3379H18651N05259j47553j44600J71726o6996l93761L7983K49494J09354J39983
3369A279540J06782l66836m07502k5499k41186L7091L16712L17430l0900L6848
3359A022480L46651k25462j77885l24578M13749L24410l28229k72724k2535l4467
3349G21410R9084l04361P344J92008L52977J17702m72854L8759O37631R2324n64205
$$ plain form
3418 4854481 5047835 5539905 6772730 8490129 9126006 8505710 7343066 6186897 4916397
3409 4916397 3420418 2365836 1913463 1610252 1920903 2270997 1697840 963861 239569
3400 239569 191011 -47377 250213 585296 845585 1020392 1338201 1010418 487679 -141920
3390 -141920 -45119 806016 920806 984652 1065825 976619 653106 -70314 -112622 236274 818651
3379 818651 1323910 1176357 1031757 1203483 1136487 742726 780709 1030203 1139557 1279540
3369 1279540 1386322 1019486 611984 586485 345299 382390 699102 1016532 985632 1022480
3359 1022480 1369131 1143669 965784 641206 1054955 1379365 1051136 778412 755877 721410
3349 721410 820494 516133 523477 715485 1068462 1186164 713310 752069 1389700 1482024 917819
3338I17819n27841j42428q7983k63288j26567M37478K91471L60608K78754m38606
3328F99417m7082K17341K24893Q60j6584M42020p9808r2462n74536q35157k73996
3317c35094L69352J184565K57617k60563J44517l4542K91037N9817k50384M15147
3307A841469O10804M42344l35681r44767l97451j66731k41139l24713R1793P87678
3297A363606L83866k458o65448l94683M86794N45411L96464L67841j0380K06773
3287B677786l57066r62344m03882J411L20002L82670M90612Q8806j52411K43133
3277B328717k21456o63975k50062L73547O63418M76482m90238r25281m44355k26182
3267F20615R1549n83916M0200J129969Q31091n78149q11747k88775M32010M19203
$$ plain form
3338 917819 389978 247550 159567 -103721 -230288 207190 498661 859269 1138023 699417
3328 699417 652335 869676 1094569 1095429 1078845 1520865 1441057 1348595 774059 -61098 -335094
3317 -335094 34258 1218823 1476440 1215877 1360394 1325852 1616889 1676706 1426322 1841469
3307 1841469 2452273 2894617 2558936 1614169 1216718 1049987 808848 484135 575928 1363606
3297 1363606 1747472 1745014 1079566 684883 1171677 1717088 2113552 2481393 2471013 2677786
3287 2677786 2320720 1358376 954494 955905 1275907 1658577 2149189 2237995 2085584 2328717
3277 2328717 2107261 1443286 1193224 1566771 2230189 2706671 2216433 1291152 846797 620615
3267 620615 712164 128248 168448 1298417 2129508 1551359 739612 450837 882847 1302050
3257A302050j28552j29208Q06469N32746o05409j580859o55349P43299O7250l96732
3247d4295k42981Q18151P98622m72542q32526j27097P20426O55075n3528p156
3237A212149M25547K07304K00667n878J36734R98565M19073l02992l97770l46259
3227B547140n06024m37087j10271K41847k41252k21336j49107M36881K1144o93292
3217H88643o89452J18196L46890j5999k46185N38260R28247M78779j78718l64170
3207A804491P1507O40732R3795m72678j40772K67031J39660o52513j192509j00851
3197D57893K95100J77305l29562m2009P76334L15383K4289l36975k30164M14384
3187A521978O75472K48057J92239J27087o0164m81047m78662j56724j16642K77266
$$ plain form
3257 1302050 1173498 1044290 1850759 2383505 1778096 197237 -458112 285187 352437 -44295
3247 -44295 -287276 530875 1329497 856955 24429 -102668 617758 1272833 1219305 1212149
3237 1212149 1637696 1845000 2045667 2039789 2176523 3175088 3594161 3291169 2893399 2547140
3227 2547140 2041116 1604029 1493758 1735605 1494353 1273017 1123910 1560791 1581935 888643
3217 888643 199191 317387 664277 648278 402093 940353 1868600 2347379 2168661 1804491
3207 1804491 1875998 2516730 2610525 2137847 1997075 2264106 2403766 1751253 558744 457893
3197 457893 752993 930298 600736 558727 1335061 1650444 1674733 1337758 1107594 1521978
3187 1521978 2197450 2445507 2637746 2764833 2704669 2223622 1744960 1588236 1471594 1748860
3177A748860O11692K65596J40312j15720j31671r5075n0844j82323j58451J39243
3167B171619j84594m34468o73341o63774M3345L53000m4634K81198N62508L58968
3157A769827L62305j29331N7555O3027M30193J64951M22254K42965O070m45319
3147B944497p53692n85071k24325J34340K32214M25599L77638j74754K9975k61836
3137B144585j55170p5925k03627J77249L06664Q9645m12129k64043n90316j82276
3127H34657K36658K50616J76953P46775O40458J24658k67214k62926O6379L58854
3117B905868L21548r2196J72160M34893j9451q50176o62866L53381Q81919K35873
3107C680953k54969N8584N05520M64987n51558o29552N2494R36734L41566o62238
$$ plain form
3177 1748860 2360552 2626148 2766460 2650740 2519069 2423994 2373150 2190827 2032376 2171619
3167 2171619 1987025 1552557 879216 215442 258787 611787 567153 848351 1410859 1769827
3157 1769827 2132132 2002801 2060356 2123383 2553576 2718527 3140781 3383746 3389816 2944497
3147 2944497 2190805 1605734 1381409 1515749 1747963 2173562 2551200 2376446 2406421 2144585
3137 2144585 1989415 1913490 1709863 1887112 2193776 2283421 1871292 1607249 1016933 834657
3127 834657 1071315 1321931 1498884 2245659 2886117 3010775 2743561 2480635 2547014 2905868
3117 2905868 3227416 3135220 3307380 3742273 3722822 2872646 2209780 2563161 3445080 3680953
3107 3680953 3425984 3484568 3990088 4455075 3903517 3273965 3326459 4263193 4604759 3942521
3097C942521j56313J11407j02371m07584n34724L25726R01408R81394L83596J27656
3087E572716M40280L79764J55776j6200O57119R33821J003904O77419K57724L87801
3077A0450124R00961O76317P62111O24737L65332N71481P79005M3330o07571l14123
3067A4251704L79805O97438L95569k58291K84018k08723j00319o78882j305091
3058A3457228K7870K56740m14590p08137m43936l02472l12513n93110m32998k25555
3048A0308527P1510O5701K06652j25210k63411J21780J49979j22334N56821M54179
3038A1424194N18622O03198M72383J60526O78617R73506Q69898O70094O31417
3029A7002455J966444J993142J810517J484027J694895L177247L130894K417528
$$ plain form
3097 3942521 3786208 3897615 3795244 3387660 2852936 3178662 4080070 5061464 5445060 5572716
3087 5572716 6012996 6392760 6548536 6532336 7189455 8123276 9127180 9804599 10062323 10450124
3077 10450124 11351085 12027402 12789513 13414250 13779582 14351063 15130068 15173398 14565827 14251704
3067 14251704 14631509 15328947 15724516 15466225 15750243 15541520 15441201 14762319 13457228
3058 13457228 13485098 13741838 13327248 12619111 12175175 11872703 11560190 10967080 10534082 10308527
3048 10308527 10380037 10445738 10652390 10527180 10263769 10385549 10535528 10413194 10970015 11424194
3038 11424194 11942816 12546014 13018397 13178923 13857540 14831046 15700944 16371038 17002455
3029 17002455 18968899 20962041 22772558 24256585 25951480 29128727 32259621 34677149
3021C4677149K036357K061549K031035R50677k83736o20015n0965r210l47150
3012D0445691o6146L14977R05846O54304n37974j101212j276373r81201j671050
3003C6686862k724940k306351k092401j658967k705097k520953j426304j171682
2995B0080167p00502q93193j304418j22139l1449l20002m99073k05127J064549
2986A7068813Q09357L41069N53647Q27574P29706l44283p2964O11307Q11477J069631
2976B2405334O58216P76196J013962J022933P95651J121279K039699K935966K622508
2967C5391744K171526J773413J103955M61383k49497k45521q49851q75937p54693
2958C7926522o85970p93841q18984m31792j64902M49757L08206k28082j195440
$$ plain form
3021 34677149 36713506 38775055 40806090 41756767 41473031 40853016 40802051 40792841 40445691
3012 40445691 40379545 40694522 41600368 42254672 41716698 40615486 39339113 38357912 36686862
3003 36686862 33961922 31655571 29563170 27904203 25199106 22678153 21251849 20080167
2995 20080167 19379665 18486472 17182054 17059915 17028466 16708464 16209391 16004264 17068813
2986 17068813 17878170 18219239 18772886 19600460 20330166 19985883 19912919 20524226 21335703 22405334
2976 22405334 23063550 23839746 24853708 25876641 26672292 27793571 29833270 32769236 35391744
2967 35391744 37563270 39336683 40440638 40902021 40652524 40407003 39557152 38681215 37926522
2958 37926522 37240552 36446711 35627727 35195935 35031033 35480790 35788996 35560914 34365474
2949C4365474j612616j562835k004084k320353k008806r83643o53900r33916j324440
2940B0960881j006542j46508o02231l91251j25170J075047J374909P43902K44208
2931B2127245R43411J823361J495179Q49678J648491J981375J998638J334966
2923C4202344m6002R3076N61084N76381k11369k55945R40790J231500N46888J22375
2913C7761122M68717J167280J092623O00577l6869j79653J73879j148241j740048
2904C8159387j747216j449895j621543k007951j796875j547290j659120j720380
2896B4609117j350064j244598j200957o09212j04041k80753o98284r82535n42742
2887A7595931j3866n18414p27130m63566K93937M99024n73656j001353l22908
$$ plain form
2949 34365474 32752858 31190023 29185939 26865586 24856780 23873137 23219237 22285321 20960881
2940 20960881 19954339 19807831 19205600 18814349 18689179 19764226 21139135 21883037 22127245
2931 22127245 23070656 24894017 26389196 27238874 28887365 30868740 32867378 34202344
2923 34202344 34156342 34249418 34810502 35386883 35175514 34919569 35860359 37091859 37638747 37761122
2913 37761122 38229839 39397119 40489742 41090319 41053450 40873797 41047676 39899435 38159387
2904 38159387 36412171 34962276 33340733 31332782 29535907 27988617 26329497 24609117
2896 24609117 23259053 22014455 20813498 20204286 20100245 19819492 19121208 18138673 17595931
2887 17595931 17582065 17063651 16336521 15872955 16166892 16665916 16092260 15090907 14767999
2878A4767999O43819N01343J02174L64402J069582P69695K23040J10687N23277
2869A9076018J032234J024271Q25356L75446J20892M02829m32604j251943j239040
2860A9933459o10532Q6061o96944r84575j059182o90628p48863r79989n45042
2851A3703765n27388J67524J058363M6137p49940n12616J5009M87619k53520k72639
2841A3162314K27257R74548N11171p16504m89343R29015J172654J104169K49688
2832A7124969N73461R63042J24891q49603o74668o31198J57262o36013q86469
2823A5265674l20640l76247p96283j237791o83154k19130J67740N93876K9989
2814A2424034J93249L57256n09071K92761K18762L93416M6795k01446j50584n11015
$$ plain form
2878 14767999 15411818 15913161 16015335 16379737 17449319 18219014 18442054 18552741 19076018
2869 19076018 20108252 21132523 21957879 22333325 22454217 22857046 22424442 21172499 19933459
2860 19933459 19322927 19408988 18712044 17727469 16668287 15977659 15228796 14248807 13703765
2851 13703765 13176377 13343901 14402264 14448401 13698461 13185845 13200854 13688473 13434953 13162314
2841 13162314 13389571 14364119 14875290 14158786 13669443 14598458 15771112 16875281 17124969
2832 17124969 17698430 18661472 18786363 17936760 17262092 16630894 16788156 16152143 15265674
2823 15265674 14945034 14568787 13772504 12534713 11851559 11632429 11800169 12394045 12424034
2814 12424034 12617283 12974539 12465468 12758229 12976991 13370407 13417202 13215756 13065172 12554157
2804A2554157l96699n95914o63020M4671J79013J98131M8098q9546P85893N26856
2794A2591640J72160L55607J358165J754957O25746L49505R07346J263506P51056
2785B0129688q9778j5561L63254N61400m54400q85720k59666R36572M44230m06103
2775B0323916n04405p3664L08519m05293j063384p72257r2598o02399j099711
2766A6018724j108177l79563o79371m37805n02981j52855L26095q4073o56174
2757A2343820q49631m07158q3215n86914l45398O6929j74956n35198m68223m23891
2747H536165M9928O35390O21714M41084P69467Q37072N46349N86221Q69397Q78608
2737A4771395Q67209N04994Q85728Q53888J015514N92279Q9439R65593J331086
$$ plain form
2804 12554157 12157458 11561544 10898524 10943195 11122208 11320339 11368437 11278891 12064784 12591640
2794 12591640 12763800 13119407 14477572 16232529 16858275 17207780 18115126 19378632 20129688
2785 20129688 20039910 20024349 20387603 20949003 20494603 19608883 19349217 20285789 20730019 20323916
2775 20323916 19819511 19745847 20054366 19649073 18585689 17813432 17720834 17118435 16018724
2766 16018724 14910547 14530984 13851613 13413808 12910827 12757972 13084067 12999994 12343820
2757 12343820 11494189 11087031 11003816 10416902 10071504 10138433 9963477 9428279 8960056 8536165
2747 8536165 8586093 9221483 9843197 10284281 11053748 11890820 12437169 13023390 13892787 14771395
2737 14771395 15638604 16143598 17029326 17883214 18898728 19491007 19580446 20546039 21877125
2728B1877125J251010N67082K66266Q68732J042666O87895P76565J445746J684065
2719C0467152R74768j06741q93209j007803j166581j974971j913890j883565o56239
2710B1838921p53603j896357j748034n11298m58576j211628p17541m0442l35450
2701A4165992p53607j138429r48346J06774j22099j73596O6649N03384K44426
2692A1951148q5874L48575M58894N12781Q27523L40154K37544N30864M45533J83786
2682A5750928L33856R55385J451100J478396J849754J237425J693367J684133
2674B6434344J065821Q33852J009452P60795j65053j023751p41076j059855m71032
2665B6643497p6256m95931n9354k04780p87209j756700j793734j478332j290180
$$ plain form
2728 21877125 23128135 23695217 23961483 24830215 25872881 26560776 27337341 28783087 30467152
2719 30467152 31441920 31335179 30441970 29434167 28267586 26292615 24378725 22495160 21838921
2710 21838921 21085318 19188961 17440927 16929629 16471053 15259425 14541884 14501442 14165992
2701 14165992 13412385 12273956 11325610 11432384 11310285 11136689 11203338 11706722 11951148
2692 11951148 11865274 12213849 12672743 13185524 14013047 14353201 14590745 15121609 15567142 15750928
2682 15750928 16084784 17040169 18491269 19969665 21819419 23056844 24750211 26434344
2674 26434344 27500165 28334017 29343469 30104264 29939211 28915460 28174384 27114529 26643497
2665 26643497 26567241 26071310 26011956 25807176 25019967 23263267 21469533 19991201 18701021
2656A8701021j456224r48847j093165r06683j048271j557144j301386j027130
2648I362171q9906j28239q71906j45536l0902l89297m19188l95316M95552P65028
2638H152461L88852k12119L2757J63761o71729o74352j38318K66924R48795K21273
2628H478305n4413J68865K51803P59827K74677R30571K171556J337757J456597
2619A5775545N03152K2050K89996k42899j369996j326833n58002p84358j602125
2610A0706530j905953j111798q15750k75685p85316k96278L47554k01503r07148
2601D754653j204357j70099K89787m02384o02782o95408N27463K67593r09294
2592A855172n79293j35365N57546k0295l01292K92141J84132J67582l11189l25806
$$ plain form
2656 18701021 17244797 16295950 15202785 14296102 13247831 11690687 10389301 9362171
2648 9362171 9272265 9144026 8272120 8126584 8095682 7706385 7287197 6891881 7387433 8152461
2638 8152461 8541313 8329194 8361951 8525712 7853983 7179631 7041313 7308237 8257032 8478305
2628 8478305 8423892 8592757 8844560 9604387 9879064 10809635 12981191 14318948 15775545
2619 15775545 16278697 16300747 16590743 16347844 14977848 13651015 13093013 12308655 10706530
2610 10706530 8800577 7688779 6873029 6597344 5812028 5515750 5863304 5661801 4754653
2601 4754653 3550296 3380197 3669984 3267600 2664818 1969410 2496873 2764466 1855172
2592 1855172 1275879 1140514 1698060 1677765 1376473 1668614 1852746 2020328 1709139 1383333
2582A383333K28962M42481l76025p75230l00635L29553j7445o02577O4499J62229
2572E39145K99654K65447k33285J6377J60075J07969l96913j69709J77486k16228
2562E50018l67366l99072k64794M47342K47621j47578K40177M51254K12677o91969
2552B78310k99868M01221L52464K52072l16817l63252K84962j66062o99257k85626
2542e61853M48090N16983j29399k91030O5212K61179k0275l79404j90777O21560
2532C40286O33550m94671p37950K17991R591l3010k37132k77807O10496M44933
2522D76277p3455l21529l10417P9513J66194j25121l968O77359L21271k69201
2512F16923p99920k67785Q3416K38664k14983k32884L40945m5774L21858j40904
$$ plain form
2582 1383333 1612295 2054776 1678751 903521 602886 932439 914994 312417 376916 539145
2572 539145 838799 1104246 870961 887338 1047413 1155382 758469 588760 766246 550018
2562 550018 182652 -216420 -481214 -33872 213749 66171 306348 757602 970279 278310
2552 278310 -21558 379663 732127 984199 667382 304130 589092 423030 -276227 -561853
2542 -561853 -113763 403220 273821 -17209 48003 309182 288907 -90497 -281274 340286
2532 340286 973836 479165 -258785 -40794 -31203 -64213 -301345 -579152 31344 476277
2522 476277 402822 81293 -229124 -149611 16583 -108538 -112506 564853 886124 616923
2512 616923 -182997 -450782 -367366 -128702 -343685 -576569 -235624 -281398 40460 -100444
2502a00444m03340p1010K41963L04365M34735P9148j48429m53922k07047m6834
2492c70815k61270J58222L13824M26249j22746n93788k15207J30939L19488k3094
2482b38198j08289L35159M31421l48076p82474j97829O10662J97933o6035j92625
2472c58351J28708L68812l65956j76887l64M13725J86804J34683j55609J74642
2462C50207J22216j53389m16697q3917K11261J61062K00250p0970p9835k21893
2452A8295L78622L70023j51286n4961J81870J57725j42244o11949j19593L87830
2442D14332M90551j79866m28210K57307N125j69885k17728L13966L14353N89150
2432A389095N44362K63938K24329M11426J69668o96075k39215j97925k40562j40911
$$ plain form
2502 -100444 -503784 -574794 -332831 -28466 406269 485417 336988 -116934 -323981 -370815
2492 -370815 -632085 -473863 -160039 266210 143464 -450324 -665531 -534592 -215104 -238198
2482 -238198 -346487 -11328 420093 72017 -710457 -908286 -297624 -99691 -165726 -358351
2472 -358351 -229643 139169 -226787 -403674 -404038 9687 196491 331174 175565 350207
2462 350207 472423 319034 -97663 -181580 29681 190743 390993 320023 240188 18295
2452 18295 396917 766940 615654 560693 742563 900288 758044 146095 26502 414332
2442 414332 904883 725017 296807 554114 559239 389354 171626 485592 799945 1389095
2432 1389095 1933457 2197395 2421724 2833150 3002818 2306743 2067528 1869603 1629041 1488130
2422A488130j90993m21737m2541j72066J9187J3166N5270J98699K26832J9571
2412A193518j28911n38319M78382P00649K60020j16961K36309K15156k4133k56006
2402B019704m08444o3384K58566J93397q0737k06764J2827m2244k89970k01933
2392A191018k26998M38690M67287j7283n73455o9150N08124J04256j8043o7565
2382A736881J65496O09876K51650j93545o7313K54513J70402J46606k09408J29515
2372B994673M33594N08841o71185q38511k18449M42475J90213m72088k95500K77936
2362B351999K31131m00941n23753p9863N34660K42513J00103l45262N2133O96995
2352B859715o5470j98550j35737M27804Q48920K24574l3765J76528N01602P0294
$$ plain form
2422 1488130 1297137 875400 832859 660793 679980 693146 748416 947115 1173947 1193518
2412 1193518 1064607 526288 1004670 1705319 1965339 1848378 2084687 2299843 2275710 2019704
2402 2019704 1611260 1547876 1806442 1999839 1919102 1712338 1725165 1682921 1392951 1191018
2392 1191018 964020 1402710 1869997 1852714 1279259 1210109 1718233 1822489 1804446 1736881
2382 1736881 1902377 2512253 2763903 2570358 2503045 2757558 2927960 3074566 2865158 2994673
2372 2994673 3428267 3937108 3265923 2427412 2208963 2651438 2841651 2369563 2074063 2351999
2362 2351999 2583130 2182189 1658436 1578573 2113233 2355746 2455849 2110587 2162720 2859715
2352 2859715 2794245 2595695 2459958 2887762 3736682 3961256 3927491 4104019 4605621 4675915
2342D675915n19948L4686P74109J52272m9593O3902J69227L14891M50598L77110
2332F443169m4345O56433R67111N77760R89044R08843J170381J154514P56199
2323A3579109J542317J108481J177712J324113J967002K614108J620062J743513
2315B6676417L320835L742304M327330M408701M441387N478048N023785L455798
2307F0874605J665071J370982J851635O66780q5413m78417k82108j248763l677889
2298F0656483m897764n085295m722878m550079n402617m720292l405204l211028
2290B4661326l269584l271604j588640p61475j230902j062699j283302m36043
2282A1757077m61211j086829l88699Q355K1497J10621J08707p1773L3844L93302
$$ plain form
2342 4675915 4155967 4190653 4964762 5117034 5067441 5131343 5300570 5615461 6066059 6443169
2332 6443169 6398824 7055257 8022368 8600128 9589172 10498015 11668396 12822910 13579109
2323 13579109 15121426 16229907 17407619 18731732 20698734 23312842 24932904 26676417
2315 26676417 29997252 33739556 38066886 42475587 46916974 52395022 57418807 60874605
2307 60874605 62539676 63910658 65762293 66429073 66343660 65865243 65583135 64334372 60656483
2298 60656483 55758719 50673424 45950546 41400467 35997850 31277558 27872354 24661326
2290 24661326 21391742 18120138 16531498 15770023 14539121 13476422 12193120 11757077
2282 11757077 11295866 10209037 9820338 9828693 9850190 9960811 10069518 9997745 10031589 10424891
2272A0424891O32147K02973O20256K90666r1660J62261J60083K02041l69623n64711
2262A1669324L22927L33928n70930r72985m60333n19646r93542j209459q22196
2253F777088l20161J46924o15249m33108K6822k95211o17473o36876k87914L3858
2243C778700L86228n1236l57158j93783k44794n50320m94889K8747L83890J54068
2233B839453j04049k02203j84904N4899j38991l36844K9762K57085k2791l09531
2223A881886k09165k2065K38648l57592q4800K59442j8068j72095p39359L42007
2213A118839N78308M1437j36352l33765J16648J01943j07725J70092K74961P3312
2203A897698q1788l60546l3215L23025N5167j94328m43778K54569O58244n4252
$$ plain form
2272 10424891 11057038 11260011 11880267 12170933 12079273 12241534 12401617 12603658 12234035 11669324
2262 11669324 11992251 12326179 11755249 10782264 10321931 9802285 8808743 7599284 6777088
2253 6777088 6456927 6603851 5988602 5555494 5582316 5287105 4669632 4032756 3744842 3778700
2243 3778700 4164928 4113692 3756534 3562751 3317957 2767637 2272748 2301495 2685385 2839453
2233 2839453 2735404 2533201 2348297 2403196 2264205 1927361 1957123 2214208 2191417 1881886
2223 1881886 1672721 1650656 1889304 1531712 1446912 1706354 1688286 1516191 776832 1118839
2213 1118839 1697147 1738584 1602232 1268467 1385115 1487058 1379333 1549425 1824386 1897698
2203 1897698 1815910 1455364 1422149 1745174 1800341 1606013 1162235 1416804 2075048 2020796
2193B020796k39576M391P8546J35943k91864P6360M67446M29992L58060L63156
2183C403250Q56553J081343Q08376M63113m7452j60743q48251j102064o88683
2174C765442k70314l35313m13924j43674J08316J50661J77145l17079m12553j76740
2164B131967n6272M31015K95668m3918L64827K14067Q539l12576k13185M59250
2154C279382J31532K87733J65842N89694M28576j78407o33179L96289J135682
2145E603144R23670M66524N21137Q27990Q28914P09110N36510J024086K033569
2136A3474654J871399J422644J488618J918071K250089K083288K297721L213474
2128C0019958L868495L436575K378324J801441J363566O31718K12220j32458K06384
$$ plain form
2193 2020796 1781220 1785611 1864157 2000100 1708236 1784596 2252042 2682034 3040094 3403250
2183 3403250 4259803 5341146 6149522 6612635 6565183 6404440 5556189 4454125 3765442
2174 3765442 3495128 3159815 2745891 2602217 2710533 2861194 3038339 2721260 2308707 2131967
2164 2131967 2075695 2506710 2802378 2758460 3123287 3337354 3345893 3033317 2820132 3279382
2154 3279382 3410914 3698647 3864489 4454183 4882759 4704352 4071173 4467462 5603144
2145 5603144 6526814 6993338 7514475 8342465 9171379 9880489 10416999 11441085 13474654
2136 13474654 15346053 16768697 18257315 20175386 22425475 24508763 26806484 30019958
2128 30019958 33888453 37325028 39703352 41504793 42868359 43500077 43712297 43579839 43786223
2119D3786223j13323j817288k365715l223047l566749l428597l437331l175796
2111B2658377k270681k082752j943303k321524j773067j389143j334271r85927
2103H557709n05806J59060k06325l85935o41675j081541m11400j44646j24007
2094E215434L13227K36053L8021O5085m68849k7552M24066P68014Q26963k25698
2084G164764l37857l64646p79574q64135m04981l01940J25151k46093l9854k86082
2074C664753m48169m27048k52226j2330k7704P4033L19608j36779O0245l65490
2064B448893l83671j48975J29107M29038q9589j73819j57660J68898m11025n82796
2054A228401M5702M29916J83861K01737L35269n15910J37330O4321n01357K64182
$$ plain form
2119 43786223 43672900 41855612 39489897 36266850 32700101 29271504 25834173 22658377
2111 22658377 20387696 18304944 16361641 14040117 12267050 10877907 9543636 8557709
2103 8557709 8051903 8210963 8004638 7618703 6977028 5895487 5484087 5339441 5215434
2094 5215434 5528661 5764714 5802735 5867820 5398971 5371419 5795485 6563499 7390462 7164764
2084 7164764 6826907 6462261 5682687 4818552 4413571 4111631 4236782 3990689 3950835 3664753
2074 3664753 3216584 2789536 2537310 2524980 2497276 2571309 2890917 2754138 2814383 2448893
2064 2448893 2065222 1916247 2045354 2474392 2384803 2210984 2053324 2222222 1811197 1228401
2054 1228401 1274103 1704019 1887880 2089617 2424886 1908976 2046306 2110627 1609270 1873452
2044A873452J99820O1737k72863n70796n013k58315R45M56953n2762P0661K79928
2033A783747K23615j94150n73934L16170L27061N59329R2725m08355K11112j42609
2023B194711l87697j39684J47521N92823J38442o8466L6405J17662J96033K3243
2013B850993j93857N30829O31524L9365n13191l06229L77855K36491K33898M92462
2003D380140k3241L58445L65310l6967k04867K3356L63371O12104R35414O66026
1993G439091P5829K43142M33449L1344J83310N00684J292857Q23531N88246O16367
1983A2227850N48374O29346O97272N45994J448153J617657J147820M38388R1701
1974A9392555P1855O90162R4384R5108Q89335J022635J47611J5671J08502l64457
$$ plain form
2044 1873452 2073272 2135009 1862146 1291350 1286337 1028022 1028967 1485920 1433158 1503819 1783747
2033 1783747 2007362 1813212 1239278 1555448 1882509 2441838 2534563 2126208 2337320 2194711
2023 2194711 1807014 1667330 1814851 2407674 2546116 2477650 2514055 2631717 2827750 2850993
2013 2850993 2657136 3187965 3819489 3858854 3345663 3039434 3417289 3653780 3887678 4380140
2003 4380140 4356899 4715344 5080654 5043687 4838820 4862176 5225547 5837651 6773065 7439091
1993 7439091 7514920 7758062 8191511 8222855 8406165 8906849 10199706 11023237 11611483 12227850
1983 12227850 12776224 13405570 14102842 14648836 16096989 17714646 18862466 19300854 19392555
1974 19392555 19464410 20154572 20248956 20344064 21233399 22256034 22403645 22419316 22527818 22163361
1964B2163361M02575Q18457N96415N78845L62323K43486j92066n07072L78468
1955B4844792O86605J039489J189117Q49656P55911M07973J099381J040842Q99978
1946C2813744K088693K660121L251188K087303K050498K844751K802887L338524
1938E3937709L089702K898577K868024J969008O07753k61056n31912P177k70351
1929F4314631j619872j744630j682080k855941l423796l267634k713296k223964
1921D4783418j601988q52034j118562j085381j113519j726108j394619j133669
1913C4757538q53470m06374q4642j01317j086369j166198j187582p89388n46259
1904B8535939r60560l38571K64694j70350j057236p64564l69878k07277j73969
$$ plain form
1964 22163361 22565936 23384393 23980808 24559653 24921976 25165462 24973396 24466324 24844792
1955 24844792 25531397 26570886 27760003 28609659 29365570 29773543 30872924 31913766 32813744
1946 32813744 34902437 37562558 40813746 42901049 44951547 47796298 50599185 53937709
1938 53937709 57027411 59925988 62794012 64763020 65370773 65109717 64577805 64584982 64314631
1929 64314631 62694759 60950129 59268049 56412108 52988312 49720678 47007382 44783418
1921 44783418 43181430 42329396 41210834 40125453 39011934 37285826 35891207 34757538
1913 34757538 33904068 33497694 33413052 33311735 32225366 31059168 29871586 29082198 28535939
1904 28535939 27575379 27236808 27501502 27331152 26273916 25509352 25139474 24932197 24758228
1895B4758228j46070k88480K04773K45211j273785j723098j113734k46838m36652
1886A9979555r24857n84985j139582n43309r78347j618950n79399j31626K44852
1877A3723352m05391p38550j64707l42254q10739q59225p56647q8099p5360j0003
1867I472377l85831o13937n72802m54990j82330l42418m06887K58111l4467o12599
1857F124227m18385k62005k98458k90399j11256L05165k48068j11259j05187q27719
1847C756656k59723j58982O7463K20892K40244j12184j76886o3331J49099l89000
1837C274248j79654p3569K55630R1408m05508K324P6647l17469m84508K21884
1827B461433L73852M78497J12785q8815l89428k78571J74622p1188j30275Q3154
$$ plain form
1895 24758228 24612158 24323678 24528451 24773662 23499877 21776779 20663045 20416207 19979555
1886 19979555 19054698 18469713 17330131 16786822 15808475 14189525 13610126 13478500 13723352
1877 13723352 13317961 12579411 12414704 12072450 11261711 10402486 9645839 9557740 9482380 9472377
1867 9472377 9086546 8472609 7899807 7444817 7262487 6920069 6513182 6771293 6736826 6124227
1857 6124227 5705842 5443837 5145379 4854980 4743724 5048889 4800821 4689562 4584375 3756656
1847 3756656 3496933 3337951 3405414 3626306 3866550 3754366 3577480 3514149 3663248 3274248
1837 3274248 3094594 3021025 3276655 3368063 2962555 2964879 3041526 2724057 2239549 2461433
1827 2461433 2835285 3313782 3426567 3337752 2948324 2669753 2844375 2773187 2642912 2726066
1817B726066J25003M6216j49604j28577l85314J82032K44344K47860J37056J63169
1807C208251j01096k84982l22365J01753L53381K9330p0536j63748J77984N32068
1797C460040j68252m90641K91112J045261N9929j155192j83211L52478q0028n26331
1787B605165k61869P41958M94988l47127n84946l38731M80140j24572j34136K73664
1777B804534L70945K56121k62356m45425J19504K83631k34595j32967M79486P07781
1767C946659k27291o07031l60218J07456O6014r487M69874Q89405Q9569o13827
1757C751123n89130J76386J231461M2857l12198O80878J198454K43416j213372
1748E209875m31298P82249J078633M20234r1340R09210R43899j26544o72724k45247
$$ plain form
1817 2726066 2851069 2897285 2747681 2619104 2233790 2415822 2660166 2908026 3045082 3208251
1807 3208251 3107155 2822173 2499808 2601561 2954942 2984272 2913736 2749988 2927972 3460040
1797 3460040 3291788 2801147 3092259 4137520 4197449 3042257 2859046 3211524 3131496 2605165
1787 2605165 2343296 3085254 3580242 3233115 2648169 2309438 2789578 2665006 2530870 2804534
1777 2804534 3175479 3431600 3169244 2723819 2843323 3126954 2892359 2759392 3238878 3946659
1767 3946659 3719368 3112337 2752119 2859575 2925589 2916102 3385976 4275381 4364950 3751123
1757 3751123 3161993 3338379 4569840 4612697 4300499 4981377 6179831 6423247 5209875
1748 5209875 4778577 5560826 6639459 7059693 6968353 7877563 8821462 8694918 8022194 7776947
1738G776947P38884J070971M60484L35870M65225j66890n32925o48515J46136
1729I646187O35428L42514L04237K12979m8483n00569k43549j31560N162M99428
1719A0721774M59467K00971J91876n35957n82215l54802N64360J026452O06725
1710A2298651J46836L68412K56021R2557k11102j69260J97027J314940Q13240
1701A5107322j85700O2602J83869L14801q3004n74757K25140J146463J156474
1692A7353210j84380n39169R2966J81417L04361K43458P11162J435224J220775
1683B0819024K05131K07817M72130J388586J459398J213188J764972J683725J982026
1674C1195997J751046J662436J828641J894070K306617K493863K500831J833287
$$ plain form
1738 7776947 8515831 9586802 10047286 10383156 10848381 10681491 10148566 9500051 9646187
1729 9646187 10281615 10624129 10928366 11141345 11092862 10592293 10348744 10217184 10222346 10721774
1719 10721774 11181241 11382212 11574088 11038131 10455916 10101114 10665474 11691926 12298651
1710 12298651 12445487 12813899 13069920 13162477 12951375 12782115 12979142 14294082 15107322
1701 15107322 14921622 14984224 15168093 15482894 15399890 14825133 15050273 16196736 17353210
1692 17353210 17168830 16629661 16722627 16904044 17208405 17451863 18163025 19598249 20819024
1683 20819024 21024155 21231972 21704102 23092688 24552086 25765274 27530246 29213971 31195997
1674 31195997 32947043 34609479 36438120 38332190 40638807 43132670 45633501 47466788
1666D7466788J584289J510543J345957O13422N63619R29302J252550M86186k96496
1657E5456160l22583l45135n49397r83207j048717r67804q42156j475998k311076
1648D6610087j670346j470024j192904j112654p90513J96811L65597M6281N10741
1639D1493076M24662M01533R25876J606436K031140J948267K020244K233585K567237
1630E5652056K547491J948301K074544K640567L306743K239129J709089J902020
1622G4019940K611158K032967J266542J815349K693744K519180K089620J528393
1614I0576893J133000J175098R86178K52964J54836J187229P83395N00178M23521
1605I7173292M17772J19581P67668P20855J135547J024273J076272J195931Q90195
$$ plain form
1666 47466788 49051077 50561620 51907577 52520999 53084618 54013920 55266470 55752656 55456160
1657 55456160 55133577 54788442 54239045 53255838 52207121 51239317 50397161 48921163 46610087
1648 46610087 44939741 43469717 42276813 41164159 40373646 40570457 40936054 40982335 41493076
1639 41493076 41917738 42319271 43245147 44851583 46882723 48830990 50851234 53084819 55652056
1630 55652056 58199547 60147848 62222392 64862959 68169702 70408831 72117920 74019940
1622 74019940 76631098 78664065 79930607 81745956 84439700 86958880 89048500 90576893
1614 90576893 91709893 92884991 93871169 94124133 94278969 95466198 96249593 96749771 97173292
1605 97173292 97591064 97710645 98478313 99199168 100334715 101358988 102435260 103631191 104521386
1596A04521386P43305Q92456J015794P83371L87230m84928p85559j060321j594941
1587A04417793j785658j839810j541759p95021o96809j042824p36924k29498K42056
1578I5991546M65658O07487K87205N16716k21925p67647j080638k068562j954222
1569I1775618j651114j685360j991354k062742j837868j509337k000331k302764
1561G6734748k097788r82165o12412j094734j290528j365562n89184n19357r29202
1552F7253816o51440J56932J28740n46489j399276j003386j117420j243958p80767
1543F0796752j392468j661273j428885j167624j634679j643170j762450j541783
1535D8564420j128770r83287j557086j525916j061486j117897j337090j419730
$$ plain form
1596 104521386 105264691 106157147 107172941 107956312 108343542 107858614 107073055 106012734 104417793
1587 104417793 102632135 100792325 99250566 98455545 97758736 96715912 95978988 95749490 95991546
1578 95991546 96457204 97064691 97351896 97868612 97646687 96879040 95798402 93729840 91775618
1569 91775618 90124504 88439144 86447790 84385048 82547180 81037843 79037512 76734748
1561 76734748 74636960 73654795 73042383 71947649 70657121 69291559 68702375 68183018 67253816
1552 67253816 66602376 66759308 66888048 66341559 64942283 63938897 62821477 61577519 60796752
1543 60796752 59404284 57743011 56314126 55146502 53511823 51868653 50106203 48564420
1535 48564420 47435650 46452363 44895277 43369361 42307875 41189978 39852888 38433158
1527C8433158p65433j158984o89475m92932p74012p73771k82335l37428n33310
1518C2625478m31613l2767N10488J16842N0141l62638J4812Q14087M96196O2449
1508C3863475j70519N64164J140918M23956j30617O9895J237649J205998M64582
1499C8669501N17075J208586J584780J179740L32340P19684J497752J550973P06624
1490D7967055N51048J544470J476242P42173L19917M46473R39225P39798J3303
1481E4739704M70980N65209N90904k14459l59488L20330k39215l86230m38804
1472E5048931n30128j65652o90455j343592q04674l60247o19294p63150n02314
1463D9269425M21661R5002m01974n24542Q4893O35711P99551P41698Q04261J340887
$$ plain form
1527 38433158 37667725 36508741 35819266 35326334 34552322 33778551 33496216 33158788 32625478
1518 32625478 32193865 32161098 32671586 32788428 32838569 32475931 32490743 33304830 33801026 33863475
1508 33863475 33692956 34257120 35398038 35821994 35691377 35761272 36998921 38204919 38669501
1499 38669501 39186576 40395162 41979942 43159682 43492022 44211706 45709458 47260431 47967055
1490 47967055 48518103 50062573 51538815 52280988 52600905 53047378 53986603 54726401 54739704
1481 54739704 55210684 55775893 56366797 56152338 55792850 56113180 55873965 55487735 55048931
1472 55048931 54518803 54353151 53662696 52319104 51514430 51154183 50534889 49771739 49269425
1463 49269425 49691086 49786088 49384114 48859572 48944465 49580176 50379727 51121425 51925686 53266573
1453E3266573J556012J071491M01532J019947J546429J255024O71683P85358J522665
1444F3096714J078951O34497N11802P75188J184329P69713M96051J42197N07140
1435F9196582N89429l78228j007168n93658J67644K19500q61099r16626p84750
1426F5631626m58925q32310j700792j203194p84407q70057j221369q71237l48899
1417E7340436m72274j274531j159871l84655l9948J4829k80077K63222M44118
1408E4451249N60868K81860N4451O95885J252125J469544J148433P90511M14534
1399F1119460P1581M88959M63008N79770N44291P67825P43117J039976L12231
1390F6130218N01312J406170J513007J193046R82121J137141J232451N45961p73949
$$ plain form
1453 53266573 54822585 55894076 56295608 57315555 58861984 60117008 60788691 61574049 63096714
1444 63096714 64175665 64810162 65321964 66097152 67281481 68051194 68547245 68689442 69196582
1435 69196582 69786011 69407783 68400615 67806957 67974601 68194101 67333002 66416376 65631626
1426 65631626 65172701 64340391 62639599 61436405 60651998 59781941 58560572 57689335 57340436
1417 57340436 56868162 55593631 54433760 54049105 54009157 54023986 53743909 54007131 54451249
1408 54451249 55012117 55293977 55348428 56044313 57296438 58765982 59914415 60704926 61119460
1399 61119460 61191041 61680000 62143008 62722778 63267069 64034894 64778011 65817987 66130218
1390 66130218 66631530 68037700 69550707 70743753 71725874 72863015 74095466 74641427 73867478
1381G3867478q38671m33298o29693j392125j606618j358889q98783r81746j122832
1372F4604823m95489K77768N52984K97562m12707k98046j85399j09411m29100
1363F3802985k60970M9821k03933l83952m11001N2820k28613R282P63772R14573
1353F4104784M52939K33471O21398K32844m88423m14779n26764o07445n87631
1344F3020394m47226r63141j523996p44525l84104r92777j303305q24622J10762
1335E5947460j87223q35827j16132M72147J331690Q39151j2165J54050P52051
1326E8345202L62506q98385k109269j233560m87411q90862k292798j866251k39367
1317D8689805m51451j164938j628975m55910R2301q09513j329579j155693r5562
$$ plain form
1381 73867478 73028807 72595509 71965816 70573691 68967073 67608184 66709401 65727655 64604823
1372 64604823 64109334 64387102 64940086 65237648 64824941 64526895 64341496 64232085 63802985
1363 63802985 63542015 63591836 63387903 63003951 62592950 62645770 62417157 62426439 63190211 64104784
1353 64104784 64557723 64791194 65412592 65645436 65157013 64742234 64215470 63608025 63020394
1344 63020394 62573168 61610027 60086031 59341506 58957402 57964625 56661320 55836698 55947460
1335 55947460 55760237 54924410 54808278 55280425 56612115 57451266 57439101 57593151 58345202
1326 58345202 58707708 57809323 55700054 54466494 53979083 53088221 50795423 48929172 48689805
1317 48689805 48238354 47073416 45444441 44988531 45080832 44271319 42941740 41786047 41690485
1308D1690485q1857o86499q64369n32732K51921P9655m56287o7823M41704M88712
1298D0262910P7337j1583K94614M70024K64570L20021K98277L10103L05839k02655
1288D2389457K85829q3722l34745j58525L96416O82932L56495J33135O85884J447492
1278D5800648J322950J140873M31659J500718K178301K232986J861925K238933
1270E8708993L092050L235821L001932J495426n11462j364083k401135l321450
1262F1936092l914722k853910q27107k8945K93744J627746L805929L704599m06427
1253F3336999l745334l876776k192701j417117j763437k168461p22019O51504
1245D8102658O95987P92695J398163L406128L333304L196767L548246M912537
$$ plain form
1308 41690485 41608628 40922129 40057760 39525028 39776949 39856604 39400317 39332494 39774198 40262910
1298 40262910 40340247 40328664 40623278 41093302 41357872 41677893 41976170 42286273 42592112 42389457
1288 42389457 42675286 42591564 42256819 42098294 42494710 43177642 43534137 43667272 44353156 45800648
1278 45800648 47123598 48264471 48696130 50196848 52375149 54608135 56470060 58708993
1270 58708993 61801043 65036864 68038796 69534222 69022760 67658677 65257542 61936092
1262 61936092 58021370 55167460 54340353 54311408 54605152 56232898 60038827 63743426 63336999
1253 63336999 59591665 55714889 53522188 52105071 50341634 48173173 47451154 48102658
1245 48102658 48798645 49591340 50989503 54395631 57728935 60925702 64473948 69386485
1237F9386485O239520P410083P632323P118605M386433J910087r60588j993653
1229A01129295k037052j469030K20215L194063O581602Q629696N496574j308641
1221A20436722n830049o346823n368066l388320j124736J26294R80900K407322
1213A01893244L729908O079094P914818Q638267R641384R928883Q931519O521191
1205A63278308K285414j131750l370141o284998q353188r787981r603272r069490
1197A17962902q820892p278969n611125l127929n06427k72383j248008m362337
1189H6734832n853460n862539n478540m026500k746205k227735j670122j797873
1181E7071858j230732q60468j41445J31736J51829O50327L87902L01516j82373
$$ plain form
1237 69386485 75626005 83036088 90668411 97787016 102173449 104083536 103122948 101129295
1229 101129295 99092243 97623213 97843428 101037491 107619093 116248789 121745363 120436722
1221 120436722 114606673 108259850 102891784 99503464 98378728 98505022 99485922 101893244
1213 101893244 105623152 111702246 119617064 128255331 137896715 147825598 156757117 163278308
1205 163278308 165563722 164431972 161061831 154776833 146423645 136635664 127032392 117962902
1197 117962902 109142010 101863041 96251916 93123987 92617560 92345177 91097169 86734832
1189 86734832 80881372 75018833 69540293 65513793 62767588 60539853 58869731 57071858
1181 57071858 55841126 54980658 54839213 54970949 55122778 55773105 56161007 56462523 56280150
1172E6280150m39126L70103R68889J393693J489391J528175J263392J019875J289471
1163F5164013J929157K221163K813531L367192L737018L697812L185821K862342
1155H8978049K345771K167392J799074J069392J056708N48888n31109j203471
1147I6230694j638958j986220j763669j704273j277653r49622r14650l49184o67601
1138H4978864L52747J684502J765113K385321K814848K511474K487988K972141
1130A01952998L921987M501932N143659N777210O035633O793083O612155P835448
1122A48574105Q805861J0679192J2577192J4725737J7182992J9389592K1537416
1115B53472087K3570775K5216078K5678836K4127479J9423895J3473955N960986
$$ plain form
1172 56280150 55841024 56211127 57180016 58573709 60063100 61591275 62854667 63874542 65164013
1163 65164013 67093170 69314333 72127864 75495056 79232074 82929886 86115707 88978049
1155 88978049 91323820 93491212 95290286 96359678 97416386 97965274 97434165 96230694
1147 96230694 94591736 92605516 90841847 89137574 87859921 86910299 85995649 85646465 84978864
1138 84978864 85331611 87016113 88781226 91166547 93981395 96492869 98980857 101952998
1130 101952998 105874985 110376917 115520576 121297786 127333419 134126502 140738657 148574105
1122 148574105 157379966 168059158 180636350 195362087 212545079 231934671 253472087
1115 253472087 277042862 302258940 327937776 352065255 371489150 384963105 390924091
1108C90924091k297447r319747j4432796j6720061j7265764j6696030j5457486
1101B98734760j3629637j0987748q528115o321700k930248O58497N082970R724706
1093B71803485J3912205J9082869K4006985K6733623K5275229J9493298Q441955
1086D08749649n157759j7138649k4672482k8247217k7677620k5074177k0717307
1079B60064438j7452397j4202612j0231839o649742m070515j860106j4537K334001
1071B07916691M724224N429631N569064O631665P683265P276702N013448K015874
1063B52260564l46475k872499o475204r604875j0329264q985313q770135r267981
1055A95608818r112103q125152p690308p806328p869934o697398n280009m542618
$$ plain form
1108 390924091 388626644 379306897 364874101 348154040 330888276 314192246 298734760
1101 298734760 285105123 274117375 265589260 259267560 256337312 256995809 262078779 271803485
1093 271803485 285715690 304798559 328805544 355539167 380814396 400307694 408749649
1086 408749649 403591890 386453241 361780759 333533542 305855922 280781745 260064438
1079 260064438 242612041 228409429 218177590 211527848 207457333 205597227 205582690 207916691
1071 207916691 212640915 218070546 223639610 230271275 237954540 245231242 250244690 252260564
1063 252260564 251914089 249041590 242566386 232961511 222632247 213646934 204876799 195608818
1055 195608818 186496715 178371563 170681255 162874927 155004993 148307595 143027586 138484968
1047A38484968m669967m454688l318790k788411k866743k809679j573732r65028
1039A15037930o08461p90949m0526N20831N41271J123170J471595K327674K945302
1030A22527837K669352K393622K949225L662265M256142M949470O256579Q447572
1022A58112064R381919J0397335J1882995J4035642J5816584J6502941J6450024
1015B52579504J5984216J3866973R317601K941338l147644p820259j1635410j5063252
1007B57023067j7138936j6975027j5896417j5205277j5085491j4027400j2135946
1000A50558573j0311779r540550q793635p425695n629362n118848n142936m460632
992I4135136l119521k183285k019232j698964j191749o23227o54089j091151j018228
$$ plain form
1047 138484968 133815001 129360313 126041523 123253112 120386369 117576690 116002958 115037930
1039 115037930 114429469 113638520 113597994 114118825 114660096 115783266 117254861 119582535 122527837
1030 122527837 125197189 127590811 130540036 134202301 138458443 143407913 149664492 158112064
1022 158112064 167493983 177891318 189774313 203809955 219626539 236129480 252579504
1015 252579504 268563720 282430693 291748294 294689632 291541988 283721729 272086319 257023067
1007 257023067 239884131 222909104 207012687 191807410 176721919 162694519 150558573
1000 150558573 140246794 130706244 121912609 114486914 108857552 103738704 98595768 94135136
992 94135136 91015615 88832330 86813098 85114134 83922385 83299158 82645069 81553918 80535690
983H0535690J84520O96070R2741J53483N38349J091835J388715R88386J778175
974H7447964L055264M032886M216568N010577N919425O696013P099866Q882858
966A32361421J0492749J1732854J2901314J2408559J1629225R713049O301560
959B07540731J020522l808502p751128j0582516j2451539j3517996j3158284j2073770
951A35217518j0536102r002329p672813o152703m443757l817730l257786k992479
943H7341819j731816n23197p14532j233296k33301N46137M84605N26527J644828
934H6107774K862093L473415L776164L300403L061255L097814K618329J506576
926A09803823J360540J990634K554563K431532K631222M088483N521782P190259
$$ plain form
983 80535690 80720210 81416280 81509021 81662504 82200853 83292688 84681403 85669789 87447964
974 87447964 90503228 94536114 98752682 103763259 109682684 116378697 123478563 132361421
966 132361421 142854170 154587024 167488338 179896897 191526122 201239171 207540731
959 207540731 208561253 204752751 197001623 186419107 173967568 160449572 147291288 135217518
951 135217518 124681416 115679087 108006274 101853571 97409814 93592084 90334298 87341819
943 87341819 85610003 85086806 84372274 83138978 82905677 83451814 83936419 84462946 86107774
934 86107774 88969867 92443282 96219446 99519849 102581104 105678918 108297247 109803823
926 109803823 111164363 113154997 115709560 118141092 120772314 124860797 130382579 137572838
918A37572838R257588J2261227J5784808J9010690K1812374K4297487K5485419
911B65482431K1832074J4496244M953036m846353j3577226k0071259k3020387
904B45248560k3353557k1485429j9821786j7286514j3982317j0850595q610440
897A29857922q068770o996183n155723l501810l010487j950784n44373J360169
889A01989961K211946K748241L596886N958832Q130383R344158R651659R783573
881A53415639Q551227N984240K125318k537691n738240p725850r626759j0838903
873A33608981j0677789r392129q515589p670617o699398n278929l511288k694270
865G9168972k898185k938468k614333l002042l308683l125804k187488j392130
$$ plain form
918 137572838 146830426 159091653 174876461 193887151 215699525 239997012 265482431
911 265482431 287314505 301810749 306763785 301917432 288340206 268268947 245248560
904 245248560 221895003 200409574 180587788 163301274 149318957 138468362 129857922
897 129857922 121789152 114792969 109637246 106135436 103124949 101174165 100629792 101989961
889 101989961 104201907 106950148 110547034 116505866 124636249 133980407 143632066 153415639
881 153415639 161966866 167951106 170076424 167538733 161800493 154074643 144447884 133608981
873 133608981 122931192 113539063 105023474 97352857 90653459 85374530 81863242 79168972
865 79168972 76270787 73332319 70717986 67715944 64407261 61281457 59093969 57701839
857E7701839j243960j573546j600844j424601r29950m42095k31280o7568j19810
848E0068185j050057k408211k898086k903526l272348k958734k499639j480175
840C0597409j553402j536516j436559j288083p21353r73231j074404o81132M011
831B1336740k55679r50709q47056l6084R471p40462q65917o26297K3420l05421
821A6742006j370210r30698J81639L91024o79378p50308j14418K65629O0980p00615
811A3095651m20411j96525P515m43365q68889m02943K56966L88879l31517l26100
801A0759261J23709k10082l59134k35554l66005M19527K0915l47127l28821k88308
791I188381l69482m56236l59034n65919J41757O9017J18073j39667O7313j79968
$$ plain form
857 57701839 56457879 54884333 53283489 51858888 50928938 50486843 50255563 50187995 50068185
848 50068185 49018128 46609917 43711831 40808305 37535957 34577223 32077584 30597409
840 30597409 29044007 27507491 26070932 24782849 24061496 23088265 22013861 21332729 21336740
831 21336740 21081061 20130352 19283296 19247212 19256683 18516221 17650304 17024007 17047427 16742006
821 16742006 15371796 14441098 14622737 15013761 14334383 13584075 13469657 13735286 13796266 13095651
811 13095651 12675240 12478715 12486230 12042865 11173976 10771033 11027999 11416878 11085361 10759261
801 10759261 10882970 10672888 10313754 10078200 9712195 10131722 10152637 9805510 9476689 9188381
791 9188381 8818899 8362663 8003629 7437710 7579467 7648484 7766557 7626890 7694203 7514235
781G514235O8554k43401r1686K01712J23537J52763m85286o36809k13114j37665
771F252840l68660K08296K06313n1412k23159k81484k28484j86391N4218l2960
761E349117K84534K16315j6674Q2684q48071o84525k64047M00560J95939j06831
751D609001J08580p6275L9420l59653n72906K48250P62414M59139l00425Q2097
741D999642L27226m24210p10382p11262J82390R11441J55905n34879o5533j14155
731D016183M8736n14557m21580O07779K51038j18585l5141J91186J75127m90932
721C709254l98135o8120K82469l0443m20336j25429L26864m4226k59022k32734
711B740142L78143P08989n70324o84870K59467L99830j17935j168726j30427Q76069
$$ plain form
781 7514235 7582789 7339388 7247702 7449414 7572951 7725714 7240428 6603619 6390505 6252840
771 6252840 5884180 6092476 6298789 6247377 6024218 5742734 5514250 5327859 5382077 5349117
761 5349117 5633651 5849966 5833292 5915976 5067905 4383380 4119333 4519893 4715832 4609001
751 4609001 4717581 4641306 4680726 4321073 3748167 3996417 4758831 5217970 4917545 4999642
741 4999642 5326868 4902658 4192276 3481014 3663404 4574845 4730750 4195871 4130338 4016183
731 4016183 4064919 3550362 3128782 3736561 3987599 3869014 3833873 4025059 4200186 3709254
721 3709254 3311119 3242999 3525468 3495025 3074689 2949260 3276124 3231898 2972876 2740142
711 2740142 3118285 3827274 3256950 2572080 2831547 3231377 3113442 1944716 1814289 2690358
701B690358O7135m69353o31401L81578M41913j32934q53663R3451P54439q0545
691B260978o58283l22280L14377J023499m60641p90005N65510L16474j98822m16744
681A634063j24769M54617N23872k17586o29329L53164K09429K79648l98698J48481
671B232892M33601p8327o01265n40006K97665J82506l22154K7470M08980N6953
661B098315j96407n36021l94241o8322L37473j79761n3223L28262N76754l00554
651A612275p71229l27757K17299L81694P2954K53159K09166J90821j75941o03291
641A059150k22278J1197M85029J75127L39953M0563O7696p30526q64581L45752
631G07082N61543M92998M29806R3899q2348n94617l63655k4721L73441R25825
$$ plain form
701 2690358 2757493 2288140 1656739 2038317 2480230 2347296 1493633 1587084 2341523 2260978
691 2260978 1602695 1280415 1594792 2618291 2157650 1367645 1933155 2249629 2050807 1634063
681 1634063 1509294 1963911 2487783 2270197 1640868 1994032 2203461 2483109 2084411 2232892
671 2232892 2666493 2588166 1986901 1446895 1744560 1927066 1604912 1632382 2041362 2098315
661 2098315 1901908 1365887 971646 903324 1240797 1061036 1007813 1336075 1912829 1612275
651 1612275 841046 513289 730588 1112282 1185236 1438395 1647561 1838382 1662441 1059150
641 1059150 836872 848069 1333098 1508225 1848178 1888741 1956437 1225911 361330 707082
631 707082 1268625 1761623 2191429 2285328 2202980 1608363 1244708 1219987 1593428 2519253
621B519253j95679l03028m2483Q4143o56939p11139J27828N61266N05551J50543
611B039316j87090m47067j80995m23036j91232j3280M27543K92728k50414j2897
601A053576k95065k40778L44007J2508J23223M53326J20088L13566l73122k63861
591A247468m64680k60998M32071O348k47751J56586L53308k06171m66953m48748
581A00480L07116N00976J18929j90079Q2225M4861l20989l45735j30112k11624
571d3952N45681K4105k09366J03622J38908K74638q1566k69292j98930N34188
561H18036J96831l67479l35079M9876q1597J53354J5894l09286P389L4067K03917
550C85923k94927N0204M26530k57967k31838j08677J27326p7539K43720R5953
$$ plain form
621 2519253 2323574 2020546 1978063 2062206 1405267 694128 821956 1383222 1888773 2039316
611 2039316 1852226 1405159 1224164 801128 609896 596616 1024159 1316887 1066473 1053576
601 1053576 758511 517733 861740 874248 997471 1450797 1570885 1884451 1511329 1247468
591 1247468 782788 521790 953861 960209 712458 869044 1222352 1016181 549228 100480
581 100480 407596 908572 1027501 837422 919647 964508 643519 297784 167672 -43952
571 -43952 501729 525834 316468 420090 558998 833636 752070 482778 283848 818036
561 818036 1014867 647388 312309 362185 280588 433942 449836 140550 147939 182006 385923
550 385923 90996 141200 567730 309763 77925 -30752 96574 19035 262755 358708
540C58708k27914k1649j42131j47842N1831j8842J7598J09158O76164K6420o19977
529F1524Q2218j10748l621J55555j05942R1174P1501M615l70607m54217L30607
518b47941L91634J00974n7860J8009M46620j23466l34792k78347l71721N00306
508D3416L47986K4942j66816j27042k38189l44440n3708N7116J94330M61695L67623
497E66913R808l19067l17659m4147k48608j54972L20453L46895K70474j77334
487B52756m15566j78682J76741k03211J08931P9107M39508L23299m79352k68301
477a64770R0990K13043l564j88435K29361K26833p6506l47281k36501K42419r2807
466a07218q84l37443K39381M98505j23717l33380j61304P8525L14485k96305j9500
$$ plain form
540 358708 130794 109145 -32986 -180828 -128997 -147839 -130241 -21083 655081 681501 61524
529 61524 143742 32994 29373 184928 78986 170160 241661 246276 -124331 -578548 -247941
518 -247941 143693 244667 186807 204816 651436 527970 193178 -85169 -456890 43416
508 43416 391402 416344 249528 122486 -115703 -460143 -513851 -456735 -262405 199290 566913
497 566913 576721 257654 -60005 -104152 -352760 -507732 -187279 159616 430090 252756
487 252756 -162810 -341492 -164751 -367962 -259031 -179924 259584 582883 103531 -164770
477 -164770 -73780 139263 135699 -52736 176625 403458 326952 -20329 -256830 -14411 -107218
466 -107218 -108102 -445545 -206164 292341 168624 -164756 -326060 -247535 66950 -229355 -248855
455b48855K60575L97608N8546n73896P2639J76744k67633J14467j62660L82637
445B10172M27728k77253k42952m31253J19916r5490p0963N91144J14997L2722
435C78768M239n47947m73611J32411n3496l998N58259P43478j54952n04482j86264
424a07595l92460k69335N2897L41356N17010K52349j31876j88397o31357j45070
414g02478M65153P7710J07703K04571N42464n9655o79106n06997k52404N32079
404b70960N29100M15771o0860m6076L80611l99345n48356J56310N06913K78290
394I41398q8180q72k41394m93855j09612l60051l12960L12070N41477R6755n65875
383b81099j52625k1124J14560L29525m8658J60671M24359J19644o75938o73626
$$ plain form
455 -248855 11720 409328 467874 -106022 -33383 143361 -124272 -9805 -172465 210172
445 210172 637900 360647 117695 -313558 -193642 -289132 -360095 231049 346046 378768
435 378768 383007 -164940 -638551 -506140 -559636 -563634 -5375 738103 583151 78669 -107595
424 -107595 -500055 -769390 -716493 -375137 141873 394222 262346 73949 -557408 -702478
414 -702478 -237325 -159615 -51912 152659 695123 635468 -43638 -550635 -803039 -270960
404 -270960 258140 673911 613051 566975 947586 548241 -115 156195 663108 941398
394 941398 853218 852346 610952 117097 7485 -352566 -665526 -353456 188021 284776 -281099
383 -281099 -433724 -454848 -340288 -10763 -59421 101250 525609 645253 -30685 -704311
373g04311J63153l4090L78721p186p6547J82059J60634l14162k06880K46125L12213
362I9729N29665P6301j13160o62306m68122K51321P1826N7914L0093j14272J68332
351g2679J23188P395p39685J22358J016496J42806l27868l16263J07461P421k75789
340b05159l21093r5298N22296L85094o55901n91065j0189N06650N4810k74127
330f83982R1227J002048L39038l37628r15234j82047L66043P15802m697o30835
320b40265L4239L67521J3118o02131n57550N41132N90562K21301J89347n4764
310E02510j80589r5299k43279n74178J59612M38881N74096k70566o74485l64956
300g28253q0546K17459K60038l6558K71274L02292L79730m81202m92365l3702
$$ plain form
373 -704311 -541158 -575248 -196527 -203713 -280260 -98201 62433 -251729 -458609 -212484 99729
362 99729 629394 705695 592535 -69771 -537893 -286572 -214746 -156832 -126739 -241011 -72679
351 -72679 50509 57904 -681781 -559423 457073 599879 272011 -44252 63209 70630 -205159
340 -205159 -526252 -621550 -99254 285840 -370061 -961126 -971315 -464665 -409855 -683982
330 -683982 -592755 409293 748331 410703 -504531 -686578 -320535 395267 390570 -240265
320 -240265 -206026 161495 174613 -427518 -985068 -443936 146626 367927 557274 502510
310 502510 321921 226622 -16657 -590835 -431223 7658 581754 311188 -363297 -728253
300 -728253 -808799 -591340 -331302 -367860 -96586 205706 585436 104234 -388131 -421833
290d21833L03875N86565k05801m48027j26224j44J35067m77589j58132P84453
280b7790J030271N18704p83223r03882L74557K36336l21554o33117L40700Q74683
270G05685J77108n42950r68487j15984N90056K54678k21390l7194P36815J53910
260G32247m41968l48455j16584j73045N21397J75311k62198k9478L03173J22565
250D82965o72598m03667L22467N70337N05787k99103k60344q5559O7866K29310
240D57461q8007k60701K43890L72510j14161m80882j43909l5888J62329L33082
230D45724M1822P8935K86767M96871j92498m94474l00697K39039J37377R438m33741
219C14563k75555K87972L52293j87236p53291M20459Q08410J76991k68665m92881
$$ plain form
290 -421833 -117958 468607 262806 -185221 -311445 -311589 -176522 -654111 -812243 -27790
280 -27790 1002481 1521185 737962 -165920 208637 444973 123419 -509698 -168998 705685
270 705685 882793 339843 -628644 -744628 -154572 100106 -121284 -158478 578337 732247
260 732247 290279 -58176 -174760 -347805 173592 348903 86705 57227 360400 482965
250 482965 -189633 -593300 -270833 299504 805291 506188 245844 160285 228151 457461
240 457461 369454 108753 352643 725153 610992 130110 -13799 -49687 112642 445724
230 445724 487546 566481 853248 1350119 1157621 663147 362450 601489 738866 748304 314563
219 314563 39008 326980 679273 492037 -261254 159205 967615 1144606 875941 383060
209C83060L72938N94705j10973m08057l07065j45119M27448j30985j22490J04861
199F58323K06685N02677k4062p0625L41538L879K3182J4008L2472k21283R4476
188A561270j76320k50422l88310L71894K93310k18117Q3842K89558L01973l9546
178A829132r6703Q8700K60511K30289K9102Q0373K61292m1994m24313l18370M58484
167B356503K96243k51901j76446N83767P83262J18929l41149P0541J087586M31383
157D958718j7295K98588N82559O44097L13720L64247Q51231J476088J553816J308164
147A2333933J321113J264047P73601M29138Q17798J635783K302229K927678M527687
138B8333007O553926R495049J3427932K1747161K9950520L7489828K3478612j0032283
$$ plain form
209 383060 755998 1350703 1239730 831673 524608 379489 806937 675952 553462 658323
199 658323 865008 1367685 1343623 1272998 1614536 1618415 1641597 1655605 1688077 1466794 1561270
188 1561270 1384950 1134528 746218 1118112 1411422 1193305 1277147 1566705 1868678 1829132
178 1829132 1732429 1821129 2081640 2311929 2341031 2421404 2682696 2640702 2216389 1898019 2356503
167 2356503 2652746 2400845 2224399 2808166 3591428 3710357 3369208 3439749 4527335 4958718
157 4958718 4941423 5240011 5822570 6466667 6780387 7144634 7995865 9471953 11025769 12333933
147 12333933 13655046 14919093 15692694 16121832 16939630 18575413 20877642 23805320 28333007
138 28333007 34886933 44381982 57809914 79557075 109507595 146997423 170476035 160443752
130A60443752k3816644k5349210k2824656j7492540j5051238j2450699q680234
123C4778531o488149n072973l408365j860841j611143q60159q27996j379152j210401
114A2059352j128055j364910j093951m44995m44033p26803r16773o56110m4807
105E238915P7614m23110m51754L1179K38965l42090j008898q59837J95694M63064
95C159742k19155l76632P1561J88410m09926l48735j79178Q6332L74397j32334
85B214482l03858j77483q8325l36065k14203j28717K4488J41188j97603k5404
75I08500l9416k96165p6814J53654L39163q5065n5796L30994R0650m65639m33119
64C70947k91899J92914K11042l31702p7145K60522J2167l59570m31938K32338
$$ plain form
130 160443752 136627108 111277898 88453242 70960702 55909464 43458765 34778531
123 34778531 28290382 23217409 19809044 17948203 16337060 15476901 14648905 13269753 12059352
114 12059352 10931297 9566387 8472436 8027441 7583408 6856605 5939832 5283722 5238915
105 5238915 5316529 4893419 4441665 4472844 4711809 4369719 3360821 2500984 2696678 3159742
95 3159742 2940587 2563955 2635516 2823926 2414000 2065265 1886087 1972419 2346816 2214482
85 2214482 1910624 1733141 1644816 1308751 1094548 965831 990319 1131507 933904 908500
75 908500 869084 572919 496105 649759 988922 903857 848061 1179055 1269705 804066 370947
64 370947 79048 271962 483004 151302 74157 334679 346846 -12724 -444662 -212324
54b12324M39627K28986j14381k16781l2798k29358j73521j16452L404j92515J25847
43d90266m5209N2845j22422O5167P3346Q0644O9099L9784R5203J85376q010m96033
31e00476m21534L12702N37559j94333n44484j12990J89636r4810j29695o2647
21a021072K06831M88380j7196j18829l11956p8840Q8703j14931P3748J13426J91358
10e00378k74058l15500j59910j53132L58941J84250O1260J26590J81375J30121
0c60441
$$ plain form
54 -212324 227303 456289 341908 125127 92329 -137029 -310550 -427002 -423598 -616113 -490266
43 -490266 -535475 -482630 -605052 -539885 -466539 -385895 -316796 -277012 -181809 3567 -4443 -500476
31 -500476 -922010 -609308 -71749 -266082 -810566 -923556 -733920 -828730 -958425 -1021072
21 -1021072 -814241 -325861 -343057 -461886 -773842 -852682 -763979 -878910 -805162 -691736 -500378
10 -500378 -774436 -1089936 -1249846 -1402978 -1044037 -859787 -798527 -671937 -490562 -360441
0 -360441
$$ Imaginary data points
##PAGE= N=2
##DATA TABLE= (X++(I..I)), XYDATA
16383a6565176J21392O65997L46913L739j66289K88736L79290P7957j18679J44447
16373a4821673O92763P54657P1810k03040j31877L6208K08868k8214K5902O92987
16363a2701609L63999R9836n02818j41800L42810L83117K63066K47526N37608
16354a1108265K32785j82767j14490K0568M1569K54853J97134L81331m6480K10669
16344a0113093N2531l32442J267L70355J39363L59992M68894N13436n2484k16465
16334h808646J46355j24747L5212J17724L78671N34028K94641m74335k33798R8828
16324h036067N29777L08393L9726N25853M18113L39781n86752k98353L32785M11817
16314f014927P4792P1326L65072L46983k55538o38409k04120M76618K87938L16212
$$ plain form
16383 -16565176 -16443784 -15777787 -15430874 -15427135 -15593424 -15304688 -14925398 -14847441 -14966120 -14821673
16373 -14821673 -14128910 -13374253 -13302443 -13505483 -13637360 -13601152 -13392284 -13420498 -13394596 -12701609
16363 -12701609 -12337610 -12237774 -12740592 -12882392 -12539582 -12156465 -11893399 -11645873 -11108265
16354 -11108265 -10875480 -11058247 -11172737 -11152169 -11110600 -10855747 -10658613 -10277282 -10323762 -10113093
16344 -10113093 -10060562 -10393004 -10391737 -10021382 -9882019 -9522027 -9053133 -8539697 -8592181 -8808646
16334 -8808646 -8662291 -8787038 -8751826 -8634102 -8255431 -7721403 -7426762 -7901097 -8134895 -8036067
16324 -8036067 -7506290 -7197897 -7158171 -6632318 -6214205 -5874424 -6461176 -6759529 -6426744 -6014927
16314 -6014927 -5940135 -5868809 -5503737 -5156754 -5412292 -6050701 -6254821 -5778203 -5490265 -5174053
16304e174053K48782L71751J81100l6079l86715j3364O27722K30484k86183L41743
16294c894812M05143m7439m40591l88695J72920M75558L06209J03915K54360P1194
16284b982238o9551m24334K1991O62570O65097j08552k06478J66649K00963n51540
16274b625423m66406L74489Q86433N06099J02378j39422m407J85738k76349k01981
16264a658851L78370P57900J63834k31849k84742Q7921P5183k72339k74605O10191
16254f48987O97583j55091k59377l32254J62190L70944L12316m9064L25768M17284
16244H41312j91161p84066m09731K53863L40402J68242k7083N47509L95287l08035
16234H26539o98608K25389R66850L65240j71047k47356l5190L12053k96208m83822
$$ plain form
16304 -5174053 -4925271 -4553520 -4372420 -4408499 -4795214 -4808578 -4180856 -3950372 -4236555 -3894812
16294 -3894812 -3489669 -3537108 -3977699 -4366394 -4193474 -3717916 -3411707 -3307792 -3053432 -2982238
16284 -2982238 -3051789 -3476123 -3454132 -2791562 -2126465 -2235017 -2441495 -2274846 -2073883 -2625423
16274 -2625423 -3091829 -2717340 -1830907 -1324808 -1222430 -1361852 -1366259 -1180521 -1456870 -1658851
16264 -1658851 -1280481 -522581 -358747 -590596 -875338 -787417 -712234 -984573 -1259178 -648987
16254 -648987 48596 -106495 -365872 -698126 -535936 -164992 147324 98260 424028 841312
16244 841312 650151 -133915 -543646 -289783 50619 218861 191778 739287 1134574 826539
16234 826539 127931 353320 1320170 1685410 1514363 1267007 1231817 1543870 1247662 763840
16224G63840J12149O00800L74057m30174j58295K73588N4178P120l48887L27547
16214A575923P04997L55456k62905k57111q3897J25866P9502k90696M61134K95630
16204B703899k7739l69361l78060N75205K23006M4977j05695m175L69169J5828
16194C047054n10041k26626L10934K22897p4146r9853K95380L74052O526o38556
16184B707621K57407M91117k3498n3673k22131J15071K87863k38419j2509K9363
16174C338212M44178J74348m69772l69460J09872L74756K05218r5667J67442N75283
16164D454410K05647o07235k53687L9968N0074k22682K38252Q8066J60211j60450
16154C992574m97419m78129K80191O70117L04156j1035J44793l15171l79189M9415
$$ plain form
16224 763840 875989 1476789 1850846 1420672 1262377 1535965 1590143 1597263 1248376 1575923
16214 1575923 2280920 2636376 2373471 2116360 2032463 2158329 2237831 1947135 2408269 2703899
16204 2703899 2676160 2306799 1928739 2503944 2726950 2771927 2666232 2662057 3031226 3047054
16194 3047054 2537013 2310387 2621321 2844218 2770072 2670219 2965599 3339651 3346177 2707621
16184 2707621 2965028 3456145 3432647 3378974 3156843 3271914 3559777 3321358 3308849 3338212
16174 3338212 3782390 3956738 3486966 3117506 3227378 3602134 3807352 3711685 3879127 4454410
16164 4454410 4660057 4052822 3799135 3839103 3889177 3666495 3904747 3992813 4153024 3992574
16154 3992574 3495155 3017026 3297217 3967334 4271490 4260455 4405248 4090077 3710888 3760303
16144C760303K07415M58703J64087n3607J58899j21861n22548k97999j05714O02810
16134D250488J84843J13155k4880O4844j36166k00204j74300o586L89725M82066
16124D942985j44281l7611l2985n63600q1380J41134r2306M97935K52214J4766
16114D896871r6740r1142j52058k79265M1127O52573o1333l32381J2330J61592
16104D751574m36419k81909K13978M43287K99070R8678l60673l43431N08202q5731
16094D806626l30978M3047L64096K87811j43794n05122J1562L75395Q1845l637
16084D986851k04687o0989L43247J15731m44244k74929K94757L49149M469n19856
16074D589499J37141L88344M3839k27137k84062P9851J26263M24970M9077m02060
$$ plain form
16144 3760303 3967718 4426421 4590508 4536901 4695800 4573939 4051391 3753392 3647678 4250488
16134 4250488 4435331 4548486 4523606 4588450 4452284 4252080 4077780 4071194 4460919 4942985
16124 4942985 4798704 4761093 4728108 4164508 4083128 4224262 4131956 4629891 4882105 4896871
16114 4896871 4800131 4708989 4556931 4277666 4318793 4971366 4910033 4577652 4589982 4751574
16104 4751574 4315155 4033246 4247224 4690511 4989581 5088259 4727586 4384155 4892357 4806626
16094 4806626 4475648 4518695 4882791 5170602 5026808 4521686 4533248 4908643 4990488 4986851
16084 4986851 4782164 4721175 5064422 5180153 4735909 4460980 4755737 5104886 5109355 4589499
16074 4589499 4726640 5114984 5158823 4931686 4647624 4727475 4853738 5278708 5327785 4925725
16064D925725L18362K39986k53572k32299k48496j78206M39691K27413P9252j89965
16054E127891J35543J97441k78686n48918l4078O02827N47683k17680k58809K26798
16044E500012j44908n1320k70871m23937J69482M85444m746k2293k37727o357
16034D992779L7507k0474p0472J48346J80199J7974K1109l37286m21057N9759
16024D608384P37402K34296n72506n32501K12656J89814J41687j5841l51072L22092
16014D974411P42774j78284q69315k8224N86402J17876n23973j61899M37760N12744
16004E610272l35693p55227j70410P20681M20236l78416m81442K93227O63978
15995E587206K89127r04185k72625O62275K58820m52277k76079j5127K79926K35386
$$ plain form
16064 4925725 5244087 5484073 5230501 4998202 4749706 4571500 5011191 5238604 5317856 5127891
16054 5127891 5263434 5460875 5182189 4633271 4599193 5202020 5749703 5532023 5273214 5500012
16044 5500012 5355104 5303784 5032913 4608976 4778458 5263902 5259156 5236863 4999136 4992779
16034 4992779 5030286 5009812 4939340 5087686 5267885 5285859 5306968 4969682 4548625 4608384
16024 4608384 5345786 5580082 5007576 4475075 4687731 4877545 5019232 5003391 4652319 4974411
16014 4974411 5717185 5538901 4669586 4641362 5227764 5345640 4821667 4659768 5097528 5610272
16004 5610272 5274579 4519352 4348942 5069623 5489859 5111443 4630001 4923228 5587206
15995 5587206 5876333 4972148 4699523 5361798 5620618 5168341 4892262 4877135 5157061 5392447
15985E392447m73773n53724J70334J056395j90280o15521P4148R1163Q799K44624
15975E204612j57775J4135M2195J3332l01006l08093K23999J94780K44134J8688
15965E189001K2033M1906j65763j00900K18466L73716j33903j50515L947q0857
15955E217131o67809O0874J75720K94698L42150J89056l27052l18065K36826l32666
15945D870863n68254J48577R22621M02428o42909o0549J32233k46308p3269L2765
15935D918198J47595L74750J73379n70872m80193n5420M13364k98717j26350N61608
15925E057342P28674M4351o70006k06163o2385J60088K78574K38253j94561Q8529
15915E462696L58943j085662o40007L90059K51478P82J61901M59971J50653o7664
$$ plain form
15985 5392447 4918674 4364950 4535284 5591679 5401399 4785878 4860026 4951189 4959988 5204612
15975 5204612 5046837 5060972 5103167 5116499 4815493 4507400 4731399 4926179 5170313 5189001
15965 5189001 5211034 5252940 5087177 4986277 5204743 5578459 5444556 5294041 5297988 5217131
15955 5217131 4549322 4610196 4785916 5080614 5422764 5611820 5284768 4966703 5203529 4870863
15945 4870863 4302609 4451186 5373807 5776235 5133326 5072777 5205010 4958702 4885433 4918198
15935 4918198 5065793 5440543 5613922 5043050 4562857 4507437 4920801 4622084 4495734 5057342
15925 5057342 5786016 5830367 5160361 4954198 4891813 5051901 5330475 5568728 5374167 5462696
15915 5462696 5821639 4735977 4095970 4486029 4737507 4738289 4900190 5360161 5510814 5443150
15905E443150j94410j26603j33420J74644M87639j64021m05218O6970j03059l45775
15895D699897k87867N14815K50665j67867J06723q4621l47047r8805L20039L23224
15885E229156n2395J23953L74305j27182j71273k69307l75637J5259L36099O1986
15875E144964r0260j39252K89789J98370m35949k41662O62934K59081k8888l26148
15865E292979j46972L02248K18752l54229k08955o3838L06682r0772p59601L09945
15855D806239O67696k3617j6010J03602K56847O0009k72524k16135l44963J43391
15845E164535j28222k08677l04621L42158K69263k92282K9933J46707L42994K75507
15835E637295j03909J23307k08968l82620M42397j37515k45976p2657j79032l6020
$$ plain form
15905 5443150 5248740 5122137 4988717 5163361 5651000 5486979 5081761 5148731 5045672 4699897
15895 4699897 4412030 4926845 5177510 5009643 5116366 5031745 4684698 4585893 4905932 5229156
15885 5229156 5176761 5300714 5675019 5547837 5376564 5107257 4731620 4746879 5082978 5144964
15875 5144964 5054704 4915452 5205241 5403611 4967662 4726000 5388934 5648015 5619127 5292979
15865 5292979 5146007 5448255 5667007 5312778 5103823 5039985 5346667 5255895 4496294 4806239
15855 4806239 5473935 5450318 5434308 5537910 5794757 5854766 5582242 5366107 5021144 5164535
15845 5164535 5036313 4827636 4523015 4865173 5134436 4842154 4872087 5018794 5361788 5637295
15835 5637295 5533386 5656693 5447725 5065105 5507502 5369987 5124011 5051354 4872322 4836302
15825D836302j64461R340k85740O8762P56905Q16297p2921m99412j09093J34880
15815E490859j41274p4024j5142J15703j2191k6083k29323p47008m2597L80728
15805D699648J49576l62115L61742P56256J35064k97587j26159K49194K28773
15796E794392o2629L0930l66932k63266J07895m15467o93130K06120Q09036L10435
15786E457384j86040j22326r7976L39359N9767K1047n5494q732Q58593j88641
15776F076941j156528o68944K07403N08555j2420k10820L58193L29767J95697
15767E627844m69662o56542K22343P14493L09334l94300N6178K83288k65268p60875
15757D666833m94079M80606P07193j4899o7856j61098k8102Q3286j44743L2869
$$ plain form
15825 4836302 4671841 4681181 4395441 4464203 5221108 6037405 5964484 5465072 5355979 5490859
15815 5490859 5349585 5275561 5260419 5376122 5363931 5337848 5108525 4361517 4318920 4699648
15805 4699648 4849224 4487109 4848851 5605107 5740171 5442584 5316425 5565619 5794392
15796 5794392 5731763 5762693 5395761 5132495 5240390 4824923 4131793 4337913 5146949 5457384
15786 5457384 5271344 5149018 5051042 5390401 5450168 5471215 5415721 5406989 6265582 6076941
15776 6076941 4920413 4251469 4458872 4967427 4955007 4744187 5102380 5432147 5627844
15767 5627844 5158182 4501640 4723983 5438476 5747810 5353510 5409688 5692976 5427708 4666833
15757 4666833 4172754 4653360 5360553 5345654 5277798 5116700 5088598 5171884 5027141 5060010
15747E060010M45022P30300r6964o02188k58717j34602m31061n46009K64379Q27551
15737E257721L3423L02681j57561l85312O6500k51196K9207P58306P76187m2108
15727F387848q69088n15819K34941l46788o09720Q1431M49529K06680k96126m6349
15717D676539r3713L85553M12344q5067L63646O16302N59271n07594j346071j8609
15707D962601J79565k37108l42974j03161P18356J37531m05657k67421j00135
15698D541597N89750N72602o0992Q6664N05497O7701o34676p72409j36216J9899
15688D779417M56514Q3016m52789J46314J13045O0062l82216k21404O57780P36995
15678E976734k42928k0562n9680m0370k13762n03562j57314j43157O19268L77464
$$ plain form
15747 5060010 5505032 6235332 6138368 5536180 5277463 5142861 4711800 4165791 4430170 5257721
15737 5257721 5291144 5593825 5436264 5050952 5117452 4866256 4895463 5653769 6429956 6387848
15727 6387848 5518760 5002941 5237882 4891094 4281374 4362805 4812334 5019014 4722888 4676539
15717 4676539 4582826 4968379 5380723 5295656 5659302 6275604 6834875 6327281 4981210 4962601
15707 4962601 5142166 4905058 4562084 4458923 5177279 5314810 4909153 4641732 4541597
15698 4541597 5131347 5703949 5642957 5729621 6235118 6302819 5668143 4895734 4759518 4779417
15688 4779417 5235931 5318947 4866158 5012472 5125517 5185579 4803363 4581959 5239739 5976734
15678 5976734 5733806 5713244 5653564 5613194 5399432 4895870 4738556 4595399 5214667 5592131
15668E592131k92243l59696J7145J93963P7996k53989N17428O37769j56058k22356
15658E752090m42479m12600Q830J10088l27983l10192K61237O88483M2367o27755
15648D742086J12414K97903L01046J61918k4022L33593J17169o1361m29259j81407
15638E370080l43204R0545j79018j23405N7393L08905N2469l21305J47270J1168
15628E070898J85340O17706K37777j27434n41935k16621j28211K56560n01323
15619D852757j73543J40048P2548j5816m53864L35292N79096J89546l51164j86870
15609D988030N62159M04655m52049k12976j60160M71673j16347n01618j47368
15600D835999K28135l0496K65405j89397k76258O97414K46890j56033j43272m0194
$$ plain form
15668 5592131 5299888 4940192 4957337 5151300 5229296 4975307 5492735 6130504 5974446 5752090
15658 5752090 5309611 4897011 4905841 5015929 4687946 4377754 4638991 5327474 5369841 4742086
15648 4742086 4854500 5152403 5453449 5615367 5591345 5924938 6042107 5980746 5551487 5370080
15638 5370080 5026876 5117421 4938403 4814998 4872391 5181296 5233765 4912460 5059730 5070898
15628 5070898 5256238 5873944 6111721 5984287 5442352 5225731 5097520 5354080 4852757
15619 4852757 4679214 4819262 4891810 4875994 4422130 4757422 5336518 5526064 5174900 4988030
15609 4988030 5550189 5954844 5502795 5289819 5129659 5601332 5484985 4983367 4835999
15600 4835999 5064134 5033638 5299043 5109646 4833388 5530802 5777692 5621659 5478387 5438193
15590E438193m2885L95630r1677m09264k18849J12628j25822p05522K37443L92653
15580D982528K45371K41561k94716J194j97034J43057M91231j17195L34566J95939
15570F026502p508p82204k48756j07983j22480j15866J05372P76672Q4869j1876
15560E596742R7861l88190l61600J71839J51950N61713R5864k36640l52637k97991
15550E038911j55708j46313l7328K99869L12092J61227j94096J30495P2422l18497
15540E163074l4340J57422L94489L47617R4440n74795q63103j63926J56217P475
15530D684570K02508Q19416N07899n19448o98105l39788L80417L61740L34977
15521E734186Q2377O6949K07877l33688m22266p33394o2776O55919J49033K34591
$$ plain form
15590 5438193 5395308 5790938 5699261 5289997 5071148 5183776 5057954 4352432 4589875 4982528
15580 4982528 5227899 5469460 5174744 5175938 4978904 5121961 5613192 5495997 5830563 6026502
15570 6026502 6018994 5236790 4988034 4880051 4757571 4641705 4747077 5523749 5608618 5596742
15560 5596742 5694603 5306413 4944813 5116652 5268602 5830315 5926179 5689539 5336902 5038911
15550 5038911 4883203 4736890 4699562 4999431 5311523 5472750 5278654 5409149 5481571 5163074
15540 5163074 5128734 5286156 5680645 6028262 6122702 5547907 4684804 4520878 4677095 4684570
15530 4684570 4887078 5706494 6214393 5694945 4996840 4657052 5037469 5399209 5734186
15521 5734186 5816563 5883512 6091389 5757701 5335435 4602041 4539265 5195184 5344217 5578808
15511E578808K58557K18974r37885o43729K91432M37220K32687K39582N2424K23856
15501E951926M8465n01197l66356m8755L20454K56436k85669j5928j79349m00858
15491D779169L76444J26728K51666J74219j06825N8410K19283k70569m89842j19071
15481D999612J72235P4655q7793m0843J77210J89204j36171m40307p1175O59790
15471E496417O09381l74777l71377M11273J28515K15594m35056n69687j8361J92081
15461E284003n68810l74292N38445N99748O131l04738j81009L22211L63569M60522
15451F145780m39919l02118K61698R5074k54461m88968J14053j53803Q0250K83642
15441E341228L96231j77895k21648J66912j57130m75346r7413M68596R26146k29957
$$ plain form
15511 5578808 5837365 6056339 5118454 4474725 4766157 5203377 5436064 5675646 5728070 5951926
15501 5951926 6000391 5499194 5132838 5084083 5404537 5660973 5375304 5359376 5180027 4779169
15491 4779169 5155613 5282341 5534007 5708226 5601401 5659811 5879094 5608525 5118683 4999612
15481 4999612 5171847 5246502 5158709 5117866 5295076 5484280 5348109 4907802 4836627 5496417
15471 5496417 6105798 5731021 5359644 5770917 5899432 6115026 5679970 5110283 5091922 5284003
15461 5284003 4715193 4340901 4879346 5479094 5485225 5180487 4999478 5321689 5685258 6145780
15451 6145780 5705861 5403743 5665441 5760515 5506054 5017086 5131139 4977336 5057586 5341228
15441 5341228 5737459 5559564 5337916 5504828 5347698 4872352 4774939 5243535 6169681 5939724
15431E939724l21637j77683r7748j92717j90246j66792K50263P35570J35015o11694
15421E302055j38289K70857K90933m38022k3194L87921O54938J21817p53943o98241
15411D976832j05595J04608Q5382J41429j20685J33945M42130j1118k81779O1650
15401E426799J97022N0925M20823N2208l00053o237j91315m87970m83420K44735
15391D923517L40304K34583l23987o8169J09572K6358R0130q9409J34923L83569
15381E761391N32149l88940o74801J60283k06247J74015j06461m16348K88766
15372E123807L54305n366j51481k85820M19092m7128o6066J4761K90898N80575
15362F227577O9286n91978p33935l23623M02729K09807j11961k89188K06993L98609
$$ plain form
15431 5939724 5618087 5440404 5342656 5149939 4959693 4792901 5043164 5778734 5913749 5302055
15421 5302055 5163766 5434623 5725556 5287534 5264340 5652261 6307199 6429016 5675073 4976832
15411 4976832 4871237 4975845 5061227 5202656 5081971 5215916 5658046 5646928 5365149 5426799
15401 5426799 5623821 5674746 6095569 6147777 5847724 5841487 5650172 5162202 4678782 4923517
15391 4923517 5263821 5498404 5174417 5106248 5215820 5242178 5332308 5242899 5377822 5761391
15381 5761391 6293540 5904600 5229799 5390082 5183835 5357850 5251389 4835041 5123807
15372 5123807 5478112 5472746 5321265 5035445 5454537 5407409 5341343 5356104 5647002 6227577
15362 6227577 6296863 5704885 4970950 4647327 5050056 5259863 5147902 4858714 5065707 5464316
15352E464316m5371o8086o763N558L25073L16733n2462n5129m32408K79522j60382
15341E570601m80074L2219M25300n7029k35331K04749p784j94316K16682M5179
15331E520196j11192M31337J79667L4581m41583m91727M68208J14242k77659k47838
15321E178232r0920L35180Q6332k96288j12650k71N50513O6240k34651K7784K37562
15310E747063L23608m54122n62486m02562J73867K48220p611j70549M95347N98152
15300E988927j45341m72191l52368O80260K50660j32086J8413J65033j23430j28106
15290E749771m81786p71204r1860O45928M08901J9237k36164J78897J13723k61323
15280E274120k50923J8680P23659K74215K88722m66498l75600k98517m5604j62828
$$ plain form
15352 5464316 5418945 5350859 5344096 5349654 5674727 5991460 5938998 5883869 5451461 5730983 5570601
15341 5570601 5090527 5122746 5548046 5491017 5255686 5460435 5452651 5258335 5475017 5520196
15331 5520196 5409004 5840341 6020008 6054589 5613006 5121279 5589487 5703729 5426070 5178232
15321 5178232 5087312 5422492 5508824 5212536 5099886 5099615 5650128 5716368 5481717 5509501 5747063
15310 5747063 6070671 5616549 5054063 4651501 4825368 5073588 5065977 4895428 5390775 5988927
15300 5988927 5843586 5371395 5019027 5699287 5949947 5817861 5836274 6001307 5877877 5749771
15290 5749771 5267985 4496781 4404921 5050849 5459750 5478987 5242823 5421720 5535443 5274120
15280 5274120 5023197 5041877 5765536 6039751 6328473 5861975 5486375 5187858 5142254 4979426
15270D979426J1774N76095L32974j16477q0380l19279l0686j22559K04193N84895
15260F019976j80192J15895Q1898m07988j70530l78475J73505R4879O3117N42043
15250E954128k72084j70540m02110j70645K01197k08064N32734K48024o5418P6940
15240E724162J6625j85271l00215O5785m12888K24967M41882j54663l68012O029
15230E058401J47866K53044Q5879j55071N73032N1057l01530k58032l148M0374
15220E491872k7779j02756l55209M85664L06073j61057m93245Q4347M91673K86409
15210F005992k20580l74908J03161K30388K24254k89282l77793M79050R4589n02926
15200E371945n16236Q4830M51033N1148l444j43173L00004L75032n22165o6888
$$ plain form
15270 4979426 4991200 5567295 5900269 5783792 5703412 5384133 5353447 5230888 5435081 6019976
15260 6019976 5839784 5955679 6037577 5629589 5459059 5080584 5254089 5348968 5412085 5954128
15250 5954128 5682044 5511504 5109394 4938749 5139946 4931882 5464616 5712640 5647222 5724162
15240 5724162 5740787 5555516 5255301 5321086 4908198 5133165 5575047 5420384 5052372 5058401
15230 5058401 5206267 5459311 5545190 5390119 5963151 6014208 5712678 5454646 5451498 5491872
15220 5491872 5464093 5361337 5006128 5491792 5797865 5636808 5143563 5227910 5719583 6005992
15210 6005992 5785412 5410504 5513665 5744053 5968307 5679025 5301232 5780282 5874871 5371945
15200 5371945 4855709 4940539 5391572 5442720 5439276 5296103 5596107 5971139 5448974 5382086
15190E382086o4632M03673N44132M217l53503m35285J85671k77780n08949p8224
15180D801406N27727M06356N38770n6419n94180k14361J68817M0957k8458M65094
15170F055709M45346k17186o50279n88028l40976l8295M02657Q46928J64046K87008
15160F366930m03463n51446k97840l39803J33271N73032O27747K87706n14045
15151E882089q32356m05831L9067J08918j7339O06858R11293l5740r68654p26993
15141D561312j9088N72673L79216P9351L48530P11728N2551j088751q99676j03051
15131D594795Q72594L26719k53419J96362L19200k69055q47304q65967L3193J015534
15121E122652R72556N2172j83286M88292l06879j101754o76580N30305Q13495
$$ plain form
15190 5382086 5317454 5721127 6265259 6269476 5915973 5480688 5666359 5388579 4879630 4801406
15180 4801406 5329133 5735489 6274259 6217840 5623660 5409299 5578116 5619073 5590615 6055709
15170 6055709 6501055 6283869 5633590 5045562 4704586 4666291 5068948 5915876 6079922 6366930
15160 6366930 5963467 5412021 5114181 4774378 4907649 5480681 6108428 6396134 5882089
15151 5882089 5049733 4643902 4682969 4791887 4774548 5381406 6292699 6256959 5288305 4561312
15141 4561312 4542224 5114897 5494113 5573464 5921994 6633722 6686273 5597522 4697846 4594795
15131 4594795 5467389 5794108 5540689 5737051 6056251 5787196 4939892 4073925 4107118 5122652
15121 5122652 6095208 6147380 5964094 6452386 6145507 5043753 4367173 4897478 5710973
15112E710973L69120m16809j48042K37851j09871r75271n23104Q78988J036329
15103F060164K36207l27336l44617J12018k03055m77817l1725N29672Q35224j21122
15093F267613n67428m09404j33221q2011o6152J90248N82782M82911l89547m493
15083E871298l05195j56152m00144K6826N48197O26309l6152p21807k55318l3573
15073E164289j31265l44136j66150Q57057O09468l55067n13299M1618N37404K13273
15063E913192n36159j28097N53368M48203m04726p55247o0065N40366J82200n26707
15053E226328Q3772Q53332K85370o58658q70745P3501P12743J54251k74223l1633
15043E554038M99908j93087p55339m84989J43348O67233M14942l29859O8570M03475
$$ plain form
15112 5710973 6080093 5663284 5515242 5753093 5643222 4667951 4144847 5023835 6060164
15103 6060164 6296371 5969035 5624418 5736436 5533381 5055564 5023839 5553511 6388735 6267613
15093 6267613 5700185 5290781 5157560 5075549 5009397 5199645 5782427 6265338 5875791 5871298
15083 5871298 5566103 5409951 5009807 5036633 5584830 6211139 6174987 5453180 5197862 5164289
15073 5164289 5033024 4688888 4522738 5379795 5989263 5634196 5120897 5162515 5699919 5913192
15063 5913192 5377033 5248936 5802304 6250507 5845781 5090534 5030469 5570835 5753035 5226328
15053 5226328 5310100 6163432 6448802 5790144 4919399 4992900 5705643 5859894 5585671 5554038
15043 5554038 6053946 5860859 5105520 4620531 4763879 5431112 5846054 5516195 5584765 5988240
15033E988240q7638p05250l46836M11347N53041K2990L62673j67500j9906l36844
15023E674317p04402J10257L97186L39398k25352k23347M61642N4188n37346l04561
15013E041980M30464N85506J94077l34563m1844J62766k98925q23426r3241N97462
15003E420256M00468l8635n59158L71887K71210l92213m20097O02J002176N34012
14993F590508n13786n29320K64819K81746l75706n14167j53007O20294L05031
14984E976412j01397k75333M10578J08841k34385l08229j38455L06041K32502
14975E976575J56841j81089j77725k6864l05099k11514K08992J25790M32629n0020
14965E948516K6752K04786J2417m71095l74067J6778O71746P052k95656j29046
$$ plain form
15033 5988240 5900602 5195352 4848516 5259863 5812904 5835894 6198567 6031067 6011161 5674317
15023 5674317 4969915 5080172 5477358 5816756 5591404 5368057 5829699 5883887 5346541 5041980
15013 5041980 5472444 6057950 6252027 5917464 5875620 6038386 5739461 4916035 4822794 5420256
15003 5420256 5820724 5782089 5222931 5594818 5866028 5473815 5053718 5054320 6056496 6590508
14993 6590508 6076722 5547402 5812221 6093967 5718261 5204094 5051087 5671381 5976412
14984 5976412 5875015 5599682 6010260 6119101 5884716 5576487 5438032 5744073 5976575
14975 5976575 6133416 5952327 5774602 5747738 5442639 5231125 5440117 5565907 5998536 5948516
14965 5948516 5975268 6180054 6192471 5721376 5347309 5364087 6035833 6042885 5747229 5618183
14955E618183k24343r2192k93840l2436L60682L96447J99755k75795p2957K36393
14945E819897k07558q6087M0425L09181L12346j91444j34032l55521k79107j35416
14935E092684l11042J88091O25032M82893K87173m98834k92006m36144j65622
14926D972225K77338p9995L69691J46533J57978l02179n7741k07588m21337R0426
14916D945351J46146N60581N19352l41852k08150Q1161m64028j55409J34472L37695
14906E555319O13244k63767j58856l45649j21511J21056J71761K85915K78145
14897F135657J40361j65476n78493j41370J00531L2981K73225K63940J71663j18854
14887F114165m43905k12185j63664K15720P3716J57032K64505j0620l295l996
$$ plain form
14955 5618183 5393840 5301648 5007808 4975372 5336054 5732501 5932256 5656461 5583504 5819897
14945 5819897 5612339 5526252 5566677 5875858 6188204 5996760 5862728 5507207 5228100 5092684
14935 5092684 4781642 4969733 5594765 6077658 6364831 5865997 5573991 5137847 4972225
14926 4972225 5249563 5169568 5539259 5685792 5843770 5541591 5483850 5276262 4854925 4945351
14916 4945351 5091497 5652078 6171430 5829578 5621428 5702589 5238561 5083152 5217624 5555319
14906 5555319 6168563 5904796 5745940 5400291 5278780 5399836 5571597 5857512 6135657
14897 6135657 6276018 6110542 5532049 5390679 5491210 5524191 5797416 6061356 6233019 6114165
14887 6114165 5670260 5458075 5294411 5510131 5583847 5740879 6005384 5994764 5991469 5987473
14877E987473j55341L59000k88953L0415j68537k03398K66466k54554J88832K41740
14867F003143k39843k20249j35635j69593M57456K24044J96181l92376j14351
14858E608777J47956m16349l1726j62676M40980M53676j76083k06681m26792L91205
14848E622287m1284n50718M57561N33186k044m2934l94598j88394M6616l79763
14838E059915P5462K23288M95472J56187m61144k60863K19816L1995l06948n7062
14828E176118Q01746L92700j57041m02392n35970o9864j43016M12005J42844k5031
14818E592099L68375j539k60493l35502l68316L05970L51389N34023M1955j38169
14808F089792j10336k88751l46766J722J52624M02361k59548R2998j03984o9862
$$ plain form
14877 5987473 5832132 6191132 5902179 5932594 5764057 5560659 5827125 5572571 5761403 6003143
14867 6003143 5763300 5543051 5407416 5237823 5695279 5919323 6115504 5723128 5608777
14858 5608777 5756733 5340384 5308658 5145982 5586962 6040638 5864555 5657874 5231082 5622287
14848 5622287 5581003 5030285 5487846 6021032 6018988 5976054 5581456 5393062 5439678 5059915
14838 5059915 5135377 5358665 5854137 6010324 5549180 5288317 5508133 5540128 5233180 5176118
14828 5176118 5977864 6370564 6213523 5811131 5275161 5205297 5062281 5474286 5617130 5592099
14818 5592099 5960474 5958935 5698442 5362940 4994624 5300594 5651983 6186006 6227961 6089792
14808 6089792 5979456 5690705 5343939 5345661 5498285 5900646 5641098 5734096 5630112 5560250
14798E560250k6478l69375J74119Q55758O78182n8165q37780k05168j32401l47057
14788E291885j01091J08734M67357Q2385n48602j06548K6785K3685J42933M87059
14778E874582N10463L13134O2768n37538n44867k57649J12273J27126K21451R0124
14768E971867k03828l94433m68638K56039J86922j08612N83862K92200J66037
14759F281416j33955l6036o69010l54641K91384L14654K37003J17832r7030k92504
14749E659113l65905j62066J55286r6376Q88164P65195J1889q58409p30723K35132
14739E501300J552o2144K90999L06815K7072m33245n00613M7390L4127N33484
14729E746737k3834J84042M04192R0287o27001n45075K76045N13854j74999k47005
$$ plain form
14798 5560250 5533772 5164397 5338516 6194274 6872456 6814291 5976511 5771343 5638942 5291885
14788 5291885 5190794 5299528 5766885 5849270 5300668 5194120 5220905 5244590 5387523 5874582
14778 5874582 6385045 6698179 6760947 6223409 5678542 5420893 5533166 5660292 5881743 5971867
14768 5971867 5768039 5373606 4904968 5161007 5347929 5239317 5823179 6115379 6281416
14759 6281416 6147461 6111425 5442415 5087774 5379158 5693812 5930815 6048647 5951617 5659113
14749 5659113 5293208 5131142 5286428 5190052 6078216 6843411 6855300 5996891 5266168 5501300
14739 5501300 5502852 5440708 5731707 6038522 6065594 5632349 5131736 5179126 5213253 5746737
14729 5746737 5722903 5906945 6311137 6401424 5774423 5229348 5505393 6019247 5844248 5597243
14719E597243J19702N35373l25014o46153l69454L92671L68311P7024m7407L60609
14709F062905O09018n43001n85068j35169N50746J47488l79961k32755o7818L11802
14699E738187j67959m23833j18061M48938L20706k03630J81263M24026K63079
14690F462716k56495l99998j83406L42863m5457n55981l79801L20116M06194n6408
14680E654343m45852K5626M55082L00809j69320o0957K31927K130J51558m13316
14670E732030k28180o4372j04733j43341K15057M47193Q7274l19176P0820o5427
14660E627145m6310J3834M3554Q05620L62068l9510o15926k69624M4886m92856
$$ plain form
14719 5597243 5716945 6252318 5927304 5281151 4911697 5304368 5672679 5749703 5702296 6062905
14709 6062905 6671923 6128922 5543854 5408685 5959431 6106919 5726958 5494203 5426385 5738187
14699 5738187 5570228 5146395 5028334 5477272 5797978 5594348 5775611 6199637 6462716
14690 6462716 6206221 5806223 5622817 5965680 5920223 5364242 4984441 5304557 5710751 5654343
14680 5654343 5208491 5234117 5689199 5990008 5820688 5759731 5991658 5993788 6145346 5732030
14670 5732030 5503850 5439478 5334745 5191404 5406461 5853654 5940928 5621752 5692572 5627145
14660 5627145 5580835 5594669 5638223 6443843 6805911 6766401 6150475 5880851 5925737 5432881
$$ [...]
##END NTUPLES=NMR SPECTRUM
##END=
