##TITLE=1H_DE-80H_X3
 200.13MHz, d2o
 8 sc
 
 19ns.26.2.2025
##JCAMPDX= 6.0         $$ Bruker NMR JCAMP-DX V2.0
##DATA TYPE= NMR SPECTRUM
##DATA CLASS= NTUPLES
##ORIGIN= UXNMR, Bruker Analytische Messtechnik GmbH
##OWNER= pz
$$ XWIN-NMR		Version 3.5
$$ Tue Apr 28 12:14:19 2026 Russian Standard Time (UT+4h)  Yarkov@DPX200
##.OBSERVE FREQUENCY= 200.1313
##.OBSERVE NUCLEUS= ^1H
##.ACQUISITION MODE= SIMULTANEOUS
##.ACQUISITION SCHEME= undefined
##.AVERAGES= 8
##.DIGITISER RES= 18
##SPECTROMETER/DATA SYSTEM= spect
##.PULSE SEQUENCE= zg30
##.SOLVENT NAME= CDCl3
##.SHIFT REFERENCE= (INTERNAL, CDCl3, 0, 17.9021)
##AUDIT TRAIL= $$ (NUMBER, WHEN, WHO, WHERE, WHAT)
$$ ##TITLE= Audit trail, XWIN-NMR		Version 3.5
$$ ##JCAMPDX= 5.01
$$ ##ORIGIN= Bruker BioSpin GmbH
$$ ##OWNER= Yarkov
$$ C:/Bruker/XWIN-NMR/data/yarkov2/nmr/H-C/1/pdata/1/auditp.txt
$$ ##AUDIT TRAIL=  $$ (NUMBER, WHEN, WHO, WHERE, WHAT)
(   1,<2026-04-28 12:13:15.82 +0400>,<Yarkov>,<DPX200>,
      <created by zg, POWCHK disabled, PULCHK disabled
       configuration hash MD5:
       00 E9 B6 7A A2 85 ED C7 34 08 36 98 17 FE 4E 26
       data hash MD5: 16K
       0B 6F 4E D3 F9 C4 51 55 42 EF 92 65 DB D4 6B 0D>)
(   2,<2026-04-28 12:13:18.71 +0400>,<Yarkov>,<DPX200>,
      <Start of raw data processing
       efp BC_mod = 2 LB = 0.25 FT_mod = 6 PKNL = 1 PHC0 = -5300.516 PHC1 = 11.42193 SI = 16K 
       data hash MD5: 16K
       0F 52 2D 1D E7 D2 09 40 4B 8A 7F 58 3D ED AA 3E>)
(   3,<2026-04-28 12:13:24.07 +0400>,<Yarkov>,<DPX200>,
      <abs ABSG = 5 
       data hash MD5: 16K
       5A A5 BA 00 FF 39 EC DB 7E AC 26 E4 DE E9 84 44>)
$$ ##END=
$$ 
$$ hash MD5
$$ AA 3D C5 1C BE 22 1B 05 1E A1 6A 0A C6 13 DA EF
##$RELAX= 
##$RELAX= 
##$RELAX= 
##$RELAX= 
##$RELAX= 
##$RELAX= 
$$ Bruker specific parameters
$$ --------------------------
##$DU= <C:/Bruker/XWIN-NMR>
##$EXPNO= 1
##$NAME= <H-C>
##$PROCNO= 1
##$TYPE= <nmr>
##$USER= <yarkov2>
##$AMP= (0..31)
100 100 100 100 100 100 100 100 100 100 100 100 100 100 100 100 100 100 
100 100 100 100 100 100 100 100 100 100 100 100 100 100 
##$AQSEQ= 0
##$AQ_mod= 1
##$AUNM= <au_zg>
##$AUTOPOS= <>
##$BF1= 200.13
##$BF2= 200.13
##$BF3= 200.13
##$BF4= 200.13
##$BF5= 200.13
##$BF6= 200.13
##$BF7= 200.13
##$BF8= 200.13
##$BYTORDA= 1
##$CFDGTYP= 0
##$CFRGTYP= 5
##$CHEMSTR= <none>
##$CNST= (0..31)
1 1 145 1 1 1 1 1 1 1 1 1 1 1 1 1 1 1 1 1 1 1 1 1 1 1 1 1 1 1 1 1 
##$CPDPRG= <>
##$CPDPRG1= <>
##$CPDPRG2= <>
##$CPDPRG3= <>
##$CPDPRG4= <mlev>
##$CPDPRG5= <mlev>
##$CPDPRG6= <mlev>
##$CPDPRG7= <mlev>
##$CPDPRG8= <mlev>
##$CPDPRGB= <>
##$CPDPRGT= <>
##$D= (0..31)
0 0.7 0 0 0 0 0 0 0 0 0 0.03 0 0 0 0 0 0 0 0 0 0 0 0 0 0 0 0 0 0 0 0 
##$DATE= 1777363995
##$DBL= (0..7)
120 120 120 120 120 120 120 120 
##$DBP= (0..7)
150 150 150 150 150 150 150 150 
##$DBP07= 0
##$DBPNAM0= <>
##$DBPNAM1= <>
##$DBPNAM2= <>
##$DBPNAM3= <>
##$DBPNAM4= <>
##$DBPNAM5= <>
##$DBPNAM6= <>
##$DBPNAM7= <>
##$DBPOAL= (0..7)
0.5 0.5 0.5 0.5 0.5 0.5 0.5 0.5 
##$DBPOFFS= (0..7)
0 0 0 0 0 0 0 0 
##$DE= 6
$$ [...]
##$SUBNAM3= <"">
##$SUBNAM4= <"">
##$SUBNAM5= <"">
##$SUBNAM6= <"">
##$SUBNAM7= <"">
##$SUBNAM8= <"">
##$SUBNAM9= <"">
##$SW= 18.0517328524113
##$SWIBOX= (0..15)
0 0 2 0 0 0 0 0 0 0 0 0 0 0 0 0 
##$SW_h= 3612.71676300578
##$TD= 16384
##$TD0= 1
##$TE= 0
##$TE2= 300
##$TE3= 300
##$TEG= 300
##$TL= (0..7)
0 120 120 120 120 120 120 120 
##$TP= (0..7)
150 150 150 150 150 150 150 150 
##$TP07= 0
##$TPNAME0= <>
##$TPNAME1= <>
##$TPNAME2= <>
##$TPNAME3= <>
##$TPNAME4= <>
##$TPNAME5= <>
##$TPNAME6= <>
##$TPNAME7= <>
##$TPOAL= (0..7)
0.5 0.5 0.5 0.5 0.5 0.5 0.5 0.5 
##$TPOFFS= (0..7)
0 0 0 0 0 0 0 0 
##$TUNHIN= 0
##$TUNHOUT= 0
##$TUNXOUT= 0
##$USERA1= <user>
##$USERA2= <user>
##$USERA3= <user>
##$USERA4= <user>
##$USERA5= <user>
##$V9= 5
##$VALIST= <valist>
##$VCLIST= <CCCCCCCCCCCCCCC>
##$VD= 0
##$VDLIST= <DDDDDDDDDDDDDDD>
##$VPLIST= <PPPPPPPPPPPPPPP>
##$VTLIST= <TTTTTTTTTTTTTTT>
##$WBST= 1024
##$WBSW= 4
##$XGAIN= (0..3)
0 0 0 0 
##$XL= 0
##$YL= 0
##$YMAX_a= 216034
##$YMIN_a= -235292
##$ZGOPTNS= <>
##$ZL1= 120
##$ZL2= 120
##$ZL3= 120
##$ZL4= 120
##$ABSF1= 17.96375
##$ABSF2= -0.0881443
##$ABSG= 5
##$ABSL= 3
##$ALPHA= 0
##$AQORDER= 0
##$ASSFAC= 0
##$ASSFACI= 0
##$ASSFACX= 0
##$ASSWID= 0
##$AUNMP= <proc_1d>
##$AZFE= 0.1
##$AZFW= 0.1
##$BCFW= 0
##$BC_mod= 2
##$BYTORDP= 0
##$COROFFS= 0
##$CY= -3
##$DATMOD= 1
##$DC= 0
##$DFILT= <>
##$DTYPP= 0
##$F1P= 0
##$F2P= 0
##$FCOR= 1
##$FTSIZE= 16384
##$FT_mod= 6
##$GAMMA= 0
##$GB= 0
##$INTBC= 1
##$INTSCL= 3.241238e-09
##$ISEN= 128
##$LB= 0.25
##$LEV0= 0
##$LPBIN= 0
##$MAXI= 10000
##$MC2= 0
##$MEAN= 0
##$ME_mod= 0
##$MI= 1.114404
##$NCOEF= 0
##$NC_proc= -7
##$NLEV= 6
##$NOISF1= 3.799351
##$NOISF2= 2.8
##$NSP= 0
##$NTH_PI= 0
##$NZP= 0
##$OFFSET= 17.90205
##$PC= 1
##$PHC0= -5300.516
##$PHC1= 11.42193
##$PH_mod= 1
##$PKNL= yes
##$PPARMOD= 0
##$PSCAL= 0
##$PSIGN= 0
##$REVERSE= no
##$SF= 200.129523630181
##$SI= 16384
##$SIGF1= 3
##$SIGF2= 2
##$SINO= 0.751879
##$SIOLD= 32768
##$SREGLST= <19F.Aceton>
##$SSB= 0
##$STSI= 16384
##$STSR= 0
##$SW_p= 3612.71676300578
##$SYMM= 0
##$S_DEV= 0
##$TDeff= 16384
##$TDoff= 0
##$TI= <>
##$TILT= no
##$TM1= 0
##$TM2= 0
##$TOPLEV= 0
##$USERP1= <user>
##$USERP2= <user>
##$USERP3= <user>
##$USERP4= <user>
##$USERP5= <user>
##$WDW= 1
##$XDIM= 16384
##$YMAX_p= 364176180
##$YMIN_p= -1992737
$$ End of Bruker specific parameters
$$ ---------------------------------
##NTUPLES= NMR SPECTRUM
##VAR_NAME=  FREQUENCY,     SPECTRUM/REAL,   SPECTRUM/IMAG
##SYMBOL=    X,             R,               I
##VAR_TYPE=  INDEPENDENT,   DEPENDENT,       DEPENDENT
##VAR_FORM=  AFFN,          ASDF,            ASDF
##VAR_DIM=   16384,         16384,           16384
##UNITS=     HZ,            ARBITRARY UNITS, ARBITRARY UNITS
##FACTOR=    0.220516191357247, 1,           1
##FIRST=     3582.72874216816, 0,            0
##LAST=      -29.9880208376171, 0,           0
##MIN=       -29.9880208376171, -1992737,    0
##MAX=       3582.72874216816, 364176180,    0
$$ Real data points
##PAGE= N=1
##DATA TABLE= (X++(R..R)), XYDATA
$$ [...]
6038 5431 -3383 -53249 -161715 -94019 107407 193127 216462 189365 148633 320868 127392
6027 127392 -87239 70826 -19225 -76786 -250245 -186369 -170077 -157091 -202504 -90391 104779
6016 104779 -76902 -61052 -18593 73522 147177 58029 -207101 36966 -93433 -40749 -129921
6005 -129921 6855 -47400 -151742 -71393 -157279 -315888 -263988 -401709 -267117 -176693 -157457
5994 -157457 -117966 39084 135651 3425 120190 233294 216261 306047 422821 252649
5984 252649 217587 38483 -73851 -297329 -264888 -376338 -302604 -269917 -161854 -58552
5974 -58552 142322 134910 259103 163482 326312 264534 199588 135695 153223 -43423 12586
5963 12586 -60055 100739 -132977 -249116 -92056 61473 -96710 -118489 -47914 -57255 32996
5952 32996 86665 69251 72620 40364 -165207 172397 23485 30361 98530 253171 172818
5941 172818 110227 118298 -59319 -115323 -342129 -279557 -204922 -21978 -289236 -262179 -20722
5930 -20722 142592 128537 54607 131377 113766 140511 263623 1672 -46458 -310887 -388208
5919 -388208 -114287 -316643 -377831 -351160 -41924 -345846 19061 107323 318464 197253
5909 197253 330956 38992 143145 -63184 -188264 -205699 -173569 -194738 -149091 -21520
5899 -21520 -138487 -128114 12415 96239 -68288 -29669 -216016 57645 -167863 -160048 -315821
5888 -315821 -116395 -157026 -222321 -218211 -143417 183428 283082 462107 367266 333447 7168
5877 7168 -49694 -43134 86458 -187694 -60003 -436332 -364796 -389744 -151627 104785 78666
5866 78666 -32670 151385 414235 167570 106137 -46838 65470 -212317 -9902 -294097
5856 -294097 -179411 -288391 13696 -21773 158287 33142 90795 108336 208979 51487
5846 51487 -35903 89013 55412 6719 -155463 -241019 -192416 9255 -107551 264486 243132
5835 243132 140435 -128095 91911 141445 206811 74339 -152444 -135445 -317355 -366342
5825 -366342 -352823 -245084 -361337 -12265 109769 318116 211827 241593 292635 283455 251031
5814 251031 93608 -33099 -51901 -228343 -264365 -159432 -195587 -240070 -21752 153315
5804 153315 -43948 125063 176034 293983 186468 218028 97026 70374 -193496 -242042
5794 -242042 -177609 -112773 -109211 -64368 -61591 106180 187209 158754 191762 186409 -42926 1511
5782 1511 72580 -48555 -182979 -76409 -114256 -112477 -125536 -861 -322891 -54735 17810
5771 17810 167118 56890 81114 -185050 -222097 -86242 -51693 -25633 -240321 -123240 -185827
5760 -185827 36376 -36262 244854 -41952 43508 162275 366254 53836 -110313 -229257
5750 -229257 -150197 -237166 -140814 -181239 -265392 -121646 -47344 99938 89514 94483 -41641
5739 -41641 110891 151567 27610 -135118 27315 -189032 -162933 -112724 -141165 -293950 -400933
5728 -400933 1374 2925 127254 -57881 172338 100509 275667 78792 198081 -223190
5718 -223190 -94100 -71553 -71044 -198206 -308487 -291098 -335584 -222412 -59634 93552 -19469
5707 -19469 106244 -10657 199223 52435 158986 4680 12954 -37849 166299 95388 -30788
5696 -30788 -128904 -82443 -27795 8084 83954 -141132 87336 -74009 83716 -24974 -22807
5685 -22807 -58429 58294 13095 79486 124221 -21233 -79263 52696 176764 -25582 262519
5674 262519 -109030 167158 -112874 -51716 -242681 -205775 -311457 -162507 -234320 -5632
5664 -5632 -177323 -55333 29159 -40679 67468 41555 135979 31362 144452 96645 -27261
5653 -27261 -116417 -154193 -220705 -59250 -222687 -220994 -322341 -186116 -104575 140512 47828
5642 47828 -41467 45810 131102 153871 220257 96213 -22617 -4727 -44274 89397 -30957
5631 -30957 -101979 -248760 -146235 -325100 -264387 -236255 -31354 -113823 -276529 -69120 86723
5620 86723 104926 19145 -86434 -33999 38426 -125960 28926 241053 207733 -29219 -27422
5609 -27422 -239880 -275944 -298059 -167355 -44104 -98011 -191579 14006 14934 104509 -88108
5598 -88108 25024 165041 315811 237456 240471 337866 185708 -133587 -160098 -154211 -139479
5587 -139479 -322807 -194269 -238075 -378251 -130153 -154105 -136462 28308 -23545 -68448 -33829
5576 -33829 -147339 -169420 16888 83873 -106152 28877 -42272 51378 146390 29982 -121455
5565 -121455 -69691 -147838 -127528 87614 83014 3776 15536 -21590 -9365 -6928 -118580 -50504
5553 -50504 19589 -34607 88824 191362 180425 21713 -36398 43721 23229 -189504 -184479
5542 -184479 -159302 20811 -35314 -348942 -410313 -171643 -157800 -113125 -35496 18398 -39629
5531 -39629 -15555 118673 -54048 -12706 -166582 -148909 -131459 -242052 -108550 80173 -8367
5520 -8367 -133597 -86179 -20691 141377 110490 61992 -80784 -103570 -101999 -95910 -94898 -77001
5508 -77001 -15876 155582 37352 -172158 -119401 97221 -68412 36235 141041 147783 335331
5497 335331 206736 30870 -57720 -30936 -151211 -207910 -290341 -163910 12482 91207 -191722
5486 -191722 -88848 -83468 -82599 -7903 73746 82824 80180 122818 113482 -219696 -179896 -81310
5474 -81310 -77155 38974 -144611 -86241 -19349 -127582 -313792 -185478 -163981 -228326 -142527
5463 -142527 -23279 -22078 54274 2375 -27045 -41353 38130 3663 -11857 -216875 -248244
5452 -248244 -111585 -114288 -199378 -151619 -69551 -89078 -21164 -77395 49323 -101914 -30105
5441 -30105 -155719 -215768 -169683 -41583 30091 39166 207078 177523 184936 8073 -99139
5430 -99139 99117 55480 163661 43739 -164940 32225 150609 -147803 -200412 53037
5420 53037 102895 150381 37631 -18804 2889 44422 -8093 75212 146691 142642 109448 13314
5408 13314 78097 -37730 -307554 -225631 -308278 -73276 -23799 37101 162164 25240 -80441
5397 -80441 47504 -7642 -298849 -150614 -36086 -119392 -73404 -199249 -338015 -201247
5387 -201247 -143990 -100124 26847 234135 193058 207966 213953 -91214 69155 -46987 -87746
5376 -87746 -184257 -151585 -191328 66961 -4166 40741 -164766 -93157 105905 184569 114519
5365 114519 -106242 -9099 48828 -57081 -226818 -157324 -257030 -175887 -171092 -14827 -225397
5354 -225397 -24879 -201980 30345 -59215 -40474 -142446 -101836 -204533 -265057 -172382 -128968
5343 -128968 -117342 -20272 75698 -37135 157016 26849 147873 100203 8505 -154079 -217559
5332 -217559 -245915 -147984 6529 -76414 -224749 -193993 -213029 -426668 -153498 89968 213332
5321 213332 126986 102850 -124844 12147 -55482 122522 6190 -86021 -196834 -32682
5311 -32682 -110064 -346426 -268549 -238044 -134546 -41469 66276 -3013 252854 118846 101547
5300 101547 -44555 43770 -46452 -51937 -117020 -183152 61271 201951 154744 63976 -111154
5289 -111154 11264 -15727 55135 100615 -126774 -76846 -76019 -399929 -287291 12319 63240
5278 63240 169709 165566 115266 181058 102253 39402 26263 161953 -72709 -66074 -150153 -221153
5266 -221153 -227057 -286993 -259191 -198992 -209150 -37479 21627 58289 192894 42560 114371
5255 114371 -170419 38792 -9898 20537 -48446 -35088 -113202 16471 117368 180102 125790
5244 125790 101694 59510 -96228 191126 -223325 -383462 -324773 -177266 -249673 -13959
5234 -13959 -110253 171255 191892 140529 -27567 -20618 106865 76216 111379 -76003 -58784
5223 -58784 -180266 -194685 -220673 -327556 -206585 -56298 -41906 -75102 -237258 -36239 125477
5212 125477 -39464 -132811 -202669 -134413 -115880 -116827 -285029 -158870 -102214 -92618 -94453 64280
5200 64280 -123214 37165 170489 43251 57243 -114426 -274119 -351391 -246351 -205179
5190 -205179 15865 -92976 -8367 -231905 90594 52807 92348 28587 -133996 -110521 33082
5179 33082 -141370 -160294 -232025 -127377 -174687 -141879 -70111 -180699 9301 -104863 -99141
5168 -99141 -126681 -134051 -55564 89355 36562 108915 118639 -98219 -302333 -140321 57858
5157 57858 -37407 263649 101904 239089 110715 87844 -277007 -46861 -132488 -135004 27881
5146 27881 13657 -222344 -168190 -3605 -58163 -34468 -147123 -23076 112830 246478 61734
5135 61734 -1752 -74443 -163413 -348087 -153857 -271046 -236144 -132651 -151099 11582 187386
5124 187386 169359 396115 141274 213520 272423 399355 245658 -89125 -171985 -154665 -253904
5113 -253904 -3536 -108971 -75379 -78325 39139 -87791 8789 -16120 21778 166534 152897
5102 152897 -13815 -200691 -228291 -185821 -94149 -323668 -273401 -141577 -67556 -100897 -18559
5091 -18559 -12928 -196489 -2806 68889 30267 -83606 -237021 -158812 17296 -163389 54407
5080 54407 -1370 -33064 93082 123140 257510 255794 197403 118608 -177448 -191901 -260673
5069 -260673 -263008 21177 -129097 -93911 -20408 180586 82311 29868 113117 405785 319707
5058 319707 413108 37511 16186 -141076 -136248 -192047 -343317 -313965 -248945 -120483 -81982
5047 -81982 -141102 -19853 95390 43624 161913 -18382 5797 72746 50797 -168612 -78852
5036 -78852 -49288 -130851 -60180 125175 280764 212529 59161 -57003 258947 91226 -23309
5025 -23309 -201748 -206644 -266137 -291725 -181298 -313190 -402035 -188989 -163951 117320 171699
5014 171699 -4836 146666 170272 182188 158283 203658 -21543 -100167 -85240 -70506 -263004
5003 -263004 -117106 -332645 -293691 -178559 -76985 173721 -72864 -64397 138015 288143
4993 288143 196746 -3503 -70250 -59992 73138 342361 55766 28188 88494 133888 -16790
4982 -16790 -154492 -13345 -224936 -261957 -241864 -321743 -122047 -208817 -182562 -62717 19349
4971 19349 -14946 -6914 308682 176346 204110 478900 526277 376110 161270 75957 59678
4960 59678 -158510 -415126 -359777 -363636 -304423 -379858 -319379 -209603 59421 398520 314944
4949 314944 329581 353393 307214 130447 -75252 -132923 39658 34404 -84630 -322760 -232269
4938 -232269 -164216 -83708 -104230 -190996 -58325 230507 149959 -72150 -61421 4820 37543
4927 37543 -11538 -12378 -67927 51796 78791 52043 -2037 -191389 -86120 128841 127233 7762
4915 7762 36551 -77958 -193108 -315500 -95742 -234165 -84951 -189455 -57785 80581
4905 80581 252432 159144 93264 27275 203628 18046 87960 -175098 -459643 -234592 -277939
4894 -277939 -67077 -150401 -263855 -58764 211717 116641 166604 66647 111410 113119 167411
4883 167411 108663 -38343 -85746 -227292 -193780 -28712 -69471 -115216 -100769 34434 71583
4872 71583 38104 107047 64897 24835 -126046 -22748 70197 -234947 -367556 -241150 -183382
4861 -183382 -396432 -142574 -207477 24130 -114714 150442 -16664 197136 -33488 -43889
4851 -43889 41025 65790 -142137 -217924 -420392 -342882 -343269 -110232 -64255 -97879 14897
4840 14897 47960 221298 70320 4875 -230918 -63054 -106277 -188056 -432429 -258968 -336464
4829 -336464 42827 -73838 -16563 128043 154434 278379 112019 -53475 -181760 92393
4819 92393 -129066 -135874 -284981 -370168 -421277 -170309 -120978 62165 255128 111259 147490
4808 147490 257294 249495 56785 104580 3979 -150606 -290036 -130552 -115972 126501
4798 126501 -180461 -83346 -3234 234724 32256 26683 -2051 11677 -91853 -61785 -379593
4787 -379593 -395011 -317991 -228312 -8421 -68097 -44208 1145 23863 194523 203920 48532
4776 48532 66504 -74909 176170 -274388 -201972 -322267 -339092 -57458 75114 -144921
4766 -144921 42411 174053 182333 -5960 18424 160881 167699 175142 -15385 -38516 -193096
4755 -193096 -116000 -215138 15131 -11130 20757 -100335 221676 18977 271332 169702
4745 169702 -42772 -35071 -298880 -166245 -205799 -211352 -211998 -5833 -33384 4821 -90165 216690
4733 216690 86615 169451 48993 -15225 80181 99628 -72430 -282040 -281804 -196875 -228986
4722 -228986 -25120 -8161 -196427 355360 71456 90849 -18304 74016 114502 110573 8728
4711 8728 -78191 -6935 39108 -110455 -72749 -88860 -290257 -8193 -231825 17936 -11337
4700 -11337 -24720 -42218 51104 -77810 23711 50657 72031 -190023 -97290 -160357 -221648
4689 -221648 702 -185296 -7803 179178 230113 27158 -116667 -113442 -192310 -357463
4679 -357463 -250258 -387393 -198590 -111620 -231031 -84384 -151875 -69679 154796 259795
4669 259795 137328 15015 241216 102809 -145168 -98961 -332607 -115677 -333864 -211671
4659 -211671 -174316 -99378 122556 176565 159259 68076 99520 120305 146113 -149677 3404
4648 3404 -128662 -40451 11886 -207369 -40976 91871 112331 -98708 -53187 -45207 -80597
4637 -80597 -63906 -202422 -82600 -64383 -100070 -59938 125666 185641 221241 122973 171474
4626 171474 210104 113144 -13883 -57522 -17497 -188802 -238557 -112321 -429508 -257894 -42649
4615 -42649 152761 -18906 -66033 -75992 140461 9287 62090 -118852 99542 60424 17579
4604 17579 116540 2928 -86728 -68846 114582 31378 -180563 -170808 640 -82683 201399
4593 201399 -169615 72956 -91815 -43169 -157148 31125 113854 237715 54628 88790
4583 88790 44823 24254 -98786 -105729 28397 -103888 -59543 -209822 -296760 -294775 -87361
4572 -87361 -69962 -13400 -162480 212936 79077 266481 -4730 -24322 72439 -90879 -91332
4561 -91332 -92500 131274 -212753 -93899 -87619 110659 49072 130265 -17833 147006 47607
4550 47607 -20877 -47385 -3575 -267063 -181147 -145598 -5228 -62715 31914 82205 125667
4539 125667 415612 128231 252267 200919 372329 24872 -86201 -155071 -91580 -181450
4529 -181450 -89050 -162748 -168671 -45768 -155027 137722 213619 222844 439741 318920 329183
4518 329183 220785 366618 140155 159127 34048 64123 -11928 -206803 -301510 -14858
4508 -14858 -109529 -142667 -99291 43084 -18957 -161068 -134711 -121603 65928 91476 6643
4497 6643 -29727 189666 236987 518301 193067 120870 137513 427947 292953 8201 -131074
4486 -131074 -263487 -314330 -367116 -447377 -455531 -72731 -14214 173374 118779 230210 272592
4475 272592 355192 306110 356005 328243 127301 89072 105081 -222617 -360854 -134310 -326347
4464 -326347 -122927 -157532 353136 216859 415925 308455 335280 416793 233296 -11648
4454 -11648 45163 60668 -82799 184668 6807 -25472 27725 249515 103423 62891 126300
4443 126300 116793 262747 164351 -145383 34300 49158 -79726 -49262 -39511 182616 244527
4432 244527 428707 250623 547759 347339 302900 -52702 86027 -91204 190820 156875
4422 156875 -66357 -65553 25969 435522 270477 269884 160468 566546 589940 638372 158658
4411 158658 395489 197479 429731 59404 158524 50215 345476 470393 650460 609239
4401 609239 687769 721454 836197 876347 759418 852819 599781 777540 428308 469615 388502
4390 388502 418437 287461 343751 496341 783443 800581 811359 788760 846635 971348 957135
4379 957135 1046155 693159 771013 765958 807947 629734 638496 666526 669637 505346 711822
4368 711822 707985 631926 624564 402470 763168 649139 785129 427337 528270 467059 581552
4357 581552 388940 544764 549387 667674 645034 663869 801033 604709 365902 466326
4347 466326 485137 366072 273707 376768 553242 301399 492006 369125 527414 362853
4337 362853 437187 661152 660200 665251 491746 509144 423594 603443 597098 717725 350638
4326 350638 658026 686001 588869 528577 636794 757143 741379 645649 514326 722374 749045
4315 749045 808427 881104 864109 966154 1383256 1557576 1831941 1847748 2088079 2217652
4305 2217652 2540308 2491707 2366729 2373374 2395027 2101060 1989299 1809252 1914828 2047557
4295 2047557 1996032 2074183 2048865 2038808 1976261 1905414 2160348 2101930 2132486 1967656 2090936
4284 2090936 2192656 2330073 2295053 2413976 2279747 2417095 2715167 2999872 3063009 3131522
4274 3131522 3297090 3486903 3669257 3544336 3718165 3715407 3663604 3443894 3648317 3285820
4264 3285820 3139936 2872143 2762612 2450011 2336740 2146680 2030654 1925984 1885850 1960398
4254 1960398 1961091 2091950 2014095 2402021 2440284 2606864 2711104 2935839 3166653 3281452
4244 3281452 3250853 3462163 3564966 3769469 3620122 3787288 3764066 3853042 3863964 3635677
4234 3635677 3744928 3715538 3682052 3510079 3598015 3354740 3379664 3335634 3569441 3390430
4224 3390430 3414729 3445235 3664897 3918097 4038928 4210775 4456054 4640713 4773187 4862847
4214 4862847 5081618 5242749 5335392 5483937 5682190 5641525 5554870 5739532 5730410 5619744
4204 5619744 5496491 5238869 5051401 4810500 4536304 4274632 4098396 3763810 3556076 3581079
4194 3581079 3480847 3543056 3579092 3463649 3326549 3250458 3088667 2994004 2877566 2970423
4184 2970423 2855378 2793388 2986279 3023823 3146282 3172044 3333319 3559979 3620520 3689333
4174 3689333 3701134 3593960 3749627 3745993 3720023 3730237 3873159 3989966 4056958 3905104 4011011
4163 4011011 4236237 4512717 4680291 4764243 4909034 5070380 5316531 5341848 5431672 5328768
4153 5328768 5431151 5553737 5565492 5466621 5416645 5396674 5363468 5405717 5561493 5751787 5988943
4142 5988943 5998772 6136103 6220319 6545815 6500253 6866131 7081870 7330962 7614376 7813508
4132 7813508 8075913 8124688 8157680 8354736 8245589 8389569 8296131 8389531 8454245 8641676
4122 8641676 8776123 8916897 9379519 9892715 10357139 10671079 11258085 11821652 12386540 12727344
4112 12727344 13706590 14301794 15051631 16060353 17278902 18915316 20789580 23239329 26119693
4103 26119693 29614028 34416153 40555628 48152637 56730954 65858009 74503420 81044761
4095 81044761 84634351 85423686 84393711 82614166 80310733 78191947 76648542 75734107
4087 75734107 75714122 76295685 77492789 79360512 81299145 83558979 85205796 86930867 87864884
4078 87864884 88377520 88799317 89722779 92574168 97773547 104392946 111240585 115950078 117375798
4069 117375798 115778737 111854676 107716607 104135449 101533359 99472540 97281224 94900372
4061 94900372 93017365 91751784 91105855 90665127 90225740 89076577 86568835 82796963 77195897
4052 77195897 70914993 63722615 56743629 50276320 44737877 39799884 35463679 31933500
4044 31933500 28612622 26023063 23718106 22251298 20629453 19396508 18169568 17534028
4036 17534028 16665474 16168597 15430383 14961981 14437101 13934970 13419713 12839798 12047850
4027 12047850 11615808 11232795 10956691 10400700 10122222 10036705 9514120 9374739 9118266 9027756
4017 9027756 8605330 8396562 8055761 7848081 7521482 7408712 7097076 6875520 6671038 6504548
4007 6504548 6598445 6327254 6295352 6309975 6444054 6353072 6262109 6259031 6319827 6417405 6779365
3996 6779365 6821642 6850164 6834701 6964155 7018282 6866764 6854508 6765048 6604703 6559638 6477720
3985 6477720 6199903 6065708 5726494 5699639 5672081 5590189 5412258 5321007 5327822 5412006 5422009
3974 5422009 5384535 5337806 5244329 5256680 5224519 5002846 4852588 4597666 4385553 4416869 4275302
3963 4275302 4115941 4012139 3692473 3656742 3554320 3500020 3311740 3173618 3054734 3084156
3953 3084156 2992982 2833307 2415968 2449410 2313098 2288166 2380034 2138319 2036443 2219125
3943 2219125 2494165 2537203 2386937 2229917 2391427 2053826 2197755 2089405 1918645 1978960
3933 1978960 1925145 1821768 1757962 1669117 1576846 1693612 1797718 1971287 1924379 1989491 2068296
3922 2068296 2004827 1911981 1965334 1712289 1844336 1714181 2011608 1846699 1988527 1881495
3912 1881495 1978363 1816840 1700398 1816385 1786353 1867957 1792193 1809157 1676374 1630332 1615737
3901 1615737 1714155 1880108 2092574 1946989 2003830 1966642 1848096 1802631 1932904 1898247
3891 1898247 2166345 1936555 2101998 2086895 2170160 2165845 2237961 2093489 2261392 2595884
3881 2595884 2650256 2679003 2633739 2778433 2972432 3260773 3307579 3527940 3752073 4324072
3871 4324072 4720430 5034146 5173412 5557981 5733756 5966125 6211247 6324176 6547553 6490272
3861 6490272 6623300 6266945 6168204 6032194 6216535 6293775 6801529 7069109 7706400 8175058
3851 8175058 8962653 9703423 10884660 11958427 13231932 14563180 15688695 16627236 17429719
3842 17429719 17637485 17433468 17443297 17207895 17129410 16513981 16554274 16330211 16555892 16546374
3832 16546374 16845131 17425929 18194412 19256583 20329955 21517605 22438714 23414834 24058432
3823 24058432 24775635 25424250 26423748 27027543 27640490 27831911 28072006 27960844 27728232
3814 27728232 27622199 27705527 28053286 28523053 28919508 29256191 29699856 29948987 30421482 30262734
3804 30262734 30415522 30207686 30403512 30123739 30065605 29440464 29180973 28632075 28640083 28459588
3794 28459588 28529540 28750717 28983195 29472240 29803354 30129082 30308329 30540044 30695185 31121531
3784 31121531 31293476 31401714 30496943 29659358 28353279 27395396 26177442 24984327 23915075
3775 23915075 23094871 22378778 21988249 21186927 20581368 20300164 20208726 20606867 21014273 21660512
3765 21660512 21909643 22094876 21703658 21072637 20397226 19776495 18689814 18120824 17455227
3756 17455227 16844374 15555843 14820456 14098945 13220472 12644409 11668098 10974996 10216283
3747 10216283 9772380 9421474 8883254 8359635 8329332 8127663 8346220 8302201 8235578 8071438
3737 8071438 7735975 7475815 6991601 6704358 6323605 5927609 5661749 5380576 5063276 4778694
3727 4778694 4488721 4250904 3845779 3835685 3694562 3401192 3195666 2838448 2667573 2623573
3717 2623573 2459601 2367945 2139992 2163490 2364563 2258826 2068016 1827139 1945186 1928493
3707 1928493 1966836 1778004 1783213 1709056 1656169 1720155 1474500 1454149 1493375 1589238 1286236
3696 1286236 1470470 1372206 1247712 1202416 979998 1020065 1254475 1408619 1491485 1407579
3686 1407579 1439209 1453376 1338783 1318059 1060262 1182990 1044249 1129530 1039456 860285
3676 860285 807256 729766 613803 907832 846843 962694 904203 1066873 1366751 1156037
3666 1156037 1118739 905207 851694 1007747 969308 901057 820806 782098 893040 686357 702929
3655 702929 739496 702654 957026 1077544 1191789 895883 822794 627605 977425 902608
3645 902608 681827 766776 814352 704112 584353 581286 508180 446414 473067 784844 742521
3634 742521 788634 515561 556385 635893 593970 509552 471165 413550 650792 848292 718948
3623 718948 586124 538500 504148 600410 998919 929075 751677 380894 374389 432469 423995
3612 423995 51179 66112 159235 462957 594205 553844 615354 528750 589924 540579 711035
3601 711035 501157 448659 382593 626169 451685 227993 86469 144214 332468 465292
3591 465292 498576 546791 597680 608279 618628 592570 307082 339365 223353 413984 327777
3580 327777 254596 109157 218777 259774 462412 286771 599398 645716 695755 516340
3570 516340 415813 464641 323228 193841 233765 339289 411753 572309 263581 420587
3560 420587 274066 558335 376541 390475 310723 472892 468134 573869 86275 151993 -6139
3549 -6139 142016 389752 408361 595216 384421 509059 448143 658565 604555 766419 411759
3538 411759 567270 661892 572784 134502 77600 159669 162204 394338 309987 435501 328071
3527 328071 751937 693816 829099 615647 684927 733951 846962 751444 721445 315898 495818
3516 495818 428448 394520 695088 609675 637230 481686 700595 613966 502329 451554 610025
3505 610025 446034 749268 828552 684381 424547 290652 583426 644078 754890 545748
3495 545748 822930 999003 1183494 985726 935865 568934 617835 636158 725693 648242 411665
3484 411665 603694 690944 920736 704322 914302 704302 1035412 925113 1089443 696354
3474 696354 807816 367931 548121 436276 449380 363644 303232 665159 785232 790868 615989
3463 615989 626058 506653 843126 870157 1088750 784016 957789 756424 859796 737672
3453 737672 526170 623694 813503 879598 897028 991402 812676 755878 565573 788641 657019
3442 657019 683631 459536 408062 585135 691283 665738 658546 628177 877332 1036811 1129412
3431 1129412 976445 783649 731385 824579 803748 483606 468036 639732 682856 646185 546304
3420 546304 434697 593484 436466 655091 757185 748032 567139 638738 534210 622940
3410 622940 478168 545343 226069 437199 410064 651673 607685 281899 269837 445403
3400 445403 609820 748019 538396 551557 596697 631052 623535 449785 486579 346270 623934
3389 623934 623751 687457 555279 649624 452937 681236 567246 553795 651930 604694 781704
3378 781704 575002 734130 650336 610179 502647 759107 697447 655765 542744 858645
3368 858645 608514 776013 597689 299879 371529 375754 603758 414118 641839 472145
3358 472145 658244 528576 695798 503581 909848 657200 911505 814555 815078 574463
3348 574463 467210 439742 558050 729272 692777 623028 298790 401242 357468 547644
3338 547644 254452 603831 463464 813502 764575 668808 351166 375521 612472 750784
3328 750784 723026 543423 809200 391183 702410 500882 800289 523136 753907 645311
3318 645311 864130 698615 758182 737050 833653 728297 864579 960318 852905 961405
3308 961405 755536 1028624 709137 806228 468819 648187 493686 830552 547575 696511
3298 696511 619678 680789 655562 859300 884376 842832 891094 1107161 1234338 1127615 815132
3287 815132 730026 830461 701049 888670 717811 530293 433909 582787 798963 813186
3277 813186 630273 545221 741805 1045727 1000674 764655 780132 666027 900887 916897
3267 916897 836041 705573 507272 608310 545584 640128 425654 549070 803503 784238
3257 784238 998237 1210841 1011309 947872 746371 805608 627781 574282 598335 544100 636050
3246 636050 578792 534148 453065 413641 570975 821292 738285 702476 523141 458567 615432
3235 615432 691515 536323 190567 505229 531004 773512 830417 688028 601424 765402
3225 765402 758049 874872 792846 574095 224458 400119 730369 739438 553714 418576 339513
3214 339513 719484 705031 731690 630783 572141 686954 678596 730410 629646 516279 521245
3203 521245 682767 698221 587041 410594 466994 457444 732639 633893 707153 547631 603200
3192 603200 683752 935609 787726 795775 414538 502479 564636 741764 554271 432799 283072
3181 283072 553235 644299 741763 744395 865989 1067507 1102647 1042960 777517 768940 760159
3170 760159 770907 700204 784981 482353 479246 596484 850106 776563 640905 711590 801993
3159 801993 770471 631611 729925 582491 535868 521652 781340 870824 891575 823674 965070
3148 965070 984283 1047842 965484 865001 934098 811029 1102868 936340 729078 678559 659415
3137 659415 695765 742440 712349 844485 813978 937449 954219 1170700 933111 916318 823532
3126 823532 821540 940762 617637 474712 466286 748723 804261 858403 706309 755822 1091005
3115 1091005 1289956 1365812 1196652 1131800 1003575 1258502 1174646 1141361 877548 1001618
3105 1001618 854734 772083 503850 668193 625153 844291 819334 956044 874825 789586
3095 789586 617476 698946 865910 865797 1006899 773645 971926 820142 1047912 871667
3085 871667 946379 670893 777725 938544 986204 726973 768164 822145 1004233 907378 817187
3074 817187 683720 690361 979527 1010263 1111301 1003477 920315 1063173 1212300 1053688
3064 1053688 1191783 1074494 994902 823470 870479 853871 900163 811760 871320 1022317 1057792
3053 1057792 874539 810101 787569 1109455 1354577 1218968 1205161 1102576 1236431 1122141
3043 1122141 1011947 882224 968472 819592 909722 1092746 1353599 1286711 1351849 1199091
3033 1199091 1184529 1326066 1421723 1468118 1364540 1365328 1558324 1536016 1290815 1231336 1277417
3022 1277417 1481909 1676756 1804813 1719089 1637215 1831647 2085277 1986453 1763661 1783218
3012 1783218 1890710 2146377 2207199 2077689 1950723 2065558 2079426 2238828 2340292 2607798
3002 2607798 2442821 2448917 2559729 2437596 2475806 2443645 2675802 2823144 3040115 3129226
2992 3129226 3080993 3017370 3122776 3100086 3273249 3440250 3471667 3609852 3786566 3747487
2982 3747487 3774492 3598425 3636117 3755872 3733697 3883746 3709793 3512410 3212843 3413176
2972 3413176 3492554 3388886 3328728 3549233 3687206 3889750 3819232 3672968 3575201 3506284
2962 3506284 3627954 3775753 3863350 3609473 3862732 4005392 4328366 4157062 4208203 4223609
2952 4223609 4467430 4620914 4845252 4879751 5224826 5348728 5370798 5501063 5169060 5054404
2942 5054404 4792241 4820821 4964515 5061544 5004711 5146640 5151589 5353674 5548068 5885833
2932 5885833 6280210 6036185 6111233 6005603 6075321 5855086 5654242 5561205 5601090 5515672
2922 5515672 5521786 5187908 5102081 4740529 4620700 4439838 4202892 4258854 4301781 4255117 4264542
2911 4264542 4353702 4319115 4559009 4724266 5390065 5526061 5959424 5801600 6045162 6075554
2901 6075554 6263329 6017816 5788328 5321902 4948805 4739308 4514565 4287397 4019755 3783248
2891 3783248 3775730 3923589 3831347 3911519 4029685 4173829 4170057 4284469 4409848 4530795 4358177
2880 4358177 4318371 4268587 4344284 4166168 3786546 3646632 3481392 3124812 3003959 2706018
2870 2706018 2750360 2510892 2729921 2829610 2773920 2849144 2993616 3323295 3643650 3539531
2860 3539531 3342602 3237877 3152859 3260096 2906746 3021980 2747186 2726602 2768882 2759151
2850 2759151 2562588 2452472 2445323 2772330 2730435 3067568 2923970 3271435 3308353 3361986
2840 3361986 3426068 3374852 3559674 3455222 3578009 3514969 3431654 3362143 3708097 3669859 3992901
2829 3992901 4082481 4697416 5083666 5734082 6460689 7320936 8348808 9920531 11760805
2820 11760805 14125037 16201475 18003751 18726703 18649615 17675918 16122258 14609205 13197494
2811 13197494 12062417 11037539 10479349 10109503 10161763 10049943 10670165 11595348 13125143
2802 13125143 14799979 16865869 18600499 19378158 19387247 18475049 16975804 15008644 13148162
2793 13148162 12030908 10981913 9847658 8916069 8202273 7787104 7636155 7386264 7279992
2784 7279992 7470513 7873381 8379772 8955290 9684393 10229585 10619934 10854412 10789379 10791390
2774 10791390 10524699 10579761 10887744 11047591 11529123 12343896 13891973 15382122 17899363
2765 17899363 20942077 24526849 27724074 30062341 31050191 30750704 28971015 26899549
2757 26899549 24296125 22078087 19943940 18019513 16815251 15928070 15210067 15126860 15878714
2748 15878714 17199032 19176246 21252028 23739511 25067252 25695601 24862038 23416138
2740 23416138 21192522 18989787 16933682 15299091 13407070 11986650 10630161 9730553
2732 9730553 9124105 8734867 8486839 8281224 8369065 8655931 9331134 10085213 11091026 11897274
2722 11897274 12716850 12931344 12598982 11956506 11302505 10405907 9674759 9092666 8817147
2713 8817147 8684713 8354894 8390788 8370887 8732300 9329460 9956182 10825934 11911399 12627103
2703 12627103 12988483 12864556 12366668 11686168 11218179 10989616 10841776 10939993 10923930 11102451
2693 11102451 11086606 10735371 10047830 9341059 8747107 8226593 7786689 7364974 7096741 6824599
2683 6824599 6902675 6887172 6955149 6894468 7417786 7943466 8884209 9231640 9691879 9766367
2673 9766367 9549325 8924735 8379151 7884686 7139369 6887636 6523730 6450726 5927608 5718568
2663 5718568 5530594 5777577 5521292 5660364 5465672 5688868 5523261 5727780 5768379 6354392
2653 6354392 6772217 7533407 8197687 8765042 9027943 9186522 9355018 9241765 9218054 9203225
2643 9203225 9846482 10321183 11212163 12343353 14013608 15448239 16524585 17048940 17401499
2634 17401499 17473374 17084889 16484270 16030972 15225439 14139115 13375476 12536675 12012181
2625 12012181 11614705 11670099 12019967 12553215 12960758 13909215 14848698 15520863 15661421 15266429
2615 15266429 14469124 13325356 12431496 11378504 10653756 9558242 8977853 8229348 8139442
2606 8139442 7936349 7783133 7781081 7912231 7978843 8376906 9043534 9774010 10692011 11807615
2596 11807615 13362758 14771517 16214529 16673882 16775665 15999148 15104791 14116084 13461073
2587 13461073 12646398 11649459 10879663 10487889 10449257 10335736 10314959 10553841 11745824 12659412
2577 12659412 13843094 14840467 15782561 16099646 16062885 15463996 14432551 13165422 12334628
2568 12334628 11740259 10881740 9961854 9218518 8993557 8690491 8177663 7747399 7790353 7752965
2558 7752965 7936215 8337082 8905866 9430150 10286518 11213181 12418566 13883364 15663414
2549 15663414 17957578 20396290 22694144 24619498 25873206 26289260 25554272 24260139
2541 24260139 22585062 20596061 18675008 16750635 15130048 13768120 12724636 12041222
2533 12041222 11345619 10666039 10303498 9892028 10008867 9889123 9801771 9926258 10241125 10840871
2523 10840871 11247136 11805870 12696841 13840438 15381953 16783100 18631478 20263038 21843958
2514 21843958 23413741 25187859 26722757 28031377 28843729 29394075 29138380 27882328 26249161
2505 26249161 24108679 22321308 20275267 18613379 17054495 15903620 15109672 14496747
2497 14496747 14308325 14514320 14952708 16042802 17149753 18889361 20780119 22890280 25417742
2488 25417742 27821738 30646360 33543675 35795808 37285216 37251238 36300732 34783672 32757095
2479 32757095 30607360 27880494 25305747 22964811 20870900 19119995 17564453 16381597
2471 16381597 15237445 14568819 14050691 13626490 13416238 13442516 13487481 14235656 14819022 15870029
2461 15870029 16915579 18061709 19142002 20283255 21486989 22660535 23986063 25645271
2453 25645271 27337057 29047489 30930729 32659577 33974856 34163438 33360314 31584106
2445 31584106 29219618 26659453 24240834 21861106 20085288 18465872 17441950 16580204
2437 16580204 15974503 15603245 15806831 16408460 17452086 18876897 20813363 22939646 24874590
2428 24874590 25651454 25935149 25570035 24534913 23463859 21865934 20235869 18695178 17247621
2419 17247621 15836264 14254308 13106134 12385485 11622800 11339091 10642598 10166195 9957565
2410 9957565 9842511 10013852 9799193 9730140 9639946 9843330 9873345 9993582 10214789 10785931
2400 10785931 11020049 11899727 12890936 14133096 15611944 17608313 19528343 20797443 21316848
2391 21316848 20904161 19930108 18381130 16585837 15174305 13849048 12585877 11701704 10808760
2382 10808760 10292978 9635556 9239266 8783422 8221042 7928352 7812810 7666389 7642091 7281239
2372 7281239 7394171 7537716 7446764 7521985 7325585 7395767 7396466 7466500 7515501 7470019 7293297
2361 7293297 7027158 7052115 7038418 6956520 6818385 6688437 6462367 6826522 6685253 6893649
2351 6893649 6970743 7175530 7433125 7722692 7548165 7565117 7412735 7603359 7367470 7164008
2341 7164008 6939972 6925367 6988934 6750740 6868443 6820056 6998151 6823930 7083781 6950138
2331 6950138 7229831 7281608 7516772 7319340 7221653 7152578 7314186 7418550 7396123 7635755
2321 7635755 7656535 7990862 8140264 7996216 8002649 8219970 8042397 8321584 7978827 8004728
2311 8004728 7771837 7746926 7620685 7489258 7394299 7273131 7333303 7487229 7518718 7417098
2301 7417098 7537371 7324071 7615210 7303253 7350195 7332395 7368598 7510360 7525747 7604586
2291 7604586 7550935 7562152 7793673 7717599 7796200 7685379 7695034 7779776 7610366 7704495 7388916
2280 7388916 7539760 7441015 7531054 7554608 7504339 7376947 7560660 7634321 7672122 7806036 7606664
2269 7606664 7788747 7780481 7988730 7921695 7994722 7709840 7547395 7562013 7874664 7773630
2259 7773630 7932810 7715384 7610310 7759400 7849064 7967323 7748638 7888387 7851863 7872184
2249 7872184 7854961 7697205 7628712 7745690 7700678 7865774 7764540 7794883 7911188 7860101
2239 7860101 8099706 8077363 8227997 8209158 8148168 8191320 8083593 8076701 8242862 8026473 7989653
2228 7989653 7831544 7906933 8078329 8140734 7993722 8106189 8289184 8272711 8238654 8487055
2218 8487055 8440907 8425039 8488069 8567301 8621757 8481243 8471609 8579520 8715827 8577670 8534258
2207 8534258 8638677 8876368 8793682 8917461 8941896 8998422 9099630 9232939 9339748 9358387
2197 9358387 9197355 9284473 9342813 9571130 9083098 9087615 9045205 9068609 9196745 9129309 9091852
2186 9091852 9038183 9301455 9509478 9748645 10057196 10308506 10446110 10469219 10234465 9988778
2176 9988778 9825038 9734878 9464784 9292996 9253207 9087859 8921605 8724867 8604715 8499841
2166 8499841 8430920 8259441 8332781 8294846 8580830 8599518 8758768 8583483 8644694 8717015 9096720
2155 9096720 9141838 9058678 8977584 9090694 9280230 9192377 9311490 9261903 9504098 9560168 9798690
2144 9798690 9852836 9843426 9677131 9513752 9523390 9701665 9367772 9486692 9443436 9644863 9655983
2133 9655983 9580874 9601549 9521677 9553841 9428551 9562033 9669907 9831011 9764859 9814356 9592725
2122 9592725 9632964 9592193 9374748 9331700 9257770 9335038 9394548 9334715 9070277 9006036 9121428
2111 9121428 9090602 8879597 8859073 8596316 8600248 8520807 8622901 8391854 8563818 8568035 8658385
2100 8658385 8589655 8571055 8445614 8515814 8677939 8659489 8591379 8532618 8640094 8557848 8570227
2089 8570227 8430652 8327050 8260274 8249897 8416786 8706065 8824326 9062811 8973136 9238220
2079 9238220 9132934 9080018 9128805 9113118 9176042 8989283 8994073 8898115 8903963 8812101 8743627
2068 8743627 8850846 9019900 8870427 9012471 9159656 9278373 9295002 9489287 9556776 9362209
2058 9362209 9566130 9748137 9842176 9915152 9891455 9716047 9713644 9600837 9662020 9467862 9539084
2047 9539084 9415796 9535000 9637879 9547703 9285547 9479934 9798705 9936511 10262040 10390256
2037 10390256 10578094 11058234 11285355 11576572 11921277 12125215 12612692 13199931 13839419
2028 13839419 14557228 15603798 16797358 18356376 20235335 22761866 26244983 30341182
2020 30341182 35437045 41580631 48596877 55738290 62211386 67382785 71369219 73581843
2012 73581843 74757319 75207997 75729932 76395396 76295205 75256987 72174881 67615139 61079335
2003 61079335 54691224 48145207 41925325 36453357 31911222 28035376 25054338 22559843
1995 22559843 20582428 19053246 17682623 16788298 16094254 15515271 14752158 14296276 13874194
1986 13874194 13669003 13108461 12883914 12236447 12018454 11641083 11561525 11200677 11123788 11088004
1976 11088004 10920783 11275311 11207851 11545755 11647215 11921360 11855607 11989052 11834011 12007295
1966 12007295 11485105 11156976 10590733 10504369 10057412 9610689 9277875 9023544 8739461 8483880
1956 8483880 8613096 8228822 7985703 7678578 7823758 7615243 7631724 6968737 7266850 7308429
1946 7308429 7499910 7265942 7173194 7292365 7621253 7900520 8009584 8167802 8080488 7961583
1936 7961583 8054895 8269400 7913525 7675691 7480578 7415613 7116998 7021697 6935996 6853579
1926 6853579 6718697 6653032 6482326 6566297 6521309 6297108 6384345 6434933 6526829 6300899 6479661
1915 6479661 6534454 6593773 6416893 6377549 6361014 6243967 6210379 6208407 6179681 5798151 5773602
1904 5773602 5518012 5459280 5406970 5111511 5063486 5154053 5143577 5115761 5208670 5356007 5364338
1893 5364338 5586558 5609333 5452030 5441528 5353248 5349023 5498137 5620466 5420794 5482723 5606392
1882 5606392 5726996 5780388 5997686 5865920 5913320 5826296 5528261 5568165 5271405 5353067
1872 5353067 4991575 4902335 4544735 4496394 4635942 4528892 4473209 4470959 4573142 4645922 4646753
1861 4646753 4719431 4721193 4668951 4528751 4280158 4104567 4083709 3971180 3995502 4209367 4013522
1850 4013522 4039952 4154426 4410125 4321570 4310531 4425716 4290047 4528214 4477516 4554642
1840 4554642 4313693 4266740 4287014 4421111 4481444 4530282 4535067 4420785 4662346 4627380 4525087
1829 4525087 4408181 4489498 4468707 4534245 4375053 4298051 4301761 4420683 4404986 4605461 4768529
1818 4768529 4926075 5050892 5177813 5255490 5194918 5214857 5012580 5112183 5109855 5360381 5428255
1807 5428255 5559063 5672952 6081210 6265328 6731280 7296555 7807976 8424433 9162822 10461226
1797 10461226 11525591 13107277 14744564 16804685 19142656 21349520 22865795 24088182
1789 24088182 25043261 25905914 26347479 26642409 26714760 26571003 26348917 25421602 23987436
1780 23987436 22387248 20513661 18645168 17014718 15715691 14844694 13966592 14101802 13922506
1771 13922506 14832331 15821085 16933222 18516219 19585352 20634501 21255069 21696083 21821693
1762 21821693 22012053 22120148 22389380 22389980 21995978 20996421 19965781 18485764 17051652
1753 17051652 15333227 13864449 12449745 11202440 10103134 9438095 8804941 8318359 7847168
1744 7847168 7544399 7509449 7137306 7122155 6821055 6905907 6888013 7255119 7218612 7274667 7537821
1733 7537821 7805698 8023496 7990081 7869878 7763613 8018923 8035845 7909824 7821433 7773654
1723 7773654 7511274 7398934 7027197 6621489 6363016 6173512 5646942 5504023 5305026 5148268
1713 5148268 5070764 4780075 4866032 4613627 4804054 4713525 4643756 4498468 4616085 4717542
1703 4717542 4709361 4383017 4250690 4517438 4400909 4594091 4236189 4185054 3981224 4040147
1693 4040147 4117647 4203655 4214093 3992511 4115096 4176029 4061428 3988456 3984323 4245259 4260221
1682 4260221 4206015 4296368 4197556 4307147 4178910 4305312 4128751 4306972 4248395 4642737
1672 4642737 4562833 4665371 4425235 4482858 4619642 4611023 5004523 4688950 4800165 4546952
1662 4546952 4724510 4790886 4811093 4707589 4719897 4615468 4709117 4736477 4811203 4849930 4859479
1651 4859479 4955712 5117139 5209419 5232021 5266363 5340511 5302853 5369923 5606131 5438855 5589337
1640 5589337 5473025 5843513 5960219 5988238 6225351 6138584 6325261 6438310 6644289 6791135
1630 6791135 7087531 7371794 7615554 7790922 8090724 8396134 8792563 9089022 9470150 9915103
1620 9915103 10174581 10762046 11096882 11603637 11935973 12409401 12720543 13235454 13474138 14048424
1610 14048424 14371482 14829756 15144887 15579969 16355323 17010765 18100960 19070788 20277522
1601 20277522 21268420 22917112 24309933 26014629 27500308 29439645 31096525 33036048
1593 33036048 34821580 36404904 38000553 39290610 40535625 41495643 42548165 43615131
1585 43615131 44905061 46108296 47590364 48858755 50478663 51794787 53874909 55815943
1577 55815943 57831096 59475276 60966492 62077020 62719712 63139728 63022417 62822473 62252935
1568 62252935 61780441 60986310 60063783 58237195 56657446 54716389 52977539 51233855 49531228
1559 49531228 48160691 46522305 45127456 43800736 42316061 40780351 39330443 37778691
1551 37778691 36648985 35628709 34817030 33929504 33509527 33189649 33023879 33043820 33203632
1542 33203632 33384898 33974016 34366303 34764706 35250578 35674671 36718398 37549907 38583440
1533 38583440 39642678 41131655 42484771 43764085 45228807 46687711 48104246 49433753
1525 49433753 50835461 52034172 52745640 53073326 53268310 53258452 53344633 53166497 53027621 52747494
1515 52747494 52559043 52540971 52370404 51857754 51310776 50671404 50126770 49517632 48810749 48118580
1505 48118580 47306039 46667067 45758148 44804693 43790856 42672896 41648627 40357870 39048105
1496 39048105 37854976 36659829 35671070 35140954 34691088 34538040 34459896 34445031 34294820
1487 34294820 33848237 33706098 33369747 33405317 33084684 33096648 33426885 34039290 34554933 35062600
1477 35062600 35478004 36089944 36453391 37143941 37572911 37983909 38369224 38565099 38448155
1468 38448155 38291290 38000662 37827413 37504059 37074690 36550018 36017148 35588744 34307611
1459 34307611 33299389 31981154 31182080 30318815 29332717 28535839 27728096 27160387 26333149
1450 26333149 25566360 25005091 24322768 23591791 23252182 22882429 22546466 22086087 21823970
1441 21823970 21909165 21970388 22139326 22600677 23440885 24208202 24761033 25502597 26195846 26647488
1431 26647488 27523000 28248451 29745350 31190184 32875138 34790782 36741003 38801135
1423 38801135 40683647 42191340 43524373 44697950 45625786 46527602 46821935 46987288 47159691
1414 47159691 47187878 47034052 46890999 46723714 46675884 46678429 46650098 46575856 46573681 46650148 46851084
1403 46851084 46838364 46535457 46492118 45757849 45300455 44419205 43876876 43039522 42181726 41174114
1393 41174114 40155015 39141761 38251609 37287789 36422284 35355577 34427540 34092383 33551543
1384 33551543 33267081 33264927 33749649 34480348 35191292 36049592 37015025 37606173 38506069 39265596
1374 39265596 40317495 41344635 42675658 44319464 46109233 48254021 50653208 53496242
1366 53496242 56035571 57806969 59212391 60037292 59727162 58788037 57422385 56134808 55016166
1357 55016166 54225379 54005359 53859731 53988617 53844277 53701726 53247376 52700687 52191429
1348 52191429 51463180 50717843 50131165 49474992 49315410 49528652 49931737 50427493 50656405
1339 50656405 50809823 50494984 49886292 49276907 48645576 47903226 47299771 46689480 46139986
1330 46139986 45628446 45584201 45419078 45649465 45867097 46232001 46593806 46681029 46679750 46459763
1320 46459763 46063983 45341350 44597025 43081746 41750699 39889647 38049453 35708190 33732254
1311 33732254 31789315 29781128 27801587 26271731 24492838 23298923 21821735 20885618
1303 20885618 19969675 19038639 18344665 17687938 17564267 17351815 17307068 17407014 17689214 17976619
1293 17976619 18446529 18594364 19054907 19468087 20163266 21046720 22054525 22940419 23631315
1284 23631315 24115284 24686312 25331040 26022229 26616923 27276131 28045964 28891756 30146497
1275 30146497 31403637 32864812 34161970 35485609 36492982 37018566 37456467 37647442 37636747
1266 37636747 37300771 36899500 35932435 35044440 33519216 31900400 29882897 28012197 25968498
1257 25968498 24550099 23369303 22161623 21164143 20269977 19758179 19043588 18404843 17919148
1248 17919148 17561986 17036474 16881789 16367406 16073548 16056819 16214741 16451099 16593095 16934993
1238 16934993 17309119 17815238 18253976 18554715 18427742 18480818 18101549 17951491 17513866 17724122
1228 17724122 17674799 17873724 18001577 18152465 18024600 18468928 19007997 19538039 20329520 21307404
1218 21307404 22458841 23582573 24582672 25122119 25967342 26549733 27391020 27878031 28704909
1209 28704909 28936072 29380733 29074280 28734338 27860493 27083608 26147554 25112035 24118054
1200 24118054 23005714 22371613 21757068 21295311 21102688 21003316 21226894 21894426 22101239
1191 22101239 22404557 22600768 22725787 22672404 22554867 22641787 22827274 23322673 23837218 24607315
1181 24607315 25363988 25808649 26052784 26380069 26342881 26224831 25757592 25544672 25272924 25014409
1171 25014409 24848424 24505685 24572971 24361240 24257786 23669450 23228685 22404420 21930555 21455331
1161 21455331 21161771 20929291 21025045 21219134 21811114 22552928 23224091 24074661 24861767 25541689
1151 25541689 25826802 26419875 26293537 26297509 26039005 26094557 25656749 25699974 25443432 25515405
1141 25515405 25438742 25199129 24552505 24131811 23581654 23045585 22808407 22636573 22842257 22722728
1131 22722728 23177302 23436871 24204352 24613351 25672250 26604092 27781772 29320898 31334465
1122 31334465 33487358 35852075 39075660 42460875 46107400 49294719 51878612 53746814
1114 53746814 55005630 56062993 56911902 57822189 58702378 59056159 58548622 57471870 56097125
1105 56097125 54392381 52453580 50337300 48463038 46977792 45527474 44716930 43968044
1097 43968044 43105520 42289477 41179718 40333807 39389791 38840012 38400766 38157739 37956676
1088 37956676 38465483 39289919 40904248 42975579 45931199 49827935 54467469 60124849
1080 60124849 66624752 74717753 84680844 97696299 114674313 137267860 165542304 198377448
1072 198377448 230144259 255110984 267607517 266589417 253851775 234209867 211668943
1065 211668943 189712001 169272240 150992746 135039587 121328344 109945387 100363060
1058 100363060 92666928 86209500 81314360 77410386 74763102 72920561 71728688 70782403
1050 70782403 70455843 70638893 71014109 71395745 71990466 72819210 74088586 76677528 80475581
1041 80475581 86475240 95088306 105800487 117226434 127113251 132955447 133526159 129001265
1033 129001265 121045784 111743334 102526734 94216127 87067156 81300303 76727539 73574082
1025 73574082 71379448 70923580 71315266 73337984 76650209 81726617 89035897 99046635
1017 99046635 111800389 127484627 145424712 164045505 181996098 196624706 207162057
1010 207162057 212699778 213617858 210503076 205183941 199246360 194597494 192654989 193978986
1002 193978986 197698064 201845302 204344483 203695681 199701715 192904095 185613490 179172413
994 179172413 175480317 174534978 177416200 184138741 195496513 210624986 229707897 251424773
986 251424773 275290827 299818574 323305035 343797457 358267206 364176180 359038924
979 359038924 342817426 317323085 286228147 253559164 222206385 193708865 168992242
972 168992242 147595273 130168428 116058642 104858231 96011044 89713023 85454738 82678681
964 82678681 80781364 79635183 78274777 76673649 74522135 72213157 69981171 67914831
956 67914831 65914685 64306273 62837648 61516813 60004154 58799066 57164016 55660482
948 55660482 54261390 53112780 51985754 50977151 50101073 49180069 48366119 47492754 47064459
939 47064459 46637355 46390106 45954200 45723264 44958146 44488363 43855256 43157168 42561261 42157010
929 42157010 42109602 42429545 42772037 43209742 43610297 43907710 44011215 43624977 43123312 42473857
919 42473857 41691015 40415378 38974405 37428906 36544287 35545260 35004470 34564127 34868427
910 34868427 35042495 35085078 34442587 33178637 31897810 30411246 29011541 27393057 26130123
901 26130123 25125339 24313022 23618955 22957740 22319988 22142145 21637729 21327518 20828809
892 20828809 20596277 20726507 20940811 21040595 21620982 22548021 23779767 25171926 27089478
883 27089478 29172602 31455124 34225001 37229675 40643592 45005924 50604478 58129415
875 58129415 67032194 76771258 86293834 93904340 98638558 100319914 99884762 98829740
867 98829740 98796981 101123636 105657619 111725955 118362095 122227651 122560156 118451824 110602139
858 110602139 100166129 89061945 78320134 68513219 59755686 52466819 46115494 41037918
850 41037918 37030603 33973431 31742833 29819755 28517240 27630601 27064139 26584593 26527189
841 26527189 26443499 26704966 26620390 26832264 26771065 27169576 27345214 27685022 28205765 28823110
831 28823110 30041864 31740668 34058160 36886782 40551257 45425859 51468372 58725112
823 58725112 67596103 78675792 92852506 110653372 131564170 154893768 177991711
816 177991711 197868982 211019632 215336418 210860876 199163714 183178593 165347317
809 165347317 147883448 132311766 119272107 109490938 103017109 99759171 99596560 101842049
801 101842049 106264989 110716140 114034919 114599627 111960471 106328439 98540019 89186279
793 89186279 79967389 71099890 62959331 55746499 49431523 44109581 39299426 35447869
785 35447869 32183722 29406907 26962133 25017601 23363192 22056627 20837729 20091430
777 20091430 19303512 18931153 18414658 17982168 17325663 16815829 16521972 16026881 15479570 15026519
767 15026519 14689837 14371921 14281567 13800862 13609941 13693281 14165459 14578301 15146177 15853283
757 15853283 16898152 18070373 19400670 20439605 21714548 22472023 23265315 23482497 23195791
748 23195791 22216599 20789627 19206969 17626735 16015237 14615991 13069828 12166427 11278136
739 11278136 10592339 10080730 9560640 9082737 8782562 8480314 8158514 7976970 7884939 7656362
729 7656362 7354824 7169796 6757591 6524557 6405009 6335160 6118061 6343010 5987771 6004050
719 6004050 5845268 5913673 5736805 5882048 5663845 5493474 5417005 5218260 5091808 4918917
709 4918917 4762859 4606814 4502772 4471671 4527676 4542130 4637612 4622682 4837141 4982495 5128057
698 5128057 5120230 5083813 5011744 5010864 5044303 4776012 4522540 4150394 4023547 3831401 3706130
687 3706130 3385395 3318687 3185492 3090260 2847195 2718368 2737926 2733336 2658006 2702512 2972541
676 2972541 2894399 2936285 2823632 2680673 2686609 2566849 2672282 2252806 2190217 2096285 2095256
665 2095256 1972037 1727240 1571782 1866159 1991514 2072353 1900408 2009262 2001660 2103943
655 2103943 2145637 2052807 1925555 1836239 1796276 1814883 1903482 1590502 1780898 1622270 1835979
644 1835979 1617811 2012806 1726923 1911573 1839057 1990287 1770961 1670207 1403860 1612862
634 1612862 1621867 1544674 1553858 1558458 1614843 1360851 1470489 1340582 1374011 1455187 1497527 1335450
622 1335450 1296251 1105410 1271562 1188734 1093172 1164308 1299897 1315089 1155539 1063094 1028581
611 1028581 1199876 1128869 961034 869814 879044 890721 847701 766781 703821 821734 784643
600 784643 925560 883283 907283 1141965 1187375 1218128 1115781 952068 1075575 1099887 1261598
589 1261598 1141227 976389 956554 1078691 1080467 954637 1138863 1157326 1274327 1265721 1377088
578 1377088 1291471 1304886 1145123 1238754 858316 988087 1040021 885612 1002056 815327
568 815327 735338 730741 788060 727425 779359 726310 1034976 871544 962634 729696 653439
557 653439 551472 677468 652231 611148 429797 726107 402190 566988 515076 554161 700965
546 700965 826900 847922 530690 712137 579268 714427 720685 632526 533649 875156 1082017
535 1082017 1283425 1236767 1240655 1292092 1472485 1539261 1539578 1397915 1441185 1185611 1139859
524 1139859 910834 1121637 941539 838714 943418 839541 911276 1017871 912366 777223
514 777223 761825 813264 1015569 764521 678272 603062 587482 650759 627516 522735 518148
503 518148 415824 856157 750841 706827 302893 227310 322100 110267 65111 180511 120900
492 120900 245436 334657 269189 249875 269916 272449 271652 458099 490323 426468 441531 514603
480 514603 291865 376078 217540 255830 109700 233653 223140 312205 393143 370148 176676
469 176676 387658 323310 389100 404310 284136 271172 325685 159449 184362 144670 105477
458 105477 284852 476154 493540 160666 116734 -92234 112486 -140701 162277 68981
448 68981 274548 64066 -74775 -174304 -204203 -18525 133221 255324 225730 254275 122518
437 122518 347366 280153 171233 -19893 163011 164965 147813 -76560 -107943 -74059 184264
426 184264 79538 111475 282351 243625 160120 186677 116684 8333 165700 28008 154320
415 154320 30643 136910 -8468 96020 114597 2317 209806 273168 426249 538510
405 538510 708472 552508 542750 570356 356241 92646 226377 165495 229171 168409 233201
394 233201 104311 263968 279854 245871 293368 -23582 219674 108379 124709 -363580 -386916
383 -386916 -512914 -102795 -128357 -50317 -70189 47070 22168 57608 214171 190105 178814
372 178814 176583 402352 166852 161695 -12914 171378 -41095 87789 -377855 -86596 -292472
361 -292472 -84475 -192472 -142435 -197266 -81367 38291 -101303 139498 10782 218104
351 218104 88332 58840 -159026 94024 26809 49917 -97684 140216 97277 12986 -145880
340 -145880 -176639 -157518 -221888 -280383 -171727 -78306 -47458 105043 209737 12579 -94538
329 -94538 -54106 -62614 117879 111155 72457 84311 -86058 -273500 -242004 -140404 -317394
318 -317394 -143149 56447 241007 70533 176045 173675 234475 284554 147550 118721 29981
307 29981 29412 -164240 -324236 -380531 -448863 -358981 -205962 -302713 90587 -52487 92202
296 92202 20034 67021 -115105 108785 267102 -28398 -127300 -341258 -72240 -220141 -143639
285 -143639 -308042 -95334 33045 88227 62130 -10573 -74355 -125509 -44659 -117708 -96775
274 -96775 -3586 68743 -100077 -173625 -165349 41060 -22804 42849 -185136 -38715 -176771
263 -176771 -125609 -262853 -111954 -175838 -53748 85318 -37967 127454 93777 238669
253 238669 215194 196886 -58855 78923 112593 -3192 91871 -16010 -133628 -149715 -263101
242 -263101 -235593 53227 -48980 171595 44940 221619 147721 230750 209034 162636 -8823
231 -8823 -20332 -75001 113687 140606 -48147 -117315 -241832 -43813 22774 360253 143584
220 143584 313798 67696 413433 233953 409804 53148 291105 279995 287138 193222 137992
209 137992 85791 104 88842 120958 171338 109362 421552 353373 513721 268079 502796
198 502796 288199 509734 325013 534559 430358 595965 344782 188843 216864 157025
188 157025 369171 214652 432514 410267 753945 582424 692355 758952 1017956 834631
178 834631 994692 972277 1077287 804427 877427 830417 680690 685352 730801 734196 720353
167 720353 862413 924156 1183842 1297663 1626675 1823487 2090308 2365310 2516172 2774629
157 2774629 2802279 3079193 3441753 3864087 4353157 4853981 5201014 5523403 6038826 6492520
147 6492520 7394991 8654390 10365376 12461137 15569965 19772591 26121875 36332073
139 36332073 50391880 66164099 78303628 80257349 75810918 65721069 54270573 44366309
131 44366309 36187036 29155980 22931207 18122893 14150034 11358310 9748439 8731448
123 8731448 7614040 7003379 6052118 5553888 5015864 4793358 4327140 4183595 4018957 3907207
113 3907207 3620739 3364252 3070438 2763966 2604127 2341138 2131046 1777172 1623801 1372128
103 1372128 1098825 928046 1006800 1077153 1086079 1165049 1291144 1137886 1171634 1247079 1256258
92 1256258 1275838 1064933 1045464 898433 903641 645338 517015 324297 262518 234375 340842
81 340842 348585 334883 358401 329797 195491 238975 216056 234684 329051 211953 232741 173584
69 173584 185568 40386 112779 -160610 -137204 -200271 -200381 -304570 -265935 -289212 -301023 -268532
57 -268532 -455397 -338124 -268702 -301550 -362904 -410076 -390772 -373703 -355466 -333197 -485504
46 -485504 -515010 -350082 -248084 -401541 -379284 -421840 -464086 -510324 -666409 -629013 -743226
35 -743226 -636370 -662365 -541902 -697708 -674292 -675695 -691487 -576925 -558000 -605359 -698772
24 -698772 -743790 -832839 -706297 -617382 -604899 -693130 -808346 -755488 -706050 -773001 -824981 -871584
12 -871584 -822536 -976523 -966561 -952398 -954680 -1028169 -1084629 -1001474 -858341 -755500 -707048 -754398
0 -754398
$$ Imaginary data points
##PAGE= N=2
##DATA TABLE= (X++(I..I)), XYDATA
16383 -9628595 -9604559 -9502126 -9390549 -9415948 -9278846 -9169692 -9192223 -9045448 -8816343 -8501942
16373 -8501942 -8366618 -8347238 -8174766 -7995684 -7842978 -7939185 -7881544 -7838444 -7860510 -7666861
16363 -7666861 -7627047 -7606012 -7602482 -7505685 -7355161 -7188393 -7206724 -7001753 -7058514 -6801567 -6780343
16352 -6780343 -6585284 -6445791 -6529267 -6501467 -6279509 -6316902 -6161886 -6088346 -6003697 -6040923
16342 -6040923 -5803536 -5696367 -5705741 -5740970 -5713034 -5566318 -5447746 -5431441 -5445823 -5341557
16332 -5341557 -5335268 -5036786 -4926377 -4783519 -4799103 -4618129 -4576283 -4575001 -4502846 -4453265 -4398791
16321 -4398791 -4354851 -4305334 -4250648 -4163711 -4263029 -4129453 -4099252 -3972606 -3812377 -3679801
16311 -3679801 -3711318 -3569694 -3383078 -3241481 -3199954 -3192475 -3184970 -3237714 -3076704 -3083126 -3020082
16300 -3020082 -3152098 -2905139 -2890842 -2648508 -2660009 -2671212 -2695698 -2521289 -2558124 -2213282
16290 -2213282 -2276659 -2413128 -2241003 -2291152 -2118449 -2128623 -2047690 -2122751 -1822257 -1830630 -1652996
16279 -1652996 -1696344 -1503525 -1555423 -1289076 -1324989 -1359646 -1397308 -1534658 -1210535 -1223233
16269 -1223233 -1190581 -1269066 -1146220 -1094436 -812163 -1034886 -756256 -915346 -722668 -652352
16259 -652352 -562664 -713187 -761607 -642974 -674332 -499384 -413821 -332906 -295162 -448292 -532257
16248 -532257 -183248 -383110 -61686 -221990 -100451 -81413 136941 -24508 -45144 -120586
16238 -120586 66326 71481 232362 117753 294735 421381 515209 678690 564331 488871
16228 488871 373534 542162 582811 514851 459319 650893 536825 730737 528648 647326
16218 647326 752707 949094 956334 1034920 1000044 1186712 953287 949385 857623 908640 1043836
16207 1043836 813139 999393 1179817 1151281 1227878 1199188 1307099 1379852 1393437 1527035
16197 1527035 1303870 1419986 1302528 1252882 1341870 1253927 1348043 1430974 1463436 1566083
16187 1566083 1524907 1454619 1454874 1442039 1723335 1710936 1923520 1724557 1563282 1840857 1579881
16176 1579881 1687655 1636421 1573698 1606998 1835875 2018541 1843364 1844759 1857839 1742932
16166 1742932 2017402 2023871 1979772 2006624 2027366 2105695 1928124 1821320 1964676 2069767
16156 2069767 2203740 2315911 2292648 2482173 2242254 2104538 2014652 2066525 2020944 1923131
16146 1923131 2167144 2106929 2137548 2114749 2113519 2145676 2155630 2216543 2592703 2559580 2528513
16135 2528513 2490299 2506128 2395771 2328700 2176409 2201973 2266909 2323150 2390379 2529267 2401515
16124 2401515 2257200 2445289 2431985 2671552 2576447 2490413 2498668 2523896 2528201 2333401 2232010
16113 2232010 2280294 2167936 2391535 2546551 2587700 2754567 2730889 2640863 2618634 2622647 2570790
16102 2570790 2626428 2715485 2525412 2466167 2504604 2367050 2402275 2506762 2523947 2736118
16092 2736118 2559869 2711970 2514302 2542626 2607013 2571292 2518832 2434965 2585524 2679584
16082 2679584 2573600 2357627 2248402 2337243 2543887 2503514 2606958 2630188 2872239 2855756
16072 2855756 2798656 2607830 2475790 2360997 2638138 2774190 2918091 2868179 2726943 2640946
16062 2640946 2653535 2713401 2483977 2645786 2681697 2700641 2787247 2699795 2545228 2549672 2654395
16051 2654395 2769122 2860928 2752136 2926775 2813135 2952447 2753486 2739094 2715352 2642496
16041 2642496 2736731 2799845 2761646 2705265 2792760 2738577 2780949 2626640 2733793 2662946 2886052
16030 2886052 2788774 2810421 2908589 2720974 2504987 2872385 2823901 2797272 2865714 2803533 2674395
16019 2674395 2602688 2686342 2602023 2524232 2245325 2650902 2730799 2852729 2643704 2709801
16009 2709801 2498412 2574374 2565899 2470336 2549963 2548463 2896421 2716684 2715417 2479446 2604942
15998 2604942 2490420 2707346 2604622 2772743 2694213 2732625 2566732 2657377 2534194 2657407
15988 2657407 2880036 2686927 2496938 2528088 2579565 2565291 2646962 2578527 2884391 2737897
15978 2737897 2825933 2699374 2925596 2780139 2864504 2766087 2742919 2784633 2833639 2971280
15968 2971280 2809261 2845929 2736850 2790799 2684228 2772327 2634875 2683201 2737571 2769007
15958 2769007 2666735 2680376 2637890 2742890 2756138 2694673 2875301 2804225 2831175 2782593 2908104
15947 2908104 2603101 2756365 2475109 2608677 2628913 2648511 2541937 2741256 2723978 2494371
15937 2494371 2647100 2689713 2675690 2832831 2930779 2790503 2641352 2669424 2756227 2666863
15927 2666863 2688907 2585371 2835704 2910111 2925202 2878686 2904214 2688813 2746284 2845493 2621294
15916 2621294 2603515 2636443 2805463 2774785 2493859 2345792 2464996 2614171 2590135 2541711
15906 2541711 2666555 2551738 2643487 2721741 2621881 2580531 2708065 2801441 2837698 2905452 2731930
15895 2731930 2663175 2758355 2783156 2814754 2795799 2739556 2856603 2669898 2601231 2441790 2702889
15884 2702889 2698986 2927448 2786200 2928324 2600341 2872964 2799452 2735678 2727149 2671058 2720449
15873 2720449 2647992 2730627 2612553 2655268 2662380 2653172 2494510 2645064 2428219 2826896 2656561
15862 2656561 2770125 2747188 2881220 2870928 2998756 2802713 2848996 2929923 3124521 2878384
15852 2878384 2664420 2788839 2592767 2676947 2755956 2870191 2678175 2765664 2848493 2822926
15842 2822926 2759302 2747408 2536497 2836368 2829168 2835170 2943572 2829894 3056202 2838430
15832 2838430 2701088 2579913 2834937 2704010 2826070 2750631 2844470 2654809 2777298 2615442
15822 2615442 2645729 2760565 2583885 2880127 2863369 2765301 2731791 2793658 2847290 2873234 2793721
15811 2793721 3038980 2933450 3000855 2899357 2751984 2575433 2567372 2587825 2629846 2555114
15801 2555114 2810723 2784931 2987723 2617301 2539614 2668205 2675697 2906580 2883598 2824498
15791 2824498 3005397 2928118 3092227 2900200 2742842 2618097 2679351 2853669 2880073 2815069
15781 2815069 2759390 2665288 2757935 2773933 2594400 2594938 2720815 2895151 2806750 2764701 2752381
15770 2752381 2859336 2883698 2927294 3011638 3095425 3043569 3217749 3158135 2792788 2613581
15760 2613581 2777778 2982220 2762596 2777222 2794076 3000964 2886260 2662960 2682192 2914132
15750 2914132 2792863 2884917 2963051 3057489 3051033 2800116 3010850 2743597 2810504 2800671 2935639
15739 2935639 2995444 2950415 2592976 2661189 2566930 2825695 2645748 2900207 2899475 3065861 3104888
15728 3104888 2985172 2856646 2894242 2716836 2740936 2881803 2828921 2891098 2810370 2886770
15718 2886770 2781794 2656406 2491732 2564839 2653740 2607964 2683411 2796894 2822094 2847777
15708 2847777 2629484 2594571 2686109 2757706 3010331 2882450 2826836 2862482 2736401 2761569
15698 2761569 2464462 2573676 2719506 2714578 2713491 2675748 2814550 2977891 2749058 3015042
15688 3015042 2664107 2714267 2861121 2908838 2979273 2841117 2646049 2717931 2598286 2668401
15678 2668401 2717206 2780155 2770783 2598659 2893501 2522581 2575201 2721920 2818670 3121964
15668 3121964 3130190 3111120 2975841 3022439 2898105 2720198 2548187 2588610 2567494 2628057 2684263
15657 2684263 2729496 2635350 2615941 2688344 2718530 3073592 3111667 3122334 3173881 2996772 2829130
15646 2829130 2714417 2808243 2908077 2569019 2723535 2956296 3136916 2844139 2713665 2620595
15636 2620595 2622251 2619406 2953530 2897048 2798328 2760783 2874700 2931416 2640788 2561246 2716843
15625 2716843 2897735 3122111 2880220 3022658 3120253 2876597 3070245 2973078 2814474 2821069
15615 2821069 2731404 2815104 2785184 2741454 2584632 2620041 2788801 2751662 2879113 2964863 3121527
15604 3121527 3013649 2879724 2945484 3077744 2867373 2936592 2929803 2846976 2718936 2652891
15594 2652891 2630976 2570293 2652132 2880246 2981338 3079316 2944982 3029522 2923683 3018559
15584 3018559 2669848 2599933 2752392 2927768 2895122 2952087 2664016 2666462 2696271 2801977
15574 2801977 2946008 2898829 2681732 2942053 2839235 2846499 2662982 2909759 2800021 2712796
15564 2712796 2782121 2724055 2827536 2803608 3034002 2989976 3131155 3011899 3087913 3076818
15554 3076818 3074949 2649350 2627727 2628965 2694354 2450828 2461876 2620212 2894813 2985181 2948552
15543 2948552 2980024 3089379 3028058 2908486 2801159 2938926 2903423 2901997 2920090 2716701
15533 2716701 2367723 2455704 2779624 2905433 2703425 2775159 3134099 3199006 3090090 2928913
15523 2928913 2828128 2859200 2668153 2874051 2817183 2827758 2729280 2912053 2923185 2895832
15513 2895832 2678666 2844901 3036998 3269587 3099620 2975867 2933335 2814121 2701396 2754083
15503 2754083 2812698 2763388 2665582 2914227 2933951 2904678 2869446 2821187 3028124 3125281 3065980
15492 3065980 3076868 2986545 2755049 2605226 2634160 2866049 2551239 2605979 2617416 3021189
15482 3021189 3070706 2997814 2998583 3075962 2846203 3078647 3097614 3197847 2655897 2439400 2591929
15471 2591929 2615451 2550414 2627237 2669922 3032745 2915449 3013941 3052084 2967448 2850641 2916106
15460 2916106 3076294 2951805 2939115 3084135 3008010 2921535 2612634 2431680 2408112 2573138
15450 2573138 2771314 2854487 2909808 2993466 2834288 2863179 2986359 2745965 2835537 2711877
15440 2711877 2965147 2773383 2752844 2726930 2889843 2906057 2776221 2857795 3043931 3097853
15430 3097853 3060697 2990264 2972749 2869232 2691536 2858419 2603917 2774992 2741306 3069792
15420 3069792 3065626 2874037 2930188 3016180 3117627 2990793 2965406 2844016 3028330 2875787
15410 2875787 2925372 2522012 2436627 2432796 2789855 3089497 2886756 2891816 3097379 3034134 3002650
15399 3002650 2764215 2760158 2804321 2900714 2700622 2816612 2802174 2715265 2726918 2863945 3018062
15388 3018062 2996490 3222847 3226610 3353926 3053405 2980300 2940697 2950701 2970972 2662150 2781323
15377 2781323 2812737 2769906 2699276 2393874 2754702 2802759 2797145 2861826 2773258 2843570 2920272
15366 2920272 3021535 2990791 2709942 2626935 2781731 2856307 2792210 2552502 2827477 2826747 2758605
15355 2758605 2904486 3035466 3074104 2941898 2943223 3140872 2866047 2815323 2665767 2778469
15345 2778469 2968800 2791848 2892206 3030542 2972710 2757166 2845183 2833526 2826274 2663454
15335 2663454 2771729 2813100 3106617 2950128 2954563 2865218 2760908 2813325 2903410 2974120 3012537
15324 3012537 3038614 3156058 3297410 2979498 2854718 2663367 3014508 2895171 2925742 2623870
15314 2623870 2740773 2690007 2716201 2836016 2845774 2838001 2756936 3130866 3138510 3174384 2774630
15303 2774630 3055558 2901054 2851921 2718704 2907541 2951034 2850693 2764249 2900360 2722223
15293 2722223 2885350 2878026 3011943 3024490 2906385 3181623 3215404 3004540 2838964 2828770
15283 2828770 2810682 2929739 2541874 2818900 2839537 3011921 2904526 2779856 2890433 2862062
15273 2862062 2950030 2888673 2906216 2723383 2797233 2825483 2873378 2649392 2634753 2646462 2859114
15262 2859114 2934834 2634136 2747190 2926824 3115040 3103330 3033697 3006581 2957622 2838141
15252 2838141 2935611 3112029 2978721 2670897 2874449 3006884 3020585 2780316 2871787 2833708
15242 2833708 2849511 2873293 2982521 2939114 2728961 2932929 3097824 3071904 2663575 2728760
15232 2728760 2803195 2869686 2954731 2713398 3004693 2978771 2972487 2798799 2928248 2811970
15222 2811970 2728818 2529089 2691496 2729513 2806460 2778098 2939328 3008187 3160305 3068015
15212 3068015 3223185 3178459 2960253 3047913 3083383 3182339 2738511 2709009 2791388 2926567
15202 2926567 2566351 2649037 2695780 2778233 2960338 3033176 3175531 3092076 3023935 3046537 3243159
15191 3243159 3072278 2638637 2779790 2794487 2782101 2755450 2788965 2894490 2905053 2730345
15181 2730345 2841883 2875822 2911816 2843095 2923910 2936423 2957263 2845183 3036798 2761793
15171 2761793 2710608 2607726 2962136 3035371 2901958 3027548 2875473 3166633 2893353 2956557
15161 2956557 2861650 2892599 2700686 2791958 2869891 2907631 2784588 2561093 3018847 3082891
15151 3082891 3036746 2898096 3153670 3184130 3195280 2921559 2971907 2799201 2801785 2612066
15141 2612066 2844587 2638314 2647899 2811189 2973555 2923657 2741822 3065295 3323301 3269503
15131 3269503 2871671 3176670 3101008 3183055 2894529 3097049 2837493 2848250 2817382 2978052
15121 2978052 3037990 3101348 3046708 3063487 2995068 2998804 2870418 3151156 3331387 3035324 3102627
15110 3102627 3017788 3048653 2889820 2905530 2991835 3173887 3155302 3126184 3141952 3079662 2950423
15099 2950423 2875040 3043239 3030232 2776268 2745454 2920074 3083671 3055889 2887600 2905372
15089 2905372 3052136 3078633 3206530 3140330 3068864 3147356 3082015 3057479 2902157 2797700
15079 2797700 2850367 3011289 2920034 2778919 2766664 2898391 2987564 2761271 2968002 3003691
15069 3003691 2979267 2915253 2935593 2943478 2778287 2751842 2572860 2788626 2692846 2948830 3127621
15058 3127621 3038674 3000077 2827448 3151164 3187807 3147520 2783696 2828612 2872874 2814131 2645244
15047 2645244 2713288 2756472 2697647 2859027 2778922 3131852 2904903 3073938 3067441 2982923 3026827
15036 3026827 2843583 2826900 2990928 2939844 3087790 2996600 2996148 2839211 2777083 2967242 3098707
15025 3098707 3013168 2949215 3056393 3125092 3021990 2845530 3217077 2896638 2950008 2880660
15015 2880660 3007812 3150455 3065148 2917598 3122030 3141771 3154675 3084951 2999444 2890642
15005 2890642 2864412 2973531 2903820 2766070 2709866 2983867 3154253 3082399 2885894 2988947
14995 2988947 2967099 3078606 2907269 2852566 3046715 2986845 3091933 3010123 3104729 2988739
14985 2988739 3012027 3103104 2973132 3037695 2833508 2943930 3085426 2838271 2771168 2779480
14975 2779480 2920720 2997850 2990790 3058330 3049170 2953972 2945968 2816124 2853373 2983199 2898465
14964 2898465 3171360 2913287 2876292 2970152 3097901 3237069 3033560 2979599 3030470 3233693
14954 3233693 3182214 3101177 2999175 3034677 2980320 3136710 3123831 2916996 2865243 3028957
14944 3028957 3113074 3035422 3049539 3011968 2903611 2905048 3048978 3132254 3076668 2881988 2983873
14933 2983873 3065359 3310296 3007335 2995049 2970819 3195596 3080728 2986872 2946464 2985815
14923 2985815 3085875 3070083 3089057 2985328 3128949 2954250 3151186 3008255 2913491 2902090
14913 2902090 3031167 3044796 2913876 2882715 3145763 3048277 3003145 2780940 2989098 3050707
14903 3050707 2820249 2828258 2889719 3075013 2945937 2947711 2771656 2894224 2798952 3052402
14893 3052402 3100729 3165302 3031468 3235701 3215755 3041211 3012470 3022767 3060121 2930114
14883 2930114 2838723 3004269 2936722 2766569 2853686 2930798 3097492 2949969 3084299 2799486
14873 2799486 2914251 2825031 2996950 3187701 2983845 2798395 3038933 3136643 3148898 3072298
14863 3072298 2943833 3067676 3063224 3232765 3094969 3031364 3152987 3232778 3073529 3020568
14853 3020568 2940973 2896313 2841870 3128435 3107578 3111677 3033905 3071514 3218487 3022293 3042250
14842 3042250 2980262 3088977 3001657 3169104 2882920 2888029 2845240 2901552 2899534 3066159 2886098
14831 2886098 2925855 3171824 3058512 3109622 3219453 3269744 3001663 2993818 2937807 2926499 2816938
14820 2816938 2909871 2919646 2982584 2857584 3078360 3123628 3199909 2920853 3104455 3092096 2991839
14809 2991839 2800870 2835807 3000715 3060189 3078855 2970191 3236946 3265461 3236435 3069673
14799 3069673 3220642 3165762 3225510 3063522 3166742 3039115 2875026 2730965 2893795 2916331
14789 2916331 2892893 2777442 2953726 3049668 2912491 2951218 2996257 3321435 3245699 3428813
14779 3428813 3417360 3321974 3072512 3083856 3082659 2953292 2774119 2825279 2920898 2851771 2824719
14768 2824719 2878764 2946205 2959250 2869804 2873558 3101775 3031651 3199823 3020215 3104638 3055005
14757 3055005 2982113 3134016 3099180 3031851 2811201 2903784 3045730 3173128 2812114 2980135
14747 2980135 3042348 3053712 2908821 2955493 3030914 2861760 3103356 3228053 3293406 3215248
14737 3215248 3267870 3377633 3402224 3069354 3042260 2833899 2903963 2689381 2753543 2848006
14727 2848006 2783529 2825817 3007562 3086170 3336000 3128062 3078877 3256927 3177636 3346049
14717 3346049 3156762 3282809 2994696 3126899 2979798 3137744 2972106 2643172 2540224
14708 2540224 2780372 2722206 2917277 2921783 2909732 2978231 3036751 3255973 3263980 3128844 3124771
14697 3124771 3063063 3143908 3337298 3124099 3162732 3168481 3166736 3252313 2976860 2842535 2648894
14686 2648894 2848370 3086148 2910373 2949976 2820816 2963857 3041718 3006206 2943099 2984834
14676 2984834 3066105 3200262 3022984 3316390 3039954 3140607 3094463 3045806 3051690 2947257
14666 2947257 2861205 2996772 2866481 2763448 2923347 3144321 3065656 2827348 3135675 3126695
14656 3126695 3170877 3021026 3056171 3067692 3181501 3044145 3086520 2850938 2936927 2958283
14646 2958283 3067742 3186579 2768471 3031887 2945364 3121190 2983251 3041438 2936957 3095703
14636 3095703 2963481 3079145 2777317 2947860 2840146 3059571 3051025 3068205 3082454 3098095
14626 3098095 3173650 3204102 3386465 3309701 3220579 2969675 3072467 2827335 2965558 2659677
14616 2659677 2786254 2628894 2967921 2930334 3059007 2952188 3202515 3102782 3022865 2901922
14606 2901922 3013621 3164067 3218919 3111708 3119237 3239776 2944422 2996254 2968674 2964476 2963330
14595 2963330 3065331 2997429 2979244 2966090 3076590 3014242 2969581 2938494 2993428 3228807 3068815
14584 3068815 3114207 3065192 3197919 3143017 3136022 2985608 3106210 3123595 3364489 3182708
14574 3182708 3193742 3000507 2867181 2927340 2902926 2745092 2947046 3065428 3214316 3176872
14564 3176872 3073565 3357707 3142427 3305369 2987930 3244772 3162262 3139157 2848829 2917560
14554 2917560 2845307 2880003 2746387 2945126 3021983 3111537 3077939 3323944 3321463 3147522 3087611
14543 3087611 3283126 3283608 3043160 3240739 3170510 3248501 3139192 3292713 2974819 3178508
14533 3178508 3107406 3240531 3286735 3134738 3099990 3064861 3106139 3077451 3147143 2881911 3032254
14522 3032254 3068801 3287006 3255840 3339309 3221108 3336665 3249919 3222018 3165301 2975226
14512 2975226 2836476 2973965 2978526 2892441 2936910 3069989 3139514 2889841 2946279 3070716
14502 3070716 3219612 3076149 3231349 3261871 3373756 3179816 3101266 2884018 2892932 3027158
14492 3027158 3085410 3049923 2913926 2893885 2972607 2946149 2874780 2907483 3075947 3298557 3129705
14481 3129705 3167229 3227081 3293257 2975017 3071179 3035621 2968266 2921139 2951727 3064491 2963577
14470 2963577 3035209 3038780 3098270 3004733 3063166 2949743 2932565 3117291 2945652 3104700 3252232
14459 3252232 3084865 3001121 2940895 3245362 3166740 3091630 3125699 3343542 3239997 3152536
14449 3152536 3033623 3111469 3007939 2947569 3111886 2952960 3085540 2978249 3052914 3023771
14439 3023771 2978673 3143788 3237969 3254609 3083161 3087334 3114199 3249779 3125084 2911142
14429 2911142 3171176 3227044 3258668 3052041 3087819 3090111 2992234 3102866 3105188 3020412 3012258
14418 3012258 3192695 3266144 3258682 2950687 3192874 3022326 3147069 3056205 3048052 3188037
14408 3188037 3125082 3094853 2875164 2994170 3146414 3343919 3255915 3299640 3431029 3428461
14398 3428461 3247090 3387472 3357995 3311798 3041526 3177268 3156583 3103967 3163644 3368133
14388 3368133 3164961 3058479 3211786 3308330 3396465 3128369 3335911 3263502 3225039 3171179
14378 3171179 3177290 3212083 3159170 3016612 3207217 3204139 3103394 3065287 3186408 3391738 3244800
14367 3244800 3259734 3250255 3267414 2990893 3063012 3045160 3247484 2971081 3193045 3191929 3267549
14356 3267549 3188431 3016490 3190873 3160418 3328111 3222785 3160447 3195245 3364030 3120338
14346 3120338 3178130 3057533 3243141 3156071 3112529 3183541 3088104 3147591 3438967 3251720
14336 3251720 3202042 3075402 3373569 3309777 2937896 3067314 3144847 3347607 3178817 3122303
14326 3122303 2998490 3175413 3221346 3402085 3419398 3317169 3209624 3197948 3097068 2961313
14316 2961313 2956235 3059922 2985072 2861028 2971257 3000602 3102798 3148736 3252823 3314407
14306 3314407 3522533 3414166 3520121 3405135 3322710 3224350 3258387 3205326 3214285 3034099
14296 3034099 3228142 3290519 3171183 3093643 3190163 3378927 3238863 3256190 3335609 3346092
14286 3346092 3240968 3363609 3221974 3180177 2944085 3094953 3119918 3082833 3184533 3124451
14276 3124451 3181038 3250549 3177306 3185835 3179810 3296694 3472601 3259579 3345576 3231668 3058388
14265 3058388 2977303 3210646 3365130 3189862 3149227 3365328 3519999 3457660 3364323 3273944
14255 3273944 3242639 2984806 3126741 3090920 3092987 2923018 3093021 3193209 3106594 2920509
14245 2920509 3249225 3285693 3294541 3313419 3437474 3428012 3190091 3004950 3188806 3147857 3052862
14234 3052862 2979116 2838664 3038104 3052693 2954165 2899749 3231302 3139045 3000862 3144183
14224 3144183 3228103 3080952 3118231 3181297 3415703 3193464 3170419 3078861 3079177 3164361 3152423
14213 3152423 3193192 3331396 3340235 3226668 3327085 3329268 3185243 2842328 2959826 2970421
14203 2970421 2986413 2926067 3176490 3318972 3273893 3346820 3472239 3222139 3089404 3220208
14193 3220208 3328049 3394002 3170893 3149926 3161538 3138758 3205017 3089177 3112297 3219232
14183 3219232 3106856 3281258 3040335 3281257 3138317 3354017 3199841 3285286 3244558 3222870
14173 3222870 3164033 3206471 3156240 3150626 3257906 3150756 3082634 3184154 3146637 3208442 3164433
14162 3164433 3054149 3199189 2960765 3095689 2986602 3123532 2916989 3170557 3377418
14153 3377418 3434577 3420412 3345223 3382889 3564390 3463606 3239424 3256926 3221015 3046944
14143 3046944 3014797 2941113 3035157 3048910 2987403 3143018 3066513 3091724 3051081 3237664 3411891
14132 3411891 3349710 3301119 3304447 3480205 3345836 3396373 3335605 3198800 3363887 3387568 3291518
14121 3291518 3202233 3072689 3065596 3105303 2976806 3029396 3266884 3355199 3334461 3166908 3252436
14110 3252436 3355727 3317486 3304552 3227511 3318897 3424487 3450317 3267613 3232721 3094859
14100 3094859 3141272 3228485 3145912 3083118 3084903 3162002 3298588 3332915 3084941 3293853 3409297
14089 3409297 3365614 3328736 3406955 3178772 3172401 3283038 3332527 3403469 3191582 3280247 3403880
14078 3403880 3402951 3233554 3232481 3239301 3363813 3204955 3171826 3230672 3223956 3097445 3077151
14067 3077151 3394267 3473317 3371021 3285393 3322826 3447298 3364178 3305640 3280391 3185913 3346862
14056 3346862 3252222 3328825 3103867 3007872 3142051 3260209 3215417 3231665 3409385 3353246
14046 3353246 3194947 3156958 3319966 3261280 3231683 3383012 3384977 3434574 3279176 3012334
14036 3012334 3092691 3359363 3389515 3197709 3137980 3195417 3164935 3320948 3313473 3217182 3095258
14025 3095258 3215634 3347495 3323670 3059702 2959638 3216211 3264953 3314077 3281533 3384038
14015 3384038 3464946 3383031 3356725 3402443 3208846 3222539 3318554 3465472 3252345 3190025 3162620
14004 3162620 3141337 2962227 3145393 3278700 3551314 3241152 3241096 3196107 3477221 3447638 3540415
13993 3540415 3362018 3345332 3344017 3384998 3573479 3348300 3376418 3343136 3461400 3442399 3513371
13982 3513371 3222549 3114726 3146701 3280439 3069111 3256612 3206585 3252847 3272225 3400634
13972 3400634 3320674 3265634 3186102 3573025 3504362 3363018 3281632 3349612 3604477 3397800
13962 3397800 3364270 3171618 3111121 3065404 2927867 3065118 3100081 2908943 3082515 3298401
13952 3298401 3412345 3482530 3728944 3758752 3647850 3694884 3463521 3332324 3175726 3004624
13942 3004624 2920035 3053363 3056067 3149019 3201480 3249245 3259314 3365485 3385066 3364368 3392027
13931 3392027 3268540 3324201 3737155 3430619 3387272 3458467 3334772 3363270 3316681 3301676
13921 3301676 3252589 3251444 3314679 3131891 3112220 2950330 3037846 3110856 3213636 3110490 3102247
13910 3102247 3244089 3332456 3378103 3456699 3547819 3387007 3472542 3304036 3504292 3425342
13900 3425342 3401886 3080048 3184687 3115102 3189374 3104141 3187759 3008228 3113196 3266853
13890 3266853 3318128 3337441 3237173 3389836 3562196 3511449 3207311 3193386 3109076 3128089
13880 3128089 3267964 3321942 3165865 3038097 3159028 3269839 3363395 3281688 3386054 3536803
13870 3536803 3458370 3441906 3507750 3414002 3373882 3356383 3373673 3096873 3284105 3155220 3232115
13859 3232115 3502701 3686646 3598807 3637743 3617153 3457041 3453815 3402657 3344512 3236599 3341834
13848 3341834 3167707 3171785 3023126 3029581 3161855 3538308 3623674 3538255 3590720 3615634 3577641
13837 3577641 3652395 3423459 3414743 3324173 3322165 3359386 3179067 3381169 3373621 3284129 3310809
13826 3310809 3281025 3483469 3614114 3419546 3422067 3211790 3383598 3468406 3151594 3109032
13816 3109032 2981787 3162149 3033170 3302600 3254738 3285068 3327707 3549060 3485927 3735813
13806 3735813 3516295 3469612 3175772 2982164 3072867 3074755 3117684 3074914 3166775 3199181 3474424
13795 3474424 3583518 3547856 3614158 3719697 3507719 3397209 2961379 3050411 3011279 2967626
13785 2967626 2922496 2885341 2866736 3073220 3182178 3545448 3477465 3229012 3624604 3665976
13775 3665976 3598846 3372190 3291656 3217669 3143310 3121823 3102127 3033303 3052486 3028051 3213765
13764 3213765 3458725 3302256 3292332 3361994 3598959 3513189 3396509 3344760 3198306 3369683
13754 3369683 3599749 3444270 3517914 3245355 3428175 3461709 3457055 3386586 3423516 3545272
13744 3545272 3341734 3232664 3041725 3050283 3072642 2986489 2911741 3410637 3378661 3501804
13734 3501804 3588031 3648812 3610723 3584642 3707222 3679159 3388523 3234054 3372878 3301617
13724 3301617 3070263 2758679 3059479 2978480 3361765 3161634 3484195 3656211 3730840 4035124
13714 4035124 3987546 3793763 3568814 3501747 3484587 3388575 3080837 3193121 3165991 3291016
13704 3291016 3164154 3442689 3367432 3515922 3557073 3774112 3575841 3853962 3515522 3541153
13694 3541153 3317990 3241747 3289942 3136050 3360439 3180781 3375720 3434125 3676933 3525513
13684 3525513 3551255 3208487 3523001 3503704 3417524 3119081 3195742 3081603 3248317 3446979
13674 3446979 3451706 3320086 3370660 3692585 3843013 3873497 3520278 3658732 3600530 3572338
13664 3572338 3225438 3343977 3227342 3278586 3146029 3094620 3252970 3306151 3415775 3768934
13654 3768934 3849040 3592266 3620805 3639648 3763032 3432225 3226162 3154259 3080859 2991996
13644 2991996 3106593 3178527 3390526 3315718 3562774 3776664 3841278 3833459 3677684 3774601
13634 3774601 3521424 3402895 3201887 3075662 2940855 2899194 2950808 3361911 3367692 3558433
13624 3558433 3578145 3732406 3974068 3861289 3738208 3553232 3428910 3144132 3246018 3150122
13614 3150122 3031189 2941713 3302995 3482234 3784376 3562385 3589388 3531296 3642526 3637717
13604 3637717 3483396 3192846 3219583 3116277 3099606 3149715 3056402 3302249 3275999 3717631
13594 3717631 3468600 3697259 3813587 3902937 3745492 3657227 3366020 3521445 3148761 3046787
13584 3046787 2914454 2969796 3055138 3144024 3157876 3273465 3463693 3623473 3823004 3668223
13574 3668223 3592333 3495701 3923152 3669166 3413641 2996992 3181040 3183689 3344943 3271182
13564 3271182 3340942 3419739 3638311 3725747 3603137 3595646 3541332 3655897 3656896 3564470 3304187
13553 3304187 3242091 3274831 3405250 3376126 3494046 3514033 3601482 3611094 3717941 3755290 3575304
13542 3575304 3536246 3444967 3437284 3276215 3161424 3186991 3190642 3146065 3347731 3358646 3611498
13531 3611498 3610022 3634875 3846123 3839197 3870021 3721722 3630243 3531770 3282036 3195649 3214485
13520 3214485 3192048 3092612 2889293 3447552 3460835 3526195 3633740 3633738 3703450 3739827 3502911
13509 3502911 3299825 3063683 3059927 3467337 3281236 3285146 3043709 3350585 3643926 3555645
13499 3555645 3424721 3417159 3703488 3654767 3494690 3431024 3418939 3413682 3314167 3189809 3358254
13488 3358254 3305630 3299675 3546131 3655746 3658371 3849937 3839415 3771457 3419694 3403288 3518155
13477 3518155 3689827 3464072 3229017 3090409 3211154 3400822 3381445 3115649 3306078 3644954
13467 3644954 3693925 3728223 3579489 3548876 3485958 3662775 3624278 3386729 3284667 3425734
13457 3425734 3498214 3592738 3481867 3674397 3496938 3844345 3586790 3526558 3529696 3335205
13447 3335205 3179355 3366732 3298077 3260543 3087866 3168628 3366380 3437476 3635906 3590845
13437 3590845 3588408 3617717 3751243 3831243 3781849 3567218 3602237 3272640 3184680 3176734 3264298
13426 3264298 3327225 3509237 3403318 3637200 3615438 3742508 3565204 3571037 3675782 3723381
13416 3723381 3680592 3414254 3286215 3387655 3515167 3403190 3382830 3279746 3460585 3473131
13406 3473131 3728887 3405594 3520378 3440588 3551104 3601947 3537175 3435800 3575979 3678970
13396 3678970 3590860 3607350 3525962 3627478 3541228 3544621 3483164 3613114 3662079 3766141 3599939
13385 3599939 3663263 3404852 3481844 3490963 3522001 3456486 3722328 3535088 3491870 3369420 3378599
13374 3378599 3407298 3541660 3650519 3437435 3572482 3534890 3535026 3571970 3470937 3391599 3394057
13363 3394057 3590558 3632300 3634589 3471480 3431175 3578339 3767228 3653274 3389735 3246331
13353 3246331 3276791 3392123 3352486 3368645 3210810 3214053 3555652 3681881 3706244 3759436 3654664
13342 3654664 3888351 3696095 3720965 3560702 3615535 3564027 3587872 3397926 3470012 3413904
13332 3413904 3475712 3301844 3353810 3397922 3302934 3364058 3377188 3407702 3470842 3590377 3623087
13321 3623087 3519216 3451376 3585781 3713857 3693375 3638417 3589711 3539333 3553423 3551877 3357483
13310 3357483 3336039 3324293 3447729 3455495 3517235 3301150 3404697 3625447 3917838 3974334
13300 3974334 3808425 3758012 3654092 3859136 3724344 3690947 3543916 3529645 3508990 3522268
13290 3522268 3469388 3358360 3292191 3585951 3476695 3658414 3582714 3716424 3640948 3626929
13280 3626929 3554274 3559527 3623017 3601074 3562230 3420553 3712976 3607328 3672754 3417044 3380234
13269 3380234 3446977 3523841 3497391 3331366 3321833 3420879 3463060 3391494 3178853 3213674 3642668
13258 3642668 3760301 3862186 3534909 3611674 3509907 3844336 3658241 3553420 3396833 3561429
13248 3561429 3698536 3720928 3444269 3311871 3369354 3521673 3570063 3563278 3735445 3587920
13238 3587920 3690698 3572456 3707457 3438976 3600013 3516070 3720682 3731058 3827922 3653552
13228 3653552 3733627 3744787 3734064 3809396 3764795 3651501 3573568 3603541 3618151 3477601 3406012
13217 3406012 3411276 3356199 3420175 3414442 3559257 3693841 3523985 3609759 3833267 3818582 3874367
13206 3874367 3887298 3673819 3557874 3566417 3712533 3533435 3231666 3311204 3259693 3428833
13196 3428833 3448529 3390855 3445636 3680178 3721374 3633023 3647194 3698353 3805841 3713353 3711757
13185 3711757 3829490 3777272 3840333 3744383 3533263 3407156 3555182 3630900 3650905 3617578
13175 3617578 3480887 3496458 3482104 3715226 3483099 3581391 3769521 3584714 3707793 3603926
13165 3603926 3905478 3865264 3794042 3808220 3722432 3755935 4002650 3802817 3620953 3413319
13155 3413319 3359156 3452073 3394282 3372969 3213261 3420291 3478452 3648475 3787353 3646070
13145 3646070 3641385 3848017 3974583 3981626 3838108 3780194 3932535 3761401 3759528 3571527 3468986
13134 3468986 3478085 3567632 3647060 3621376 3556315 3623546 3455689 3570614 3657380 3583997 3586884
13123 3586884 3623973 3798030 3706059 3773485 3545314 3795988 3806059 3878390 3609362 3886816
13113 3886816 3537983 3638200 3459314 3480270 3534221 3564472 3538002 3360614 3600887 3600688 3636593
13102 3636593 3435739 3532230 3510910 4034734 3916249 3839350 3613931 3749452 3763872 3577845
13092 3577845 3529727 3308543 3345336 3563598 3684637 3787226 3618524 3559176 3743038 3794883
13082 3794883 3840458 3775213 3816114 3920025 3810807 3669619 3663171 3460170 3603911 3568177
13072 3568177 3686577 3727178 3516293 3633065 3597170 3655104 3571806 3602782 3648240 3591680 3671913
13061 3671913 3790310 3882973 3756313 3678400 3502826 3668490 3540821 3723129 3575022 3615604
13051 3615604 3744438 3832005 3887460 3757568 3764624 3464138 3785779 3907797 3851140 3413303
13041 3413303 3683247 3594488 3829872 3536355 3701234 3501930 3542620 3543882 3648994 3786088
13031 3786088 3617813 3469040 3525796 3781887 3616161 3725113 3466924 3741858 3795984 3840480
13021 3840480 3720906 3856016 3766950 3817962 3612650 3694379 3506399 3515155 3515089 3597511 3589672
13010 3589672 3510882 3675485 3613420 3616589 3759832 3922610 4054159 3982104 3903876 3980355 4128686
12999 4128686 3937411 3815564 3618255 3541195 3408765 3645219 3514129 3482868 3260106 3441339
12989 3441339 3736447 3663524 3633656 3433148 3872179 3934514 4045878 3732612 3800474 3595479
12979 3595479 3710403 3473306 3556812 3286969 3419809 3504625 3683270 3683451 3741566 3623925
12969 3623925 3689267 3674717 3749742 3703425 3388930 3668581 3467578 3899669 3674230 3872820
12959 3872820 3630184 3865124 3735440 3973022 3865724 3866145 3786667 3588918 3724184 3798373
12949 3798373 3773202 3364446 3493973 3416618 3817768 3590562 3685602 3351767 3883189 3785462
12939 3785462 4004973 3748020 3699599 3711905 3713609 3783809 3580799 3628752 3567551 3863598 3791848
12928 3791848 3731224 3435747 3812886 3648283 3966154 3827093 4039320 3703092 3516091 3403028
12918 3403028 3394474 3461509 3357424 3417743 3481725 3672877 3795699 3955676 3781574 3964244
12908 3964244 3775201 4160555 3950763 3622860 3539501 3501202 3656904 3496220 3495595 3450682
12898 3450682 3533019 3546673 3890595 3722257 3984355 3732035 4001738 3889377 4204116 4090542
12888 4090542 3848548 3730656 3801710 3740636 3682782 3591793 3524355 3682548 3609185 3934705
12878 3934705 3691357 3581344 3413619 3816962 3786797 3964741 3618175 3853757 3807427 3927048
12868 3927048 3613453 3721254 3754388 3971333 3971364 3817826 3858143 3583994 3722618 3507976
12858 3507976 3680605 3495042 3598249 3579322 3533218 3471252 3677902 3764547 3833049 3782756
12848 3782756 3876434 4078061 4075870 3911326 3907521 3822419 3819845 3784068 3600968 3595034 3357659
12837 3357659 3616922 3511611 3716250 3505080 3564839 3630522 3864737 3895502 3821799 3881542
12827 3881542 4143277 4064815 3985134 3814755 3910412 3676032 3490948 3658703 3730639 3621003
12817 3621003 3514119 3678849 3580063 3810706 3792208 3825306 3678913 3865881 3966102 4060646
12807 4060646 3939319 3852191 3850625 3793263 3818145 3887426 3799573 3794904 3563782 3587423 3750656
12796 3750656 3801514 3775903 3753488 3886267 3827085 3840074 3837181 3819141 3570904 3635397 3863528
12785 3863528 4060526 3988877 3626780 3860834 3788859 3872880 3559193 3586150 3542589 3845474
12775 3845474 3808215 3832508 3700954 3849876 3723364 3821432 3766548 3754168 3721922 3572072
12765 3572072 3780405 3783335 3797002 3607953 3666508 3677558 3798832 3541832 3801448 3450692
12755 3450692 3782572 3661444 3918053 3746452 3714124 3732664 4017074 4106480 4018855 3922807
12745 3922807 3741414 3720033 3591492 3856007 3623695 3742394 3480457 3794997 3764903 3854475
12735 3854475 3808695 3799885 3605371 3959723 3870354 3950823 3807101 3769302 4070135 3923283
12725 3923283 3962050 3658530 3622980 3486521 3715582 3562373 3682306 3457066 3722319 3560213
12715 3560213 3886240 3847263 3935995 3963415 4096909 4007440 3878583 3667779 3563307 3442659
12705 3442659 3391455 3545160 3426226 3595587 3603994 3808416 3598003 3876372 3794687 3836907
12695 3836907 3675042 3761382 3787834 4007572 3927018 3661152 3751108 3653479 3918686 3825975
12685 3825975 3760244 3757642 3767742 4025252 3919948 3903255 3693062 3595157 3678496 3744725 3697077
12674 3697077 3623203 3645526 3960535 3988503 4038901 4058388 3943382 3912779 4094747 4084678 4053136
12663 4053136 3786733 3753166 3740724 3763796 3758476 3471236 3631226 3577210 3955250 3885699 4002846
12652 4002846 3812465 4055417 3944455 4008536 3995151 3826007 3722560 3582157 3598442 3548087
12642 3548087 3627661 3517331 3630908 3617916 3903715 3908073 3893219 3636802 3790738 3775144
12632 3775144 4120915 3792605 3815691 3519851 3686846 3734071 3669126 3571327 3597201 3801646
12622 3801646 3908950 3955128 3891915 3814628 3762476 3908118 3797773 3835552 3854941 3979766
12612 3979766 3884556 3881938 3744225 3779118 3642830 3866823 3778765 4051186 3947120 3656939
12602 3656939 3831991 3712275 3765829 3617929 3638034 3786674 3597677 3796202 3633332 3898313
12592 3898313 3705893 3686118 3770432 4073508 4024261 3977464 3895416 3941313 3842597 3568360 3610284
12581 3610284 3589295 3784324 3679314 3836947 3922950 3970948 3967652 4015776 4143723 4092919 3979517
12570 3979517 4052124 3928680 3967010 3937988 3755034 3658197 3576660 3595227 3799113 3898351 3975204
12559 3975204 3987508 3788569 4085942 3903574 4148712 3756461 3893657 3792549 3790730 3755022
12549 3755022 3889316 3634701 3781376 3859363 3832830 3722034 3826351 4132371 3952951 3983739
12539 3983739 3920679 4087844 3780023 3673289 3585787 3943918 3839056 3968799 3651861 3946283
12529 3946283 3970240 4256555 3927795 4033369 3919180 3992599 3890075 3962353 3607647 3637621
12519 3637621 3746009 3879569 3865868 3931808 4041940 3904153 4027238 4070798 3987388 3779126
12509 3779126 4010806 3906735 3891907 3907250 3988135 3740369 3721144 3756153 3720409 3851649
12499 3851649 3729302 3749252 3835083 3930160 4193959 4117493 3850251 3841997 4090166 4230953
12489 4230953 4184789 4101527 3990463 3811617 3812851 3731092 3733525 3810865 3618369 3812489 3825832
12478 3825832 3591344 3777177 3754058 4076995 3988494 4183583 4107947 4169810 3956962 3898098
12468 3898098 3925100 3843255 3840444 3739550 4011882 3863670 3804150 3988907 3953228 3882744 3978957
12457 3978957 4050836 3815898 3989136 3884479 3988672 3951791 3902672 3944162 3935278 3783951
12447 3783951 3805504 4116542 4194189 3945487 4090951 4012982 4020591 3919924 4023157 3965766
12437 3965766 3876549 3930906 3986138 3907988 3809832 4050938 3864268 4143216 3963165 4162052
12427 4162052 4014162 3984293 3959896 3990557 3866119 3826310 3852916 3879980 3810606 3849348 3846730
12416 3846730 3734283 3693420 3734642 4021433 4140010 4075765 3952716 3924599 3862455 3853793 3750394
12405 3750394 3626194 3773274 3768544 4061306 3915236 4072142 3906742 4043871 4010554 4185933
12395 4185933 4192697 4208163 4222182 4024750 4069897 3854226 3705989 3595021 3667820 3501524
12385 3501524 3875403 3857890 3941343 3807465 4202150 4141889 4288423 4105219 4183190 3994592
12375 3994592 4124727 3756157 3765563 3833252 3732507 3893077 3837478 3783981 3684133 3905119
12365 3905119 3889755 4210964 4081312 4203352 4020841 4118815 4190545 4092937 4027589 3910636
12355 3910636 3783824 3849842 3877397 4014992 4149078 4127089 4137532 4045483 3991817 4002077 3950243
12344 3950243 3974081 3994013 3978336 3916873 3740944 3933735 3980981 4005325 3993482 4163305 4295247
12333 4295247 4290655 4406522 4268823 4205196 3768567 3813548 3804889 3565433 3540004 3815312 3768899
12322 3768899 3829956 4014143 4010039 4094537 4110334 4221478 4285618 4214988 4274002 4151818 3963913
12311 3963913 3880964 3815748 3832966 3922841 3971999 3813622 4087763 4088885 4035892 4123718 4038185
12300 4038185 4127007 4099512 4071783 4091497 4098463 3892558 4006283 3977499 3949650 4028993 4059877
12289 4059877 4118111 4048292 4104457 4342572 4297106 4225816 4032158 3983891 4028196 3892576 3924565
12278 3924565 3735969 3867374 3725564 3832409 3984647 4112928 4105585 4205120 4081269 4212590
12268 4212590 4190857 4211778 4224593 4041296 3896496 3889402 3707895 3881979 3743329 3896973
12258 3896973 3921980 4165420 4282872 4124553 4321736 4130983 4140903 4203386 4311534 3889224
12248 3889224 4040628 3977617 4005894 3777553 4036265 3961987 3985914 4041675 3964549 4156344
12238 4156344 4185155 4192236 4131676 3974611 4057197 3840686 3959647 3942295 3863590 3915475 3905384
$$ [...]
##END NTUPLES=NMR SPECTRUM
##END=
