##TITLE=1H_DE-80H_X3
 200.13MHz, d2o
 8 sc
 
 19ns.26.2.2025
##JCAMPDX= 6.0         $$ Bruker NMR JCAMP-DX V2.0
##DATA TYPE= NMR SPECTRUM
##DATA CLASS= NTUPLES
##ORIGIN= UXNMR, Bruker Analytische Messtechnik GmbH
##OWNER= pz
$$ XWIN-NMR		Version 3.5
$$ Tue Apr 28 12:10:15 2026 Russian Standard Time (UT+4h)  Yarkov@DPX200
##.OBSERVE FREQUENCY= 200.1313
##.OBSERVE NUCLEUS= ^1H
##.ACQUISITION MODE= SIMULTANEOUS
##.ACQUISITION SCHEME= undefined
##.AVERAGES= 8
##.DIGITISER RES= 18
##SPECTROMETER/DATA SYSTEM= spect
##.PULSE SEQUENCE= zg30
##.SOLVENT NAME= CDCl3
##.SHIFT REFERENCE= (INTERNAL, CDCl3, 0, 17.9638)
##AUDIT TRAIL= $$ (NUMBER, WHEN, WHO, WHERE, WHAT)
$$ ##TITLE= Audit trail, XWIN-NMR		Version 3.5
$$ ##JCAMPDX= 5.01
$$ ##ORIGIN= Bruker BioSpin GmbH
$$ ##OWNER= Yarkov
$$ C:/Bruker/XWIN-NMR/data/yarkov2/nmr/H-C/1/pdata/1/auditp.txt
$$ ##AUDIT TRAIL=  $$ (NUMBER, WHEN, WHO, WHERE, WHAT)
(   1,<2026-04-28 12:07:45.35 +0400>,<Yarkov>,<DPX200>,
      <created by zg, POWCHK disabled, PULCHK disabled
       configuration hash MD5:
       00 E9 B6 7A A2 85 ED C7 34 08 36 98 17 FE 4E 26
       data hash MD5: 16K
       81 DB D6 2F D4 C8 BF C3 CC 47 B9 93 1F B8 9A 93>)
(   2,<2026-04-28 12:08:21.96 +0400>,<Yarkov>,<DPX200>,
      <Start of raw data processing
       efp BC_mod = 2 LB = 0.25 FT_mod = 6 PKNL = 1 PHC0 = -5301.716 PHC1 = 11.42193 SI = 16K 
       data hash MD5: 16K
       E8 83 01 7E 84 71 BE 05 21 9F FD 39 D8 70 7B 58>)
(   3,<2026-04-28 12:08:40.06 +0400>,<Yarkov>,<DPX200>,
      <pk PHC0 = 1.2 PHC1 = 0 
       data hash MD5: 16K
       0F E7 65 E0 B9 A3 6C A1 39 E7 F3 40 3C C4 61 44>)
(   4,<2026-04-28 12:09:43.46 +0400>,<Yarkov>,<DPX200>,
      <abs ABSG = 5 
       data hash MD5: 16K
       F1 B6 C2 D5 1B DF F0 22 6B EE 6D 76 E8 3C D9 C0>)
$$ ##END=
$$ 
$$ hash MD5
$$ 76 EC AE 2A F6 61 A7 B1 B0 CE 03 7E B3 FD C8 4C
##$RELAX= 
##$RELAX= 
##$RELAX= 
##$RELAX= 
##$RELAX= 
##$RELAX= 
$$ Bruker specific parameters
$$ --------------------------
##$DU= <C:/Bruker/XWIN-NMR>
##$EXPNO= 1
##$NAME= <H-C>
##$PROCNO= 1
##$TYPE= <nmr>
##$USER= <yarkov2>
##$AMP= (0..31)
100 100 100 100 100 100 100 100 100 100 100 100 100 100 100 100 100 100 
100 100 100 100 100 100 100 100 100 100 100 100 100 100 
##$AQSEQ= 0
##$AQ_mod= 1
##$AUNM= <au_zg>
##$AUTOPOS= <>
##$BF1= 200.13
##$BF2= 200.13
##$BF3= 200.13
##$BF4= 200.13
##$BF5= 200.13
##$BF6= 200.13
##$BF7= 200.13
##$BF8= 200.13
##$BYTORDA= 1
##$CFDGTYP= 0
##$CFRGTYP= 5
##$CHEMSTR= <none>
##$CNST= (0..31)
1 1 145 1 1 1 1 1 1 1 1 1 1 1 1 1 1 1 1 1 1 1 1 1 1 1 1 1 1 1 1 1 
##$CPDPRG= <>
##$CPDPRG1= <>
##$CPDPRG2= <>
##$CPDPRG3= <>
##$CPDPRG4= <mlev>
##$CPDPRG5= <mlev>
##$CPDPRG6= <mlev>
##$CPDPRG7= <mlev>
##$CPDPRG8= <mlev>
##$CPDPRGB= <>
##$CPDPRGT= <>
##$D= (0..31)
0 0.7 0 0 0 0 0 0 0 0 0 0.03 0 0 0 0 0 0 0 0 0 0 0 0 0 0 0 0 0 0 0 0 
##$DATE= 1777363664
##$DBL= (0..7)
120 120 120 120 120 120 120 120 
##$DBP= (0..7)
150 150 150 150 150 150 150 150 
##$DBP07= 0
##$DBPNAM0= <>
##$DBPNAM1= <>
##$DBPNAM2= <>
$$ [...]
##$SUBNAM3= <"">
##$SUBNAM4= <"">
##$SUBNAM5= <"">
##$SUBNAM6= <"">
##$SUBNAM7= <"">
##$SUBNAM8= <"">
##$SUBNAM9= <"">
##$SW= 18.0517328524113
##$SWIBOX= (0..15)
0 0 2 0 0 0 0 0 0 0 0 0 0 0 0 0 
##$SW_h= 3612.71676300578
##$TD= 16384
##$TD0= 1
##$TE= 0
##$TE2= 300
##$TE3= 300
##$TEG= 300
##$TL= (0..7)
0 120 120 120 120 120 120 120 
##$TP= (0..7)
150 150 150 150 150 150 150 150 
##$TP07= 0
##$TPNAME0= <>
##$TPNAME1= <>
##$TPNAME2= <>
##$TPNAME3= <>
##$TPNAME4= <>
##$TPNAME5= <>
##$TPNAME6= <>
##$TPNAME7= <>
##$TPOAL= (0..7)
0.5 0.5 0.5 0.5 0.5 0.5 0.5 0.5 
##$TPOFFS= (0..7)
0 0 0 0 0 0 0 0 
##$TUNHIN= 0
##$TUNHOUT= 0
##$TUNXOUT= 0
##$USERA1= <user>
##$USERA2= <user>
##$USERA3= <user>
##$USERA4= <user>
##$USERA5= <user>
##$V9= 5
##$VALIST= <valist>
##$VCLIST= <CCCCCCCCCCCCCCC>
##$VD= 0
##$VDLIST= <DDDDDDDDDDDDDDD>
##$VPLIST= <PPPPPPPPPPPPPPP>
##$VTLIST= <TTTTTTTTTTTTTTT>
##$WBST= 1024
##$WBSW= 4
##$XGAIN= (0..3)
0 0 0 0 
##$XL= 0
##$YL= 0
##$YMAX_a= 327553
##$YMIN_a= -429420
##$ZGOPTNS= <>
##$ZL1= 120
##$ZL2= 120
##$ZL3= 120
##$ZL4= 120
##$ABSF1= 17.96375
##$ABSF2= -0.0881443
##$ABSG= 5
##$ABSL= 3
##$ALPHA= 0
##$AQORDER= 0
##$ASSFAC= 0
##$ASSFACI= 0
##$ASSFACX= 0
##$ASSWID= 0
##$AUNMP= <proc_1d>
##$AZFE= 0.1
##$AZFW= 0.1
##$BCFW= 0
##$BC_mod= 2
##$BYTORDP= 0
##$COROFFS= 0
##$CY= -3
##$DATMOD= 1
##$DC= 0
##$DFILT= <>
##$DTYPP= 0
##$F1P= 0
##$F2P= 0
##$FCOR= 1
##$FTSIZE= 16384
##$FT_mod= 6
##$GAMMA= 0
##$GB= 0
##$INTBC= 1
##$INTSCL= 3.241238e-09
##$ISEN= 128
##$LB= 0.25
##$LEV0= 0
##$LPBIN= 0
##$MAXI= 10000
##$MC2= 0
##$MEAN= 0
##$ME_mod= 0
##$MI= 1.114404
##$NCOEF= 0
##$NC_proc= -6
##$NLEV= 6
##$NOISF1= 3.799351
##$NOISF2= 2.8
##$NSP= 0
##$NTH_PI= 0
##$NZP= 0
##$OFFSET= 17.96375
##$PC= 1
##$PHC0= -5300.516
##$PHC1= 11.42193
##$PH_mod= 1
##$PKNL= yes
##$PPARMOD= 0
##$PSCAL= 0
##$PSIGN= 0
##$REVERSE= no
##$SF= 200.129511281896
##$SI= 16384
##$SIGF1= 3
##$SIGF2= 2
##$SINO= 0.751879
##$SIOLD= 32768
##$SREGLST= <19F.Aceton>
##$SSB= 0
##$STSI= 16384
##$STSR= 0
##$SW_p= 3612.71676300578
##$SYMM= 0
##$S_DEV= 0
##$TDeff= 16384
##$TDoff= 0
##$TI= <>
##$TILT= no
##$TM1= 0
##$TM2= 0
##$TOPLEV= 0
##$USERP1= <user>
##$USERP2= <user>
##$USERP3= <user>
##$USERP4= <user>
##$USERP5= <user>
##$WDW= 1
##$XDIM= 16384
##$YMAX_p= 409567153
##$YMIN_p= -409641
$$ End of Bruker specific parameters
$$ ---------------------------------
##NTUPLES= NMR SPECTRUM
##VAR_NAME=  FREQUENCY,     SPECTRUM/REAL,   SPECTRUM/IMAG
##SYMBOL=    X,             R,               I
##VAR_TYPE=  INDEPENDENT,   DEPENDENT,       DEPENDENT
##VAR_FORM=  AFFN,          ASDF,            ASDF
##VAR_DIM=   16384,         16384,           16384
##UNITS=     HZ,            ARBITRARY UNITS, ARBITRARY UNITS
##FACTOR=    0.220516191357247, 1,           1
##FIRST=     3595.07667624553, 0,            0
##LAST=      -17.6400867602515, 0,           0
##MIN=       -17.6400867602515, -409641,     0
##MAX=       3595.07667624553, 409567153,    0
$$ Real data points
##PAGE= N=1
##DATA TABLE= (X++(R..R)), XYDATA
$$ [...]
12158 3899 58317 88153 33930 42254 63143 78344 77545 71143 80131 96793 90308 -60644 -70355
12145 -70355 -133257 -151182 9512 -51269 -130781 -86865 -1096 13684 54348 110458 143372
12134 143372 114634 24140 68921 6610 -63640 -131186 -160199 -190394 -217696 -216074 -167355 -228305
12122 -228305 -206472 -207267 -88910 -26937 16292 -8977 16124 136549 182944 171328 220267
12111 220267 264007 248253 178298 93166 67993 68377 20728 35872 -12593 -48993 -61638 -55148
12099 -55148 -47899 35034 5864 -57342 72802 231338 249960 193811 182297 275431 306040
12088 306040 151258 194489 182372 53227 5172 -84983 -112902 -136133 -146196 -85742 -78707
12077 -78707 -81706 -197865 -127089 26416 71140 14906 38989 99839 89683 3672 -85565
12066 -85565 -74652 -19783 -19768 29445 90639 99159 15624 -17862 35211 56537 33507 54473
12054 54473 22976 -82511 -70012 -99841 -54015 -14567 -55195 -63326 -51409 -88665 -15723 58456
12042 58456 35034 36549 19045 82105 139292 143464 103464 182455 189391 186956 167995 67484
12030 67484 96233 90749 92413 53715 -37472 -41337 -51093 -53528 -82562 -62341 -58191 -16822 -19776
12017 -19776 -43922 -20979 -10920 17480 38078 -8359 -28711 -2971 -41485 -40618 -52431 -26564
12005 -26564 -25832 -87451 -210216 -170542 -44413 -80566 -141549 -168010 -95117 -46529 -98014 -171108
11993 -171108 -79074 -73498 -29843 30935 66443 32651 10585 130741 141181 145566 67902 76357
11981 76357 82139 73625 87490 55151 2526 28383 88314 21604 -71898 -98103 -102774 -93104
11969 -93104 -109813 -105237 -86375 -71794 -24958 110111 190908 174129 183590 294846 390584 324490
11957 324490 203921 203053 181841 91712 -50714 -118642 -69328 -109918 -215700 -269748 -266040
11946 -266040 -97803 -35936 -72150 -87948 -98113 -27456 41280 6447 -62019 -74833 29617
11935 29617 59933 -11607 -73795 -81720 -45925 -108331 -121839 -136130 -119379 -139027 -201627 -172165
11923 -172165 -45932 83258 47077 -3399 28954 126198 201055 143580 191560 212274 216216
11912 216216 190633 75150 -18300 5550 134606 53262 -31037 29973 55147 85076 41578
11901 41578 53002 113706 142024 114429 60140 113285 120893 34589 -6503 50641 58647 -37525
11889 -37525 -124887 -96716 5886 -11817 3678 44427 31401 6827 -3753 -39567 -8984
11878 -8984 -21499 16621 71158 5957 -131465 -170830 -65582 42872 -30214 -228772 -241891
11867 -241891 -192401 -155379 -197622 -179620 -80141 -29961 -43990 -26128 125093 222365 202787
11856 202787 59461 54203 117886 119791 127318 88801 39541 35142 61510 -5875 -76424 -24858
11844 -24858 72584 52399 286 -53140 47470 104646 75522 98111 28483 42278 33439 22558
11832 22558 -18150 -19245 90025 131396 32035 -6043 13794 51805 51774 20581 22173 -52534
11820 -52534 -110931 -158458 -102248 -102920 -75200 -69510 -87215 -94911 -61658 1914 36041 61518
11808 61518 17987 15857 8791 -63460 -52241 -7194 36017 -8321 -54174 -57339 19669 47148
11796 47148 -31274 1058 117531 76819 -59015 -183730 -53357 79557 32590 29844 7627
11785 7627 46714 46882 55681 87285 103797 41028 50650 155237 105029 -1622 57694 140519
11773 140519 161824 90940 47188 97174 146837 -4364 -111778 -6248 96530 -24425
11763 -24425 -118750 -107485 -94852 -22057 -125581 40144 131370 102054 94246 127701 189939
11752 189939 92152 89848 69853 26309 -137922 -153991 -125239 -117055 -138903 -195701 -147683 -23796
11740 -23796 -95647 -105359 -39033 -13182 -53033 -69237 26086 68626 -88481 -158751 3472
11729 3472 117031 146847 179635 246347 197566 129875 91142 158255 90538 -940 -28546 76436
11717 76436 21502 -74008 -13545 127247 172445 92678 41237 103599 14405 -120161 -102015
11706 -102015 -62140 -65003 -68145 -74088 8192 78796 95457 74968 187952 236015 133942 94490
11694 94490 129991 122758 4285 25430 54850 49993 -124076 -162771 -65532 -83687 -154172 -135508
11682 -135508 -15588 11971 -4251 -49701 -13733 35899 -39674 50556 154452 158131 122392
11671 122392 203310 244545 138342 83903 29 69661 -3296 -50034 -47348 -115648 -120007 -180937
11659 -180937 -43137 44653 82151 72325 118503 174378 203186 59470 51513 182356 174125
11648 174125 -33523 -104962 -9180 34427 10268 -34985 35946 27968 -92287 -193216 -111918
11637 -111918 -12188 -38982 -44761 75799 101792 -76364 -59564 64309 110384 -53124 -2736
11626 -2736 175015 132788 96863 -10501 27691 133631 76573 -49835 -1523 75283 12503
11615 12503 -46126 -403 -23749 -47102 -67579 -59765 -34744 -52120 -45102 29403 61203 -65484
11603 -65484 -80707 -48557 -60197 -38887 38284 103730 91670 42775 -4797 82211 137915 -358
11591 -358 -2461 46961 93496 -13236 -140631 -150419 -170447 -159998 -144473 -11684 20527 -76619
11579 -76619 -78702 23599 93652 73987 41255 105452 106201 104553 37423 85645 124054 114131
11567 114131 110402 161441 109441 -12010 -125494 -38482 40821 -71429 -116828 -25956 43853
11556 43853 28258 -29751 -62972 56201 159637 74333 45297 50730 106974 30310 -67941
11545 -67941 -48697 -84357 -133645 -164226 -223071 -167679 -127559 -123669 -67586 -71141 -54918 -45948
11533 -45948 -30898 -59725 -39969 -26999 10879 8834 -66796 -121686 -110390 -102208 -68954 -20033
11521 -20033 -7118 25215 44614 -108502 -171215 -108981 -11335 17318 43358 57106 110303
11510 110303 49257 -15127 54293 163830 135099 45044 -38202 17453 57262 18079 -42487
11499 -42487 38576 137331 213850 138304 69178 79085 205512 259165 190377 93927 71315 129328
11487 129328 45250 -59984 -84174 -2092 -84525 -200238 -213966 -175648 -189394 -217330 -191102
11476 -191102 -94258 -8031 87069 -17617 5871 29202 45315 171903 225039 168331 30809
11465 30809 -3861 65149 -4137 -105682 -92647 -29006 -62677 -152981 -257064 -79898 72937
11454 72937 -79068 -58635 98904 104018 111437 44715 81834 202122 229065 155066 129338
11443 129338 168803 105379 83383 81976 120743 156844 170646 85406 -27842 -44041 -36007 426
11431 426 -58847 -113215 -22764 -15380 -42241 -92853 -107034 -26287 43716 -19658 -23808 11507
11419 11507 72394 26920 -40405 84997 182581 177920 79867 462 -59395 -159168 -134809 -116814
11407 -116814 -131092 -124631 -17006 46935 -135353 -217746 -89342 60783 95087 -76851 -129977
11396 -129977 83315 114111 18865 21886 120849 206001 15793 -93982 12523 34000 -13973
11385 -13973 -65871 -57000 -106397 -189705 -195491 -149969 -93159 -29156 47557 175537 211322 171437
11373 171437 79767 127346 159572 45138 45610 22655 27384 4237 -15155 31814 44495 -30040
11361 -30040 -98296 -27947 34188 -92032 -155679 -62162 -50143 -48705 44519 58151 60889 67222
11349 67222 34914 68455 15128 -96089 -37656 -61185 -160562 -206464 -103547 -59968 -23453
11338 -23453 -90310 -73114 115648 124025 55136 76903 132447 34416 -90476 -124721 -34238
11327 -34238 -71622 -165886 -151062 -80034 -155253 -146700 -45705 9105 12144 -14388 42051 213423
11315 213423 206740 30911 7150 100801 60931 -20523 -1383 88559 123843 27191 -19970
11304 -19970 53847 41821 -23598 -72687 -7783 -3102 -69572 -114740 -5634 73767 31778 86273
11292 86273 119964 79241 60763 120343 71878 33874 -16358 17186 -263 -39612 -22894 -86261
11280 -86261 -62226 9232 -76770 -80111 -1014 -21744 -40323 5899 3501 -89840 -56499 2551
11268 2551 -79818 -33577 -2720 41092 96047 82423 35609 67645 12823 2687 -53051 -50932
11256 -50932 3513 -119796 -146226 -124434 -26786 -31311 -116971 -109392 -10769 -24659 -39043 -1432
11244 -1432 115625 167254 143053 211210 241359 264967 176573 153418 166862 52746 15854
11233 15854 27799 104009 37043 -15293 -9339 -19476 -64337 -79393 -48943 -41284 18655 16363
11221 16363 -2188 12942 7500 145602 100004 65043 78045 64016 29903 16285 -60268 -159160
11209 -159160 -201133 -223896 -225660 -302892 -212739 -203119 -156364 -13340 66722 91103 87469 77097
11197 77097 158696 98778 35756 30268 21432 16533 -33245 -41027 -58818 53338 124949 94588
11185 94588 127478 195597 117585 53101 93730 106493 106081 20400 36329 109716 127083 38350
11173 38350 71218 131892 88828 15148 -81199 -36045 -64937 -168940 -148360 -87999 16543
11162 16543 19984 -7163 88411 159257 237537 251576 206883 132622 59275 20561 -59701 -24185
11150 -24185 -201317 -317528 -269072 -256700 -217227 -265704 -102527 9103 -100854 -101982 -12245
11139 -12245 82374 134848 -4975 -22188 127420 36145 -18903 11950 126574 140133 97345
11128 97345 127945 97911 -47276 -66593 11897 15921 -89088 -129827 58124 89133 41509
11117 41509 38753 207430 274895 217821 157347 130221 145840 92264 -33968 -68983 104007
11106 104007 7463 -101224 -61325 -30133 -36694 -93292 -2574 167757 92589 -73988 -25306
11095 -25306 12533 -57892 -168824 -114309 5093 6610 -99172 -10682 20503 -41203 -130665
11084 -130665 -73584 64782 5825 -148960 -187646 -98322 -39260 -180673 -161461 75695 120114
11073 120114 -12317 -142428 -62721 63825 19317 -32196 -11279 -46760 -75993 -31126 59365
11062 59365 109859 125129 96993 270015 255578 172103 159111 232280 252430 90858 27825
11051 27825 65878 53965 -83207 -108244 -43678 -528 -106041 -157396 -200546 -140868 -93991
11040 -93991 -68401 -70546 -35629 -43131 -4539 71333 42893 -4229 -36873 33767 49055 -62474
11028 -62474 -21911 71670 -95252 -189417 -115266 11696 -45412 -138530 -71019 -1967 -80517
11017 -80517 -115121 21423 119390 92217 -8167 -78258 -94307 -62505 -37101 -74073 -66321
11006 -66321 91576 113891 50853 52240 78447 124842 136940 146206 36445 -56806 -22270 11243
10994 11243 -42668 -36088 -78266 -33495 49782 17531 -5492 43417 128856 152979 92980 50888
10982 50888 71950 89674 29248 -44651 -45528 53264 84 -73611 -195779 -130517 -46701 -78406
10970 -78406 -16650 -71630 -23 37175 -28639 -2262 64294 65135 44178 63008 163746 84722
10958 84722 -54835 4307 40122 17397 -42655 -85304 -3994 -110195 -174235 -160000 -59023
10947 -59023 -9112 -47237 25794 125505 160234 119589 124179 222792 261104 165477 164367 47489
10935 47489 -35405 -104137 -132407 -77978 -10380 3141 27253 49026 35603 166146 220782
10924 220782 220914 244328 246537 190522 -338 -76610 -7780 60052 14131 -125580 -113808 -77012
10912 -77012 -108145 -113726 -83292 7759 -5872 -45147 -63756 -46486 -5431 -9256 20407 65536
10900 65536 69871 68830 42055 116165 46086 -95221 56902 118633 -3226 -152389 -169391
10889 -169391 -163065 -78546 -98359 -8941 139260 143315 53575 18233 81843 87561 954 52796
10877 52796 96594 2672 -75992 -88072 -12568 15486 45577 80653 124410 96594 -96725
10866 -96725 -52579 53240 -33653 -24923 63054 75069 -5336 -92910 -40674 63277 90912
10855 90912 66648 37802 98457 34297 -108954 -73893 75459 31438 -48841 -34131 13131
10844 13131 19767 -103762 -156312 57020 122614 -3270 -76185 2830 -34206 -155706 -55804
10833 -55804 62308 72006 -60225 -129935 -56380 -111 -58164 -8702 142437 179602 120871
10822 120871 27110 132198 173832 29310 -90284 21733 101498 -37757 -179457 -69158
10812 -69158 44360 11334 -42312 100287 240922 163398 -2548 41458 200043 215380 159915
10801 159915 122976 76616 -76709 -151758 -94701 31104 78019 15551 62004 94348 -50428
10790 -50428 -167330 -90958 31998 -43498 -79060 -137191 -41040 -24981 -51257 -45778 43958
10779 43958 80059 -21277 -139362 -125134 -80595 -79523 -134363 -99028 -36340 -16287 -23478 24274
10767 24274 35048 109601 207423 228243 205057 126253 148180 167600 69262 -71341 20054
10756 20054 112760 85357 479 -17255 16757 100914 87735 154346 191744 166104 46237
10745 46237 -66300 -50873 25050 66768 35163 136813 151622 24938 -48787 -70789 -66627
10734 -66627 -21187 -20810 -93727 -147466 -134371 -123785 -93304 -25642 -51655 2071 24149 64506
10722 64506 70051 3090 18794 86414 40393 -46056 -98814 -117356 -118277 -204306 -241479 -122069
10710 -122069 41157 32293 -20748 -29178 44183 79304 -121687 -69801 138955 221306 91045
10699 91045 -48920 70740 176934 107190 33475 84768 78624 15489 -53458 -36513 -28034
10688 -28034 -15377 21213 63950 1696 -31943 -76739 65025 226699 83179 -14291 31219
10677 31219 46666 -22894 -42078 33097 103031 76364 -89611 -95613 -2413 -85435 -193940
10666 -193940 -154586 -32878 -76396 -153937 -273469 -192426 -56647 -7805 -54903 -8210 46232
10655 46232 9820 43954 73379 62176 35000 33868 -10075 -24530 -10530 31014 107694 5913
10643 5913 -98402 -20428 90831 16234 -235874 -219824 43167 108759 8651 18057 109630
10632 109630 146942 81403 74889 71838 166561 116533 55398 -3127 -45884 -70465 -6749 595
10620 595 -118197 -151453 -49414 39898 -43305 -94403 -42893 111918 156103 7230 -30831
10609 -30831 38635 -25208 -112973 -125808 -9122 71387 -30731 -158202 -195271 -91403 -120165
10598 -120165 -149953 -86797 -28567 18969 -62582 -24183 29980 119220 79406 11659 49774
10587 49774 96447 109933 47085 -59409 -97228 -128779 -134053 -175473 -192157 -115984 -55198 -22291
10575 -22291 -23185 -25359 101987 190576 157486 -23924 -7469 65927 38493 6387 -78305 -137716
10563 -137716 -107225 33314 11760 -51348 -6433 66216 72967 17938 -190933 -94860 105321
10552 105321 57454 -75161 1919 173665 168578 9052 4052 101535 225476 79691 -70499
10541 -70499 -116615 -165131 -211296 -217066 -190199 -178142 -96889 -62834 74152 56477 27920 130726
10529 130726 169118 122093 22990 -28661 13826 23643 32914 18699 106624 109364 -46299 -84017
10517 -84017 -57097 24561 -28812 -89653 -21361 18318 -39776 -61855 -74191 -3453 99828
10506 99828 77873 72794 61295 75600 122827 50905 -49127 -72975 -38345 -37033 -114547 -140075
10494 -140075 -59408 20893 19271 -36990 -12401 89757 92726 52301 -15285 27305 58040 -37549
10482 -37549 -132527 -61426 -9320 -33777 -101723 -111412 -32336 -11814 -6158 23800 -23744 -96112
10470 -96112 -20633 76382 10218 -48322 33683 146781 144352 52307 -45532 64904 120771
10459 120771 -10662 -49005 -6114 29627 -61093 -85300 36417 34890 25132 -10716 -16130 -34013
10447 -34013 -2680 64626 44832 76435 56420 148508 150222 22399 -8664 105542 196741
10436 196741 77244 -3501 91521 133346 31686 14585 -6720 16225 34732 735 30594
10425 30594 55771 48085 36299 6360 13569 -36029 50080 109255 83071 129038 98611 123782
10413 123782 123611 61939 -22667 47564 114014 -76473 -226650 -211921 -23385 -17513 -178329
10402 -178329 -126189 -39524 15702 -72277 -119361 29987 75955 -29821 -80755 -10902 44764
10391 44764 6056 -85269 -162331 -126081 -189959 -158825 -60173 2045 -62136 -38798 115478
10380 115478 68358 -101198 -162121 -62060 -58832 -120119 -126790 -13324 47601 14850 58815
10369 58815 141861 197964 92839 49263 11204 -17464 -68206 -109257 -127367 -202255 -249143
10358 -249143 -96373 -55768 -82234 -37131 19691 51864 -47460 -83897 -74064 -3579 -70437
10347 -70437 -159232 -36499 62873 -44348 -108042 -17109 52878 57453 12348 -25380 -6410
10336 -6410 -5024 -109709 -143988 -116719 -47426 -78917 -35499 28914 33012 34168 43622 66631
10324 66631 37818 -17727 -28748 -35427 -89866 -127847 -111820 44307 70125 29578 26651 116057
10312 116057 204047 194157 107815 119730 160395 140297 -13607 -40475 -42626 -130300 -184325 -222647
10300 -222647 -127803 -21727 -39650 -78575 -94039 -60840 -88100 -55769 48307 82474 84810
10289 84810 2694 34777 93268 80495 38847 45013 125835 148207 45635 -133110 -203742
10278 -203742 -246405 -216531 -225566 -242998 -151280 -28633 -33685 774 101998 122834 197536
10267 197536 157274 195845 201172 71710 33588 143583 78246 -25838 -36343 -63276 -60077
10256 -60077 -97949 -144572 -60625 51941 4090 -49725 -24956 12472 41894 41389 69732 107655
10244 107655 92053 78101 3019 -18784 -53270 20373 113045 38452 -86219 -97926 -81807
10233 -81807 -17087 -52646 -60191 4152 -20246 -83567 -69479 -30613 -63234 -70063 19868 47904
10221 47904 -19600 -82600 -105788 -94848 -44526 23600 53894 -18917 -33591 -8550 -31666 29259
10209 29259 35244 60539 59635 39803 -15566 -30256 -56795 -18929 -31705 -115773 -125796 -95588
10197 -95588 -91408 -67503 -89075 -49222 128113 104045 13772 52423 52027 133558 63972 36253
10185 36253 70427 88008 26308 -135682 -85464 -49382 -25336 8773 97606 35251 -50817
10174 -50817 -82854 -57440 -137224 -212301 -159429 -56695 -32974 -114751 -119290 -62745 -47356 23458
10162 23458 91586 132317 114003 18858 -50040 -111309 -87876 -22693 -8158 -70335 -115974 -67367
10150 -67367 25485 44797 11873 53553 118243 6471 -74796 -165974 -69753 -63383 -98082 23833
10138 23833 61746 8195 -45440 -22817 35609 37675 83346 127148 118347 64199 -35224 -89330
10126 -89330 -93695 -34344 -49213 -119101 -74713 -39588 -10611 86156 114049 87775 95336 89265
10114 89265 129614 92148 -24303 -162104 -73370 31438 -43579 -175850 -149018 -11790 -108621
10103 -108621 -271103 -212717 -18982 28906 -117186 -145225 -61041 5197 -2904 94472 197863
10092 197863 152889 122727 54251 18340 -25845 -13280 94528 150021 71236 -132623 -122619
10081 -122619 -60253 -81298 -89141 -376 177806 78551 -121206 -114992 33660 -1498 6738
10070 6738 47809 67981 -34391 -138922 -94064 -4685 -94559 -16021 56455 23534 1253
10059 1253 -55059 25615 109278 75078 101859 150280 148577 -41729 -158548 -76965 78011
10048 78011 43363 -106374 19888 151764 11605 -77704 -55763 17964 116363 49784 -19128
10037 -19128 -4209 -30111 -95932 -102341 -44193 -12036 -61191 -86914 -68959 -114022 -159176 -97614
10025 -97614 -24902 -25373 -89368 -54080 27161 21396 -34773 39980 239273 227714 59436 -36111
10013 -36111 -33422 -60651 -79920 -147829 -162788 -149614 -245487 -298055 -258187 -221806 -134781 8067
10001 8067 36220 42680 -63312 -7111 170231 183966 156545 197870 225339 155133 16883
9990 16883 34266 11499 52628 88856 108215 107894 56837 -38974 -69405 -15328 22561 -1927
9978 -1927 -31569 -30063 -115142 -144776 -91724 -60858 -53472 -111294 -63873 -55187 -173022 -159243
9966 -159243 -19620 19944 -32724 10376 112233 61846 -10874 -89514 -90495 -13722 2529 -10533
9954 -10533 -91444 -97440 -111007 -45894 -31930 -27432 18971 133571 125827 50973 -51509 -30322
9942 -30322 55439 117928 61443 1678 -2192 45033 -43367 -28753 57582 87096 26169 -80309
9930 -80309 -109923 -94673 -105568 -30047 71131 77987 174314 221984 243710 143078 118649 123845
9918 123845 138625 46667 -54229 -177088 -189122 -193313 -283224 -243620 -60706 -31495 -87192
9907 -87192 -143917 -98469 45764 66172 69562 22049 -32027 -70420 -126129 -112542 -81313 42030
9895 42030 39423 45168 67528 15446 -71713 -42208 97680 163186 135870 121819 169207 90232
9883 90232 47833 178830 209794 216380 142120 122922 84645 -89550 -224360 -270372 -216533
9872 -216533 -242977 -256734 -267262 -265588 -188530 -36531 85020 143242 216491 241108 161391
9861 161391 55921 -37415 10617 54864 -35760 -136491 -125315 -128477 -204754 -251204 -181260
9850 -181260 -56414 -68698 -159691 -140783 -137310 -91694 -59517 29514 153853 133789 114008
9839 114008 118631 102961 -16290 -80452 -1378 106605 -1764 -71645 -54236 5790 61852
9828 61852 -44009 7581 124224 186245 135295 44920 95698 140565 94763 36460 82418
9817 82418 89948 -18654 -97609 -123101 -76054 -165003 -46592 -24180 -110638 -234747 -211293
9806 -211293 -63990 8343 2415 17704 72093 36615 -117934 -75683 89359 87754 4593
9795 4593 -53800 4298 -28052 -54043 -30087 70924 177618 154575 25126 39050 69198
9784 69198 47994 -2579 57086 80371 34270 -1958 -24753 -58630 -208629 -112170 43133
9773 43133 92908 2455 -1026 115185 115719 -3848 30035 132639 167178 30407 -31912 62124
9761 62124 82921 66401 71390 162821 71132 -27655 -14436 -89297 -158742 -143896 -142038 -125842
9749 -125842 -120160 -70452 -81564 -14366 53230 4832 76080 106287 86343 13611 -118983 -227864
9737 -227864 -206063 -106610 -76841 -2228 16103 66612 -57181 -54272 -12145 65982 94610 -11283
9725 -11283 -77209 -75742 -101067 -105966 -22265 44052 92778 44983 11956 87534 113408 104051
9713 104051 138256 111118 114636 63521 -70640 -192500 -242805 -185870 -123421 -87894 -94111 -45622
9701 -45622 2334 -806 14407 -11030 18689 -45029 -11595 -16996 -62232 54921 117943 141763
9689 141763 95125 82369 39751 -19797 -130052 -175134 -182392 -182774 -227115 -250108 -234981 -218740
9677 -218740 -83189 8071 107180 217851 284602 299281 280618 220872 178490 91978 40759
9666 40759 32979 22238 -23753 -123181 -166252 -126381 -103339 -83103 -101296 -52776 -42295 -32734
9654 -32734 -36739 -49732 24416 100708 127923 36728 38967 29174 -30176 -128290 -143115 -46268
9642 -46268 45089 -35827 -86462 -99400 -140552 -213368 -236465 -118212 -21930 -64136 -78622 -55771
9630 -55771 24440 182824 278952 212032 140722 76211 21784 48174 72037 -27381 -72313 -19518
9618 -19518 -45806 -162052 -191623 -166671 -58839 -1652 6932 18744 18507 -19866 -113098 -21937
9606 -21937 19318 130111 62885 3641 12809 51115 32518 122008 128526 132673 59674 59600 2802
9593 2802 -83534 -104579 -184445 -257447 -179470 -153705 -123991 -83628 -108960 -22638 -26225 -5673
9581 -5673 84628 72883 -11093 24922 54037 45746 50679 50721 -9807 -66389 -48686 -75749 -73918
9568 -73918 -16264 -47166 -93360 -88574 -98933 -104284 -127521 -144053 -67474 16077 89491 136287
9556 136287 187004 207244 284669 287997 176960 90749 102073 30966 -83845 -235300 -237490
9545 -237490 -176880 -169590 -178858 -160178 -112414 34353 99905 105827 133651 172504 222062 126267
9533 126267 68844 -27798 -28241 -121445 -121619 -14739 -48817 -144606 -97588 -1824 -32640 -81191
9521 -81191 -94984 12554 4034 -53402 -35010 12319 33161 -231 82275 167015 94222 22642
9509 22642 34384 -5465 -76000 -199859 -257153 -111505 -118333 -198602 -252784 -149237 -78322
9498 -78322 -26928 11706 119920 228453 140645 95687 98554 69761 12426 -31999 -24811 -141493
9486 -141493 -210686 -258128 -200326 -159348 -182636 -139663 -41184 35538 -75052 -9120 33347
9475 33347 84615 80571 11121 66646 122075 67519 -78758 -108913 -18628 22357 21109 -52403
9463 -52403 -106136 -95482 -133085 -159763 -59816 -74775 -74863 37046 114165 130273 98040 156454
9451 156454 242678 224263 56369 40453 -28113 -71997 -157101 -97838 -3172 -88953 -187479
9440 -187479 -211818 -102183 -46171 -86862 -101403 81060 170404 -20604 -51173 5819 26037
9429 26037 -57595 -69985 43256 2775 -64347 -29783 7196 -12502 -58848 -41602 66990
9418 66990 -38694 -197201 -158874 -4489 -48701 -149025 -185318 -77089 -80491 -176159 -145156
9407 -145156 -96019 29673 51528 -13958 -8431 25863 87567 77773 104324 109600 101910 73655
9395 73655 6930 -49788 -40776 -48672 -71044 -10814 -144021 -158570 -100257 -16870 -46109 -113782
9383 -113782 -10241 -4356 27121 -10587 113297 135906 165850 59827 4051 27082 22446
9372 22446 -86225 -166762 -116777 -153850 -203758 -236119 -138584 -92675 -157833 -94672 -44234 -21856
9360 -21856 44393 132552 119524 19745 1007 12715 18043 -45678 -85341 37581 144492 30173
9348 30173 -95757 -117694 -13031 -90267 -225114 -220117 -117943 -93040 -162228 -184763 -15143
9337 -15143 78930 70598 54787 13822 38786 84349 54073 71898 42740 85045 124537 22386
9325 22386 -12416 -10590 -54169 40506 85279 5172 59161 80270 73491 -27616 -95847 -71278
9313 -71278 6055 -17117 -131794 -20846 78674 42591 -105052 -156344 -11244 77922 14939
9302 14939 9577 -22266 40731 41590 -51255 -6525 94021 113636 36696 52164 -22800 -5956
9290 -5956 36725 -32906 5156 -56486 -53648 -62504 -86951 39826 76129 122395 64966 25790
9278 25790 35774 62665 -1996 11334 -13359 -2959 24894 -62071 -215049 -216544 -58780 -39936
9266 -39936 -106756 -189107 -203257 -100321 -58839 -111437 -35563 114756 109613 106864 108392 85967
9254 85967 134902 164840 204324 76166 13128 -51446 -84709 -133600 -126250 -98876 -12115 -66086
9242 -66086 -140118 -100645 -58059 -3671 -83407 -97096 37050 68620 27533 -26413 69376 126516
9230 126516 90321 97971 48145 64100 1789 -120985 -174438 -179603 -215124 -209634 -160694 -143700
9218 -143700 -197388 -111333 -52723 -48073 -35108 151 138149 89533 -16005 13544 81452
9207 81452 117535 67563 66127 150516 115616 -52782 -153540 -65087 -16412 -113149 -143266 -136641
9195 -136641 -170680 -160902 -22375 57997 137271 204105 205485 156265 63646 84438 130658 115381
9183 115381 66412 11976 -23790 -61316 -165681 -184804 -164056 -112847 -15954 -79473 -154132
9172 -154132 -132263 -85049 -78343 -37053 30192 45067 119530 113376 67727 116029 25249 27678
9160 27678 86993 30084 -9206 -26792 -70502 -62244 -165607 -141792 -2287 8060 -31476 -25795
9148 -25795 41262 49072 -40367 -39453 51597 31642 -71550 -120794 -38542 34047 13503 -47928
9136 -47928 34599 144812 86434 -14713 36461 91951 29673 -24851 -11543 19033 -58920
9125 -58920 -122216 -37072 15838 -4966 -11942 68575 66666 -50863 -129259 -3294 53004 -58651
9113 -58651 -116438 -119530 -86587 -98693 -126051 -60977 111057 88864 77853 65534 -17983 -90978
9101 -90978 -266941 -237507 -92030 -54822 -141203 -105431 9915 29865 17049 22824 139218
9090 139218 106409 -16560 -65405 5753 -8812 -188022 -185357 -77132 -115412 -164763 -122488
9079 -122488 -69827 -118524 -111492 -59436 105825 105838 -100853 -137320 32856 68660 -118871 -130041
9067 -130041 47006 100948 -60682 -117641 2181 41470 -77258 -84830 35190 80080 -99321
9056 -99321 -184761 -71106 -3794 -119726 -123774 71751 40578 -196078 -275133 -125286 47522
9045 47522 -77298 -129745 74381 172283 -37425 -148276 7783 142207 66031 -74635
9035 -74635 42553 125897 -87084 -155075 47415 114017 -26342 -36516 -46306 -104754 -199381
9024 -199381 -295807 -135558 -32363 -56025 -71554 60511 150726 114566 68363 153489 151018
9013 151018 41038 -33529 -80283 -37301 -176015 -267396 -151212 31534 -72885 -199214
9003 -199214 -130506 -20445 -54833 -166028 -72514 95016 54168 -100313 13643 81332 32583
8992 32583 51618 138792 251701 149214 -23298 -54380 -9822 -63384 -134749 -6934 4188
8981 4188 -163249 -241789 -143131 13955 -23297 -78462 74432 168363 101059 29070 137889
8970 137889 142158 42575 -42151 -45796 -51463 -149933 -260469 -259531 -79750 -95443 -132414 -78292
8958 -78292 -52596 -83074 -116377 -40901 -4004 -51462 -47345 -1875 5035 -51836 -57420 24528
8946 24528 137699 35307 17292 120550 23628 -57428 -86283 -66943 -52895 -34920 -65885
8935 -65885 -59807 -18165 -82439 -117613 2090 69208 109545 127729 56146 42045 39190 53684
8923 53684 103419 70087 -14585 -30611 1695 -53498 -123287 -62114 34271 61031 69351 -24053
8911 -24053 -45909 -6286 -55105 -86068 7613 74756 -20431 -109629 -79840 29985 62526 9878
8899 9878 31620 -4090 -100418 -220452 -105945 -44084 -43501 -18496 -18665 16316 -295 190 13790
8886 13790 73112 142835 115053 111619 109183 -52849 -185718 -116829 -87173 -126854 -165008 -124335
8874 -124335 30202 -37417 -49704 9210 163914 197290 115299 137167 144773 80127 30857
8863 30857 67806 105185 56472 71593 73015 29614 -97074 -104215 -87288 -39319 -72768 -223510
8851 -223510 -178695 -154298 -198203 -157197 39649 120102 94033 93173 129277 149636 177505 196328
8839 196328 172793 151476 76485 -78243 -116660 -116642 -180352 -208737 -209843 -73303 -30827 -101686
8827 -101686 -76814 -19709 -52846 44884 71772 79459 141698 52148 14872 44410 61915 105235
8815 105235 122096 200651 199348 -70709 -206680 -112018 -43948 -189138 -282238 -155684 -96661
8804 -96661 -224403 -291822 -118750 31623 23681 -54801 -36787 57660 76786 171034 228021
8793 228021 220018 120452 41976 95626 -3501 -237298 -193505 -74255 -75474 -202189 -282915
8782 -282915 -170329 -189047 -295109 -254845 -51205 73545 8808 -12271 39785 94882 70381
8771 70381 70490 176772 178494 38869 -124940 -139875 -120897 -265455 -230299 -67762 -64845 -247392
8759 -247392 -372426 -264837 -176742 -96127 1886 151399 171097 21780 11384 118089 143329
8748 143329 76975 -14683 51390 77596 -101674 -260480 -191116 -31314 -37275 -119560 -42522
8737 -42522 2589 -53162 -164594 -44038 120258 60251 -22852 -1926 58997 -16207 -7011
8726 -7011 66900 111543 94948 77464 59923 116187 -32553 -143014 -65113 89937 49021
8715 49021 -91385 -63558 48073 5493 -110284 -33375 53436 -10034 -118520 -126469 -105237
8704 -105237 -185771 -206032 -104318 -70832 -131121 -200140 -214828 -78921 -29016 -79601 113830
8693 113830 222210 186941 27229 77887 155326 60007 658 30924 4414 -182536 -283819
8682 -283819 -194610 -171143 -92974 -56151 17490 43512 -27947 -25766 -52647 39262 114412 151134
8670 151134 127750 22802 -53091 -65673 -102343 -69650 -90356 -133531 -136506 -150366 -288943
8659 -288943 -360818 -236251 -81932 28544 -54096 -96752 4354 59072 40242 20267 127214
8648 127214 157826 -13208 -99981 -138054 -103108 -156958 -287963 -219090 -133211 -186464 -229007
8637 -229007 -160940 -142008 -85518 -5540 48087 74692 53695 93476 139651 141884 170559 173131
8625 173131 199242 165557 22054 -62103 -43110 18282 -36747 -128358 -86509 -47434 -117780
8614 -117780 -81182 11680 39952 64671 -62853 -55049 -13700 -112869 -101803 -54613 -14410 -70376
8602 -70376 -77712 -64201 -155466 -226051 -179361 -116587 -98633 -46522 7776 -2056 -54079 -172769
8590 -172769 -208401 -28805 14011 -17870 -275811 -358703 -1115 -29166 -76401 -35110 38183
8579 38183 37075 -79821 -80889 -68750 -56845 -88778 -73469 26927 77981 22280 53125 163531
8567 163531 135599 18005 44686 49677 -3956 -114081 -75097 14969 23883 -14082 32655 146695
8555 146695 92743 -22814 8835 82103 103629 -33720 -17914 80720 -68682 -216430 -156826
8544 -156826 5351 -58765 -105504 -53407 73505 54779 -128109 -69500 64429 40106 -90489
8533 -90489 -84153 -55287 -70946 -115976 -78127 36435 82791 -491 -74611 -2578 -51796 -89610
8521 -89610 7635 138863 44061 -3068 40957 80404 74156 -28597 -48564 -941 -50009 -124447
8509 -124447 -193976 -153655 -178174 -170233 -111814 -37122 -16824 -129718 -67165 79896 59219
8498 59219 -14585 56346 95024 28619 -63275 -89760 -35086 -2498 -20755 -63178 22087 -34031
8486 -34031 -147577 -80007 -4730 115660 -60958 -118496 11297 -15552 -140438 -236077 -34866
8475 -34866 42924 -87970 -198924 -114968 -61851 -149529 -252575 -150394 -46557 -3639 8257
8464 8257 20019 -17641 -84113 -28275 93300 86783 -80744 -86954 9219 -18408 -136356 -124011
8452 -124011 -33399 -17956 -103602 -187101 -176698 -94080 -123399 -126356 -32663 68339 -15482 -99415
8440 -99415 -11556 46495 97037 72014 106923 119191 -43769 -40232 116 -31500 -169038 -168840
8428 -168840 -31864 -14681 -159273 -76515 94439 180612 95429 24740 205580 281187 119706
8417 119706 52638 197266 345519 162178 71376 52169 7140 -120224 -243566 -254770 -244343
8406 -244343 -244652 -291049 -218867 -150375 -104315 -31931 83845 74364 65697 87474 187747 222450
8394 222450 17004 -80431 100332 151587 -55237 -270002 -174656 -19614 -167543 -245126
8384 -245126 -243730 -194980 -194877 -230691 -138841 -29222 -109246 -103187 77533 101179 26195 21767
8372 21767 -19460 -43410 -106795 -205736 -109646 -62130 -140446 -300255 -177784 -63979 -20421
8361 -20421 -55506 82936 136081 77480 3504 130031 254288 160451 66039 165388 174621
8350 174621 20595 -22655 -13818 54638 -54647 -125895 -119724 -124919 -208057 -270552 -170555 -19510
8338 -19510 -55897 -99644 -48973 97544 24492 25621 170493 216903 36569 -145084 -196222
8327 -196222 -230538 -279271 -352115 -380712 -182952 -122643 -128890 -85559 41065 63472 -9589
8316 -9589 -12102 83445 146772 -33695 -5910 73087 42192 -147710 -141014 -68129 -108647 -285030
8304 -285030 -230687 -194432 -163569 -263390 -283713 -150505 -57704 -45684 41566 242728 269789
8293 269789 216259 273790 376079 285450 133219 -3027 26839 -14533 -185793 -197662 -190497
8282 -190497 -282986 -317256 -236112 -66831 -20339 -19893 59030 85702 81487 -7550 -7831 107917
8270 107917 104028 -38965 -68688 -65529 -143842 -231692 -156719 -91039 -174365 -334290 -338240 -280807
8258 -280807 -292659 -202046 -74907 54380 74226 108111 118217 239105 207890 107333 35203
8247 35203 136766 67667 -176292 -222431 -158036 -155241 -207553 -234111 -80039 142 -28795
8236 -28795 -79019 29252 180822 134883 28048 21571 118241 101030 16501 56513 174724
8225 174724 127944 1924 2904 37300 -107717 -263513 -163465 -117978 -120458 -83067 -116153
8214 -116153 12537 96685 -35113 49711 127631 73791 -10065 -72323 -62109 -154122 -254613
8203 -254613 -212144 -167540 -154344 -193629 -149137 -72435 -100417 -56660 63154 166227 117177
8192 117177 364702 59951 -59858 -106224 -174159 10813 35699 -11752 -124627 -58561 -55497
8181 -55497 -107015 -171121 -146652 -20802 -90115 -210292 -123097 21508 51705 34752 157982
8170 157982 167371 211228 59606 -21440 55310 -19760 -61152 -10603 -65417 -209221 -249342
8159 -249342 -133030 -14978 -58699 -74713 68508 161788 115558 147 8651 149975 90197
8148 90197 -95560 -94409 56935 68075 -105232 -100032 -5918 -19065 -246308 -372460 -264281
8137 -264281 -241812 -319213 -308649 -197534 -121228 -132839 -94957 -31793 -9842 -84927 -67780
8126 -67780 28453 -68949 -160429 -67683 13071 -76548 -149044 -77192 -16423 2751 -18417 -13578
8114 -13578 38000 -22261 -72319 -6822 58891 14961 -26810 9034 81673 25921 -25652 4554
8102 4554 124024 112408 50901 71314 104216 82953 44229 49098 66606 52348 3785 73796
8090 73796 152124 11308 -104204 -111320 -84914 -166227 -273900 -367424 -169727 -114636 -138482
8079 -138482 -196064 -61046 90100 2912 -15774 26549 51446 35647 -52466 -144542 -163952
8068 -163952 -181371 -152484 -169642 -159633 -241089 -187371 -188196 -157168 -163559 -102118 -59736 11615
8056 11615 45282 17443 7239 71962 5323 -22822 93535 181895 137048 50731 47990 57715
8044 57715 52064 -9965 -19476 -157054 -222771 -239866 -185560 -108548 -56818 -28023 -26912 -8186
8032 -8186 44125 147744 166697 155885 157815 187638 219266 110048 -5108 -17900 26216 -40424
8020 -40424 -184710 -288246 -185154 -151312 -232109 -169344 -148913 -187643 -196104 -168989 -222580
8009 -222580 -147735 -43899 -66703 192 42528 93369 94215 73591 19787 -64396 9811 -10252
7997 -10252 -129140 -191861 -238522 -288762 -148752 -112953 -142292 -85477 14918 25189 -38671
7986 -38671 32291 146265 247017 103410 390 108386 163869 69390 -12522 4382 65033
7975 65033 15448 -115507 -141152 -55881 -66113 -114140 -141644 -85192 -47971 -93511 -82377 -118878
7963 -118878 -95404 12317 96829 134076 176990 130522 100474 83745 2785 -114670 -20248
7952 -20248 8385 -139723 -196699 -148308 -78927 -142858 -252562 -193704 -137817 -229425 -263532
7941 -263532 -285819 -241819 -106136 -49448 14699 29354 110444 76224 49441 151939 162989
7930 162989 85463 66380 6120 -117957 -195144 -81885 -7513 -133773 -253399 -205104 -101709
7919 -101709 -163107 -214671 -186779 -19428 34167 -94013 -170260 -4348 49832 36789 -4869
7908 -4869 36859 49382 -7284 -8903 91191 92545 -53429 -121653 -7188 -22740 -146525 -142017
7896 -142017 -170446 -191556 -198435 -132433 -66203 -22841 -88789 -36458 72189 63512 33343 111124
7884 111124 108137 45465 -16427 -116167 -72675 -51034 -154162 -146286 -97332 -108858 -125227 -101810
7872 -101810 -102644 -95302 -28515 40789 20982 -92778 -43391 25561 54757 -13099 -103278 21358
7860 21358 139098 -16004 -74927 36703 156491 151701 51887 1552 -15399 -83683 -205849
7849 -205849 -167164 -79607 -116699 -79944 -65455 -62804 -106876 -148467 -96228 50447 55729 -35932
7837 -35932 -64496 -15001 23909 -24294 91941 157150 -34137 -125440 -34892 31991 -36177
7826 -36177 -198069 -211032 -72463 -140352 -304427 -219969 -121445 -105848 -190643 -48849 112536
7815 112536 160309 92499 54898 93528 141189 67185 39445 32087 -167291 -181646 -171258 -183472
7803 -183472 -275295 -371323 -302161 -233672 -407484 -400811 -163133 38322 68618 12151 9845
7792 9845 165049 176862 36151 64498 212667 189655 63345 -73247 -113016 -138054 -267780
7781 -267780 -265821 -172704 -244582 -257955 -184734 -95204 -164421 -196493 22207 238066 198043
7770 198043 78071 116203 205590 178747 -22038 59547 220754 185348 -82367 -173244 -142489
7759 -142489 -114595 -225818 -188799 -50775 11668 -57775 -64606 -9759 76505 96337 132907
7748 132907 186926 204003 96785 117581 148100 194793 237374 237557 347873 397781 166259
7737 166259 156570 283495 309825 105919 -8954 112666 177179 101659 -34963 75422 225601
7726 225601 278676 231865 245805 294177 239353 191819 293841 343636 387077 399106 375915
7715 375915 281908 276378 361188 498296 498834 470416 531382 640470 713831 645227 743559 987844
7703 987844 1082773 1156678 1205049 1278789 1312253 1214709 1144130 1149906 1003815 908703 715157
7692 715157 558911 397144 269034 296700 328567 257769 192040 177779 284284 334731 399497
7681 399497 454033 527842 579547 514160 475919 517135 604713 572804 602353 790049 834569
7670 834569 896547 954937 950942 926642 911322 981253 928798 786630 680574 604236 497925
7659 497925 366456 409456 427298 417051 353564 248688 295434 315878 287978 278915 261409
7648 261409 175676 63129 -3782 106543 200007 188427 213830 307804 368536 321943 281057
7637 281057 361961 348440 303199 227681 250936 207985 -6765 -72364 79008 199068 209757
7626 209757 116987 258881 289703 253087 124105 203208 327537 393079 355080 258765 296156
7615 296156 293511 249543 270493 413516 386503 288685 162713 78947 63112 -8406 -75051
7604 -75051 41070 87783 -15037 -61139 -4257 115036 196077 271901 381745 428627 391299
7593 391299 277321 326130 407392 389363 289226 240181 181585 202158 133682 78787 140517
7582 140517 129119 155756 190938 214891 185934 113857 145654 188573 303414 394559 356054
7571 356054 280416 275103 397250 454328 447863 561283 548311 514131 429668 397126 362076 263470
7559 263470 410930 384596 337981 313026 247042 280693 312498 368096 362906 453275 466618 381226
7547 381226 393656 466051 541620 584086 673740 665625 634265 565422 506154 549194 597525 589608
7535 589608 634938 694257 548193 351068 334029 472309 477153 383253 389362 458007 441124
7524 441124 391094 467180 655555 798464 833467 864766 923013 908690 824598 809955 876546
7513 876546 937982 819646 732048 725161 753131 638993 697136 830343 812376 734515 697606
7502 697606 731913 833163 689113 669492 894667 1031397 1070303 1000954 1064694 1191351 1195237
7491 1195237 1110477 1200232 1332901 1288039 1199663 1157356 1152565 1149382 1022321 1051220 1161006
7480 1161006 1179117 1118563 1080841 1175926 1217679 1220801 1368964 1466065 1464732 1374651 1282524 1295076
7468 1295076 1385712 1500767 1586883 1682040 1633786 1576687 1614537 1701340 1700945 1666583 1671084 1666549
7456 1666549 1702093 1665837 1696083 1748041 1907507 2004375 2053710 2132555 2193329 2213554 2300147
7445 2300147 2379297 2436058 2570185 2621805 2638907 2623832 2710791 2895047 2929957 2898683 2902239
7434 2902239 3002698 3049532 2983224 2949073 2939724 2935816 3007216 3053371 2999833 3064989 3173875
7423 3173875 3371282 3510403 3751268 4022632 4189054 4214952 4328118 4477281 4574928 4697238
7413 4697238 4759731 4871788 4952029 4968782 5066197 5202232 5356934 5607370 5842270 6221124
7403 6221124 6641685 6929766 7329087 7869598 8374649 8755263 9252826 9870774 10421874 10936862
7393 10936862 11526541 12306741 13175891 14194617 15392781 17067167 19603495 23235289 27913313
7384 27913313 33339235 38610655 43272463 47793789 52281825 55916486 58205198 58652395
7376 58652395 57644934 56212071 53837106 50043908 45745955 41807884 38733299 36480591
7368 36480591 34895116 33898335 33321327 33039493 32982916 33355274 34116897 35116040 36494403
7359 36494403 38325522 40692721 43854857 48066204 53793151 61576905 72307635 87295917
7351 87295917 107182953 130320553 152611089 170071826 181464904 189246701 197569696
7344 197569696 207044427 214843664 219075623 219125829 213781692 202015423 183727364 161098300
7336 161098300 138335237 118062985 101279769 88001929 77704354 69848211 63838446
7329 63838446 59576353 56644544 54620168 53526851 53396965 54444559 56642615 59876807
7321 59876807 64177460 68959929 73881052 78604065 83236528 89023263 97667121 110490351
7313 110490351 128113097 149529208 170764385 188388676 200085096 203686274 200702307
7306 200702307 192972317 180355096 163670922 144236012 123401884 103510176 86330368
7299 86330368 72089380 60660966 51792321 44821648 39272987 34940366 31689046 29026355
7291 29026355 26841450 24964138 23337700 21924573 20606159 19316879 18180597 17210487
7283 17210487 16263768 15397044 14527784 13774476 13096779 12564404 12082604 11652738 11242404
7274 11242404 10852799 10409742 10009589 9685274 9334692 9065639 8775773 8502669 8167295
7265 8167295 7824412 7637302 7355703 7125758 6870681 6764186 6707014 6538183 6283645 6085160
7255 6085160 6056115 5921483 5627144 5468926 5414255 5280868 4902282 4628935 4625102 4599880
7245 4599880 4507356 4384531 4399465 4213605 3948009 3815782 3829638 3712726 3519646 3445931
7235 3445931 3510492 3450965 3287515 3252736 3325205 3291998 3181643 3157877 3196072 3073282 2895884
7224 2895884 2865714 2889489 2804811 2648360 2536677 2524951 2575964 2450655 2351048 2355398 2239772
7213 2239772 2209104 2143227 2038749 2024865 2005762 2021664 1967406 1997037 2060189 2083061 2043022
7202 2043022 2029341 1986839 2090959 2100548 1992155 1904866 1825799 1741569 1727253 1671780 1650511
7191 1650511 1748746 1730676 1625323 1564981 1581049 1584344 1618660 1530789 1566742 1557296 1429466
7180 1429466 1400922 1330443 1325324 1294329 1302307 1243286 1172823 1044927 946368 966349 966692 874023
7168 874023 862392 930824 1008072 1035703 1013701 1163215 1342855 1408849 1380940 1405583 1492744
7157 1492744 1419922 1328678 1336632 1254599 1149201 1053859 1097124 1029144 871545 791266 887053
7146 887053 1001488 1065098 1065407 1124647 1128626 1080526 1093926 1106087 1083151 1003287 966368 1005907
7134 1005907 990769 835120 790968 782701 814691 776716 742770 803440 830555 779284 876836
7123 876836 923659 963818 1098981 1221037 1176065 1070572 1141163 1283662 1341190 1269401 1249318
7112 1249318 1275023 1232652 1115238 1082666 1067422 1064247 1003093 856616 834209 872870 894241
7101 894241 964077 921305 908923 915609 924225 894110 785838 727055 859943 873636 929607 926054
7089 926054 916584 958432 1045945 1046786 1095004 1281937 1450700 1532071 1408867 1319611 1401577 1471922
7077 1471922 1452011 1380172 1356212 1382003 1267387 1068868 984723 1049646 950705 814932 654589
7066 654589 620469 630211 578778 583420 629853 599235 617323 608860 639373 600588 666610 745708
7054 745708 728409 707203 781960 758729 695729 580948 629913 726641 752623 773077 760200
7043 760200 766438 754557 822254 795095 905826 954246 1018385 1141670 1087796 969219 934463
7032 934463 972785 946746 843272 793801 741469 692682 587681 573477 698723 840518 849980
7021 849980 800405 836230 881754 958242 946296 880829 938398 974925 994953 958168 807775
7010 807775 807538 923637 878566 763576 690792 773748 788138 691840 705173 845577 991789
6999 991789 990412 944072 875803 943770 970191 1045764 1185106 1211387 1233594 1269307 1312697 1284295
6987 1284295 1483440 1701487 1817745 1782459 1783249 1873394 2009684 2073987 2059479 2092668 2164610
6976 2164610 2151032 2002685 1975666 1974273 1964178 1889765 1810930 1831097 1840954 1850093 1726156 1653850
6964 1653850 1627611 1697025 1753856 1684382 1641638 1671054 1715693 1754641 1814637 1977132 2201805
6953 2201805 2407462 2522650 2575040 2720709 2766230 2923783 3021239 3045306 3090725 3172475 3162781
6942 3162781 3089017 3089844 3196624 3192546 3073966 2936650 2872461 2797824 2672714 2493590 2301497
6931 2301497 2293729 2244768 2164607 2084842 2068438 2147267 2112577 2098422 2019900 2004627 2018401 1992823
6919 1992823 1904305 1854499 1947328 2000406 2054200 2145936 2306408 2515269 2680693 2848068 3072980
6908 3072980 3219228 3231732 3238085 3231244 3189460 3225448 3227756 3114161 2984160 2875393 2790842
6897 2790842 2724535 2616583 2523624 2572445 2552824 2477251 2348571 2342138 2341881 2436879 2507417 2539219
6885 2539219 2545338 2563362 2614886 2580095 2610318 2598557 2682587 2611094 2571092 2593046 2676137 2714235
6873 2714235 2772018 2791427 3006052 3196998 3237752 3217098 3330205 3576666 3676031 3739840 3792463
6862 3792463 3851759 3850395 3962446 4149729 4356629 4453675 4613609 4792731 4903258 4992012
6852 4992012 5226205 5551099 5878848 6293120 6989294 8070677 9305859 10359430 11104051
6843 11104051 11576444 11848981 12245196 12680787 12871257 12678295 12042585 11283886 10559322
6834 10559322 9978559 9683189 9373542 9191445 9189049 9283113 9503507 9880603 10353780 10968817
6824 10968817 11665547 12224329 12816129 13524872 14358336 15434557 16552282 17570239 18362446
6815 18362446 18921624 19584303 20675665 22306916 24701785 28093829 32282852 36715882
6807 36715882 40334276 42260446 43052404 44108747 45890189 47558651 47423159 44905364
6799 44905364 41365944 38280479 35896831 34439825 33924256 34191800 34996950 36219779 38000111
6790 38000111 40238348 42951197 46060721 49629295 53901117 59605494 67445195 77835290
6782 77835290 90106444 102504898 113327423 121201933 124772349 125142038 124884924 125546184
6774 125546184 126564940 125898427 122353833 117065805 111678436 106796605 101920184 96981044
6766 96981044 92864666 89672669 87086032 85535522 85910971 88498142 91971109 94226187
6758 94226187 94166132 92465728 90675909 89335745 87940381 85682566 82875882 80145655
6750 80145655 77479205 74997854 73270056 72354845 72347738 73061509 73985675 74935389 75757248
6741 75757248 76167417 76046541 75601580 75147488 75170663 76759265 80590012 87022920 96024550
6732 96024550 106921880 118337716 129531800 140138833 147967609 151563577 151542958 149571334
6724 149571334 146615869 142132113 136045232 129450644 122928229 115988610 108926609 102817561
6716 102817561 98031320 93915973 89002082 82737032 76016679 69857403 64702271 60512187
6708 60512187 57144455 54628559 53098334 52312225 52040051 52390845 53661520 55977205 59774951
6699 59774951 66003074 74776938 85419653 96371138 105219556 112069886 119557566 128866117
6691 128866117 138207292 143267313 141187244 134136951 126163768 119236664 112412292 103441168
6683 103441168 91827019 79408695 67944507 58274503 50682579 44626423 39761344 35937587
6675 35937587 33053057 30981078 29222502 27865403 26811421 25932530 24984835 24082139 23452745
6666 23452745 22812472 22270625 21983706 21818228 21619871 21348488 21071390 20846247 20645995
6657 20645995 20379119 20225291 20166271 20158706 20082156 20021578 20062100 20281826 20395943 20464217 20696772
6646 20696772 21104860 21647841 22347684 23167941 24170348 25622475 27586568 30486413 34555141
6637 34555141 39545840 44462051 47923525 49204386 49345144 49451156 49781456 50617976 52099557
6628 52099557 54426200 57262225 59920763 61239376 61062870 59959925 58649018 57601239
6620 57601239 56889025 57017864 58410104 61240663 65863934 72838132 82464466 94381846
6612 94381846 107452573 121427790 136597676 151532617 164147612 172194197 174092252
6605 174092252 171578016 165688929 156957893 148095651 140719771 134456771 128792222 123357445
6597 123357445 118238320 114317799 112256567 112095649 113751619 116816958 121110172 125903434
6589 125903434 131295798 138388188 148151448 160861526 176189839 193495245 213503346
6582 213503346 238260931 268664508 301941125 332842075 357925509 378594261 396421989
6575 396421989 408916580 409567153 395765390 370857459 337603243 299273868 261747507
6568 261747507 229640179 206991406 195984555 194360389 198893273 199917703 186497822
6561 186497822 165860365 146675086 130471227 118244565 108667904 101019289 95450463
6554 95450463 92143773 90939187 92301832 96010645 102355237 111598063 124097708 139287279
6546 139287279 157157007 177039160 196022475 211016742 221462091 227189282 227795030
6539 227795030 222642923 211342448 195625488 177202693 156853691 136171132 116592657
6532 116592657 99414995 85018408 73250376 63872762 56515047 50566523 45835943 42025404
6524 42025404 39037651 36577360 34218691 32256472 30624595 29065306 27527367 26181524
6516 26181524 25041715 24103719 23122995 22240888 21480364 20840476 20266044 19649321 19161735
6507 19161735 18770490 18485435 17957976 17554249 17144604 16782483 16429685 16134177 15733419
6498 15733419 15206146 14612901 14208116 13755690 13148592 12636933 12361948 12107221 11791293
6489 11791293 11403236 11063870 10985344 10736459 10438391 10309081 10296602 10068626 9680485 9268391
6479 9268391 8945876 8726799 8426268 8217854 8104572 7864899 7641623 7562630 7509099 7331313
6469 7331313 7286864 7281162 7244239 7013499 6745475 6651306 6557188 6319049 6052457 6050476 6064916
6458 6064916 5839897 5568384 5401491 5368868 5289851 5224180 5204178 5209228 5131975 5039630 5022896
6447 5022896 5025197 4921656 4859925 4859585 4736166 4531826 4389138 4376855 4292693 4160237 3998999
6436 3998999 3913455 3835212 3648201 3532678 3498997 3559992 3533776 3502465 3519452 3537475 3456796
6425 3456796 3389758 3371772 3465768 3470566 3419098 3367386 3253548 3120496 2999472 2915124 2884125
6414 2884125 2799127 2752022 2699619 2560329 2378791 2344597 2425976 2429766 2278421 2206929 2299578
6403 2299578 2401127 2319026 2209853 2281756 2354254 2367092 2392483 2411878 2483919 2485396 2522655
6392 2522655 2685633 2707327 2625435 2525264 2535943 2426528 2236261 2197861 2322689 2367863
6382 2367863 2106814 1903054 1997390 1974492 1835861 1666575 1693383 1858606 1709433 1583370
6372 1583370 1613579 1791872 1800666 1781100 1862177 1919415 1945849 1805907 1875296 1965483 1940354
6361 1940354 1968185 1992485 1945043 1850718 1757110 1930108 1961085 1804770 1806449 1804191 1769768
6350 1769768 1582930 1531849 1566345 1613910 1509862 1375103 1402755 1368495 1304712 1184478 1111102
6339 1111102 1178514 1215644 1178690 1040301 944183 975018 1034696 1111983 1119923 1158970 1182323
6328 1182323 1222354 1224635 1259601 1259761 1301911 1253315 1091216 1006048 1028357 1019435 979142 999385
6316 999385 1054369 1130609 1099406 932796 844490 743367 690787 634871 697509 717648 642112
6305 642112 568511 525595 531011 634696 661465 656855 699685 665575 650612 653813 695104 717212
6293 717212 729606 720232 711405 646293 598001 632421 668024 706850 611698 601363 614273 531071
6281 531071 474062 382168 407360 492813 525833 454161 434336 525473 648345 632972 658546
6270 658546 745281 816934 738543 606554 592832 621491 645031 601537 571013 617816 610642 598243
6258 598243 597541 631558 682694 613641 569344 575925 584152 618855 754654 855867 871247 893850
6246 893850 1042104 1217432 1164212 1093382 1139445 1237499 1237849 1176784 1107321 1143880 1125334 1000408
6234 1000408 941634 1042052 1104512 1003624 989799 1003619 1003140 970562 1068162 1208671 1230538
6223 1230538 1220762 1239829 1329585 1394797 1462013 1597116 1786459 1805026 1781635 1929961 1962798
6212 1962798 1905095 1815738 1858593 1894624 1751716 1521360 1365731 1275886 1160047 1079099 1011583
6201 1011583 1012104 967463 888210 859379 812423 801460 835516 834880 802500 782987 784358 756888
6189 756888 776442 805511 869226 992688 1105634 1122584 1166811 1320205 1460876 1530318 1524256
6178 1524256 1498321 1508995 1411047 1229934 1050729 999802 1002065 983216 907773 755043 788527
6167 788527 759803 694206 620171 575692 552019 410326 393620 349105 358402 387431 386468 467138
6155 467138 510710 482413 449107 364020 266190 253005 286781 268450 267708 196080 136347 69088
6143 69088 135777 205147 200843 245029 329624 306300 329875 288093 309214 316416 330379 289612
6131 289612 220929 262406 238098 141219 97649 228598 274682 248066 229535 235809 273498 291356
6119 291356 187637 207583 153949 146592 49871 18251 156574 299336 320606 249804 198920
6108 198920 289228 214419 131617 191988 248571 245168 228571 203500 174869 134176 172825 221534
6096 221534 166180 255650 282116 226279 235679 229838 270398 370694 483870 488535 475623 517712
6084 517712 509253 377272 308310 323553 359946 327960 278640 169338 136292 85276 90663 86463
6072 86463 56998 87618 68005 42518 73637 79415 107664 148398 154910 107369 69914 136090
6060 136090 147034 21468 76472 243121 116735 34023 -32530 27600 157589 153233 109900
6049 109900 149546 132930 135304 183388 135790 118307 8160 49947 230730 235494 154624 123486
6037 123486 220486 203250 125213 79333 308033 298473 88962 -76729 55220 119789 53309
6026 53309 28777 79009 114088 10111 -15188 115262 244392 181746 86311 100880 111337
6015 111337 7345 -35710 -2106 -14110 12807 25397 81506 23328 -80108 -19559 57799
6004 57799 183116 149959 37329 69402 49512 -25800 -48483 41932 146526 85450 -6931
5993 -6931 83565 146053 112653 93354 107095 171597 230626 163184 24072 95891 156983 141469
5981 141469 75051 107215 68466 -22157 26702 102198 115129 101589 142737 228573 114959
5970 114959 38748 104803 172113 76484 34254 121541 199925 148214 -4288 82555 230563
5959 230563 196693 -2721 -15315 43416 -94173 -132531 -74562 33396 16911 -21216 11681
5948 11681 103055 21359 -26198 99919 226346 190683 -576 -18703 64949 -34528 -170325
5937 -170325 -145077 -37838 -30000 -30573 15667 79918 96236 37202 22067 118265 181293 52167
5925 52167 14155 10781 -53912 -46465 28103 98147 158494 96695 105589 156944 85218 -15488
5913 -15488 34582 86059 52545 -2296 15046 22992 69822 69766 76269 79659 37381 -57967 -78272
5900 -78272 -1530 -9601 -53611 -41702 12246 -22545 -33109 -52265 47056 70077 46262 92811
5888 92811 163962 107252 -12234 -6926 134028 79068 -90072 -155131 -75775 -104024 -210163
5877 -210163 -88477 71263 149511 -46552 -80268 -8808 -28874 -141483 -88012 15031 40845
5866 40845 13062 50146 139108 147577 38860 109021 197387 138422 70224 74786 118107 44718
5854 44718 -71320 3071 117842 15384 -104392 -37181 130252 57761 -1300 63534 117016
5843 117016 75229 56893 116054 130778 153855 171420 203612 204272 88408 60647 54230 43786
5831 43786 -59469 -119793 56001 75349 2190 -54912 -109236 -121535 -89467 -70291 -69642 -42916
5819 -42916 -38673 -52944 29409 177164 239490 246459 215412 181584 150062 86160 27358 64434
5807 64434 109810 7829 -38898 -39063 -62100 -76571 -137620 -97797 -86547 -145637 -74040 -30354
5795 -30354 -58773 14082 89094 147303 237404 170709 59549 161030 179755 126567 93864
5784 93864 112694 90967 2758 -52902 -40387 -129171 -144640 -162062 -136007 -104735 -59713 -887
5772 -887 31129 91131 179475 160976 143753 74630 109004 113113 93196 78103 73142 139375 105573
5759 105573 -41502 -167893 -62123 -132296 -185827 -136928 -133588 -222941 -237068 -100971 -25605
5748 -25605 -126689 -101873 63669 176222 105537 42800 163925 220066 61787 31156 192379
5737 192379 253865 99194 -124570 -140266 -32862 -18438 -142843 -125894 -91933 -168974 -251541
5726 -251541 -240424 -101433 42093 87672 118165 179169 144239 159665 215309 194224 122569
5715 122569 95122 110539 133498 28398 -78074 -40730 -53538 -98920 -182698 -221284 -191928
5704 -191928 -198294 -271441 -243118 -109955 -35144 -39670 -14773 165350 172769 97393 72591 141527
5692 141527 134676 44302 -31086 -85482 -128024 -162186 -155619 -98118 -94903 -173911 -113525 -6994
5680 -6994 33140 -72319 -6937 257822 140487 -56556 14934 189221 132144 102322 69597
5669 69597 218198 200567 1942 -85186 -37571 -36771 -119871 -207493 -175789 -125008 -203628 -153296
5657 -153296 -10112 -13874 -9402 70314 133181 84331 -15459 3448 48816 -36717 -103457 12014
5645 12014 52799 26823 -68801 -61359 -36712 -71772 -118912 -145881 -164597 -69717 -103201 -106039
5633 -106039 -108205 -71986 -35235 10738 -85979 -61241 628 84185 89171 8306 98528 182336
5621 182336 35127 -14123 -30102 37372 35054 28146 41598 -12081 -29260 -72894 -131090 -50234
5609 -50234 -16602 1886 36985 30044 24849 42484 27265 -58937 -51515 -61916 17508 -20616
5597 -20616 -92395 -111204 -93635 -133085 -81841 -61598 -93293 -132522 -48836 -166325 -184682 -87326
5585 -87326 12377 -29727 -96110 -100380 -22316 89710 91267 77468 125656 121984 -24557 -78191
5573 -78191 -91121 -84863 -22530 -2921 -18091 13242 75123 43007 4378 13744 48226 115835
5561 115835 49109 25150 79972 127316 109588 -35922 -53144 -3442 38543 -33752 -67043
5550 -67043 76461 134792 139480 160640 138096 190448 113516 -27680 44727 -41374 -122122 -70722
5538 -70722 -20385 -128725 -187236 -191973 -141639 -175972 -205529 -131316 -12083 -83009 -151209 -87245
5526 -87245 36048 39087 17919 110498 180123 166214 106768 93465 120554 22926 -35884 -106541
5514 -106541 -138094 -85516 -45482 3016 -2091 -22590 92028 212593 180674 204356 298523
5503 298523 408577 427495 302318 176770 155414 122566 69132 106205 145037 105180 110119
5492 110119 177804 267704 272429 342797 420263 464566 474960 590721 644219 724218 736459 737538
5480 737538 693602 673857 623006 540895 516390 455436 450316 279043 112888 -23728 -43912
5469 -43912 -85868 -200463 -230304 -98959 -11438 -84597 -43955 104348 250497 150830 87295
5458 87295 197703 259951 177762 77093 40466 83727 25027 -51822 -82202 -88920 -63578 -32156
5446 -32156 -111272 -72638 -16492 41711 99190 -12190 -24991 75549 117812 128781 136310 140581
5434 140581 74332 60352 98104 37776 -5328 -65358 -59762 -117511 -237790 -216564 -181240 -198264
5422 -198264 -292253 -178321 10191 97149 79006 21691 60239 137810 187378 19883 -22172
5411 -22172 61784 -14630 -88233 -79003 -88966 -65086 -54460 -97273 -190828 -204058 -87576 -117398
5399 -117398 -141225 -173621 -193169 -59719 -112241 -158903 -6568 151045 76089 -65898 -2554
5388 -2554 120270 127912 34377 9469 57815 27736 30072 62599 11181 -56873 -26644 18733
5376 18733 34322 -44356 -49780 -56170 11384 -66844 -111769 -65238 15721 32862 -36556 -48159
5364 -48159 -11744 20980 -81819 -128576 33638 74284 -19737 -89723 -95971 789 -89177 -87650
5352 -87650 -53132 42478 110091 738 -100631 -79671 49169 -29047 -30416 6635 19649
5341 19649 35578 73737 -83536 -265009 -198918 -120380 -130891 -216505 -227711 -118519 -106250
5330 -106250 -123375 -136085 -42006 79804 85749 17076 26043 73063 150110 124221 26471 -43669
5318 -43669 -45654 -93445 -131423 -105678 -67487 2963 -25208 -123401 -143291 -19873 61793 27459
5306 27459 -137913 -49047 56042 59088 -48714 -22871 45393 39076 -93379 -153058 -128396
5295 -128396 -85535 -150978 -223283 -212073 -118676 -64554 -7479 18138 77 83613 220188
5284 220188 273243 153334 91208 147287 162839 14239 -123836 -140140 -65376 -91474 -244169
5273 -244169 -243548 -167826 -92555 -94272 -18617 7021 27845 23436 -32056 -59201 13913 171098
5261 171098 179361 6858 -99896 -7632 31350 -76328 -227910 -143076 4161 -43746 -204854
5250 -204854 -209767 -46237 -3578 -65367 -72731 26483 81632 60446 -10401 -71286 -54655 60223
5238 60223 56409 -71910 -125845 -114193 -106865 -155866 -252672 -299882 -149216 -91249 -153059 -124886
5226 -124886 -70243 50334 159077 9130 -41364 -12234 26047 -14310 -112924 -44272 74442
5215 74442 102741 12391 -78046 -15865 37647 -38869 -208274 -188375 -58412 -75692 -166158
5204 -166158 -275161 -197591 -96 76580 -64447 -35776 60220 78814 27073 -71485 120822
5193 120822 257159 212984 5827 -111538 -62147 -63771 -116188 -192141 -119109 -215039 -321350
5182 -321350 -262729 -261839 -286462 -185061 -53550 -60408 -128527 -97883 48404 106214 7269 -14825
5170 -14825 156285 203025 -7797 -180687 -85760 -9874 -54481 -200777 -197194 -39166 -58932
5159 -58932 -232594 -175754 -67955 29590 39871 111441 125625 100031 197103 199121 110021 49681
5147 49681 46737 149466 -13808 -154126 -219972 -154034 -77280 -291172 -297032 -143750 -117951
5136 -117951 -211242 -223284 -97091 -39636 -89056 -96628 -34510 -52640 -23886 -46904 -108192 -112971
5124 -112971 -143913 -71483 2449 -93733 -247237 -185241 -13564 -14230 -157487 -143121 66431
5113 66431 70015 -95087 -126253 -35528 52114 -90686 -117709 -105377 -79721 -136585 -175261 -49274
5101 -49274 42229 -4129 11742 30674 82358 128547 163411 277469 267318 49393 -4700
5090 -4700 14511 93936 -58780 -82809 -34966 -12612 -127018 -217497 -199312 -93821 -100780 -154807
5078 -154807 -37345 94336 30591 -165321 -114093 34746 57228 -114223 -118633 -79939 -144560
5067 -144560 -197775 -143192 -63163 -111445 -142653 -126295 -211647 -330320 -280575 -88502 12400
5056 12400 -13468 2354 37647 28702 18454 -10326 51257 72743 -54246 -153406 -76519 -121018
5044 -121018 -156085 -128840 -72228 -44243 -75116 -36405 6257 -62892 -133505 -97810 44536
5033 44536 130862 50370 -80614 13846 73286 76217 42697 96348 181979 72597 -15304 9530
5021 9530 24061 2235 235 -85178 -121827 -115835 -269605 -270563 -237244 -152736 -112646 -118736 -73657
5008 -73657 -62890 -63476 16156 16319 -9410 -5338 -17197 -49706 -38197 -62772 -154282 -151241 -80627
4995 -80627 -176067 -199267 -142781 -210008 -221313 -227881 -217283 -177078 -56031 29022 -8781 13345
4983 13345 160130 265230 348190 249342 247592 258901 138212 19457 12058 85517 52081
4972 52081 -160138 -189133 -115081 -121104 -166846 -154468 -50523 26379 -76595 -55398 15986
4961 15986 87154 99323 101273 148736 102637 19842 20066 101525 -83207 -141424 -23947 -33501
4949 -33501 -208176 -312854 -317737 -250515 -205337 -174563 -123683 -47807 39701 19281 -36926 -63432
4937 -63432 -35272 33643 -23809 -144792 -117792 -57574 -94120 -206566 -234789 -102126 51793
4926 51793 -18510 -110338 -69245 -69678 -112157 -64028 -61570 -58656 -70942 -132079 -149634 -130218 -102548
4913 -102548 -61591 2466 12937 35972 65291 114861 84432 116654 200058 157651 40867
4902 40867 -14417 -42301 9526 30266 4511 29408 -4516 -80773 -156774 -259300 -275463 -258779
4890 -258779 -205955 -138295 -204667 -264116 -134527 -60259 -14118 -12068 98623 215201 99317
4879 99317 -23742 -73177 30811 -1713 -105558 -217517 -271818 -281034 -269077 -353962 -388562
4868 -388562 -278710 -150729 -149752 -155373 -129489 -72912 -86767 -32449 106670 83694 59105 -14534
4856 -14534 -17653 -51450 -64071 6480 67459 70057 -20733 -103148 -113630 -105150 -186839 -222771
4844 -222771 -200589 -180989 -223284 -188441 -112610 -49608 -51415 -16549 48753 97372 82123 37432
4832 37432 44607 34614 23840 12181 58598 -56035 -192808 -247961 -256713 -219045 -243719 -199475
4820 -199475 -92212 -65926 -167423 -104492 -86904 -82571 -65100 -51512 75650 -45840 -116068
4809 -116068 -57788 -28095 15103 43689 -30680 -30832 -139456 -185231 -125614 -84131 -175085 -191422
4797 -191422 -112089 29552 -25170 -71566 17422 113791 239202 162243 44853 17313 15803
4786 15803 -48664 -157383 -175550 -82661 -109954 -140092 -159360 -180394 -172648 -42557 -730 71437
4774 71437 257 -29758 25467 71527 1165 -49968 82500 31664 -15414 -180461 -180703 -131997
4762 -131997 -241141 -250809 -220018 -76374 -98474 -169006 -152008 -24337 54115 97716 116709
4751 116709 184739 151978 51611 40724 -39859 -9327 -15789 26703 1564 -94909 -151201 -22550
4739 -22550 -23835 -54526 -9604 28257 -36285 -112340 -142263 -79888 47011 -15381 -38789 46631
4727 46631 32928 -125613 -101760 -126396 -154974 -148441 -173884 -258233 -208104 -212809 -175072 -58895
4715 -58895 -103377 -106857 -87888 -52795 -111714 -176394 -148796 1184 -25499 -126266 -282008
4704 -282008 -159937 -39191 -47574 6021 109714 223094 161886 10818 -78412 -13192 43530
4693 43530 -11511 -85650 -80200 -141567 -104082 -108476 -70122 -60888 -39401 87983 109222 62780
4681 62780 -16296 -14345 120441 138088 35289 36755 81955 24974 -101651 -61596 10759 -28748
4669 -28748 -131341 -239459 -230816 -211542 -287861 -252813 -144979 -140685 -88080 11305 25718 18863
4657 18863 -40506 14025 99283 12283 -31301 17591 54345 -95043 -171359 -33506 47819
4646 47819 -31772 -67869 69251 97408 16236 8449 68542 207217 186268 97954 144078 207131
4634 207131 102219 36892 26441 -19270 -88930 -145688 -74416 -63414 -178422 -181547 -80438
4623 -80438 51029 32238 29160 83985 234010 217110 143098 204813 119480 -17465 -107416
4612 -107416 -228908 -161198 -162599 -169475 -203205 -251404 -146912 -97507 -87161 -124924 -118604 -31726
4600 -31726 43014 53591 51977 38143 79420 43414 36311 108854 141923 129537 -4586 -97424
4588 -97424 -86929 -192847 -138434 -69409 -64323 -56267 -3309 78954 87916 82439 92199 204064
4576 204064 182799 101520 3211 5683 57830 -41139 -26306 -85618 -46190 -83864 -176935 -198333
4564 -198333 -72940 -35460 -1755 -40713 20611 -53424 -116634 -84709 -60736 -61681 -49358 -87750
4552 -87750 -75599 -43004 -140417 -173671 -143521 -189406 -189369 -168820 -132086 -134670 -185911 -159861 -67719
4539 -67719 1408 -52918 59862 161470 163857 157423 189865 151465 29583 -25460 -33428 -64054
4527 -64054 -84726 -105510 -33634 -97592 -162656 -159033 -41183 6181 -2800 21164 178323 231855
4515 231855 152799 96624 94225 88341 981 -46333 115581 176858 61686 -64628 -131256
4504 -131256 -166023 -139619 -81350 -99701 -96220 -165803 -235846 -143592 -107619 -5215 37774 73959
4492 73959 141283 197461 258235 214085 246856 198687 99979 66059 58472 97465 72030 -50427
4480 -50427 -22600 98043 97264 107536 168516 228032 205556 178268 183935 300745 321586 246092
4468 246092 240583 260121 294080 340068 362047 287094 292083 297975 224960 106881 83213 115566
4456 115566 184039 180313 75076 140715 215626 174408 210872 273944 346090 335764 358905 363111
4444 363111 360736 281348 309190 363881 297984 274869 171637 233668 213590 84980 56777
4433 56777 129906 190667 116449 76195 61478 174328 205813 85858 205595 318096 334480
4422 334480 275535 244111 241390 269958 263987 268337 257618 361087 406479 377523 327330 309870
4410 309870 330787 268074 182797 91405 59318 27748 37576 51823 97688 127222 165169 211312
4398 211312 115452 109088 185411 202549 172472 62951 49056 43931 26419 -45507 -15698 53078
4386 53078 166888 155542 72154 76173 61668 -33111 -3339 22890 31270 51337 74565 90952
4374 90952 113978 169564 247883 287448 262287 171498 165393 104466 -5687 -16552 -5974 -10438
4362 -10438 -17771 29113 50454 109270 193828 224075 296906 305555 300851 328723 307681 169451
4350 169451 142316 182804 156578 191444 230819 201075 256984 269809 234150 227562 277447 323772
4338 323772 234560 116391 205186 267261 265712 395549 551708 690801 804120 822127 760111
4327 760111 765533 656946 539942 476941 534157 603516 531556 401075 468187 497760 429685
4316 429685 385038 435162 408346 297243 161201 146644 156813 162801 168711 212185 242111 206758
4304 206758 204257 257657 355804 431184 474771 482179 525136 503619 421320 387867 417128 378012
4292 378012 331377 316003 312796 314642 290436 316346 267340 288740 367347 382474 402320 535607
4280 535607 606135 677651 664697 593731 656450 666286 647778 599158 632938 688940 610570 511920
4268 511920 473273 457933 464365 473816 454304 500652 445551 381876 418342 438236 457314 528889
4256 528889 547391 670874 770979 751427 732819 768210 859622 828966 765879 801895 829127
4245 829127 830191 768996 746579 759697 734500 790247 850782 900284 876729 810792 791868 823747
4233 823747 839540 878606 930881 919249 911593 921262 1012468 1166099 1250775 1230713 1247133 1229261
4221 1229261 1145208 1072256 1160609 1266167 1181484 1237684 1302436 1378109 1462037 1606466 1729644
4210 1729644 1815907 1869377 2033546 2054454 2083659 2141175 2190500 2380621 2529615 2633719 2739437
4199 2739437 2923894 3105746 3297562 3576004 3908281 4230118 4366600 4456554 4624951 4664199
4189 4664199 4548973 4526874 4605599 4680640 4696031 4715066 4860872 4967509 5066398 5198444 5560074
4178 5560074 5894733 6213756 6626164 7154811 7970387 8721017 9567978 10422626 11090188 11625110
4168 11625110 11895883 12072551 12238763 12263198 12297399 12355107 12489101 12549666 12549187 12659819 12755212
4157 12755212 12936944 13108749 13126636 13250604 13386729 13420733 13575197 13929584 14318725 14663483
4147 14663483 14990237 15351712 15682395 15846111 16246993 16878104 17804462 18911351 20120023
4138 20120023 21388379 22544421 23418063 23723816 23624343 23095503 22121705 21136268 20318648
4129 20318648 19636143 19024603 18545046 18273211 18006199 17725981 17509814 17303753 17147538
4120 17147538 17033210 17108031 17338732 17546686 17776462 18018159 18301639 18570572 18856980 19212265
4110 19212265 19415936 19397691 19578421 19664808 19783945 19904326 20023492 20063648 19871551 19395699
4100 19395699 18633386 17793510 16860600 15814050 14752672 13875701 13090884 12336431 11630415
4091 11630415 11065520 10732942 10545692 10362551 10323008 10343552 10605627 10971756 11300445 11686688
4081 11686688 12044506 12297680 12350766 12100029 11817611 11284551 10675101 10136444 9585976 9034261
4071 9034261 8469859 7942695 7434722 7026004 6700739 6385092 6159664 5966183 5755192 5430796
4061 5430796 5183274 5062234 4909380 4765119 4633012 4644764 4559966 4432917 4319782 4423781
4051 4423781 4463569 4442897 4509320 4671948 4734776 4737944 4650632 4649880 4855569 4825670 4833456 4867392
4039 4867392 5021594 5105177 5167687 5330079 5483334 5611092 5598939 5633802 5730077 5796682 5886352
4028 5886352 5997426 6106757 6194790 6272815 6317582 6513901 6701559 6880901 6963019 7162297
4018 7162297 7465784 7671446 7878860 8156722 8485280 8887513 9277030 9697128 10160398 10672256
4008 10672256 11203883 11936772 12911175 14083010 15512483 17263725 19606547 22515117 25877352
3999 25877352 29359745 32647664 35089522 36133778 35597444 33722658 30950876 27833988
3991 27833988 24858899 22124477 19779020 17854165 16234762 14924966 13885209 13110952
3983 13110952 12535438 12155953 11807175 11646491 11458643 11315360 11287475 11313197 11518248 11827630
3973 11827630 12170127 12518660 13094598 13828300 14741009 16049256 17619293 19524310 21634988
3964 21634988 23685893 25453321 26653120 26953051 26343787 25109005 23466423 21723934
3956 21723934 20218892 18942505 18019807 17261254 16849172 16813615 16884741 17043803 17279342
3947 17279342 17674793 18225385 18942756 19757951 20776230 22106464 23791196 25743927 27978868
3938 27978868 30778968 34294006 38539713 43508628 49688350 57060098 65157071 73040144
3930 73040144 79604590 83823573 84864651 82779255 78450231 72723652 66614443 60878106
3922 60878106 55677258 51167422 47111353 43332576 39737591 36712043 34152945 32120918
3914 32120918 30490883 29294351 28646148 28370204 28299823 28564994 29254625 30179455 31265187
3905 31265187 32651306 34448071 36752906 39674745 43485494 48298786 53955121 60010608
3897 60010608 65857416 70738229 73856629 74572944 72764257 69248240 64654268 59434150
3889 59434150 54368402 49866001 46181319 43172906 40801227 39363310 38692613 38501354
3881 38501354 38570192 38867130 39307310 39872061 40402526 41108909 42282669 43997875 46310386
3872 46310386 49511624 53857306 59361852 66317316 74448486 83407705 92244553 99790711
3864 99790711 105215993 107722522 107169960 104112417 99960814 95788731 91893452 88312654
3856 88312654 84993494 81768795 78600873 75533864 72905411 71049332 70109803 70171145 71429569
3847 71429569 73874688 77432212 81574445 85883428 90111068 93525209 95911009 97286368
3839 97286368 97664250 97160818 95730183 93282055 90103330 85822730 80211406 73676131
3831 73676131 66817734 59917679 53487426 47808745 43133780 39173721 35736690 32951932
3823 32951932 30883764 29244085 27639007 26286376 25217306 24270308 23285937 22341231 21651485
3814 21651485 21026733 20343664 19671846 19093220 18692108 18393560 18321009 18474129 18911909 19488957
3804 19488957 20407445 21913036 23853105 26128785 28877564 31730789 34134463 35562272
3796 35562272 35823417 35098542 33475846 31263908 28893174 26674746 24750286 22970721
3788 22970721 21450292 20170553 19254306 18627546 18172290 18017745 18074460 18455780 19318387
3779 19318387 20328289 21564909 22968058 24289646 25276257 25608532 25186511 24188035 22778268
3770 22778268 21031436 19090577 17407716 15926633 14447449 13117521 11915980 11003429
3762 11003429 10210544 9366176 8657284 8079807 7551896 7039535 6641674 6360522 6085707
3753 6085707 5850082 5564364 5343223 5168262 5031120 4900874 4839196 4734535 4561096 4471756
3743 4471756 4467271 4380465 4241107 4154019 4244079 4227405 3975186 3688301 3703841 3670814 3473865
3732 3473865 3383635 3448163 3479896 3339990 3290266 3287450 3337027 3349037 3276668 3205974 3174814
3721 3174814 3094121 2957475 2971120 2879572 2750190 2694453 2797030 2859288 2729381 2684633 2855805
3710 2855805 2905696 2732411 2642257 2625867 2594616 2437959 2324968 2337016 2336517 2269474 2267956
3699 2267956 2295761 2337547 2206493 2172868 2204334 2189550 2003444 1948486 2029059 1991010 1877027
3688 1877027 1809718 1966395 2112466 2130707 2155484 2357824 2490836 2429000 2259665 2336779
3678 2336779 2349301 2213980 2112137 2046599 2156842 2015605 1970028 2122002 2253695 2196155
3668 2196155 2046118 2067835 2106998 1950084 1762978 1840890 1953921 1974274 1935416 2046800
3658 2046800 2159574 2104734 2146611 2237884 2377565 2407091 2296540 2391271 2607094 2688568 2670437
3647 2670437 2903078 3254709 3520159 3822416 4187288 4615777 4930867 5041363 5020951 4906874
3637 4906874 4688793 4485492 4358952 4334771 4365068 4467966 4635674 4760385 4856619 5051933
3627 5051933 5433353 5795372 6225489 6658440 7100585 7518899 7971331 8357693 8770698 9139766
3617 9139766 9274194 9322353 9339788 9273266 9037070 8913501 8867508 8887138 8962808 9225562 9575336
3606 9575336 9886749 10195007 10469012 10647801 10943353 11113834 11300083 11514666 11556382 11454919
3596 11454919 11362493 11319642 11181521 10919507 10883755 10972473 10987431 11103288 11228820 11501973
3586 11501973 11806102 12119503 12451512 12818217 13075328 13132004 13014490 12829581 12399081 11862521
3576 11862521 11482323 11047198 10578191 10123404 9853469 9673776 9380137 9213443 9225087 9431454
3566 9431454 9563187 9780098 10165675 10486825 10533123 10426600 10211369 10016757 9721088 9455541
3556 9455541 9206412 8849301 8261122 7757206 7456935 7115961 6653518 6214311 6004143 5892480
3546 5892480 5705824 5414936 5316231 5460711 5511575 5429692 5454731 5590941 5572036 5352840
3536 5352840 5207005 5157612 4936128 4501436 4178879 4002418 3712931 3461939 3259010 3241489
3526 3241489 3102869 2880697 2785337 2757783 2692576 2475823 2348169 2384951 2454112 2262185
3516 2262185 2085559 2051972 2080609 1980864 1856181 1861189 1911703 1777633 1761613 1781657 1745793
3505 1745793 1718441 1602267 1618315 1682689 1552535 1507533 1508455 1497510 1476362 1449542 1433113
3494 1433113 1496222 1452882 1327883 1324797 1385347 1445421 1368432 1408337 1513290 1463054 1456499
3483 1456499 1455633 1546446 1532141 1481680 1438052 1453527 1432124 1311406 1292558 1377608 1401722 1278900
3471 1278900 1249493 1325289 1305130 1252590 1238559 1282845 1319237 1298150 1314282 1251739 1131691
3460 1131691 1116332 1091172 1157846 1199158 1089841 1121880 1226628 1195990 1144124 1141678 1254145
3449 1254145 1285959 1152565 1016566 1088144 1096966 1023558 1017941 1054665 1090120 1054012 1022760
3438 1022760 1091705 1183372 1135547 1091893 1116248 1054558 980833 956918 1044754 1027594 993755
3427 993755 1046296 1134292 1185035 1085523 996195 1095122 1250698 1188720 1131029 1191560 1196855 1061541
3415 1061541 988150 982457 1080637 1029658 1018337 1018124 1076401 935222 957215 1007994 1064196 1016271
3403 1016271 922208 942902 927150 893950 962395 1123953 1213099 1210965 1263566 1441158 1456018
3392 1456018 1337347 1209859 1159088 1112225 998195 961092 970003 975498 929997 907184 1003830
3381 1003830 1109361 1060767 1000438 1025352 1080227 1048421 1029027 1115637 1129752 1082717 968727
3370 968727 1041685 1034343 977841 964023 1047998 1068760 939578 827757 797685 862210 882505
3359 882505 814444 833610 1016958 980219 924480 967445 1113502 1039724 996009 949992 942032
3348 942032 942627 863310 954566 929355 931390 841965 927976 1047232 946588 893808 965903 1019684
3336 1019684 1053883 1030030 1042892 1077493 1029365 970105 979853 1038898 1073796 1083629 1031964 1098857
3324 1098857 1173237 1036502 1022146 1066697 1012145 1073268 1093102 1006361 1055388 1102944 1130415
3313 1130415 1052290 962120 1038307 985477 925047 820732 844209 914918 973509 891179 845050
3302 845050 935307 957854 1020964 991625 1070866 1171756 1165628 1130332 1105836 1079362 1091244 1060829
3290 1060829 1103860 1127173 1186108 1158144 1175126 1202778 1222290 1265185 1308738 1301631 1268588 1241129
3278 1241129 1257201 1289213 1325219 1355046 1375948 1446122 1460832 1486017 1416819 1497053 1554501
3267 1554501 1505543 1402470 1353519 1479241 1523550 1539609 1447782 1416287 1484325 1496755 1382969
3256 1382969 1437039 1536756 1514348 1449002 1544916 1648060 1720156 1758933 1875874 2054964 2200053
3245 2200053 2438478 2742018 3044249 3105338 3074049 2993281 2898512 2742398 2509454 2437949
3235 2437949 2370244 2228892 2040619 1993053 2048586 1977402 2013169 2099781 2259220 2385181 2516334
3224 2516334 2701028 3010382 3212246 3300570 3374370 3261668 2956996 2610974 2382720 2278094
3214 2278094 2201550 2182593 2246795 2206890 2151578 2207244 2356459 2499356 2507727 2540419 2711096
3203 2711096 2884599 2944408 2986924 3050140 3167360 3272161 3420048 3640606 4064464 4590845
3193 4590845 5307090 6170743 7041344 7393492 7378866 7121852 6735362 6349489 5953999 5660153
3183 5660153 5491724 5182458 4832496 4808867 4805535 4746925 4671588 4771493 5007017 5208376 5510654
3172 5510654 5981326 6632327 7072631 7119702 7019986 6736101 6269122 5774956 5406590 5053510
3162 5053510 4747842 4470145 4299947 4278531 4293804 4380752 4612623 5118045 5896563 6700307
3152 6700307 7373451 7648683 7538757 7200243 6735483 6231099 5839183 5450254 5147735 4854214
3142 4854214 4490935 4244601 4163204 4116903 4067215 4086481 4137849 4217914 4356470 4735181 5142229
3131 5142229 5669884 6361649 6978507 7245381 6896828 6173571 5546389 5020027 4344080 3851106
3121 3851106 3498741 3300309 3002370 2759621 2679319 2630161 2551608 2484983 2546276 2511669 2396260
3110 2396260 2357857 2295924 2110064 2007021 2094710 2184525 2250474 2334736 2498753 2804545 2998398
3099 2998398 2992600 2940184 2831599 2688520 2489288 2299796 2212920 2162418 2063171 1998687 2071359
3088 2071359 2120334 2070413 2038006 2140051 2216436 2278388 2332523 2517570 2669254 2700852 2744023
3077 2744023 2863611 2885419 2690700 2477215 2349169 2172200 1864456 1652518 1720279 1722476
3067 1722476 1601934 1527721 1587435 1565699 1400332 1245248 1370521 1482754 1386742 1241267
3057 1241267 1206825 1192814 1059702 949960 1053784 1267714 1243117 1197221 1293279 1402932
3047 1402932 1206078 1052555 1129953 1200693 995533 848144 1011325 1148256 1007052 941702
3037 941702 1138208 1322358 1258912 1155419 1156243 1150170 1097756 945433 1001791 1106231 981468
3026 981468 899527 1003533 1101413 1102463 1091524 1172258 1270350 1204334 1197395 1278559 1250782 1170496
3014 1170496 1105578 1171438 1325393 1315972 1287657 1354229 1347211 1353832 1316952 1348334 1361038 1189312
3002 1189312 989812 1020149 1041459 900520 848677 976136 1000334 958465 984126 1072011 1168259
2991 1168259 1183020 1161071 1179253 1240828 1114139 1099266 1154630 1176951 1056225 977660 977411
2980 977411 1095336 1001114 875642 990216 1155527 1124486 1041801 1091801 1143887 1052583 984163
2969 984163 988869 1099460 1116804 1014735 1039127 1100595 1033904 954490 1046311 1101089 1120282
2958 1120282 1049855 991387 1071551 1148690 1086189 1145354 1225122 1336666 1324442 1258113 1377244
2947 1377244 1393268 1210363 1250221 1313265 1204297 1000691 912695 1013764 1011262 914243 1048031
2936 1048031 1188936 1170145 1209111 1362778 1471580 1545783 1493290 1409698 1332323 1247800 1092039
2925 1092039 1016830 1048330 1000220 1029534 1144180 1119895 1079292 1088551 1141023 1254340 1325324
2914 1325324 1375240 1372901 1437267 1452475 1496185 1670768 1972403 2217089 2244698 2288495 2292222
2903 2292222 2108536 1901959 1718619 1633073 1558061 1370316 1212499 1293392 1342091 1313765
2893 1313765 1393568 1490156 1628982 1660764 1756568 1941432 2160242 2269562 2383538 2428832
2883 2428832 2367799 2177060 1916581 1822251 1731631 1562541 1523730 1642250 1680555 1617722 1672683
2872 1672683 1745924 1863066 2048807 2173094 2376369 2401899 2191474 1995969 1896890 1791012
2862 1791012 1672955 1617006 1561271 1541113 1522002 1466926 1432345 1373082 1301998 1235766 1252261
2851 1252261 1180230 1132998 1178693 1262064 1336186 1340671 1469876 1736479 1881108 1887226 1971995
2840 1971995 2150499 2149944 2005929 1788199 1652274 1639074 1551816 1401794 1430000 1506833 1546999
2829 1546999 1426852 1365766 1402042 1237779 1161956 1211560 1244496 1195682 1200477 1215427 1251221
2818 1251221 1170601 1130044 1296723 1432260 1373227 1285652 1293018 1283296 1135090 994609 1138793
2807 1138793 1150689 1119252 1014058 1003353 1103029 1148360 1085823 1065064 1211589 1310680 1171812
2796 1171812 1109174 1161555 1239215 1295661 1297727 1367828 1469826 1510733 1570926 1600648 1526984
2785 1526984 1483922 1576905 1495949 1321562 1228592 1169563 1229881 1212574 1217584 1294891 1502111
2774 1502111 1639865 1705178 1776584 1941573 2048541 2072635 2039174 2001254 1956514 1968332 2044763
2763 2044763 1980198 1994376 2134605 2168855 2094345 2054307 2020950 2075151 2133379 2024892 1954108
2752 1954108 1938148 1957770 1842499 1735440 1835438 1948414 1961345 2010367 2143700 2194024 2180805
2741 2180805 2144122 2290819 2373059 2385726 2384812 2395419 2486565 2588579 2671233 2815530 2974429
2730 2974429 3015519 3069803 3050201 3096105 3086579 3060950 3101076 3177326 3063082 2984378 3038011
2719 3038011 3135338 3143188 3107573 3278122 3557066 3634691 3680116 3792366 3913787 3945003 3921631
2708 3921631 3860772 3792337 3728102 3500657 3316267 3092248 2886991 2835901 2778394 2756457 2666418
2697 2666418 2566565 2631349 2644715 2595859 2658902 2876074 3042887 2963400 2916513 2923733 2925159
2686 2925159 2856363 2812759 2863702 2843583 2789813 2729253 2738931 2700437 2627432 2596425 2626717 2643988
2674 2643988 2604766 2658152 2820551 2987377 2999969 3137843 3361320 3493693 3541683 3782498
2664 3782498 4265664 4686013 5105478 5613334 5934985 6105953 6028785 5730408 5484336 5249886
2654 5249886 4982402 4607400 4252233 3945349 3790125 3615915 3384342 3364845 3448791 3485055
2644 3485055 3499329 3411705 3402969 3428813 3456418 3523768 3642367 3662908 3592208 3535480 3465151
2633 3465151 3386376 3371396 3355441 3319328 3139851 2938813 2853400 2774629 2622971 2535029 2471495
2622 2471495 2339433 2207843 2111606 2052220 2015592 1974489 1977401 2006604 1944245 1995696 2059444
2611 2059444 2048870 2005039 2114739 2346856 2516316 2657324 2681566 2778953 2835844 2750400 2609140
2600 2609140 2528712 2404041 2299190 2145808 2105445 2111516 2030716 2061558 2147235 2197324 2197230 2280828
2588 2280828 2467190 2597641 2612495 2547863 2435199 2348199 2200717 2046502 1986812 1885510
2578 1885510 1885287 1865278 1842269 1767703 1713265 1629476 1564387 1571509 1574425 1591513 1485633 1336551
2566 1336551 1416305 1423740 1344518 1350289 1464332 1562966 1598324 1558676 1718429 1902471 2046975
2555 2046975 2236583 2368104 2639287 2875791 3057403 3201944 3305254 3339295 3224703 2983735
2545 2983735 2792900 2599132 2398687 2243481 2286476 2275821 2224194 2130593 2235211 2405568
2535 2405568 2532943 2691895 2962923 3122147 3117248 3043871 3069634 2903218 2653729 2461198
2525 2461198 2363087 2289870 2177159 1963051 1779791 1694399 1665919 1578195 1450483 1449109 1455402
2514 1455402 1461424 1440219 1506049 1560989 1557657 1654442 1710427 1656485 1519285 1475728 1530918 1475319
2502 1475319 1392276 1476958 1579022 1562854 1440070 1496755 1609525 1624066 1601043 1573227 1572279
2491 1572279 1456974 1316610 1279409 1307594 1354996 1359466 1445661 1514873 1505455 1456499 1516576
2480 1516576 1613538 1537428 1455465 1480667 1485435 1370874 1354027 1527595 1668179 1644030 1542833
2469 1542833 1664621 1797084 1758514 1673136 1681776 1813481 1756441 1658965 1674531 1802961 1890863
2458 1890863 1936437 2007236 2118021 2174678 2162642 2203994 2268837 2226666 2241624 2349198 2421844
2447 2421844 2335112 2354474 2497204 2601950 2691824 2822504 3001296 3308999 3550413 3841288
2437 3841288 4229398 4838043 5531278 6318601 7008915 7444027 7498130 7344985 6931873 6341449
2427 6341449 5858568 5538979 5271563 4966431 4892723 4884076 4948496 5149695 5403558 5850649
2417 5850649 6470444 7170107 7807764 8394351 8692784 8484613 7911178 7257929 6604733 6036671
2407 6036671 5408710 4892254 4641082 4361142 4136417 4022238 4087206 4021169 3983621 4112144
2397 4112144 4111468 4058884 4139987 4288430 4350710 4374556 4437981 4710343 4997158 5164244 5288929
2386 5288929 5681289 6116937 6528630 7130942 8026620 9217383 10607862 12376858 14423967
2377 14423967 16369024 17738140 18323523 18298303 17495467 16154587 14975291 13931591 12941020
2368 12941020 11973503 11441618 11322150 11268822 11210458 11563567 12368146 13381459 14533976
2359 14533976 15777988 17023510 17779340 17574686 16651312 15492927 14186746 12669045 11338233
2350 11338233 10323892 9417901 8454376 7668906 7223942 6787014 6313058 6053769 5962311
2341 5962311 5817045 5577400 5493094 5661088 5818872 5759418 5802316 6044394 6344913 6367173
2331 6367173 6443052 6846244 7388282 7789330 8239239 9235726 10469314 11766405 13320347
2322 13320347 15029173 16598889 17651755 17910722 17611245 16741162 15378955 13916724 12783752
2313 12783752 11749328 10669452 9806689 9220770 8747827 8130161 7712175 7437059 7320047
2304 7320047 7066589 6873725 6889123 6975326 6942437 6931077 7256468 7753079 8148207 8518244
2294 8518244 9076901 9729447 10242444 10720536 11490030 12475377 13433206 14585452 15969414
2285 15969414 17169601 17720118 17585315 16929635 15963942 14671490 13332545 12291723 11328387
2276 11328387 10369780 9510493 9052372 8752118 8317418 7984661 7968861 8205415 8428356 8803708
2266 8803708 9491172 10282281 10939723 11198831 11296569 11269704 10926110 10445934 10118163 9695794
2256 9695794 9162209 8576672 8016258 7623286 7290439 6900787 6702999 6530780 6393367 6220223
2246 6220223 6141310 6093363 6131233 6180088 6338083 6522700 6682842 6921607 7233299 7583849
2236 7583849 7829330 7971316 8239712 8630135 9027898 9460600 9958686 10406760 10767152 10748100
2226 10748100 10390604 9871933 9240849 8603544 8043129 7507570 7076752 6722025 6453518
2217 6453518 6221152 6000797 5882163 5832051 5690484 5572464 5522334 5498004 5523184 5588748
2207 5588748 5692278 5802462 5966380 6181314 6340553 6389893 6422024 6330067 6194540 6116750
2197 6116750 6078932 5926861 5877248 5821991 5800681 5786452 5742290 5696378 5767989 5763903 5681877
2186 5681877 5614441 5605032 5614486 5562160 5621428 5685769 5740186 5751394 5821429 5905928 5891076 5885516
2174 5885516 5960759 6086823 6023685 5918798 5897883 5949709 6002166 6070913 6050670 6076248 6256118
2163 6256118 6372578 6368424 6369100 6500140 6530430 6532036 6535907 6539842 6643656 6593440 6605598 6708527
2151 6708527 6820577 6902707 6937087 7028309 7115688 7057108 7091792 7174579 7256978 7275679 7354485
2140 7354485 7478916 7493925 7468775 7537887 7677836 7783011 7825113 7848180 7950610 8041917 7991018
2129 7991018 7951884 7971956 8072266 8054809 8031901 8062585 8105807 8192571 8197857 8267553 8391896
2118 8391896 8443078 8411788 8425105 8417234 8461175 8566800 8681312 8695446 8781975 8911927 8869116
2107 8869116 8898398 8978907 9090813 9206830 9225628 9224561 9235100 9407894 9689343 10030293 10543388
2096 10543388 11580521 12951994 14280379 14984764 14627088 13673854 12676802 11768335 10989505
2087 10989505 10440014 9906899 9496686 9155257 8891583 8799471 8715167 8628308 8472236 8329321
2077 8329321 8230833 8213386 8248343 8204691 8186368 8266780 8231029 8107726 7974360 7955665 8010290
2066 8010290 7889180 7760628 7716996 7747929 7772890 7629165 7539368 7486733 7439518 7434296 7404567
2055 7404567 7391039 7250414 7143108 7197839 7155238 7027184 7107773 7074317 6931087 6803003
2045 6803003 6755463 6828581 6757529 6674556 6539355 6495331 6448621 6289147 6157943 6161459 6074142
2034 6074142 6066491 5971808 5912327 5900765 5821915 5814691 5843083 5790427 5715545 5726143 5628584 5451603
2022 5451603 5368993 5366501 5446306 5365605 5151876 5136600 5153994 5109410 5106164 5195751 5308968
2011 5308968 5317587 5252437 5116137 5103468 5137197 5108095 5031168 4955889 4936572 4946961 4865213
2000 4865213 4819295 4784069 4825523 4911310 4768829 4631665 4627617 4632926 4500815 4455238 4441742
1989 4441742 4455551 4469701 4456964 4402917 4436422 4436150 4476980 4498994 4468856 4427225 4375612 4289057
1977 4289057 4274077 4264518 4285174 4322010 4218866 4224226 4139046 4097760 4133975 4079440 4136345 4219861
1965 4219861 4180271 4092572 3962614 3878160 3911288 3821869 3803665 3838972 3826940 3818302 3759001
1954 3759001 3634609 3513820 3622498 3634698 3498967 3453185 3436025 3431095 3422546 3417436 3498853
1943 3498853 3616982 3618019 3603292 3638899 3672407 3705203 3740620 3769520 3823153 3864253 3869043 3816905
1931 3816905 3853520 3983627 4088243 4169749 4241013 4240980 4240247 4348148 4521522 4733141 5099799
1920 5099799 5471883 5881541 6076741 6205869 6276026 6422186 6612288 6663791 6689982 6500395
1910 6500395 6314379 6107471 6085363 6435347 7189050 7904365 8342313 8389787 8019548 7485338
1900 7485338 6887546 6468943 6076013 5702799 5213903 4812108 4459943 4174615 4051492 3980689
1890 3980689 3876896 3841721 3806291 3707989 3621108 3491160 3491458 3686279 3791037 3716462 3721352
1879 3721352 3782231 3872006 3945983 4008772 4167134 4282233 4364185 4436771 4459156 4658610 4996104
1868 4996104 5494711 5975843 6459834 6968323 7495361 8074850 8420737 8644894 8903992 9162297
1858 9162297 9389350 9569939 9825794 9995516 10076759 10067885 10023381 9949230 10008522 10082101 10405878
1847 10405878 11156237 12250249 13665422 15614789 18150731 20970117 23872417 26528421
1839 26528421 28556466 29818007 30427441 30733055 30941277 31265061 31557047 31465103 30509719
1830 30509719 28794356 26353850 23457437 20605921 17931421 15573043 13607871 12046388
1822 12046388 10837352 9688285 8725188 7930913 7262553 6694171 6164935 5920934 5800372
1813 5800372 5530153 5180091 4882860 4693006 4626507 4490431 4365275 4302218 4229708 4061536
1803 4061536 3847316 3620179 3539333 3550422 3565838 3484195 3358222 3249338 3174500 3148600 3146980
1792 3146980 3246189 3360055 3325192 3212653 3081289 3114048 3227047 3210998 3196242 3184718 3174901
1781 3174901 3075430 2946454 2945411 3011991 3065997 3129108 3193022 3223895 3240190 3273704 3395173
1770 3395173 3686940 4018640 4290217 4601899 4819873 5122550 5229930 5238670 5215387 5086978
1760 5086978 4914840 4588355 4281148 3985501 3734844 3451345 3399260 3346017 3233594 3082618
1750 3082618 2982725 3128370 3172865 3256310 3386918 3576188 3612285 3582437 3638317 3871934 4116438
1739 4116438 4316688 4695602 5195215 5427664 5427167 5373218 5190143 4937737 4734187 4456970
1729 4456970 4213430 3896724 3591752 3411467 3360229 3345498 3230947 3126714 3201701 3109742
1719 3109742 2874629 2860122 3020134 3108185 3192212 3314839 3574995 3849894 4107308 4410385
1709 4410385 4730387 4994891 4957460 4899035 4950285 4963517 4828668 4560049 4327839 3983381
1699 3983381 3584289 3158403 2858754 2705212 2486392 2350080 2335728 2323291 2305860 2242446
1689 2242446 2182140 2277324 2263203 2314648 2403007 2507280 2382580 2264387 2312156 2375148 2287989
1678 2287989 2241212 2335954 2316767 2172275 1998740 1995092 2058297 1986343 2072517 2187885 2215957
1667 2215957 2061621 2028981 2068382 2179984 2118272 2103587 2180682 2171171 2014211 1858173 1930386
1656 1930386 2021614 1974716 1878856 1875466 1904005 1750813 1646611 1782678 1992341 2003780 1902145
1645 1902145 1994653 1976268 1808647 1672559 1842734 1987175 2041050 1991294 1991823 1957640 1875368
1634 1875368 1934068 1986470 2053157 2078358 2166379 2249074 2182556 2210627 2391444 2589528 2653968
1623 2653968 2683688 2687998 2687562 2631473 2550571 2620807 2750940 2743183 2708889 2711309 2686009 2660938
1611 2660938 2679751 2763000 2844681 2836888 2817411 2807606 2789719 2810572 2940447 3136519 3309028
1600 3309028 3430441 3483046 3677756 3798944 3915741 4053113 4202847 4378436 4481090 4430495
1590 4430495 4453397 4625132 4726454 4649900 4567368 4541873 4463732 4269711 4084431 3983582
1580 3983582 3884958 3821017 3787504 3799085 3660457 3392023 3197682 3140402 3038502 2963457 2841959
1569 2841959 2710977 2600020 2457661 2497518 2623855 2621220 2503040 2468141 2421994 2299967
1559 2299967 2236873 2217320 2341691 2339942 2315308 2415815 2442197 2391318 2437322 2559045 2712680
1548 2712680 2674625 2639765 2650529 2540383 2362309 2311758 2374566 2401183 2297146 2309355 2376117
1537 2376117 2391322 2328851 2353804 2522413 2629146 2590875 2519175 2585104 2644633 2643125 2666047
1526 2666047 2715964 2833513 2851157 2829835 2802148 2745133 2754921 2780267 2883047 2867036 2918567
1515 2918567 2901697 2951268 3009313 3053441 3173676 3261344 3336554 3287253 3235960 3257307 3387691
1504 3387691 3581305 3688362 3717470 3875808 4084185 4212963 4387629 4577867 4854254 5090879
1494 5090879 5323038 5496734 5683017 6002725 6283271 6528991 6737574 6955994 7082634 7227045
1484 7227045 7391775 7626246 8058460 8509897 8929934 9451473 10101123 10850538 11737897 12782987
1474 12782987 13994466 15140430 16273448 17329090 18337551 19332197 20249996 21121024 21947870
1465 21947870 22524086 22806488 23043928 23197871 23254838 23211819 23271573 23426722 23568420 23741945
1455 23741945 23848709 24023844 24285258 24520004 24811032 25217053 25480441 25386715 25083084 24629388
1445 24629388 23979520 23224942 22296723 21359652 20337447 19202371 18081916 16964274 15871536
1436 15871536 14906173 14105009 13296065 12434205 11636724 10970522 10501918 10143792 9897054
1427 9897054 9750958 9615358 9524071 9377726 9287937 9303422 9312206 9352666 9309285 9248463 9243685
1416 9243685 9298063 9333677 9226492 9224493 9322960 9438903 9488912 9423945 9464266 9653128 9889470
1405 9889470 10133605 10457976 10657669 10874486 11138716 11408664 11623047 11885141 12082001 12147804
1395 12147804 12163007 12068039 12018343 11934293 11981809 12048783 12162872 12391102 12624712 12815642
1385 12815642 13073195 13257254 13350653 13450455 13423888 13208075 13001623 12783239 12515359 12198393
1375 12198393 11967083 11786633 11661759 11600536 11554218 11783758 12002887 12179551 12343522 12473971
1365 12473971 12603362 12573608 12560570 12555518 12585368 12634511 12755302 12832657 12955301 13068885 13143935
1354 13143935 13189877 13253470 13328034 13591847 13859400 13954355 14055346 14274971 14561433 14708787
1344 14708787 15012091 15445493 15791660 15950570 16054319 16243925 16508397 16825674 17221388
1335 17221388 17723481 18327080 18965974 19651153 20365969 20854137 21104692 21198656 21246499 21085646
1325 21085646 20688270 20207699 19740958 19285462 18632220 17912988 17262295 16727393 16172837
1316 16172837 15635657 15235771 15021726 14764683 14401420 14159361 14009091 13980026 14041253 14136134
1306 14136134 14278456 14353900 14251710 14141562 14131083 14127992 14185001 14369635 14704752 15017924
1296 15017924 15401963 15745701 16222107 16696355 17184818 17926123 18833984 19696522 20403846
1287 20403846 21009801 21617847 22064187 22187987 22260660 22506577 22717934 22822883 22909337 22924964
1277 22924964 22626174 22077876 21409096 20649879 19854130 18986248 18298871 17672746 17161086
1268 17161086 16726815 16428439 16183341 15884422 15613512 15560236 15706553 15598381 15252797 14886923
1258 14886923 14541715 14123739 13735553 13555327 13751926 14043448 14264680 14434799 14595442
1249 14595442 14583747 14252933 13891336 13620841 13372380 12931892 12584610 12419041 12237642 12295293
1239 12295293 12518921 12789892 13161884 13583458 14161746 14738165 15361744 15749336 16112109
1230 16112109 16436670 16673326 16854144 17043678 17591436 18246090 18838514 19339416 19700228
1221 19700228 20046258 20276523 20459781 20699869 21027114 21360825 21554766 21624895 21504613 21198912
1211 21198912 20790711 20426501 20015766 19681195 19448612 19017334 18346242 17461826 16464894
1202 16464894 15487862 14555601 13606450 12896252 12443378 12049261 11698572 11394443 11258236
1193 11258236 11172626 10926753 10629565 10312556 10051132 9786317 9465451 9310407 9234164 9096458
$$ [...]
##END NTUPLES=NMR SPECTRUM
##END=
