##TITLE=1H_DE-80H_X3
 200.13MHz, d2o
 8 sc
 
 19ns.26.2.2025
##JCAMPDX= 6.0         $$ Bruker NMR JCAMP-DX V2.0
##DATA TYPE= NMR SPECTRUM
##DATA CLASS= NTUPLES
##ORIGIN= UXNMR, Bruker Analytische Messtechnik GmbH
##OWNER= pz
$$ XWIN-NMR		Version 3.5
$$ Tue Apr 28 10:46:59 2026 Russian Standard Time (UT+4h)  Yarkov@DPX200
##.OBSERVE FREQUENCY= 200.1313
##.OBSERVE NUCLEUS= ^1H
##.ACQUISITION MODE= SIMULTANEOUS
##.ACQUISITION SCHEME= undefined
##.AVERAGES= 8
##.DIGITISER RES= 18
##SPECTROMETER/DATA SYSTEM= spect
##.PULSE SEQUENCE= zg30
##.SOLVENT NAME= DMSO
##.SHIFT REFERENCE= (INTERNAL, DMSO, 0, 18.0189)
##AUDIT TRAIL= $$ (NUMBER, WHEN, WHO, WHERE, WHAT)
$$ ##TITLE= Audit trail, XWIN-NMR		Version 3.5
$$ ##JCAMPDX= 5.01
$$ ##ORIGIN= Bruker BioSpin GmbH
$$ ##OWNER= Yarkov
$$ C:/Bruker/XWIN-NMR/data/yarkov2/nmr/H-C/1/pdata/1/auditp.txt
$$ ##AUDIT TRAIL=  $$ (NUMBER, WHEN, WHO, WHERE, WHAT)
(   1,<2026-04-28 10:44:36.31 +0400>,<Yarkov>,<DPX200>,
      <created by zg, POWCHK disabled, PULCHK disabled
       configuration hash MD5:
       00 E9 B6 7A A2 85 ED C7 34 08 36 98 17 FE 4E 26
       data hash MD5: 16K
       6E 08 B4 37 99 42 D9 47 59 D8 FB AA E4 F3 49 C1>)
(   2,<2026-04-28 10:44:57.96 +0400>,<Yarkov>,<DPX200>,
      <Start of raw data processing
       efp BC_mod = 2 LB = 0.25 FT_mod = 6 PKNL = 1 PHC0 = -5298.916 PHC1 = 11.42193 SI = 16K 
       data hash MD5: 16K
       74 8F 3B 38 54 80 B1 EA 4D 22 DB 5B 23 7A 9D 76>)
(   3,<2026-04-28 10:45:56.20 +0400>,<Yarkov>,<DPX200>,
      <pk PHC0 = -2.799999 PHC1 = 0 
       data hash MD5: 16K
       71 A4 19 37 03 A6 65 AA 98 FF 45 BE E9 39 7E E9>)
(   4,<2026-04-28 10:45:59.67 +0400>,<Yarkov>,<DPX200>,
      <abs ABSG = 5 
       data hash MD5: 16K
       2E 3B EE 49 82 58 32 9E 78 E1 7C 31 2D 5B 0F 16>)
$$ ##END=
$$ 
$$ hash MD5
$$ B7 9A 10 3E 2F B6 CE CA E2 D9 59 EC 97 81 45 A8
##$RELAX= 
##$RELAX= 
##$RELAX= 
##$RELAX= 
##$RELAX= 
##$RELAX= 
$$ Bruker specific parameters
$$ --------------------------
##$DU= <C:/Bruker/XWIN-NMR>
##$EXPNO= 1
##$NAME= <H-C>
##$PROCNO= 1
##$TYPE= <nmr>
##$USER= <yarkov2>
##$AMP= (0..31)
100 100 100 100 100 100 100 100 100 100 100 100 100 100 100 100 100 100 
100 100 100 100 100 100 100 100 100 100 100 100 100 100 
##$AQSEQ= 0
##$AQ_mod= 1
##$AUNM= <au_zg>
##$AUTOPOS= <>
##$BF1= 200.13
##$BF2= 200.13
##$BF3= 200.13
##$BF4= 200.13
##$BF5= 200.13
##$BF6= 200.13
##$BF7= 200.13
##$BF8= 200.13
##$BYTORDA= 1
##$CFDGTYP= 0
##$CFRGTYP= 5
##$CHEMSTR= <none>
##$CNST= (0..31)
1 1 145 1 1 1 1 1 1 1 1 1 1 1 1 1 1 1 1 1 1 1 1 1 1 1 1 1 1 1 1 1 
##$CPDPRG= <>
##$CPDPRG1= <>
##$CPDPRG2= <>
##$CPDPRG3= <>
##$CPDPRG4= <mlev>
##$CPDPRG5= <mlev>
##$CPDPRG6= <mlev>
##$CPDPRG7= <mlev>
##$CPDPRG8= <mlev>
##$CPDPRGB= <>
##$CPDPRGT= <>
##$D= (0..31)
0 0.7 0 0 0 0 0 0 0 0 0 0.03 0 0 0 0 0 0 0 0 0 0 0 0 0 0 0 0 0 0 0 0 
##$DATE= 1777358675
##$DBL= (0..7)
120 120 120 120 120 120 120 120 
##$DBP= (0..7)
150 150 150 150 150 150 150 150 
##$DBP07= 0
##$DBPNAM0= <>
##$DBPNAM1= <>
##$DBPNAM2= <>
$$ [...]
##$SUBNAM3= <"">
##$SUBNAM4= <"">
##$SUBNAM5= <"">
##$SUBNAM6= <"">
##$SUBNAM7= <"">
##$SUBNAM8= <"">
##$SUBNAM9= <"">
##$SW= 18.0517328524113
##$SWIBOX= (0..15)
0 0 2 0 0 0 0 0 0 0 0 0 0 0 0 0 
##$SW_h= 3612.71676300578
##$TD= 16384
##$TD0= 1
##$TE= 0
##$TE2= 300
##$TE3= 300
##$TEG= 300
##$TL= (0..7)
0 120 120 120 120 120 120 120 
##$TP= (0..7)
150 150 150 150 150 150 150 150 
##$TP07= 0
##$TPNAME0= <>
##$TPNAME1= <>
##$TPNAME2= <>
##$TPNAME3= <>
##$TPNAME4= <>
##$TPNAME5= <>
##$TPNAME6= <>
##$TPNAME7= <>
##$TPOAL= (0..7)
0.5 0.5 0.5 0.5 0.5 0.5 0.5 0.5 
##$TPOFFS= (0..7)
0 0 0 0 0 0 0 0 
##$TUNHIN= 0
##$TUNHOUT= 0
##$TUNXOUT= 0
##$USERA1= <user>
##$USERA2= <user>
##$USERA3= <user>
##$USERA4= <user>
##$USERA5= <user>
##$V9= 5
##$VALIST= <valist>
##$VCLIST= <CCCCCCCCCCCCCCC>
##$VD= 0
##$VDLIST= <DDDDDDDDDDDDDDD>
##$VPLIST= <PPPPPPPPPPPPPPP>
##$VTLIST= <TTTTTTTTTTTTTTT>
##$WBST= 1024
##$WBSW= 4
##$XGAIN= (0..3)
0 0 0 0 
##$XL= 0
##$YL= 0
##$YMAX_a= 327408
##$YMIN_a= -314417
##$ZGOPTNS= <>
##$ZL1= 120
##$ZL2= 120
##$ZL3= 120
##$ZL4= 120
##$ABSF1= 18.01886
##$ABSF2= -0.03303528
##$ABSG= 5
##$ABSL= 3
##$ALPHA= 0
##$AQORDER= 0
##$ASSFAC= 0
##$ASSFACI= 0
##$ASSFACX= 0
##$ASSWID= 0
##$AUNMP= <proc_1d>
##$AZFE= 0.1
##$AZFW= 0.1
##$BCFW= 0
##$BC_mod= 2
##$BYTORDP= 0
##$COROFFS= 0
##$CY= -3
##$DATMOD= 1
##$DC= 0
##$DFILT= <>
##$DTYPP= 0
##$F1P= 0
##$F2P= 0
##$FCOR= 1
##$FTSIZE= 16384
##$FT_mod= 6
##$GAMMA= 0
##$GB= 0
##$INTBC= 1
##$INTSCL= 3.241238e-09
##$ISEN= 128
##$LB= 0.25
##$LEV0= 0
##$LPBIN= 0
##$MAXI= 10000
##$MC2= 0
##$MEAN= 0
##$ME_mod= 0
##$MI= 1.114404
##$NCOEF= 0
##$NC_proc= -6
##$NLEV= 6
##$NOISF1= 3.799351
##$NOISF2= 2.8
##$NSP= 0
##$NTH_PI= 0
##$NZP= 0
##$OFFSET= 18.01886
##$PC= 1
##$PHC0= -5301.716
##$PHC1= 11.42193
##$PH_mod= 1
##$PKNL= yes
##$PPARMOD= 0
##$PSCAL= 0
##$PSIGN= 0
##$REVERSE= no
##$SF= 200.129500253021
##$SI= 16384
##$SIGF1= 3
##$SIGF2= 2
##$SINO= 0.751879
##$SIOLD= 32768
##$SREGLST= <19F.Aceton>
##$SSB= 0
##$STSI= 16384
##$STSR= 0
##$SW_p= 3612.71676300578
##$SYMM= 0
##$S_DEV= 0
##$TDeff= 16384
##$TDoff= 0
##$TI= <>
##$TILT= no
##$TM1= 0
##$TM2= 0
##$TOPLEV= 0
##$USERP1= <user>
##$USERP2= <user>
##$USERP3= <user>
##$USERP4= <user>
##$USERP5= <user>
##$WDW= 1
##$XDIM= 16384
##$YMAX_p= 307494597
##$YMIN_p= -1065605
$$ End of Bruker specific parameters
$$ ---------------------------------
##NTUPLES= NMR SPECTRUM
##VAR_NAME=  FREQUENCY,     SPECTRUM/REAL,   SPECTRUM/IMAG
##SYMBOL=    X,             R,               I
##VAR_TYPE=  INDEPENDENT,   DEPENDENT,       DEPENDENT
##VAR_FORM=  AFFN,          ASDF,            ASDF
##VAR_DIM=   16384,         16384,           16384
##UNITS=     HZ,            ARBITRARY UNITS, ARBITRARY UNITS
##FACTOR=    0.220516191357247, 1,           1
##FIRST=     3606.1054195677, 0,             0
##LAST=      -6.61134343808499, 0,           0
##MIN=       -6.61134343808499, -1065605,    0
##MAX=       3606.1054195677, 307494597,     0
$$ Real data points
##PAGE= N=1
##DATA TABLE= (X++(R..R)), XYDATA
$$ [...]
4716c7669k1725J4830L5337m2345l8055J8848K8950J0960o066k9916N4624J3n778
4703a7992l2687q7277J2033P3255l2106l0070N5592L0647j7246N160k84L9879
4691a096j0285k7667k1989K6524L036R992O1320k6644l7702o0320L5937K1332
4679b7562m10j7394L0169m181j1977r221M1298m3575L2444K7250k6316k6286J0737
4666b5024l4268L1058N39o1043N8231j7843q19N402k2137n004n116n1693J0595
4653a17122R4104L9727j6372m193n5762r439n0819m9009k5183J5749P4040q215
4641a12494j853L0393K7056m086l3812O6892K121Q472l4547J0450J9577P192o854
4628b1493o401n580p029K1092J3160K4538k4145J9431p298k6689P716J0991Q2037
$$ plain form
4716 -37669 -59394 -44564 -9227 -51572 -89627 -70779 -41829 -30869 -36935 -66851 -12227 -12214 -17992
4703 -17992 -50679 -137956 -125923 -52668 -84774 -114844 -59252 -28605 -45851 -40691 -40975 -1096
4691 -1096 -11381 -39048 -61037 -34513 -31477 -21485 39835 13191 -24511 -84831 -48894 -27562
4679 -27562 -27972 -45366 -15197 -19378 -31355 -40576 722 -42853 -10409 16841 -9475 -35761 -25024
4666 -25024 -59292 -28234 -27695 -88738 -30507 -48350 -49169 -43767 -65904 -70908 -76024 -127717 -117122
4653 -117122 -23018 16709 337 -3856 -59618 -69057 -119876 -168885 -194068 -178319 -104279 -112494
4641 -112494 -114347 -83954 -56898 -60984 -94796 -27904 -25783 -17311 -51858 -41408 -21831 -14639 -21493
4628 -21493 -27894 -33474 -40503 -19411 -6251 18287 -5858 13573 6275 -20414 -12698 -1707 80330
4615H0330p5394m2390K090j3710k1070J2287L3003L165N6072m2542p7497j5601
4603a01257n2325O8499O1634M1794m5319L1350K5514k7231m0927k0063M2951n1755
4591f7135M74M4189j0436o5419k7803K1900j7371k8212K4820K0655J00820l9125
4579d2643o1049q023M4934M3462n688k4810L4387l7829k1465J6994m4027L0052
4567g5705n783K7382L4653O1673n9600m2837L1693p6563j1757K017R3242q516
4555c0101Q2846p4412n3493j937L90K5974M4074K5240L0824j654n5775l6903j1731
4542e6658K8004L875K2730o0767K8702j5260j01477M638O7236L7153J3776J4863
4530a3185k2123M4221N4227l1996M336n7157j9585R65M0911J6814j0081j6995
$$ plain form
4615 80330 4936 -37454 -35364 -49074 -70144 -57857 -24854 -21689 34383 -8159 -85656 -101257
4603 -101257 -153582 -85083 -23449 18345 -26974 4376 29890 2659 -38268 -58331 -15380 -67135
4591 -67135 -66661 -22472 -32908 -98327 -126130 -104230 -121601 -149813 -124993 -104338 -3518 -42643
4579 -42643 -103692 -111715 -66781 -23319 -29007 -53817 -19430 -57259 -78724 -61730 -105757 -75705
4567 -75705 -81488 -54106 -19453 42220 -17380 -60217 -28524 -105087 -116844 -114827 -21585 -30101
4555 -30101 52745 -21667 -75160 -77097 -76707 -50733 -6659 18581 49405 47751 -8024 -44927 -56658
4542 -56658 -28654 -24779 -2049 -62816 -34114 -49374 -150851 -146213 -78977 -41824 -28048 -13185
4530 -13185 -35308 8913 63140 31144 35480 -21677 -41262 -40297 614 17428 7347 -9648
4518i648k8126k1204j8677K1525k0037L6813n31l8914J6416O4203L723p1982M1539
4505b4900l5645K1076J2251M1051l2164Q897R335j6953p1989L5186L9118J3640
4493a097r7723L6869K0483j4818N651r558J2414m4303J2190l0898N1992L4074
4481b4724l7750l3132N2397K6838k2086k4180j1383L8158o401o9868M1859K960
4469f7312j9497J7329L8918k4140k4674l5101m093O8541J1407k5268L8941M7787
4457B2838p9114k3294P5508k6362M1404l9092j5583r80M969j1164L315N1968m564
4444a51o6782N1840j8302k5389n796J1041L2254K8039J5124p3212k6851o999M2871
4431d2313L5340M815l7341o087L6263M5847R06p8479n9100L5222O6331j8605o800
$$ plain form
4518 -9648 -37774 -58978 -77655 -56130 -76167 -39354 -39885 -78799 -62383 1820 5543 -66439 -24900
4505 -24900 -60545 -39469 -27218 13833 -18331 -9434 -99 -17052 -89041 -53855 -14737 -1097
4493 -1097 -98820 -61951 -41468 -56286 -50635 -60193 -47779 -92082 -79892 -110790 -58798 -24724
4481 -24724 -62474 -95606 -43209 -16371 -38457 -62637 -74020 -35862 -42263 -112131 -70272 -67312
4469 -67312 -86809 -69480 -30562 -54702 -79376 -114477 -118570 -50029 -38622 -63890 -24949 22838
4457 22838 -56276 -79570 -4062 -30424 10980 -28112 -43695 -44675 -39706 -50870 -47555 4413 -151
4444 -151 -66933 -15093 -33395 -58784 -64580 -53539 -21285 6754 21878 -51334 -78185 -85184 -42313
4431 -42313 -6973 -2158 -39499 -45586 -9323 36524 37430 -41049 -100149 -64927 1404 -17201 -24001
4418b4001m8077n2625K806N6397O453L8905n461l1295O3782o9003k4586n0896
4406a37601M0277M3942k6335L4755j4040l0426j8329K3219M9488N0618o8941l7383
4394i0756q99K9496N179J1963K0218m1455M2103L6473k770p6006Q109k7633O1419
4381b4559J6972m3142J2420L1675N0498o6622j8052p7607M6828L7023P097J6361
4369a1108n2869L8229k9934Q992j0692l273J5785l3026k106O530j662K3694K3903
4356b7537n8877L8803L217o5206K0039N5963m1488n4654N0816K4712R634k8772
4344g3350j4346P9737j3077J6332Q701k3395P174J1486M478l2883j8838k0805
4332f8786K9408L5581n4689o2078O2432J2919O7751O258m4397P3030m3556j01073
$$ plain form
4418 -24001 -72078 -124703 -121897 -65500 -59047 -20142 -25603 -56898 6884 -62119 -86705 -137601
4406 -137601 -97324 -53382 -79717 -44962 -59002 -89428 -107757 -84538 -35050 15568 -53373 -90756
4394 -90756 -91655 -62159 -56980 -45017 -24799 -66254 -24151 12322 9552 -66454 -58345 -85978 -24559
4381 -24559 -7587 -50729 -38309 -6634 43864 -22758 -40810 -118417 -71589 -34566 -27469 -11108
4369 -11108 -63977 -25748 -55682 -46690 -57382 -60655 -44870 -77896 -80002 -73472 -75134 -51440 -27537
4356 -27537 -86414 -47611 -44394 -109600 -89561 -33598 -75086 -129740 -78924 -54212 -44578 -73350
4344 -73350 -87696 -7959 -21036 -4704 3997 -19398 -12224 -738 3740 -29143 -47981 -68786
4332 -68786 -39378 -3797 -58486 -120564 -58132 -45213 22538 28796 -15601 57429 13873 -87200
4320h7200l9631N8379p76k4617N9404j1440J944J3598j8987p2899K3714L1302
4308f7209Q0143j412K298r2787K466N9205l572l8248k3587O3356L5254J049k3103
4295f147M707Q7227j6960o8145k2251J2647l3411O6190k3429r7692J083K7711
4283f8470K3221J8842J3831J050L3972k6782l0225N4680L7012R15m2766n7915
4271d2635J622o9695M6630k1760J35099L5495j24202n6812J9966j1725K6616K1060
4259d0341r47J3809k3465l9983M9095k8592l3437O3623O2322r1941O1679k3372
4247c1550L7003m870k3247M9159p4822J3991L3371K4335p0585L1576M1993j9211
4235G143o858K809P1585n7029n2359M32q567Q1057j295k6099J9331M3145q9514
$$ plain form
4320 -87200 -126831 -68452 -69228 -93845 -34441 -45881 -43937 -30339 -49326 -122225 -98511 -67209
4308 -67209 12934 11522 13820 -78967 -76501 -17296 -20868 -59116 -82703 -19347 15907 16956 -6147
4295 -6147 -1440 85787 68827 682 -21569 -8922 -42333 23857 428 -97264 -96181 -68470
4283 -68470 -45249 -26407 -12576 -11526 22446 -4336 -34561 20119 57131 58046 15280 -42635
4271 -42635 -41013 -110708 -64078 -85838 49261 84756 -39446 -96258 -76292 -88017 -61401 -40341
4259 -40341 -41288 -27479 -50944 -90927 -41832 -70424 -103861 -40238 22084 -69857 -8178 -31550
4247 -31550 5453 583 -22664 26495 -48327 -34336 -965 23370 -47215 -15639 26354 7143
4235 7143 285 3094 74679 17650 -34709 -34277 -42844 38213 36918 10819 30150 73295 -16219
4222a6219p5129J9321L2165j9888m962j7944K764N3324L7166q5764j0926J0175
4210g5917k0433Q2052J1944j9851L9582l2811K1044o6923J6089P4576n8784k723
4198c2155m7468L7823J2907M234l0134j3259j2932K2910l2157r430M1700k0983
4186g8944K9108k6307J5045N0797o9247M7799M5700p8607j079k5057M5863J27362
4174H2433m5015q3243N065j0814L1086M9755K2851r100l1496M455n749n8007O7191
4161A9412J2316l6722k7870n2988N9485L0243n8835k0866l5933J38730J6641q6314
4149d2701o8887j0259L2584M0409m1932M0002j4500j5275O517K6101J26k7J1050
4136c6792O73N0238J8614L8188p0178n0116n1234K1552P0433k0749N2687L5159
$$ plain form
4222 -16219 -91348 -72027 -39862 -59750 -64712 -82656 -79892 -26568 10598 -75166 -86092 -75917
4210 -75917 -96350 -14298 -2354 -22205 17377 -15434 5610 -61313 -45224 29352 -29432 -32155
4198 -32155 -79623 -41800 -28893 -24659 -54793 -68052 -80984 -58074 -90231 -99661 -57961 -78944
4186 -78944 -49836 -76143 -61098 -10301 -79548 -31749 13951 -64656 -65735 -90792 -44929 82433
4174 82433 37418 -45825 -40760 -51574 -20488 29267 52118 43018 11522 15977 10228 -47779 19412
4161 19412 31728 -4994 -32864 -85852 -26367 3876 -54959 -75825 -111758 26972 43613 -42701
4149 -42701 -111588 -121847 -89263 -48854 -90786 -50784 -65284 -80559 -74042 -47941 -47815 -47842 -36792
4136 -36792 -36119 14119 32733 70921 743 -49373 -100607 -79055 -8622 -29371 23316 58475
4124E8475n4872N9854J2085O976j1900L0321N4485K8204k3324K3396r0781l9724
4112E3195M734L5214l3594k8863j8417n7737r199k3010K1427J1468J7064M6621
4100A8903J1804k0469l64J2577Q527m2762k9441N4214N7299K8331k9662L493l4133
4087C8317o039P155k0264O7131k917j026k8115j0182N3825l6080q2233Q97O1324
4074D1793K4320n7540K8575l6708k5580M5997M3022m6536m6854J5052j9497O182
4062b7774k2868R667K7955q54J4759l3737l2272L7813P1344q3341m4441O4092
4050a9657N9017J3479k5008m6436k0856M5758L0345N1434j9413j2554M2328k921
4038I5516p3684j939Q3350j0962r6484l745J2438J0250j8111K2976M4776r759
$$ plain form
4124 58475 3603 63457 75542 82518 70618 100939 155424 183628 160304 183700 92919 53195
4112 53195 57929 93143 59549 30686 12269 -45468 -54667 -77677 -56250 -44782 -27718 18903
4100 18903 30707 10238 9874 22451 30978 -11784 -41225 12989 70288 98619 68957 72450 38317
4087 38317 32278 39433 19169 86300 83383 82357 54242 44060 97885 61805 -20428 -19531 41793
4074 41793 66113 8573 37148 440 -25140 20857 63879 17343 -29511 -14459 -33956 -27774
4062 -27774 -50642 -40975 -13020 -13874 885 -32852 -65124 -27311 44033 -39308 -83749 -19657
4050 -19657 39360 52839 27831 -18605 -39461 6297 36642 88076 68663 56109 98437 95516
4038 95516 21832 19893 103243 92281 -4203 -7948 4490 14740 -3371 19605 64381 54622
4026E4622o3436K5860K7277J4262k0006n2017l3988R1034L9760K628p7990j0605
4014b599J9449k9786r940l956J2233k3384n0149K6057M9404o897O5205n7708m8638
4001f0709j9998L3148K4227j8527k7725P4474n527J4197K6161j3414n0821O1237
3989C6723m8379K1352K8265r350j5172m134m0911l6186J0250o0523O9420R2559
3977D3914k0025m8709J724L2936J1175p0603L0963k0890l0848j9285M4303P8608
3965C3263N4500o1588j10814M596R2980N649k5275Q7822J1507q4410r278J4767
3953A3719k7130O1206R908k1095m7818o8251M8419Q3732k486p8370K4041n001
3941i126K615K6292j7329j2326K2658M2589n2358l3928l4124Q1801L4406n4140
$$ plain form
4026 54622 -8814 17046 44323 58585 38579 -13438 -47426 43608 83368 85996 8006 -2599
4014 -2599 16850 -12936 -22876 -26832 -14599 -37983 -88132 -62075 -12671 -19568 45637 -12071 -60709
4001 -60709 -80707 -47559 -23332 -41859 -69584 4890 -637 13560 39721 26307 -24514 36723
3989 36723 -11656 9696 37961 28611 13439 9305 -31606 -67792 -57542 -118065 -48645 43914
3977 43914 23889 -24820 -23096 9840 21015 -49588 -18625 -39515 -70363 -89648 -45345 33263
3965 33263 87763 26175 -84639 -80043 12937 18586 -6689 81133 92640 8230 -1048 13719
3953 13719 -13411 47795 57703 36608 -11210 -79461 -31042 52690 50204 -28166 -4125 -9126
3941 -9126 -6511 19781 2452 -9874 12784 55373 3015 -30913 -65037 16764 51170 -2970
3929b970L112j9551L7866n9710K53P1075j571L46q806L0744l5636k8090k2366
3916c5304J7201R1910k3916o6778m5582L2359P026k7803L7007J6811l050M936
3904D817n7754n6961p559L8375K3450j3158K0900L1831m502J8277l4461J2136
3892b4609P6696R26n9883K5205L3036n821m1450J5108k452l5485m9237j7262K7752
3879e7476M6967J9003Q528l4719k890M8590l1270j6364j922L0824j8943r338R6037
3866G7027j273O844P57l299l2399M2K128L6K4894l3852K9155r742m4006N0672
3852F6984J1250n1128J456j5817M9549k3794j14179M3292r004j9183P2803m2594
3840c0365P0770k3738l1065K5684J557m4887K4443k8687r6924M697M5592M302
$$ plain form
3929 -2970 142 -19409 18457 -41253 -41000 30075 28504 28850 20044 50788 15152 -12938 -35304
3916 -35304 -18103 73807 49891 -16887 -62469 -30110 -23084 -50887 -13880 2931 -119 4817
3904 4817 -52937 -109898 -117457 -79082 -55632 -68790 -47890 -16059 -20561 -2284 -36745 -24609
3892 -24609 52087 53013 -6870 18335 51371 45550 4100 19208 16756 -18729 -67966 -85228 -57476
3879 -57476 -10509 8494 17022 -17697 -20587 28003 -3267 -19631 -21553 9271 -9672 -19010 77027
3866 77027 75754 82598 83355 80056 47657 47699 49827 49863 74757 40905 70060 60318 16312 66984
3852 66984 78234 27106 28562 12745 62294 38500 -75679 -32387 -41391 -60574 12229 -30365
3840 -30365 40405 16667 -14398 11286 12843 -32044 -7601 -36288 -133212 -128515 -82923 -78621
3828g8621L6555L2063L6446K4309k2194J1291L6439l6646N137K5093n5555j0342
3816C975J7844K3965R711k4010n132m754P161K4261N427J3150m7706q5514L731
3803e7891q981O8832l385k4071K019J5387P2605j5686o0947Q4560P5186j18976
3791B8652r9897l1381M8526M3152L0079n971O9557j9375o9183J9252Q994p8967
3779e6562j8600M2221m2277M6667L0594r680j9107j9158L5249n8898J6308O2165
3767H922J1632n9759n5965L6688P879L9626j3177L7007N947l1614l267l6601M2760
3754i922L9294l783K8305o8002j4418O44n856l6132J5955Q9695O053J3226L1858
3741H6917j3460L1868r2285l696O2615J5980l1866r8857L528K708l5077J3204
$$ plain form
3828 -78621 -42066 -10003 26443 50752 28558 39849 76288 39642 44779 69872 14317 3975
3816 3975 21819 45784 55495 31485 26353 21599 28760 53021 58448 71598 23892 -61622 -57891
3803 -57891 -66872 1960 -1425 -25496 -23477 -8090 64515 48829 -12118 72442 147628 28652
3791 28652 -71245 -102626 -54100 -10948 19131 13160 82717 63342 -5841 13411 22405 -56562
3779 -56562 -75162 -32941 -75218 -28551 2043 -7637 -26744 -45902 -10653 -69551 -53243 8922
3767 8922 20554 -39205 -95170 -58482 -50603 -10977 -24154 12853 18800 -12814 -16081 -52682 -9922
3754 -9922 29372 25589 53894 -14108 -28526 -27882 -33738 -69870 -53915 35780 41833 55059 86917
3741 86917 73457 105325 13040 9344 71959 87939 56073 -42784 -39256 -36548 -71625 -58421
3729e8421P0700n2702J163J8359L5315j8141J7713q476m1121m4185L1486M8155
3717a55M6093p3057n4401Q2599L9992j0914J4661o6003K6047n646q628l9882M2854
3704f440p130p212K1668j5655k013k3998M1218J9543l2097M6747m3641o1957N7603
3691a3364j805k4169R6571j8715k1633L864K7146N7719p7283q6651o329J9571
3679d5078M1231J9184k6736L5732j0290N8387M1897q232n934J8660k7317K0724
3667A12228N6482k9946n0427k2720M6817N082m8139k2282M2143J3208q8604M9062
3655F2904L7149J9506m5818j127p8714J3244N6706K6814N0490L0960l1880p292
3643A32942k4498Q1315m879N758J4958p9831k7403O4144L6458Q44R8647K0891
$$ plain form
3729 -58421 12279 -40423 -39260 -20901 14414 -3727 13986 5510 -35611 -79796 -48310 -155
3717 -155 45938 -27119 -81520 1079 41071 30157 44818 -21185 4862 -784 -9412 -49294 -6440
3704 -6440 -13570 -20782 886 -14769 -16782 -40780 438 19981 -12116 34631 -9010 -70967 -13364
3691 -13364 -15169 -39338 57233 38518 16885 20749 47895 105614 28331 -58320 -64649 -45078
3679 -45078 -3847 15337 -11399 24333 14043 72430 114327 106095 100161 118821 91504 112228
3667 112228 168710 138764 88337 65617 112434 117516 69377 47095 89238 102446 13842 62904
3655 62904 100053 119559 73741 72614 -6100 7144 63850 90664 141154 172114 140234 132942
3643 132942 108444 189759 184880 190638 205596 125765 98362 162506 198964 199808 298455 319346
3631C19346L782O2075N3457J405J09258J80016K5889J01491L1806N7929P140n8121
3619H95473o7926j27517r1915r6792j01438m5742p9194J1457l1100m0376J3657
3608B38587K019j2189n3678M4223M6391k5384j761k9671k1072j5809J5623O8758
3596B56037p8902M2800n3596j2018j438K1694L677n8917n3726k228J8943l2182
3584E0144L1341K3466k8195P0947k8424J1418K7593j8158k3177J0004l6553j11900
3572b1494P1074K9027m5328k590q09P2104o400k8159L1893l8489N751O4813M3682
3559A75075k3588l7867l8071k006Q278m9039M5657J2218m9650j6448j5330K5447
3547C4676Q3433J1221K7844R683k2897n8193m157q530L0631L9004J9180l9068
$$ plain form
3631 319346 323128 385203 438660 440065 549323 729339 755228 856719 888525 946454 953594 895473
3619 895473 827547 700030 608115 511323 409885 364143 284949 296406 265306 224930 238587
3608 238587 240606 228417 174739 218962 265353 239969 238208 208537 187465 171656 187279 256037
3596 256037 177135 219935 166339 154321 152883 174577 178254 119337 65611 63383 82326 50144
3584 50144 81485 104951 76756 147703 119279 130697 158290 140132 116955 126959 90406 -21494
3572 -21494 49580 78607 33279 30689 29880 101984 95584 67425 99318 60829 66580 131393 175075
3559 175075 151487 113620 75549 73543 81821 32782 78439 90657 41007 24559 9229 34676
3547 34676 118109 129330 157174 166857 143960 85767 81610 73080 103711 142715 161895 122827
3535A22827n7418Q217j6250L2362l4444P761L5332Q812O0983j9803k5155L0080
3523A53304j551n408L689j7928l4455o187k68M6745q934m5934o897R938O3008
3510A49122j681k0622k4788P4992L8050j5930L797o159J4329l269J0483L6890
3498B55214j3493R8R8654K5536o9613M717P924L5345k2844p4317N6575L9508r18
3485C42386O782M5437p8179M1433K9643K1425N7280R720r0171L2686l489j9226
3473C95727N7007j1054K0692P7069J0982k2881N9543k9764n143P2105K3161N1955
3461F99399L8644O5823M8016k7132Q4965R4879J11240M9212M9080J27656J57699
3450A499481J21150J87684K10154K64805K45804K79044M24769N13744N99900P15111
$$ plain form
3535 122827 65409 73626 57376 89738 55294 63055 98387 107199 168182 148379 123224 153304
3523 153304 151753 146345 150034 132106 97651 91464 91196 137941 129007 83073 76176 86114 149122
3510 149122 147441 126819 102031 177023 215073 199143 202940 196781 211110 207841 218324 255214
3498 255214 241721 241819 340473 366009 296396 301113 309037 344382 321538 247221 303796 343304 342386
3485 342386 349168 394605 316426 357859 387502 408927 466207 475927 385756 418442 414953 395727
3473 395727 452734 441680 462372 539441 550423 527542 587085 557321 552178 624283 647444 699399
3461 699399 738043 803866 851882 824750 909715 1004594 1115834 1165046 1214126 1341782 1499481
3450 1499481 1620631 1808315 2018469 2283274 2529078 2808122 3232891 3746635 4346535 5061646
3440E061646R38348J192448J593761J906341J730089J070353J75128o18739q94669
3431A2154706r46156j022622j153376j279278j250349r88061p29193o02273n11757
3422C671641m30355m02915k59605k72493k31094j64333j60402j57186q3350j19230
3412A390678j56782j17279p4661L6102j07502j12716o845M9512l6761j07571k8899
3401G27276m1844k9315j603L0235o5810j5402K7679p6855P0472k135o4473o2195
3389D96030n4578J0952k3696m1313K5677L9053o5643M2692L2574l0001n8890n8643
3377C14214K0181p664n4934k463k2055j5898J3544m8859J1802M4113Q3263o5358
3365B69886k3854j2737M2123N577o3262L0965m5683p8242K510Q84m3379K6946
$$ plain form
3440 5061646 5999994 7192442 8786203 10692544 12422633 13492986 13668114 13049375 12154706
3431 12154706 11208550 10185928 9032552 7753274 6502925 5514864 4785671 4183398 3671641
3422 3671641 3241286 2838371 2578766 2306273 2075179 1910846 1750444 1593258 1509908 1390678
3412 1390678 1233896 1116617 1041956 1078058 970556 857840 850995 900507 863746 756175 727276
3401 727276 685432 656117 654514 684749 618939 603537 631216 554361 624833 622698 558225 496030
3389 496030 441452 452404 428708 387395 413072 452125 386482 429174 461748 431747 372857 314214
3377 314214 334395 326731 271797 269334 247279 231381 244925 196066 207868 251981 335244 269886
3365 269886 246032 233295 275418 280995 217733 248698 203015 124773 127283 128167 84788 111734
3353A11734L0296O531J4395M7710o253k3307j8118J9146J6217l8106M8024k3717
3341A84552o4796J7913P4322l4631j5536l7548K3591P039p511p6649O5156N6654
3329A92556l2466P973o6901K6988J342n0610o5286K0164M9533m204j4037n639
3317E9413N6326O1408m5008O462k2191m2644j238k6297K4210L8483k1735k249
3305H4940n3912P2714m7007k4751P5315Q3583l7162J6414J3339p0817o9034j3628
3293B9994Q2552J6268k750k7630o8077M376K5545J9946Q5477O8600n5161o6508
3281A12632j4226L4497o3266Q402R2874p8536k5121R440j9095n569M7409j3145
3269H6296L2082j6067p577R96o1459M481K9718L920J5134J1939j9479p3323P0214
$$ plain form
3353 111734 142030 148561 162956 210666 204413 181106 162988 182134 198351 160245 208269 184552
3341 184552 119756 137669 211991 177360 161824 124276 147867 154906 147395 70746 135902 192556
3329 192556 160090 168063 101162 128150 129492 78882 13596 33760 83293 79089 65052 59413
3317 59413 115739 177147 132139 138601 116410 73766 72528 46231 70441 108924 87189 84940
3305 84940 31028 103742 56735 31984 107299 190882 153720 170134 183473 112656 43622 29994
3293 29994 112546 128814 126064 98434 30357 34733 60278 80224 165701 234301 179140 112632
3281 112632 98406 132903 69637 78039 170913 92377 67256 76696 57601 52032 99441 86296
3269 86296 118378 102311 94734 95730 34271 38752 68470 72390 87524 99463 79984 6661 76875
3256G6875N1524p3720n035n1418K5430N6778p8281O6971r0507K9217M0527j8108
3244C0253O6361q579l6465L0195m0850L221M6201r5417p456m1599M4693j2104
3232b1546J5579K3255J5446m5208k9350Q3574l0236j8049N1693N772K6356l4046
3220D3240l4869K6064L8248l3695L3849J1795R085r381m954K0259l9852M5838
3208A05627k451o3517k3913j7246K155l631l5430K4376O0558K6599J9474p366
3196H5235p7338Q1267k0166k2736k6459l820J4776M2589l748m3888Q1295L0689
3184A37696r6033j9585M7685m1479l7101L5413K5079l543O8524j8328k2799j4152
3172F1377o5458j5172R7950l2220m608L9883p225l8208l9383P7751L1677o3028
$$ plain form
3256 76875 128399 54679 49644 -1774 23656 80434 2153 69124 -21383 7834 48361 30253
3244 30253 96614 88035 51570 81765 40915 44136 90337 -5080 -12536 -54135 -9442 -21546
3232 -21546 -5967 17288 32734 -12474 -41824 41750 11514 -6535 45158 50930 77286 43240
3220 43240 8371 34435 72683 38988 72837 84632 93717 84336 79382 99641 59789 105627
3208 105627 103176 39659 15746 -1500 655 -2976 -38406 -14030 46528 73127 92601 85235
3196 85235 7897 89164 68998 46262 19803 15983 30759 73348 69600 25712 107007 137696
3184 137696 41663 22078 69763 28284 -8817 26596 51675 48132 116656 98328 75529 61377
3172 61377 -4081 -19253 78697 46477 41869 81752 74527 36319 -3064 74687 106364 43336
3160D3336J017j725L8979J2742J2013l5103m3925P5693m284p3022j943l2713K5331
3147A6396m5607k3697O1973L6724l7806J1694O6990k4217n4971j9611M0358M1065
3135F9291J7769k1680m4701k4662J9115M6357M3608R935j8555J3251l1693n4208
3123B3827j5072j4697M6501j9994R9153K289q3227l1577M9118M6492r004J5349
3111A09158M8925k6379p9105o8964O9363K5006P3378l4015J5483O215k4404l208
3099A11453k0259J8215K2442O2418r0391l6410L564k1322J1471M4317p39L1529
3087A36288m648O064J4044j7819o4873Q258Q5009j5503K9783l0002l5382J8724
3075A29943l4584K1797k5428M7131k9673M373n6071M8037L3524l0951R206r694
$$ plain form
3160 43336 44353 42628 81607 94349 106362 71259 27334 103027 98743 25721 23778 -8935 16396
3147 16396 -29211 -52908 9065 45789 7983 19677 86667 62450 7479 -12132 28226 69291
3135 69291 87060 65380 20679 -3983 15132 61489 105097 115032 96477 109728 78035 23827
3123 23827 8755 -5942 40559 20565 119718 122007 38780 7203 56321 102813 93809 109158
3111 109158 158083 131704 52599 -16365 52998 78004 151382 117367 132850 139065 114661 111453
3099 111453 91194 109409 131851 194269 103878 67468 71032 49710 61181 105498 104759 136288
3087 136288 131640 137704 151748 133929 69056 77314 162323 146820 176603 146601 111219 129943
3075 129943 95359 117156 91728 138859 109186 113559 57488 105525 139049 108098 117304 107610
3063A07610k0789K01o486P9595L1184l2256J7841j3517p3145k7337N7379J5746
3051A36026j5133p3176k659j2306K1129m7611K6583P1485j0361n8475J5528Q7800
3039A38830J9589o8842n0879M3100O891k5566k839K16Q9736k3472r5761N2933
3027H3936K3635N485k5813p9676N9062L7768j7952n3165J4919m2836o0120J33652
3015G8895O8306q4565l1810J16127M54o8175J6175J5961O867k212l8262J9910
3003I7671l2316O1979N789k7706m1359R613j8851k5892M3847P831J8320p0615
2991B8311l32m1738M0714N9251K7073j6204J5903j1667O6969R832p8494j00394
2979g76J3076K0580k0288M3380j413L8741j2592m4707M1760N6245k77L210k4549
$$ plain form
3063 107610 86821 87022 80536 160131 191315 159059 176900 163383 90238 62901 120280 136026
3051 136026 120893 47717 45058 32752 53881 6270 32853 104338 93977 35502 51030 138830
3039 138830 158419 89577 38698 81798 88689 63123 60284 60500 150236 126764 31003 83936
3027 83936 107571 113056 87243 7567 66629 104397 86445 33280 48199 5363 -54757 78895
3015 78895 147201 62636 30826 146953 147407 79232 95407 111368 118235 116023 77761 97671
3003 97671 65355 127334 133123 105417 64058 73671 54820 28928 72775 80606 98926 28311
2991 28311 27979 -13759 26955 86206 113279 97075 112978 101311 168280 178112 99618 -776
2979 -776 12300 32880 12592 55972 54559 93300 80708 36001 77761 134006 133729 136939 112390
2966A12390k1475M7525l9378o0516k4065P6746l3755M0565o1351K8429J41475
2955B06590p1458n9445n3560J6644J6515P707k1023K0972M6608l6310r7554O7738
2943D3424k5597J8490l1911N3245J0870J8662L7446o0247N8230K3964j3188p9100
2931E4288K3261J09658n6827J811l8340k1952P2756N529p4808J04149r678q7759
2919H2088M9530j4715O1051K7795M7948J0608M599m4034o1598j1098M7226Q185
2907B07585j03635j4681R156K8557m2875o288K7008J3274n01l3879j1372l4844
2895C7505P8816k9793J707k4944n7881M9350j7365k5234P6479K0286m9531k007
2883E7388m9265L8552m6485O6112O658k1405j6573q062L7587J4613J2479p8275
$$ plain form
2966 112390 90915 138440 99062 38546 14481 91227 57472 98037 36686 65115 206590
2955 206590 135132 75687 22127 38771 55286 62993 41970 62942 109550 73240 -24314 43424
2943 43424 17827 36317 4406 57651 68521 87183 124629 64382 122612 146576 133388 54288
2931 54288 77549 187207 130380 132191 93851 71899 144655 150184 75376 179525 169847 82088
2919 82088 131618 116903 177954 205749 253697 264305 268904 224870 163272 152174 199400 207585
2907 207585 103950 89269 98425 126982 84107 77819 104827 118101 117600 83721 72349 37505
2895 37505 116321 86528 88235 63291 5410 54760 37395 12161 88640 108926 59395 57388
2883 57388 8123 46675 190 66302 72960 51555 34982 26920 64507 79120 91599 13324
2871A3324P186L5975N277N367q5216J8017M1970L5793K4928R75M007o4679r855
2858C3069M1363p5540O99P1743p5705j8587m281Q9749L1960J3648P709l6593j2451
2845F6783l8210l8959O9338R340J9570l8784M5467k5186o0120L9051k8218P883
2833B7955K4649k8017P808M7044P737j6747O5571j7996n2316j8757q7401o881
2821d7351j340P9637N2895O0415l8717n5441J0321m775J5014R195j4329j2622
2809E2902J6052j7482N006R430L1802o3814M3432j1929M1839O858o8982M0608
2797H5722k0163M1651j2508o0633L6560l0606N9240l099P8747p025m6923M0134
2785A61097k6853l556p6930J3550O708K4246m5284m0266L3707N7403j1984p3478
$$ plain form
2871 13324 20510 56485 61762 67129 -18087 -70 41900 77693 102621 103596 107603 42924 33069
2858 33069 74432 -1108 -409 71334 -4371 -22958 -27239 62510 94470 108118 115827 79234 66783
2845 66783 28573 -10386 58952 68292 87862 49078 94545 69359 9239 48290 20072 27955
2833 27955 52604 24587 32395 79439 87176 70429 136000 118004 65688 46931 -40470 -47351
2821 -47351 -48691 30946 83841 144256 105539 50098 60419 55644 70658 79853 65524 52902
2809 52902 68954 51472 56478 65908 97710 33896 77328 65399 107238 114096 45114 85722
2797 85722 65559 107210 94702 34069 70629 40023 99263 96164 174911 167886 120963 161097
2785 161097 134244 130688 53758 67308 74016 98262 52978 12712 46419 103822 91838 18360
2773A8360j3633J17463m729j4911m4275n7029J7061J7138K4098l4281L8161N402
2761F8825K0180M1186j6874l8346n0136j4445q941M1499L894m2906N8685n66N2254
2748A14309l1675K1010M9401j7436l2748o2680R028Q125M1351l860L906M0880
2736A39611n447m8418k6635l1359K9420J6199P2905n0662K3191p6067k5797j2275
2724D666J7414K9436K8965L1898n0417J0334l9422j489l6211J5441L8443K5340
2712G4398O3372j6660n2995K3429O3954N0659K3648j5213o4220l72n4847L4235
2700A29388O9538k2289o617R213k5833J236L3905M9884J8982L4072J13200J0991
2688D15670q592J1277j6745n0488l1530j8779m886J3448o4670l0427J7401K1304
$$ plain form
2773 18360 4727 122190 117461 102550 58275 1246 18307 35445 59543 25262 63423 68825
2761 68825 89005 130191 113317 74971 24835 10390 1449 42948 46842 3936 62621 62055 114309
2748 114309 82634 103644 153045 135609 102861 40181 49209 57334 98685 94825 98731 139611
2736 139611 134164 85746 59111 27752 57172 73371 146276 95614 118805 42738 16941 4666
2724 4666 22080 51516 80481 112379 61962 72296 32874 31385 -4826 10615 49058 74398
2712 74398 137770 121110 68115 91544 155498 206157 229805 214592 150372 150000 95153 129388
2700 129388 198926 176637 170020 179233 153400 154636 188541 238425 257407 291479 404679 415670
2688 415670 407078 418355 401610 351122 319592 300813 295927 309375 244705 214278 231679 252983
2676B52983m9441m4442o233J9770O3842k7917j5362m9811L855L9495r415j4910
2664A62414N5854l2325M791P28N4234j728m6421K504j6241o1271l9520Q9397J3666
2651A86082n0894p366O4978j2173j0974J659q213q126K2351J7905K1872r6563
2639A20538k0899Q7108j4321l9228K5762Q229R51k8314n4320K3143M4382M181
2627A57212O8194L3437k6391J6527p6154n1401L5403L5305M423l568M8428k3258
2615B18157l5454J5318r977M9767j5095n2297k1505K4311L7751l8006k0771k5086
2603A27113O1331L3630N7282J8171j04400o4971p841r856P7033j7405J6954J7957
2591B04998J1600p259L0618L4060m1104n0525J9326l7380l4048M6228Q8511O4369
$$ plain form
2676 252983 203542 159100 152867 172637 236479 208562 193200 143389 147244 186739 177324 162414
2664 162414 218268 185943 190734 191462 245696 243968 197547 200051 183810 122539 83019 172416 186082
2651 186082 135188 127822 192800 180627 169653 171312 163099 154973 177324 195229 217101 120538
2639 120538 99639 186747 172426 133198 158960 167189 168140 139826 85506 108649 153031 157212
2627 157212 225406 258843 232452 248979 172825 121424 156827 192132 196555 192987 241415 218157
2615 218157 182703 198021 188044 237811 222716 170419 148914 173225 210976 172970 152199 127113
2603 127113 188444 222074 279356 297527 193127 128156 120315 110459 187492 170087 187041 204998
2591 204998 216598 209339 239957 274017 232913 182388 201714 164334 130286 176514 265025 329394
2579C29394K2370n6088l8152l2994l374J941P831J0646J16618J0156o7837j1453
2567B89058k7841l5647m8861K5403N9506P2533n1448J22929L0484J6915k1481
2556D31550n1511M5969P2996N777K5749l0036N231O1655J26839J6783J0335M1335
2544G62672j2045q264q5429p641K7675m2526K6804k0037K2194P2794n940m0085
2532F90172r341L7154M9845M5810L568O4727J26857N7481J0235N9463J04775J17190
2520A357936K23433J88914Q4002J87008K05355K87821L73243M12838N54632Q06383
2510D681565J025322J288069J372090J074328L85911k28239n43403o11790o69920
2501G773933p62464r39855r30167p01237o19444m55610m11234k98375k55605k00206
$$ plain form
2579 329394 351764 295676 257524 224530 221156 223097 230928 241574 358192 368348 300511 289058
2567 289058 261217 225570 176709 202112 261618 334151 282703 405632 436116 453031 431550
2556 431550 380039 426008 499004 504781 530530 500494 505725 567380 694219 711002 721337 762672
2544 762672 750627 742363 656934 649293 676968 634442 661246 641209 663403 736197 730257 690172
2532 690172 680831 717985 767830 813640 817208 881935 1008792 1066273 1076508 1135971 1240746 1357936
2520 1357936 1581369 1770283 1854285 2041293 2246648 2534469 2907712 3320550 3875182 4681565
2510 4681565 5706887 6994956 8367046 9441374 9827285 9599046 9055643 8443853 7773933
2501 7773933 7011469 6071614 5141447 4440210 3820766 3365156 2953922 2655547 2399942 2199736
2491B199736j46020j84222j89544j41127p9013j17415j14324o4379p2025n1143
2481A040524j7836r1230o5778j3589o4599M817l488j1056n3427l8221J1006K8136
2469G25259p550l9827n3094j2379j5361Q548m8132l36L4429l0423k2637o8286
2457D70211K1580k4649J1013N5421P376l149p8789N53k4592K2521O0775J505j6201
2444E03575l2571o2542P9422J97o6057M7343r7563k979m6586L8941K7819P6101
2432D65100k2554n2823k3862l1291N6913j9886L6428P113M1952m8307Q711n0642
2420C66852M5124O8827j7372j0924l3741J894m8534M132L8168m365P8100J05030
2408E93191q6499m8262l419O062m8895N582k2317O168Q936K6864K6618N3515r99
$$ plain form
2491 2199736 2053716 1869494 1679950 1538823 1459810 1342395 1228071 1163692 1091667 1040524
2481 1040524 1022688 931458 865680 852091 787492 792309 788821 777765 724338 686117 697123 725259
2469 725259 717709 677882 624788 612409 597048 605596 557464 557128 591557 561134 538497 470211
2457 470211 491791 467142 478155 533576 540952 537803 459014 459567 434975 457496 518271 519776 503575
2444 503575 471004 408462 487884 488081 422024 469367 371804 368825 322239 361180 388999 465100
2432 465100 442546 389723 365861 334570 391483 371597 408025 415138 457090 408783 417494 366852
2420 366852 411976 480803 463431 452507 418766 420660 372126 376258 414426 410061 488161 593191
2408 593191 506692 458430 455011 461073 412178 417760 395443 401611 410547 437411 464029 517544 516545
2395E16545J4909R866p0993k5772j9342N8217k687q5525L3340M2114K5972k0953
2383D75691J0667j0086K4248R8925M6415K1256n2720o0033M0594M1088O5656m0181
2371F61520J3406N8414m2479l7512J14078M4349l2496l2934J4299N1499M7961
2360H60105r99l1407L5425k3667J19613J82584J7960J13819M1078O2329J04073
2349A480913J09037J65344J24530K80824L55719K94678J19850J40598O7392N3619
2339C192504q0238r7280n9468q8866j57798o3316R502K0777J06010R6123P1772
2328B949722J83820J83695K87851K38718K49247J60874J95062L36847L13737K58172
2318E357745K88021L01426J96361K83309K08984J58025K36043J95722J33278N7840
$$ plain form
2395 516545 531454 541320 470327 444555 425213 483430 480743 395218 428558 470672 496644 475691
2383 475691 486358 476272 500520 599445 645860 667116 614396 554363 594957 636045 701701 661520
2371 661520 674926 733340 690861 653349 767427 811776 779280 746346 760645 812144 860105
2360 860105 859106 827699 863124 839457 959070 1141654 1159614 1273433 1314511 1376840 1480913
2349 1480913 1589950 1755294 1879824 2160648 2516367 2811045 2930895 3071493 3138885 3192504
2339 3192504 3112266 3014986 2955518 2866652 2708854 2645538 2655040 2675817 2781827 2877950 2949722
2328 2949722 3133542 3317237 3605088 3843806 4093053 4253927 4448989 4785836 5099573 5357745
2318 5357745 5645766 5947192 6143553 6426862 6635846 6793871 7029914 7225636 7358914 7416754
2308G416754K9743K8828o6043j07776j30283j26211k36891j46378j99007k45441
2298F217295k18961l09621k49445k70377k83479l12011k26768k54157k70675k25683
2288C596118k95891j51197j95987j38020j44575j63462j06259j51029r6825n7751
2278B095122k9873m9737j5047m9574k8938k4952r0569r0136j7181k7013M2513
2267A714615K5056m8868m1497Q6486Q4396k1345j2635P1966K6562K7943P4199
2256A986878M8339k2661n5733j5431K7371l3023O074m1076m692L6668j0762o4242
2244A857710m1824l1500N1550R8540p4375p5278o8760q639N082j29351N10R8694
2232A682359L3197K3999k33j8059K8265l2048r6116l7916J403L8002m3250l0849
$$ plain form
2308 7416754 7446497 7475325 7409282 7301506 7171223 7045012 6808121 6661743 6462736 6217295
2298 6217295 5998334 5688713 5439268 5168891 4885412 4573401 4346633 4092476 3821801 3596118
2288 3596118 3300227 3149030 2953043 2815023 2670448 2506986 2400727 2249698 2152873 2095122
2278 2095122 2065249 2015512 2000465 1950891 1921953 1897001 1806432 1716296 1699115 1672102 1714615
2267 1714615 1739671 1690803 1649306 1735792 1820188 1798843 1786208 1858174 1884736 1912679 1986878
2256 1986878 2035217 2012556 1956823 1941392 1968763 1935740 1941814 1900738 1896046 1932714 1921952 1857710
2244 1857710 1815886 1784386 1835936 1934476 1860101 1784823 1716063 1707424 1712506 1583155 1583665 1682359
2232 1682359 1715556 1739555 1739322 1721263 1749528 1717480 1621364 1583448 1584851 1622853 1579603 1548754
2220A548754n131L4838r0913q4032j7255j8278p1851J2505J4576K6624k1943L623
2208A331517o3132o9824j9855M3206M7053L7783K6929k747k0884m765j7815j5635
2196A271831k2163K6650j6193k9703K7982R128p0867J00023L3561o3544N3005
2185A319710k607p8454k6895M2360J7694j4337p4267q10P549n8047l1820N8336
2173A158412P4341K8694j8537K399l7816K69K3789Q1500j256L4537N3954p4992
2161A325294n0664P0179K5388P4923J14404m7950K1117m0897K4845J6526k3546
2150A509619L6604M8294J20951l4218L1019J17610J22912L1447R5813J56410J57335
2139B393796J54311K16233K06630J93148M06174M30717M53005N46532N59669N08435
$$ plain form
2220 1548754 1543623 1578461 1487548 1403516 1386261 1367983 1296132 1308637 1323213 1349837 1327894 1331517
2208 1331517 1268385 1198561 1178706 1221912 1268965 1306748 1333677 1330930 1310046 1305281 1287466 1271831
2196 1271831 1249668 1276318 1260125 1230422 1258404 1267532 1196665 1296688 1330249 1266705 1319710
2185 1319710 1317103 1238649 1211754 1254114 1271808 1257471 1183204 1182394 1189943 1131896 1100076 1158412
2173 1158412 1232753 1261447 1242910 1245309 1207493 1207762 1231551 1313051 1311795 1346332 1400286 1325294
2161 1325294 1274630 1344809 1370197 1445120 1559524 1511574 1532691 1491794 1516639 1533165 1509619
2150 1509619 1546223 1594517 1715468 1681250 1712269 1829879 1952791 1984238 2080051 2236461 2393796
2139 2393796 2548107 2764340 2970970 3164118 3570292 4001009 4454014 5000546 5560215 6068650
2129F068650M90085L69703K20949J22483j47964j97249l50357m49539m64950m95963
2119E165848m14177l82178l47794l44569j87164j43301r7926j58936j45388m6031
2109B898384p8636p2123q9026j15330n3816m8267J4642J6188R206l5570n5436
2098B390216l4595M8663m2763n8100M9362n6274p439n8475K1355Q6203l9360N733
2086B304526l808l2880J15786O3812j5189k5959P1296l618P8570k8993k0834J8001
2074B520710L5885O2125M9384O0652p7433j7004R0581j1904M4457Q0086J1737
2063B849276N2641L3866K6319N2738N1107O2274P9844L4268l5961J1547R8370
2052C316289K7165Q4703J15730R429q756R3721K7985M7346J07932m0350j2205
$$ plain form
2129 6068650 6558735 6928438 7149387 7271870 7123906 6926657 6576300 6126761 5661811 5165848
2119 5165848 4751671 4369493 4021699 3677130 3489966 3346665 3248739 3089803 2944415 2898384
2109 2898384 2819748 2747625 2658599 2543269 2489453 2441186 2455828 2472016 2481222 2445652 2390216
2098 2390216 2355621 2404284 2361521 2303421 2352783 2296509 2289070 2230595 2251950 2338153 2298793 2304526
2086 2304526 2300718 2267838 2383624 2447436 2432247 2406288 2477584 2473966 2552536 2523543 2502709 2520710
2074 2520710 2556595 2618720 2668104 2728756 2651323 2634319 2724900 2712996 2757453 2837539 2849276
2063 2849276 2901917 2935783 2962102 3014840 3065947 3128221 3208065 3242333 3206372 3217919 3316289
2052 3316289 3343454 3428157 3543887 3553316 3544560 3638281 3666266 3713612 3821544 3781194 3768989
2041C768989N9239Q4376P0357L6897J19836R5408N2659M6140P9971M0093J09770
2030D563735J72067P0592M5235J48056J56733P4276N2088J15437J86880J27964
2020E713063J66185J50088L9064J24575J28561J98011J82518J38556J58658K58937
2010G258216K37411K07878K37661J85471L56966K81853J45995L18350K71576L04448
2000I805825L96087L67788L41493L33783M53377M03207L82230M91323M30787N00196
1990A3906096N16026O05587N11164O07905N86805P28749P43427Q65067Q75157
1981A9945983P90768R71301J038664J086987J178732J300248J301189J437656
1973B9051528J529975J625320J735925J869518J936156K016604K140253K186314
$$ plain form
2041 3768989 3828228 3912604 3982961 4019858 4139694 4235102 4287761 4333901 4413872 4453965 4563735
2030 4563735 4735802 4806394 4851629 4999685 5156418 5230694 5282782 5398219 5585099 5713063
2020 5713063 5879248 6029336 6068400 6192975 6321536 6519547 6702065 6840621 6999279 7258216
2010 7258216 7495627 7703505 7941166 8126637 8483603 8765456 8911451 9229801 9501377 9805825
2000 9805825 10201912 10569700 10911193 11244976 11698353 12101560 12483790 12975113 13405900 13906096
1990 13906096 14422122 15027709 15538873 16146778 16733583 17462332 18205759 19070826 19945983
1981 19945983 20736751 21708052 22746716 23833703 25012435 26312683 27613872 29051528
1973 29051528 30581503 32206823 33942748 35812266 37748422 39765026 41905279 44091593
1965D4091593K248148K381831K469521K616318K612270K744246K869635K764824
1957F4798386K899575K984019K905707K974278K937011K845555K788199K802732
1949H7935462K623976K545127K396227K323979K246051K161205J970830J776773
1941A05979630J592197J450923J299681J051286Q06314N28603K79505L9617k13666
1932A12814090m16193n81493p30014r97670r81188j189966j383410j435369j629922
1923A03468865j865786j922238k043761k124940k180969k195224k259074k296138
1915H6580735k298260k335630k306465k245143k188828k144418k164228k156160
1907F8741603k025599j951524j864115j857879j795212j710290j727963j626863
$$ plain form
1965 44091593 46339741 48721572 51191093 53807411 56419681 59163927 62033562 64798386
1957 64798386 67697961 70681980 73587687 76561965 79498976 82344531 85132730 87935462
1949 87935462 90559438 93104565 95500792 97824771 100070822 102232027 104202857 105979630
1941 105979630 107571827 109022750 110322431 111373717 112180031 112708634 112988139 113027756 112814090
1932 112814090 112397897 111816404 111086390 110088720 109107532 107917566 106534156 105098787 103468865
1923 103468865 101603079 99680841 97637080 95512140 93331171 91135947 88876873 86580735
1915 86580735 84282475 81946845 79640380 77395237 75206409 73061991 70897763 68741603
1907 68741603 66716004 64764480 62900365 61042486 59247274 57536984 55809021 54182158
1899E4182158j563371j464757j383380j391593j315276j252060j105967j167479
1891D3538275j041608j049623r75206r13313r12376r47424q75756q57457q71292
1882C5094220p65182q25978p27616p19297o83904o55994p85658o53425o92405
1873B8584761o08427n69591o30432o93905n75534n55604n17209m94061m25804
1864B3514194m87875l94725l45806l95001l69676l24224l69556l03240k34237
1855B0289854j35120j63598j92651q6635o8019r1908j4615K7656O9198J48403
1845A9782565K37873L62042L41832M56584M79690P52622Q16151R41172J173797
1836B5344328J300723J502418J743053K074818K198633K392983K454466K460358
$$ plain form
1899 54182158 52618787 51154030 49770650 48379057 47063781 45811721 44705754 43538275
1891 43538275 42496667 41447044 40471838 39558525 38646149 37698725 36822969 35965512 35094220
1882 35094220 34329038 33503060 32775444 32056147 31372243 30716249 29930591 29277166 28584761
1873 28584761 27976334 27406743 26776311 26082406 25506872 24951268 24434059 23939998 23514194
1864 23514194 23026319 22631594 22285788 21890787 21521111 21196887 20827331 20524091 20289854
1855 20289854 20154734 19991136 19798485 19711850 19643831 19551923 19537308 19564964 19634162 19782565
1845 19782565 20020438 20382480 20724312 21180896 21660586 22413208 23229359 24170531 25344328
1836 25344328 26645051 28147469 29890522 31965340 34163973 36556956 39011422 41471780
1828D1471780K314972J943572J616611J282963R08055M70495J71052k42482l79397
1819D9557621m70724m49618l93467m41788m76416n55633p01159q86050j109383
1810D4073383j277913j590294j734435j907022j919227j887527j842625j706651
1802C0207689j574145j385980j301605j079260r92694p95614o37301n89567l79566
1793B1471957l55242k32617j21305N337J09043K45017L40793L78518M71466N87927
1783B2900894O13408N43922O07126N29779L36653K28849K04794J86171O8434P3478
1773B6293508R4723O1455j0025O1331J40748J31793J15915K9511p4589j06390
1763B6737980p8340p4385j61132j31067j13762j27587p9745J8686M6238J53968
$$ plain form
1828 41471780 43786752 45730324 47346935 48629898 49537953 50008448 50179500 49937018 49557621
1819 49557621 49086897 48637279 48243812 47802024 47325608 46769975 46068816 45182766 44073383
1810 44073383 42795470 41205176 39470741 37563719 35644492 33756965 31914340 30207689
1802 30207689 28633544 27247564 25945959 24866699 23874005 23078391 22441090 21851523 21471957
1793 21471957 21116715 20884098 20762793 20768130 20877173 21122190 21462983 21841501 22312967 22900894
1783 22900894 23514302 24058224 24665350 25195129 25531782 25760631 25965425 26151596 26220030 26293508
1773 26293508 26388231 26449686 26439661 26500992 26641740 26773533 26889448 26918959 26844370 26737980
1763 26737980 26659640 26585255 26424123 26293056 26179294 26051707 25971962 25990648 26036886 26190854
1753B6190854J80553K51685L38505L65957M66581N11128N87108O97561P93149
1744C0383081R02105R63150J046588J115870J203084J215585J373716J407722
1736C9610901J485571J703982J821668K013996K301006K478711K780027L102229
1728E7298091L377849L845778M135083M515963M984023N577799O006289O474560
1720I6215435P004538P647500Q299032Q986614R756523J0704187J1529792J2404352
1712A72547973J3146419J3777995J4144151J4197504J3587606J2608916J1230048
1705B65240612R635969P879180O098516M343220K855120J604993N00883k30711
1697B97927782r14729j707838k342902l313440m312714n573139o971786q430135
$$ plain form
1753 26190854 26371407 26623092 26961597 27327554 27794135 28305263 28892371 29589932 30383081
1744 30383081 31285186 32248336 33294924 34410794 35613878 36829463 38203179 39610901
1736 39610901 41096472 42800454 44622122 46636118 48937124 51415835 54195862 57298091
1728 57298091 60675940 64521718 68656801 73172764 78156787 83734586 89740875 96215435
1720 96215435 103219973 110867473 119166505 128153119 137909642 148613829 160143621 172547973
1712 172547973 185694392 199472387 213616538 227814042 241401648 254010564 265240612
1705 265240612 274876581 282755761 288854277 293197497 296052617 297657610 298158493 297927782
1697 297927782 297013053 295305215 292962313 289648873 285336159 279763020 272791234 264361099
1689B64361099r853207j1179321j2152193j2666115j3089508j3065147j2816225
1682A79539383j2374133j1768017j1044534j0220535r330427q529310p831773
1675A08440654p102893o369424n780806n244969m711798m235279l818881l468225
1667F7708379l007760k707857k512604k199836j947088j699669j481599j271176
1659E0880790j205265j101999j055421j006081j027272j030578r77693q69824
1651D2606657q89601q76078q03197p35428p64204o81246o20276n81010n60945
1642C6094672n54634o65959o00058o34882n86873n50469o31001p36202p75354
1633C0359240q12641o96969p37319p10275o61573n19957n15250n54649m23462
$$ plain form
1689 264361099 254507892 243328571 231176378 218510263 205420755 192355608 179539383
1682 179539383 167165250 155397233 144352699 134132164 124801737 116272427 108440654
1675 108440654 101337761 94968337 89187531 83942562 79230764 74995485 71176604 67708379
1667 67708379 64700619 61992762 59480158 57280322 55333234 53633565 52151966 50880790
1659 50880790 49675525 48573526 47518105 46512024 45484752 44454174 43476481 42606657
1651 42606657 41717056 40840978 40037781 39302353 38538149 37856903 37236627 36655617 36094672
1642 36094672 35540038 34874079 34274021 33639139 33052266 32501797 31870796 31134594 30359240
1633 30359240 29546599 28849630 28112311 27402036 26740463 26220506 25705256 25150607 24727145
1624B4727145l63150l31984l55298k44106k08615j65557j08236j71366q2935l8326
1614B2657572n50P6050L4875J20734J62624J54411K19149L96991L30747K35322
1604B4387925J96649J27207O5239J32819J54392J65977J72431J63398J94330K58788
1594B6019155K36429K38482L49628L37835M01645M50921M00130N14681N35742
1585B9484648M48156N45503N16514N70632O87767O73066P40911Q29032Q49794
1576C5346023R38705R66808J120626J278038J248815J389379J520383J702340
1568D5511117J887652K073959K184565K524535K740725L079288L321265L690678
1560F7013784M189015M612903N106798N663715O198514O842294P560587Q214729
$$ plain form
1624 24727145 24363995 24032011 23676713 23432607 23223992 23058435 22950199 22778833 22695898 22657572
1614 22657572 22657022 22733072 22767947 22888681 23051305 23205716 23424865 23821856 24152603 24387925
1604 24387925 24584574 24711781 24777020 24909839 25064231 25230208 25402639 25566037 25760367 26019155
1594 26019155 26255584 26494066 26843694 27181529 27583174 28034095 28434225 28948906 29484648
1585 29484648 29932804 30478307 30994821 31565453 32253220 32926286 33667197 34496229 35346023
1576 35346023 36284728 37251536 38372162 39650200 40899015 42288394 43808777 45511117
1568 45511117 47398769 49472728 51657293 54181828 56922553 60001841 63323106 67013784
1560 67013784 71202799 75815702 80922500 86586215 92784729 99627023 107187610 115402339
1552A15402339Q987807R606574J0204259J0657282J0966060J0923471J0851911
1545A87599703J0531185J0053408R625290R147647Q761468Q682525Q417263Q226593
1537B61045082Q229712P979576P489690O882702O015411M725693L275756J714596
1529C07358218J36379j490820k891163m129092n093285n930142o464671o842926
1521B74652498p100731p311871p587870p813936q183890q553710q860851r267773
1513B09971866r579871r761675r851948r707876r559444r337497q953721q539414
1505A34680420q006933p500542p045734o430489o010298n447595m994609m662227
1497H4581993m343752l975895l669139l593915l342080l165068l005666k835169
$$ plain form
1552 115402339 124390146 133996720 144200979 154858261 165824321 176747792 187599703
1545 187599703 198130888 208184296 217809586 226957233 235718701 244401226 252818489 261045082
1537 261045082 269274794 277254370 284744060 291626762 297642173 302367866 305643622 307358218
1529 307358218 307494597 306003777 303112614 298983522 293890237 287960095 281495424 274652498
1521 274652498 267551767 260239896 252652026 244838090 236654200 228100490 219239639 209971866
1513 209971866 200391995 190630320 180778372 171070496 161511052 152173555 143219834 134680420
1505 134680420 126673487 119172945 112127211 105696722 99686424 94238829 89244220 84581993
1497 84581993 80238241 76262346 72593207 68999292 65657212 62492144 59486478 56651309
1489E6651309k605466k467671k293081k199859j975906j843861j773181j586619
1481C9905665j443850j377232j310126j155708j144324j069445j066313r30496
1473C0408171q76240r28360q32561q12035p50479p57063p52816n99395p63292
1464B3335930o62911n30008o90481n88902m87263n03175m61321l97013m83596
1455A8531260n55657m46663l87662m15738m14655m01103l34046l80306l27684
1446A4867746l29822l52183l09402k70019l03025l33689k33255k73121k42322
1437A2220908j77654k88878k98942j53312j75534j85755k37121k18488j20622
1428A0364602j49314j44212j80409j45799j02142p1407j86755j26904j15785p7559
$$ plain form
1489 56651309 54045843 51578172 49285091 47085232 45109326 43265465 41492284 39905665
1481 39905665 38461815 37084583 35774457 34618749 33474425 32404980 31338667 30408171
1473 30408171 29531931 28603571 27771010 26958975 26208496 25451433 24698617 24099222 23335930
1464 23335930 22673019 22143011 21452530 20863628 20376365 19873190 19411869 19014856 18531260
1455 18531260 17975603 17528940 17141278 16725540 16310885 15909782 15575736 15195430 14867746
1446 14867746 14537924 14185741 13876339 13606320 13303295 12969606 12736351 12463230 12220908
1437 12220908 12043254 11754376 11455434 11302122 11126588 10940833 10703712 10485224 10364602
1428 10364602 10215288 10071076 9890667 9744868 9642726 9571319 9384564 9257660 9141875 9064316
1418I064316r9331n2968q7826o9321q2635j02144j42178j16031n4716p1936p5786
1407H109444j19592j35819p4730o6740k01373j17175j35889q9277j06858j18146
1397F943845k08257j11070j11705j03076j30425j30515j53264j98504l8094j09738
1387E649197j66175l6785q0853j63817j45108p0218m0386j27450j21845j22001
1377D574559r5228j8604j00835n2792j01619j00625m6424n0731j08764m6014k4467
1366C828456o9286o0574n2052j23922m2384o8904q3605J7621j617q4008q9628
1355C170097m176k1679m1878m4167r2388l32o4880m4922L9640k2643o5589o1825
1343B745258k1486p0954j6179m7714l5315m885n5065L2264N450j29692Q349r7221
$$ plain form
1418 9064316 8964985 8912017 8824191 8754870 8672235 8570091 8427913 8311882 8257166 8185230 8109444
1407 8109444 7989852 7854033 7779303 7712563 7511190 7394015 7258126 7168849 7061991 6943845
1397 6943845 6735588 6624518 6512813 6409737 6279312 6148797 5995533 5797029 5758935 5649197
1387 5649197 5483022 5446237 5365384 5201567 5056459 4986241 4945855 4818405 4696560 4574559
1377 4574559 4479331 4460727 4359892 4307100 4205481 4104856 4058432 4007701 3898937 3852923 3828456
1366 3828456 3759170 3698596 3646544 3522622 3480238 3411334 3327729 3345350 3343733 3259725 3170097
1355 3170097 3165921 3144242 3102364 3058197 2965809 2965477 2900597 2855675 2895315 2872672 2807083 2745258
1343 2745258 2723772 2652818 2636639 2588925 2553610 2548725 2493660 2525924 2531374 2401682 2410031 2312810
1331B312810M904R955o9771L3454K949m2602j08325m7599m1834M5331k8716l7189
1319B033367N709j2173m7530j3082K7585o4107K7760N0969K6433o7220n1507P0685
1307A986889K7923k6630l8964J2617l8024j40384q57k2638N3854K2059m9576p33
1295A785536K3522l1684l8461j651n2936j4874K1284n6642L895j9250k0220l5663
1283A562856R173K5707l1861j9571M8123j7868k1978J0924L4936J1765k6184K7861
1271A613883L0269J2704m7650N7538O919L8041K635P5781R2752K5705L6564N7982
1259B003123l4930l2239Q9930j7806O0752Q5247J9298K6431Q9777K7830L4578
1248B351991O3438K5933l4721J5153O2051L0109Q1482L9850n7815n382J4830l6348
$$ plain form
1331 2312810 2317714 2327669 2257898 2291352 2294301 2251699 2143374 2095775 2053941 2099272 2070556 2033367
1319 2033367 2039076 2026903 1979373 1966291 1993876 1929769 1957529 2008498 2034931 1967711 1916204 1986889
1307 1986889 2014812 1988182 1949218 1961835 1923811 1783427 1782570 1759932 1813786 1835845 1786269 1785536
1295 1785536 1809058 1777374 1738913 1737262 1684326 1669452 1690736 1634094 1637989 1618739 1598519 1562856
1283 1562856 1572029 1597736 1565875 1546304 1594427 1576559 1554581 1565505 1600441 1612206 1586022 1613883
1271 1613883 1644152 1656856 1609206 1666744 1673663 1711704 1714339 1790120 1882872 1908577 1945141 2003123
1259 2003123 1968193 1935954 2025884 2008078 2068830 2154077 2173375 2199806 2289583 2317413 2351991
1248 2351991 2415429 2441362 2406641 2421794 2483845 2513954 2595436 2635286 2577471 2572089 2586919 2550571
1236B550571p0416l2792N0256l0713j11012n2268n005J5132n0429m8951n6732
1225B157641j04913j0064o2789q8702j9901o1159k6195q579o5530p1861l9845
1214A598103k1195l5789m5737M323n4558o4069j0227m0693o5781K3673m8785j2411
1202A226854j0824r2330j4353M0729O042l8105O183m6696M8177m9024p3497N1550
1190A054706M1932p0085p848m0495P860K5563L2317R319k0316M7144j2947o6436
1178A000714m9875J4623M6168j1883k2374j0541j0222K8023j1680o720L9731l6615
1166I69349n8667n282J9106k8815n3093l238N4284O796P6039J4980n3140n5089
1154H83230K4911P5876n196L705J1099j2351J07J02761K7385o8630M4366L1991
$$ plain form
1236 2550571 2480155 2447363 2497619 2466906 2355894 2303626 2298621 2313753 2263324 2214373 2157641
1225 2157641 2052728 2042664 1979875 1891173 1871272 1810113 1783918 1775339 1709809 1637948 1598103
1214 1598103 1576908 1541119 1495382 1499705 1445147 1381078 1370851 1330158 1264377 1288050 1239265 1226854
1202 1226854 1216030 1123700 1109347 1150076 1156118 1118013 1124196 1077500 1125677 1076653 1003156 1054706
1190 1054706 1096638 1026553 1018705 978210 986070 1011633 1043950 1053269 1032953 1080097 1067150 1000714
1178 1000714 950839 965462 1011630 999747 977373 966832 956610 984633 972953 966233 1005964 969349
1166 969349 910682 905400 924506 895691 842598 839360 893644 900440 976479 991459 938319 883230
1154 883230 908141 984017 978821 982526 993625 981274 981381 1084142 1111527 1042897 1087263 1119254
1142A119254N7608k1915N0934P7014l8459Q262Q178M8594M1862P1541N4477O413
1130A483763p0571j8590m5750j2171n1460j5418k0622j58318K0460J3328m9410
1119A075241q7115m3491q0187O5503m735q2785l8085r7057L6623K0886M529l3461
1107G35866K7645o0431k2925k0497k4983q947j0334j8726P502L6066J7791o3327
1095E94700k1174L5119m370j3749l795o229k4858m8813j8930P7036m3480O301
1083E27758j6055J2217M7460k0176K250l6440M772O1884n4704O707P000m0185
1071E02488K497n535K2608L5592Q648j2599N2892m4310m5775J9475J419P75m27
1058E37748j7499J3117l6874J6308J4895o3295P1065O1583n3649M3923n271J1226
$$ plain form
1142 1119254 1176862 1154947 1205881 1282895 1244436 1252698 1260876 1309470 1351332 1422873 1477350 1483763
1130 1483763 1413192 1394602 1348852 1336681 1285221 1269803 1249181 1090863 1111323 1124651 1075241
1119 1075241 988126 944635 864448 929951 925216 842431 804346 707289 743912 764798 769327 735866
1107 735866 763511 703080 680155 659658 634675 625728 615394 596668 604170 640236 658027 594700
1095 594700 573526 608645 604275 590526 586731 580502 555644 506831 487901 564937 521457 527758
1083 527758 511703 523920 571380 551204 553454 517014 521786 583670 528966 535673 542673 502488
1071 502488 504985 499450 522058 557650 566298 553699 606591 562281 516506 535981 537400 538175 537748
1058 537748 520249 533366 496492 512800 527695 464400 535465 597048 543399 587322 582051 593277
1046E93277j6j7588p7514M5145l2203m0247M1061r536k9911k7841J835K8856M2195
1033E17513l1753o1367n2139L6058J1589k0951N1290p482O7543m6649K5728O6051
1021E55431q8973L8828K5459k0469k5826P855L5782K0691n1482q6659j3303p613
1009C89721K4229k3334J6731M0874p3530l8284j0358M8437j7143L2302m8787M4522
997C85380n5971l1554L7388M9148p921j3000M3386j543J9862k4784k8302k0270
985C51819k3800j9937P7817n608R154J0019j4250m62m674n2138k0889L0459l6794
972C00716p320Q956J2766L4717n994m321l4045q760K1092j03741L6006l912k3410
959B22750O203j461J9889n710N5433J8208l4827k8619m8960K564o0664Q954L1010
$$ plain form
1046 593277 593261 575673 498159 543304 511101 470854 511915 502379 472468 444627 446462 475318 517513
1033 517513 485760 424393 372254 408312 419901 398950 450240 442758 510301 463652 489380 555431
1021 555431 466458 505286 530745 510276 484450 492305 528087 548778 497296 410637 397334 389721
1009 389721 413950 390616 407347 448221 374691 336407 326049 374486 357343 389645 340858 385380
997 385380 329409 297855 335243 384391 376470 363470 406856 405313 425175 400391 372089 351819
985 351819 328019 308082 385899 380291 389445 399464 385214 384752 380078 327940 307051 337510 300716
972 300716 293396 302352 315118 349835 343841 339520 305475 296715 317807 214066 250072 246160 222750
959 222750 228953 227492 247381 241671 297104 315312 280485 251866 202906 205470 144806 153760 184770
946A84770k0606k7315p309o313O3230K1987n2103J6706J6670L0078m72k1050L2292
933B30565j805l3451k6537K6222k0169j851j713J2012K7682k2973j5455N8008
921B30535L958J2611K1367j7380n839q7411l9089O1472M3091m862L7186m3512
909B12127K6580Q256K8962r6212l5302J16083p684r8217n3059q615N8582M2252
897A93753O7434k3564k1160j9955q4995K8040M7361l3256L3717J1435n0816j7569
885A30425m3544L1852N5433K4700k7440M0461l0166o170n2676J9121P1383n2031
873A61348J1535L1766J7495J4278r3443j4277l0847K1911O9849N0815M1699p7611
861B04518K9681j3051R796m498P7050J8546n3747q062L1264p4421L5386N7795
$$ plain form
946 184770 164164 136849 129540 123227 186457 208444 156341 173047 189717 219795 219323 198273 230565
933 230565 228760 195309 168772 194994 174825 172974 171261 183273 210955 187982 172527 230535
921 230535 234493 247104 268471 251091 245252 157841 118752 180224 223315 218453 255639 212127
909 212127 238707 246963 275925 179713 144411 260494 252810 154593 101534 92919 151501 193753
897 193753 261187 237623 216463 196508 111513 139553 186914 153658 187375 198810 147994 130425
885 130425 86881 118733 174166 198866 171426 211887 181721 175551 122875 141996 213379 161348
873 161348 172883 204649 222144 236422 142979 128702 97855 119766 189615 240430 282129 204518
861 204518 234199 221148 230944 226446 303496 322042 268295 260233 291497 217076 252462 310257
849C10257j0820K199M8150m5044k8513L8802l2218J994k6184M4392l279o9976
837B29760M1794M3434m92l1904j6167j1082l4200j0253K0741K9296L3096N5025
825C49048n219k919j223k297K8400K9645m4071K3258P4816n3237j9309N8260m2348
812C92804J8511J6878k1694n89O970R871l4792m3525K6540M6928L8197M1262k9496
799D67865Q1343P2110K0268L5126K8638m1887L1985P2848l389O6826m6268l1873
787G53592k6373L7955k4089p2988n4079r7484n6864M4634L8094m1044n0432q0436
775C70486l0056o9695N2846K3573K8857j0583l9105M7442k3770J953k7194K1026
763C45780k2160k8087l7178k756L5680M044l7603L7450m7929j4628j2325J812
$$ plain form
849 310257 299437 301636 349786 304742 276229 315031 282813 284807 258623 303015 299736 229760
837 229760 271554 314988 314496 282592 266425 255343 221143 210890 231631 260927 294023 349048
825 349048 343829 340910 339687 337390 365790 395435 351364 374622 449438 396201 376892 435152 392804
812 392804 411315 428193 406499 405910 412880 422751 387959 344434 370974 417902 456099 497361 467865
799 467865 549208 621318 641586 676712 705350 663463 695448 768296 764907 831733 785465 753592
787 753592 727219 765174 741085 668097 614018 516534 459670 504304 542398 501354 450922 370486
775 370486 340430 270735 323581 347154 376011 365428 326323 373765 349995 351948 324754 345780
763 345780 323620 295533 258355 255599 291279 295323 257720 295170 247241 232613 220288 222100
751B22100p87m9788n5948P93J8840K7116m2148m5342M9653l479K2606L335L3100
738A80051m2196n1280l6100N7620o6230K8280P5403j8592k4211M9947k5161N5978
726A83509l9675j07854m0646J7550J21857j0110m9701m969l4956j2294J1539o991
714B7259J01159R795o0334o6059P1519K4577L5933l9471o2844J01694J095j12762
702C1561l1LL915k2664n5930J0004L0767L4950Q22k9834k909l8524O8645n520
688B5255M4353L1738q084O5386n0141p7048l446L354k1899J9830J4163J358n1045
675f226j4305Q0082L565n1073j7217P94L0802K4626L4497j8920j07276m506M8346
662C189l7534N6342M0218q082q516m6178p6165K8051k640j4831J43624J5940l0882
$$ plain form
751 222100 221313 171525 115577 116370 135210 162326 120178 74836 124489 121010 143616 146951 180051
738 180051 137855 86575 50475 108095 41865 70145 145548 126956 102745 152692 127531 183509
726 183509 143834 35980 -4666 12884 134741 124631 74930 69961 35005 22711 34250 27259
714 27259 128418 138213 77879 11820 83339 107916 143849 104378 41534 143228 144323 31561
702 31561 31530 31533 35448 12784 -43146 -33142 -2375 32575 33397 3563 654 -37870 30775 25255
688 25255 69608 101346 93262 158648 108507 31459 28013 31367 9468 29298 43461 44819 -6226
675 -6226 -20531 59551 63116 12043 -5174 -4380 26422 51048 85545 66625 -40651 -45157 3189
662 3189 -34345 21997 62215 54133 45617 -561 -76726 -48675 -51315 -66146 77478 93418 62536
649F2536K2466o7084m7303M1472K2545K4003j7051P143k0225l4051n1231M634
637e2146P7764l4153j8815n019Q517L6652L1704n2388L8008n8360m4987L7160
625c6063m9007J4570J9051P7683Q5523q2266m5550r4321R3590R046M6001k1253
613A7004m1735K8430J0935p5672j0208Q0003k9425O2120n5995m6072J6337Q8857
601D4579N030r1386n9211M2420J01110R842K616M7805o4182R758J0222l3457l9942
588a4796o8864O1688j6755K2976k5971m4339J022K4189j2526j7398K4655M0539
576b5580L4501k6772L3817l3555k6421Q4151k4530k98O2940k3734R598J8974j3660
563F9431l8370m5167J7154M3405n1294o9580l9469L8559N8090K6080L3261l4303
$$ plain form
649 62536 85002 17918 -29385 12087 34632 58635 41584 48727 28502 -5549 -56780 -52146
637 -52146 25618 -8535 -27350 -32369 -23852 12800 44504 -7884 30124 -28236 -73223 -36063
625 -36063 -85070 -70500 -51449 26234 111757 29491 -16059 -110380 -16790 -7744 38257 17004
613 17004 -24731 3699 14634 -61038 -71246 8757 -20668 41452 -14543 -60615 -44278 44579
601 44579 49609 -41777 -100988 -58568 42542 52384 55000 102805 38623 48381 58603 25146 -14796
588 -14796 -83660 -21972 -38727 -15751 -41722 -86061 -85039 -60850 -73376 -90774 -66119 -25580
576 -25580 8921 -17851 15966 -17589 -44010 40141 15611 15313 78253 54519 64117 83091 69431
563 69431 31061 -14106 3048 46453 -4841 -74421 -113890 -75331 -17241 8839 42100 7797
551G797j1714K141l4948j6812l6058K1830J5418l3492J2049N3470l4911K5149
539c0081O283j08760M8775Q5839Q2625O779j56029J623L2592J449m2056j795n102
526g7858j1943M9278Q395k4078N0563l9972O1646k5705p180K982k7394n9181L8736
513f1711L708P8266J7098l9750K9328J7714l8257J9711j5856j7302L9969J6406
501D9324k9211m1515n1316n6078K6207L3075M3872L8419Q949q298l5430q2088
489a04090N3951J6530N1437q1965q6673Q0442N3226L592P2422n2183l6654j3745
477d3710J06m7747K367O082l9327k8015J7250J6363L7247N7875O0113m9430l533
464a4359K2007j1949L2281k2958o3408K4239N6808R429l2459N105L0776k1351
$$ plain form
551 7797 -3917 -1776 -36724 -53536 -89594 -67764 -52346 -85838 -73789 -20319 -55230 -30081
539 -30081 -23798 -132558 -83783 2056 84681 91460 -64569 -62946 -30354 -28905 -70961 -72756 -77858
526 -77858 -89801 -40523 -32128 -56206 -5643 -45615 16031 -9674 -16854 -13872 -41266 -100447 -61711
513 -61711 -58003 20263 37361 -2389 26939 44653 6396 26107 10251 -7051 32918 49324
501 49324 20113 -21402 -72718 -128796 -102589 -69514 -25642 12777 21726 13428 -22002 -104090
489 -104090 -50139 -33609 17828 -64137 -150810 -70368 -17142 -13550 58872 6689 -29965 -43710
477 -43710 -43604 -91351 -88984 -82902 -122229 -150244 -132994 -116631 -79384 -21509 38604 -10826 -14359
464 -14359 7648 -4301 27980 5022 -58386 -34147 22661 32090 -369 4736 35512 14161
452A4161j0515K2517O565L067k0984p979K1358o0778J7753P6884o9528m7776k2101
439g7356k4229K4259L1919m24N463m9161Q388K3739P4849n4429L4898m3013L8398
426f699O3017J5188m3348j6125L1380m5987j5293l9537L6994J2347j1590k6075
414d5728M7870k375l8996j3604k0767m4346M6721J6668o4737k4727Q2385k7257
402h8893j15696k0618Q807j11969N8734m0288k4107m5055n210J0060n2934N3119
390c74050K869L9725j4277n6014N4514j04240k419L6301j5872l3882j9533J7878
378d69000p2578K7712P7876j5631j9889N8680J3033m3046K5780k8987m4033K57
366d89826M3581p149j637L6359n8798N9181L1735p2629k2303j2309m5508M4271
$$ plain form
452 14161 3646 26163 32728 35795 14811 6832 28190 -32588 -14835 62049 -7479 -55255 -77356
439 -77356 -101585 -77326 -45407 -45831 -40368 -89529 -81141 -57402 17447 -36982 -2084 -45097 -6699
426 -6699 56318 71506 28158 12033 43413 -2574 -17867 -57404 -20410 -8063 -19653 -45728
414 -45728 2142 -233 -39229 -52833 -73600 -117946 -71225 -54557 -119294 -144021 -61636 -88893
402 -88893 -204589 -225207 -216400 -328369 -269635 -309923 -334030 -379085 -384295 -374235 -427169 -374050
390 -374050 -371181 -331456 -345733 -401747 -347233 -451473 -453892 -417591 -433463 -467345 -486878 -469000
378 -469000 -541578 -513866 -435990 -451621 -471510 -412830 -399797 -442843 -417063 -446050 -490083 -489826
366 -489826 -446245 -453394 -455031 -418672 -477470 -418289 -386554 -459183 -481486 -493795 -539303 -495032
354d95032L3030K3858J8352K652M032k4824J7551L1944j6246L3004n7709J2285
342d17103J07063l2482k8518J2231k2354K8190J6519N1900Q263n9772l5296l1552
330d02911P5901K0387l2204J6709K9486J96J2103n378l1319l9057P8740M425m8468
317c21390J8136O772J6132k5488K2651O2511N6933L9710p2267r4438M9401L9058
305b02279o4233N0786J3269m2432O8699n0317K9782K9157l0963K8529N351m2488
293b07139L023l3087j6146k8169l121L0706J3805l6397J9737M6864k6847P715
281b29056m679J7096l004K0114L8941J2357O7915o3733M057Q8789k431P3319k6815
268g130j5411p0058O2187k0094r9966Q3j9736N1146q8414m2999J802n3863o5J7254
$$ plain form
354 -495032 -462002 -438144 -419792 -417140 -413108 -437932 -420381 -388437 -404683 -371679 -429388 -417103
342 -417103 -310040 -342522 -371040 -358809 -381163 -352973 -336454 -284554 -276291 -336063 -371359 -402911
330 -402911 -327010 -306623 -338827 -322118 -292632 -292436 -280333 -285711 -317030 -356087 -277347 -272922 -321390
317 -321390 -303254 -296482 -280350 -305838 -283187 -220676 -163743 -124033 -196300 -290738 -241337 -202279
305 -202279 -266512 -215726 -202457 -244889 -176190 -226507 -196725 -167568 -198531 -170002 -164651 -207139
293 -207139 -204116 -237203 -253349 -281518 -284639 -253933 -240128 -276525 -256788 -209924 -236771 -229056
281 -229056 -233735 -216639 -219643 -199529 -160588 -148231 -80316 -144049 -139992 -51203 -53634 19685 -7130
268 -7130 -22541 -92599 -30412 -50506 -150472 -150389 -170125 -118979 -207393 -250392 -248590 -302453 -302518 -285264
254b85264k1301J8635K3052m3537o2520j9687O7257j6781m2816L0966O045L2500
242c13451l9212j6694O479J2258l2998m5274K1737m8449Q698Q987k58r7901J135
229e34943L1300k734K5240K1910k6966k614L3960L385k6135n1661N650K1009j7588
216e20187J7325J7933k9350R990k9754L3976k9589p6698j9515R9677L0803p6479
204e71868k5760k5006L1704J7851J8702j1172J8163N9436p7000J2691m5739M7654
192e50344L4086l9076j9522n2217O7153M4244k9289m3939M0476l0260r35j5024
180e94647N9479p618j4703J8669j9288L5818M1290j8030k7917J7755k3136K3582
168e08746k9304L7405J2207k9664P367P0169O255J5611k9671K0542K7468J3850
$$ plain form
254 -285264 -306565 -287930 -264878 -308415 -370935 -390622 -323365 -340146 -382962 -351996 -345951 -313451
242 -313451 -352663 -369357 -362878 -350620 -383618 -428892 -407155 -455604 -446906 -437919 -438177 -536078 -534943
229 -534943 -503643 -506377 -481137 -459227 -486193 -488807 -454847 -451462 -477597 -529258 -523608 -502599 -520187
216 -520187 -502862 -484929 -514279 -504289 -534043 -500067 -529656 -606354 -625869 -526192 -495389 -571868
204 -571868 -597628 -622634 -590930 -573079 -554377 -565549 -547386 -487950 -564950 -552259 -597998 -550344
192 -550344 -516258 -555334 -574856 -627073 -559920 -515676 -544965 -588904 -548428 -578688 -579623 -594647
180 -594647 -535168 -542786 -557489 -538820 -558108 -522290 -481000 -499030 -526947 -509192 -532328 -508746
168 -508746 -538050 -500645 -488438 -518102 -510735 -440566 -434311 -418700 -448371 -427829 -400361 -386511
156c86511j9357n5914K5293l6761J05549k5348n8249L2340P607k793n769L9251
144c80662L6573J74j5108N6738L3212n737O5780l7616m9335j0590L2220N7402
132b16949l379J4941J1667l911K2780j3270o6592J9979K9131L558L119M8182J0429
119a40315j5935j3724K6135K6790J7252j7505l721j3962j9655M9026M2728j8127
107h1013J8172j8850m3887L4845M9719m927m5738M2404M0738O2069m7229m9219
95d2916N3896j1713n0612j0253K4061j7719J180P3845l4873k2774j5882L1108
83b2652L1266n3282m9953j1714l750M663l1769k8592K208k2970j8812J0240k247
70a97364j1339n6099j8121k550J0232j7875m1596J9924R539m0324m0761p4039
$$ plain form
156 -386511 -405868 -461782 -436489 -473250 -367701 -393049 -451298 -418958 -411351 -414144 -419913 -380662
144 -380662 -344089 -343915 -359023 -302285 -269073 -274810 -209030 -246646 -295981 -306571 -274351 -216949
132 -216949 -220328 -205387 -193720 -197631 -174851 -188121 -254713 -234734 -205603 -202045 -198926 -150744 -140315
119 -140315 -156250 -169974 -143839 -117049 -99797 -117302 -121023 -134985 -154640 -105614 -62886 -81013
107 -81013 -62841 -81691 -125578 -90733 -41014 -45941 -91679 -49275 -8537 53532 6303 -42916
95 -42916 10980 -733 -51345 -61598 -37537 -55256 -54076 19769 -15104 -37878 -53760 -22652
83 -22652 8614 -44668 -94621 -106335 -110085 -105422 -137191 -165783 -163575 -186545 -205357 -195117 -197364
70 -197364 -208703 -264802 -282923 -285473 -275241 -293116 -334712 -314788 -305249 -345573 -386334 -460373
58d60373j2372j3797k3644j6274l4088m7483k7390m774q7943p6567k4733m6374
46h75812l4494O372l0314k3969o5528m5108K440p0913l3608n9878q9298N175o4216
33a379151n2154K3318J3237p894j6682P625M4126r78L7994O7985J50646J37318
21i74610J64218J68335K53013K87788K24801K32102L19065M08531N25603P07308
11B316154R05629J108585J416117J856547K454617L193345L907992L837086K366036
2B3362108K94595j393895
0B2262808
$$ plain form
58 -460373 -472745 -486542 -510186 -526460 -560548 -608031 -635421 -640195 -728138 -804705 -829438 -875812
46 -875812 -910306 -903934 -934248 -958217 -1023745 -1068853 -1066413 -1137326 -1170934 -1230812 -1320110 -1314935 -1379151
33 -1379151 -1431305 -1407987 -1394750 -1402644 -1419326 -1411701 -1367575 -1368553 -1330559 -1262574 -1111928 -974610
21 -974610 -810392 -642057 -389044 -101256 123545 355647 674712 1083243 1608846 2316154
11 2316154 3221783 4330368 5746485 7603032 10057649 13250994 17158986 20996072 23362108
2 23362108 23656703 22262808
0 22262808
$$ Imaginary data points
##PAGE= N=2
##DATA TABLE= (X++(I..I)), XYDATA
16383a7495747j980225j482292q65830l7612O54503R59929J150639J073003R21153
16374a7102479Q21501P05367O48343O26770N55911N57708N38285N05548M19905
16365a1723141M25968L92870M63967L92860L93200L25819K75362K92106K76496
16356h484493K62232L06418J65470J46845K06077K24326J83056J79866J93071
16347f617132J36434J22205K07972J89426J62755J51084P0016Q7476R9522P1706
16337e318536J52662J26288Q8487O0361M3194J60200K02575J26112L9022O2924
16327d256711L8996Q3309O0511R0360J39646Q0955J21174O5002R4766P2066M9224
16316c360702J04243L4720P2219P4094N7294O6014Q1731O0973N0874K5827O4243
$$ plain form
16383 -17495747 -19475972 -20958264 -21824094 -21861706 -21207203 -20247274 -19096635 -18023632 -17102479
16374 -17102479 -16280978 -15575611 -14927268 -14300498 -13744587 -13186879 -12648594 -12143046 -11723141
16365 -11723141 -11297173 -10904303 -10440336 -10047476 -9654276 -9328457 -9053095 -8760989 -8484493
16356 -8484493 -8222261 -7915843 -7750373 -7603528 -7397451 -7173125 -6990069 -6810203 -6617132
16347 -6617132 -6480698 -6358493 -6150521 -5961095 -5798340 -5647256 -5577240 -5489764 -5390242 -5318536
16337 -5318536 -5165874 -5039586 -4951099 -4890738 -4847544 -4687344 -4484769 -4358657 -4319635 -4256711
16327 -4256711 -4217715 -4134406 -4073895 -3983535 -3843889 -3762934 -3641760 -3576758 -3481992 -3409926 -3360702
16316 -3360702 -3256459 -3221739 -3149520 -3075426 -3018132 -2952118 -2870387 -2809414 -2758540 -2732713 -2668470
16305b668470N4449J09743M9411N6800L8480N3427K9502O5125K0958N7339M3337
16294b089899Q1126O812N5320P0223M6784O2616K4815N0049K3696N0685P9051
16283a538722Q615J9690M2865O2966j973L4447J18337M1949J5111K4584J09348
16272a062783K3021j7147l894N7878P9287M385L116N3303J6178j950O9478J8913
16260g60215O6037p861m1917N9143O3105J4950j9191N9136M4058N9272J2982N2590
16248c97911j6604J7739L1260L7453o961J8662M5040K9980j5636O1432J02766
16237i2780J6605J8725q575L1292K9304j2639L4920M199J7896k0432k5957Q8170
16225H0728O6939j3448M9409M6649K8002k8930k8692N3063P6385M6828J538O8202
$$ plain form
16305 -2668470 -2614021 -2504278 -2454867 -2398067 -2359587 -2306160 -2276658 -2211533 -2190575 -2133236 -2089899
16294 -2089899 -2008773 -2001961 -1946641 -1876418 -1829634 -1767018 -1742203 -1692154 -1668458 -1617773 -1538722
16283 -1538722 -1530107 -1510417 -1467552 -1404586 -1406559 -1372112 -1253775 -1211826 -1196715 -1172131 -1062783
16272 -1062783 -1039762 -1056909 -1060803 -1002925 -923638 -919253 -916137 -862834 -846656 -848606 -779128 -760215
16260 -760215 -694178 -702039 -743956 -684813 -621708 -606758 -625949 -566813 -522755 -463483 -450501 -397911
16248 -397911 -414515 -396776 -365516 -328063 -335024 -316362 -271322 -241342 -256978 -195546 -92780
16237 -92780 -76175 -57450 -66025 -34733 -5429 -18068 16852 21051 38947 18515 -7442 80728
16225 80728 147667 134219 183628 230277 258279 229349 200657 253720 330105 376933 378471 446673
16213D46673K3836j7232J2328Q466J0922L2060J0422m9024l5851K6395J1431L4101
16201E14527J8367P1581n5745R661M8978K391M3174J2282l396N2321M5341l4505
16189G24977J8851L7078l994m6198O1259P356k2833J7281L4472o589o2777J9559
16177G78442p924K6481N3472L2127L6911J2055O3407n4162k9570R5953j0317m2643
16165I54232k9654j1447L0224M7319J5399j9972L2694J3202q996k4602K0889O4891
16153A084179J0201K2413M199j449k5109n097J4251l6932M6426L2488l9391j2524
16141A093655N1036K870l9379O9042J085P6628m6506m5661M3182m3150O2739J4172
16129A239713n290o7220L4913J5443l5080J3078L5046k8416J1353M8092k9039
$$ plain form
16213 446673 470509 453277 465605 474071 484993 517053 527475 478451 442600 468995 480426 514527
16201 514527 532894 604475 548730 558391 607369 609760 652934 665216 661820 714141 759482 724977
16189 724977 743828 780906 776912 730714 791973 799329 776496 793777 828249 821660 758883 778442
16177 778442 770518 796999 850471 882598 919509 931564 994971 940809 911239 1007192 996875 954232
16165 954232 924578 913131 943355 990674 1006073 986101 1018795 1031997 1023001 998399 1019288 1084179
16153 1084179 1094380 1116793 1120992 1119543 1094434 1089337 1103588 1066656 1113082 1145570 1106179 1093655
16141 1093655 1144691 1147561 1108182 1177224 1178309 1254937 1208431 1162770 1205952 1162802 1225541 1239713
16129 1239713 1234423 1167203 1202116 1217559 1182479 1195557 1230603 1202187 1213540 1261632 1232593
16118A232593l3526o3890N5173O112k9527J03070M3918p48L0082M6425M306o1773
16106A332215O3149m5161n6057J114M6682P3216o1395r347l3474l887k583j8431
16094A286041L1340N0435k3176N0154l544o4882n879l2372l0212M7021N0243j0219
16082A344950l7948L6Q3070m905k3715k3389n903j8957K1050j6243J7308l9496
16070A295858P3618j6663l854O3010o2130L201k5258q241k329P416O6240k0036
16058A370832m8995j2687j2517R8844N9952m4194q1261j93O3626n923J9550Q956
16046A415990K3763n4318k5464n6738P1262r466J4531J2089K412m2948j3227K2961
16034A360847j4848k6543K589M5683j3892k0306L080R6321o894K7734n3614l2861
$$ plain form
16118 1232593 1199067 1135177 1190350 1196462 1166935 1270005 1313923 1313175 1343257 1389682 1393988 1332215
16106 1332215 1395364 1350203 1294146 1295260 1341942 1415158 1353763 1344416 1310942 1307055 1304472 1286041
16094 1286041 1317381 1367816 1344640 1394794 1391250 1326368 1320489 1288117 1257905 1304926 1355169 1344950
16082 1344950 1307002 1307038 1390108 1385203 1361488 1338099 1332196 1313239 1334289 1318046 1335354 1295858
16070 1295858 1369476 1352813 1348959 1411969 1349839 1353040 1327782 1319541 1317212 1324628 1390868 1370832
16058 1370832 1321837 1309150 1296633 1395477 1455429 1411235 1329974 1329781 1393407 1387484 1407034 1415990
16046 1415990 1439753 1385435 1359971 1303233 1374495 1365029 1379560 1391649 1394061 1351113 1337886 1360847
16034 1360847 1345999 1319456 1322045 1367728 1353836 1333530 1336610 1432931 1426037 1453771 1400157 1367296
16022A367296m439K2246m6426m0464k2510L5900J3365j6648m893M1751P2181K0965
16010A438324j8929o6094p1865j4906N9172O4554l5563L1440j2802M9746l4606
15999A388471m0471M1408K0786p751j1363o8387J7224k0766j7815K1469m293n174
15987A313338N1548O2969k8745l4693N8552j4040p9575k0413R6927L5842m9736
15976A391974p690K3599J1501l0317J5713j7317j318K6502K6039k1259p390n1838
15964A358199r9654J07117O1917l4472k0536n7763J5795j1086N8945J6373L4753
15953A429588L8340r0567l024M4378o17l3530j7395N2582M2776L6383n1300n3067
15941A394547m6031k3344M5791M9868p1295J8055j5845J1086Q5634J2338m7402
$$ plain form
16022 1367296 1362857 1385103 1338677 1298213 1275703 1311603 1324968 1308320 1303427 1345178 1417359 1438324
16010 1438324 1419395 1353301 1281436 1266530 1325702 1390256 1354693 1386133 1373331 1423077 1388471
15999 1388471 1348000 1389408 1410194 1402443 1391080 1322693 1339917 1319151 1301336 1322805 1318512 1313338
15987 1313338 1364886 1427855 1399110 1364417 1422969 1408929 1329354 1308941 1405868 1441710 1391974
15976 1391974 1384284 1407883 1419384 1389067 1404780 1387463 1386145 1412647 1438686 1417427 1410037 1358199
15964 1358199 1258545 1365662 1427579 1393107 1372571 1314808 1330603 1319517 1378462 1394835 1429588
15953 1429588 1467928 1377361 1374337 1418715 1418098 1384568 1367173 1419755 1462531 1498914 1447614 1394547
15941 1394547 1348516 1325172 1370963 1420831 1349536 1367591 1351746 1362832 1448466 1460804 1413402
15930A413402l9142k1584M0880N54K709l8462L1693K3072l9282p408J8796Q598
15918A393826l0166O3291l936k2050L7017j4677l1081r0492J4838J6344N8894
15907A391808p44K314l4200n3L1247k4435M4088J4371l5062O992M3053m7189J5520
15894A407710k4137M9069k7664J5205l898j04678L5673n9438R353O4005J9201
15883A380401j8677J1022O5005m0655p7097P706O2155l255k7527m7793j8243J16741
15871A409783K7862p2709j6757k286O027R168Q4035k0780n5711M9222j542L078
15859A419390j0855J0145J6228n4742O0949l4724l6956K2696j09802J626N3542
15848A337497M7577M7647L836r8294j9169M2898R467J1282Q803k388J5605j7548
$$ plain form
15930 1413402 1374260 1352676 1393556 1394110 1396819 1358357 1390050 1413122 1373840 1366432 1385228 1393826
15918 1393826 1363660 1426951 1423015 1400965 1437982 1423305 1392224 1301732 1316570 1332914 1391808
15907 1391808 1391064 1393378 1359178 1359125 1390372 1365937 1410025 1424396 1389334 1396326 1439379 1392190 1407710
15894 1407710 1383573 1432642 1404978 1420183 1416285 1311607 1347280 1287842 1297195 1361200 1380401
15883 1380401 1361724 1372746 1437751 1397096 1319999 1327705 1389860 1386605 1359078 1311285 1293042 1409783
15871 1409783 1437645 1364936 1348179 1345893 1351920 1361088 1445123 1424343 1368632 1417854 1416312 1419390
15859 1419390 1408535 1418680 1434908 1380166 1441115 1406391 1369435 1392131 1282329 1283955 1337497
15848 1337497 1385074 1432721 1436557 1338263 1319094 1361992 1371459 1382741 1391544 1389156 1404761 1387213
15836A387213j752K5703m9982j5814o74Q2490j9330O4402R67m4613m0403K939
15824A391146l0118N2698J4555N348n0307r353m600j3893J3484j1298K1161K316
15812A381139n8064M798j5547L0093Q3650n1148o6175N8543L061j5969P4763o2658
15800A366486O4022q364j0645Q701k7773J5119p097j9450L7311j8268k8291l9019
15788A332732J01638j7797k3770Q5525p0241l3290L4674K7469l3661o940J0982
15777A407321p518j5595P089J4294K6753m6636k5737L1877M8964O694r843J3856
15765A451519O4824p0600l1360J4832n9L9419j00013j8408O398l1168M4954N117
15753A375455K915M4375P844l9329j4128K6864N065j7872P379k9707m7586R898
$$ plain form
15836 1387213 1385461 1411164 1361182 1345368 1344694 1427184 1407854 1472256 1473223 1428610 1388207 1391146
15824 1391146 1361028 1413726 1428281 1433629 1383322 1373969 1369369 1355476 1368960 1357662 1378823 1381139
15812 1381139 1323075 1327873 1312326 1342419 1426069 1374921 1308746 1367289 1370350 1354381 1429144 1366486
15800 1366486 1430508 1422144 1411499 1420200 1392427 1407546 1400449 1380999 1418310 1400042 1371751 1332732
15788 1332732 1434370 1416573 1392803 1478328 1408087 1374797 1409471 1436940 1403279 1396339 1407321
15777 1407321 1399803 1384208 1391297 1405591 1432344 1385708 1359971 1391848 1440812 1447506 1437663 1451519
15765 1451519 1516343 1445743 1414383 1429215 1429156 1468575 1368562 1350154 1356552 1325384 1370338 1375455
15753 1375455 1378370 1422745 1430589 1391260 1377132 1403996 1409061 1391189 1398568 1368861 1321275 1331173
15741A331173j5259Q4081J904J3522j04562J4099j0049N5944L6425j895K6814
15730A432197L3058k4610j4529N2684m8180l5444r89N5884o003k5846L3742j7967
15718A433997J2077j0928r1683L1339M237n3708J9485N1986N5723l5060L747o723
15706A414489K6416J5497k1281M2375k8695p309r7018J8888M4033K3868L730P1158
15694A506151P609K3377j20324l4686O7569m5897K6607m2958k2631N1453k9603
15683A386667p3682J02207R366m9898l8471K6607J6725M4581N2653J5515n7158
15672A435112J2086j8683L9409J9741j1131L910j3036p6479k092M1300L9875K8322
15660A498334q7149p13K856M6679n6457M4031K0841M5008o4446q6240j6867O9367
$$ plain form
15741 1331173 1315914 1399995 1401899 1415421 1310859 1324958 1314909 1370853 1407278 1405383 1432197
15730 1432197 1465255 1440645 1426116 1478800 1430620 1395176 1394187 1450071 1444068 1418222 1451964 1433997
15718 1433997 1446074 1435146 1343463 1374802 1379039 1325331 1344816 1396802 1452525 1417465 1421212 1414489
15706 1414489 1440905 1456402 1435121 1477496 1448801 1441492 1344474 1363362 1407395 1431263 1434993 1506151
15694 1506151 1513760 1537137 1416813 1382127 1449696 1403799 1430406 1387448 1364817 1416270 1386667
15683 1386667 1312985 1415192 1424558 1374660 1336189 1362796 1379521 1424102 1476755 1492270 1435112
15672 1435112 1447198 1428515 1467924 1487665 1476534 1480444 1467408 1390929 1388837 1430137 1470012 1498334
15660 1498334 1411185 1410472 1413328 1460007 1403550 1447581 1468422 1513430 1448984 1362744 1345877 1415244
15648A415244L833Q1275q4511o4460P1653j8138L0340Q725J0916m84n86o4120
15636A389687M2747J3021l0271N6189k7847J0799l592l0096l0506n2482K3512
15625A361161k0520L3567J4815k514K6425n0404L9424K6014o8193l5463J9617
15614A343929M4868L3175M1447p051l7958N7237l8665m6782J12355n9973o8491
15603A374091M3627j9913m0256J0004M2799L126K6751k3525J5517j5839l2484
15592A383898l960L7712m829l5766K7022N9603J4412m2712N4715m3606k136N6177
15580A500530l3453k3536J3167k2009M9101j8514k6103j21200K7601L1007j9063
15569A357528N2106K3877j9699j1897J8186k351r345M2792M379n5261M055P5222
$$ plain form
15648 1415244 1419077 1500352 1415841 1351381 1423034 1404896 1435236 1443961 1454877 1454393 1453807 1389687
15636 1389687 1432434 1445455 1415184 1471373 1443526 1454325 1450733 1420637 1390131 1337649 1361161
15625 1361161 1340641 1374208 1389023 1386509 1412934 1362530 1401954 1427968 1359775 1324312 1343929
15614 1343929 1388797 1421972 1463419 1456368 1418410 1475647 1436982 1390200 1502555 1442582 1374091
15603 1374091 1417718 1397805 1357549 1367553 1410352 1413478 1440229 1416704 1432221 1416382 1383898
15592 1383898 1379938 1417650 1412821 1377055 1404077 1463680 1478092 1435380 1490095 1446489 1444353 1500530
15580 1500530 1467077 1443541 1456708 1434699 1483800 1465286 1439183 1317983 1345584 1376591 1357528
15569 1357528 1409634 1433511 1413812 1401915 1420101 1417750 1408405 1451197 1455576 1400315 1404370 1479592
15557A479592M6722j4384m2261q195j3649k6870L6403o1485m895j1520J3920k0846
15545A372532L8584N9108j6849M581K815L1881o1879j4599L0668l5834O4088j9657
15533A455439k5703K3790l5574K4574N5258l0435o2444Q920q613p276K6880K0321
15521A445137K967k993j1445J1365L1256N2417n078k5734l6297p896J6797m6364
15509A424132m4630K7781l7503j2609O2159m1041M7729K3734q82n7146k9418M3656
15497A405962j7937J5467L752N9372M9252L3025k4129p852l6507l2289m703Q290
15485A451703L1350n6964n7184k5940M8613L8313l2561O3837o615q3903J7049
15474A387698J8039k4250Q3832J8652l6827r639K1369R6348k1378n1098K2596
$$ plain form
15557 1479592 1526314 1511930 1469669 1461474 1447825 1420955 1457358 1395873 1390978 1379458 1393378 1372532
15545 1372532 1411116 1470224 1453375 1457956 1460771 1492652 1430773 1416174 1446842 1411008 1475096 1455439
15533 1455439 1429736 1453526 1417952 1442526 1497784 1467349 1404905 1413825 1405212 1397936 1424816 1445137
15521 1445137 1448104 1445111 1433666 1445031 1476287 1528704 1523626 1497892 1461595 1453699 1470496 1424132
15509 1424132 1379502 1407283 1369780 1357171 1419330 1378289 1426018 1449752 1448870 1391724 1362306 1405962
15497 1405962 1388025 1403492 1407244 1466616 1515868 1548893 1524764 1516912 1480405 1448116 1443413 1451703
15485 1451703 1483053 1426089 1368905 1342965 1391578 1429891 1397330 1461167 1454552 1370649 1387698
15474 1387698 1405737 1381487 1465319 1483971 1447144 1437505 1458874 1555222 1533844 1482746 1505342
15463A505342n6461j9687J1144o5386L0191m9117M1347Q514J04992L893l5858
15452A478914j66480j5495J12763q803N625J8241P8936j6996j0076p098R759l1957
15440A447333M2242p0339K3167N8879K2412O785o1060p7091M2648O5445J5218
15429A515639p3639k2123j3565k1563P9994j5875o0254Q4178M9220k4982J0365
15418A507395J3344k0994q180l8117p4279N1527O1158K5173l1112p6500J7783
15407A427198J0931l4727N3963m1233J9373m8943K5866L1506n7750L6336k3438
15396A399082N3907n7387l4347Q1192o1856n2947L8789P1139n6269k6262N9950
15385A414991R6289K4429K2947k4732q1085l3156R7517p587k7585M5594k3592
$$ plain form
15463 1505342 1448881 1429194 1440338 1374952 1405143 1356026 1397373 1405887 1510879 1514772 1478914
15452 1478914 1312434 1296939 1409702 1400899 1406524 1424765 1503701 1486705 1476629 1469531 1479290 1447333
15440 1447333 1489575 1419236 1442403 1501282 1523694 1530479 1469419 1392328 1434976 1500421 1515639
15429 1515639 1442000 1419877 1406312 1384749 1464743 1448868 1388614 1472792 1522012 1497030 1507395
15418 1507395 1520739 1499745 1491565 1453448 1379169 1430696 1491854 1517027 1485915 1409415 1427198
15407 1427198 1438129 1403402 1457365 1416132 1435505 1386562 1412428 1443934 1386184 1422520 1399082
15396 1399082 1452989 1395602 1361255 1442447 1380591 1327644 1366433 1437572 1381303 1355041 1414991
15385 1414991 1511280 1535709 1558656 1533924 1452839 1419683 1517200 1509613 1482028 1527622 1504030
15374A504030k2248l2952l3188j2227J09186j0027J645j98r7349o559O3624k4042
15362A439695j6661K40l1200J6074J579m483N181J5946k986N4424M1832l9250
15350A480391p1190M8145L2231o4410J1247J8203J8936N3282k773o8631r0369
15339A365062p591M2165K8283N6224j5410n3913q480N1961J4162j6387J6173k930
15327A469319m2654l3733k449Q3033Q721m3951K7013l018J2398N5163m7309j1608
15315A470925K912N4793k283j06746n88K6177l4448J3051N3162p9r06n5065k0408
15302A400497Q9944K1495m8092K8443j446o2408N0828J8014l5781k1369Q9658
15291A529783o8742O3681N6613m1223l0607J2633k0558K0249j9050q2565K8303
$$ plain form
15374 1504030 1481782 1448830 1415642 1403415 1512601 1502574 1504219 1504021 1406672 1400113 1463737 1439695
15362 1439695 1423034 1423274 1392074 1408148 1409727 1405244 1410425 1426371 1423385 1477809 1519641 1480391
15350 1480391 1409201 1457346 1489577 1425167 1436414 1454617 1473553 1526835 1524062 1455431 1365062
15339 1365062 1357471 1399636 1427919 1484143 1468733 1414820 1406340 1458301 1472463 1456076 1472249 1469319
15327 1469319 1426665 1392932 1390483 1473516 1482237 1438286 1465299 1462281 1474679 1529842 1482533 1470925
15315 1470925 1473837 1528630 1526347 1419601 1419013 1445190 1410742 1423793 1476955 1476876 1475970 1420905 1400497
15302 1400497 1490441 1511936 1463844 1492287 1490841 1428433 1479261 1497275 1461494 1440125 1529783
15291 1529783 1461041 1524722 1581335 1540112 1509505 1522138 1501580 1521829 1502779 1420214 1448517
15280A448517K7728N025m5031J5823j7481R272J1824P6208J8058j21387l851L1199
15268A455904k7249Q7432j0879l4307J9189K0189k0977K739J8732j6762J9298
15257A513309o1328k8484K3202N3281O5616l919m2981j25283O1519J10110J3356
15246A578398M0980k2342o5495m5974p5681N758R1825J8649o0943l9667K8052
15235A453560L7741j8531M3828j2326k0645K8541K066J733J4590j3900m397L2451
15223A544711k2482p3572R21M4240J0195m1711L7846O514l6819P247L1385k0314
15211A488161n399n8933m0863M8231M8461l5268j6019M6314K5419m4949n7508
15200A397647R498j762M7497J0980J5332o39K7314O4676r180p8191j3109L2615
$$ plain form
15280 1448517 1476245 1481270 1436239 1452062 1434581 1443853 1455677 1531885 1549943 1428556 1424705 1455904
15268 1455904 1428655 1516087 1505208 1470901 1490090 1510279 1489302 1492041 1510773 1494011 1513309
15257 1513309 1451981 1423497 1446699 1499980 1565596 1561677 1518696 1393413 1454932 1565042 1578398
15246 1578398 1619378 1597036 1531541 1485567 1409886 1415644 1507469 1526118 1465175 1425508 1453560
15235 1453560 1491301 1472770 1516598 1504272 1483627 1512168 1514234 1515967 1530557 1516657 1512260 1544711
15223 1544711 1522229 1448657 1449578 1493818 1504013 1462302 1500148 1506662 1469843 1477090 1508475 1488161
15211 1488161 1482762 1423829 1382966 1431197 1479658 1444390 1428371 1474685 1500104 1455155 1397647
15200 1397647 1407145 1405383 1452880 1463860 1479192 1478553 1505867 1570543 1561363 1483172 1470063 1502678
15188A502678K2944P1159k4783k0750n7024k9032m5614R298O4004O6385l466q4000
15176A471799N2059k1305m3153j3840p498P8646J8055m2549j6731L6103K9387
15165A540973n1810K8555R440m3522k8196L305J0021N4282m1592j5238K5575J2048
15153A503841R115J8588j1883L2163l0239o2737J7203m2974J7645N6977k7499
15142A480200n326k5984k1820k7112L737P6634P204m2239J2853k8435o2405P9463
15130A446770m3366p364L3469M9363Q9265M705m6211p1785J2385P2122l2130m3615
15118A463608j0435J2692J5170j6243J31426l0151k0084o2188j06823O5264K588
15107A444824q0809L4890P8800o226k9605N6478p8696K856O1231j9655K7087M1873
$$ plain form
15188 1502678 1525622 1596781 1571998 1551248 1494224 1465192 1419578 1428876 1492880 1559265 1555799 1471799
15176 1471799 1523858 1502553 1459400 1445560 1438062 1516708 1534763 1492214 1475483 1511586 1540973
15165 1540973 1489163 1517718 1527158 1483636 1455440 1458745 1468766 1523048 1481456 1466218 1491793 1503841
15153 1503841 1512956 1531544 1519661 1551824 1521585 1458848 1476051 1433077 1450722 1507699 1480200
15142 1480200 1474874 1448890 1427070 1399958 1403695 1480329 1487533 1445294 1458147 1429712 1367307 1446770
15130 1446770 1403404 1396040 1429509 1478872 1568137 1572842 1526631 1454846 1467231 1539353 1507223 1463608
15118 1463608 1453173 1465865 1481035 1464792 1596218 1566067 1545983 1483795 1376972 1442236 1444824
15107 1444824 1364015 1398905 1477705 1471479 1441874 1498352 1419656 1422512 1483743 1464088 1491175 1533048
15095A533048n3319k8189J2276m2397r487J12490L5794o2433l1702p64K2293K6184
15083A513794J91M7459l5939l7114L1316L9210J1448j4322k3880o4271o939N53
15071A461506L3613J9143K2060k5718j5256k3971j8004N1811L9107l0044k2763
15060A491484J3966K7105l5717j5432o510k024N2044r271k0809P1359o0835k8559
15048A476801L7849K9254l1274l7340L8914R866l2047k0986k4434J4799j2113
15037A449289K2645L7074K0027o4881K9993J6115m0471J6901M7971P417O098l7314
15025A510864J3235k6072J2863K6183K1892K530n0651k0003K3488m0591N1524
15014A525262L1976j10215Q919L1387O1644K6194o7943k4616k0240O6977O414
$$ plain form
15095 1533048 1479729 1451540 1463816 1421419 1411932 1524422 1560216 1497783 1466081 1465317 1487610 1513794
15083 1513794 1513985 1561444 1525505 1488391 1519707 1558917 1570365 1556043 1532163 1467892 1460953 1461506
15071 1461506 1495119 1514262 1536322 1510604 1495348 1471377 1453373 1505184 1544291 1514247 1491484
15060 1491484 1505450 1532555 1496838 1481406 1474896 1472872 1524916 1515645 1494836 1566195 1505360 1476801
15048 1476801 1514650 1543904 1512630 1475290 1514204 1524070 1492023 1471037 1446603 1461402 1449289
15037 1449289 1471934 1509008 1529035 1464154 1494147 1510262 1469791 1486692 1534663 1542080 1548178 1510864
15025 1510864 1524099 1498027 1510890 1537073 1558965 1561495 1510844 1490841 1514329 1473738 1525262
15014 1525262 1557238 1447023 1455942 1487329 1548973 1575167 1507224 1482608 1462368 1529345 1535759
15003A535759p5527j4076L6197K0861j6227K5560j6647J5284k6632N0497l6543
14992A498506j2188m3937L0139N2018j2487r135P7014J0792o1647m2687m4809
14981A441579J06659K848l0151p045J8171L2793k7655l1888J3825K0438J0305
14970A549879J4107m071l5495j1317M4924K4362p0416K8953O241n7798m764j622
14958A482983R847n6266K3400L8045j3298O4563P2196o8710p6721M948k5363J1272
14946A466896L57r606L1614K5031N1537p0450L4893k6280n3276M3302K6845l0201
14934A490662K2925J1520l3988n1995k9887J0512k7615J3892O0121J1518J7791
14923A495456r315m0450k8549J1629l838M4989M3637L998m410J5975o2823O8775
$$ plain form
15003 1535759 1460232 1446156 1482353 1503214 1486987 1512547 1495900 1511184 1484552 1535049 1498506
14992 1498506 1486318 1442381 1472520 1524538 1512051 1502916 1579930 1590722 1529075 1486388 1441579
14981 1441579 1548238 1551086 1520935 1513890 1532061 1564854 1537199 1505311 1519136 1539574 1549879
14970 1549879 1563986 1559915 1524420 1513103 1558027 1582389 1511973 1540926 1547167 1489369 1484605 1482983
14958 1482983 1492830 1436564 1459964 1498009 1484711 1549274 1621470 1552760 1476039 1480987 1455624 1466896
14946 1466896 1467253 1457647 1489261 1514292 1565829 1495379 1530272 1503992 1450716 1494018 1520863 1490662
14934 1490662 1513587 1525107 1491119 1439124 1409237 1419749 1392134 1406026 1466147 1477665 1495456
14923 1495456 1486141 1445691 1417142 1428771 1424933 1469922 1513559 1517557 1513147 1529122 1466299 1535074
14911A535074k3097k0041K2757l9927N836J0489p7813L1421J09111L9698k0134
14900A573374k5299k5977m1582J6103m8264L6056N4285k3443L0778n3524l5877
14889A456630Q0579k7231K514L3310O71r9848L7057K9198K4606l0126l1674k5885
14877A449801O8580L6946k4160q330l0880J2798M8944N8015j0395r4427M8720
14866A555612M2986k480o3380J198L5623j3187r933K4261o5053M6580J2909l1829
14854A533307m3071N4538P2799r9177j7304L9405K6874P3883j0289l8978l3803
14843A558184N342k7121j1821J4221k4849K4895p602J319j0009n7830k0746K1042
14831A465025M2886O678j5326R3271m5996j4596K696k8333l968R413p594K8817
$$ plain form
14911 1535074 1511977 1491936 1514693 1474766 1480602 1491091 1413278 1444699 1553810 1593508 1573374
14900 1573374 1548075 1522098 1480516 1496619 1448355 1484411 1538696 1515253 1546031 1492507 1456630
14889 1456630 1537209 1509978 1512492 1545802 1546473 1446625 1483682 1512880 1537486 1507360 1475686 1449801
14877 1449801 1518381 1555327 1531167 1522837 1491957 1504755 1553699 1611714 1601319 1506892 1555612
14866 1555612 1598598 1596118 1532738 1533936 1569559 1556372 1546439 1570700 1505647 1552227 1565136 1533307
14854 1533307 1490236 1544774 1617573 1518396 1501092 1540497 1567371 1641254 1630965 1591987 1558184
14843 1558184 1563526 1536405 1524584 1538805 1513956 1538851 1531249 1532568 1522559 1464729 1443983 1465025
14831 1465025 1507911 1514589 1499263 1592534 1546538 1531942 1534638 1506305 1502337 1511750 1504156 1532973
14819A532973l368l9343L664L957K6001m6259p0361O7747J4228O756N704J3852
14807A515551J8767M1398k0549M928K6632K7042p5240M027l2636N1290J0819l7034
14795A534995j0346k955J7485M6819J8679o3105j3999q0544M8329N0299p3295
14784A472362k1103K6879J4563n340M3594K5651k8175K8277O943j1562k0144l3969
14772A497976J9920o596J2724j2410n347N6253L144m211j24081M2856K4218L51
14760A504797N286M4504p260P711K2881O519p3879J0251l4524K2640n219n7177
14748A446530L4468o1381k972P4227r972j3841j5326O3802m139q83O7023q5059
14736A492477j0105L543N1741m5435L710K0120J231K817K9742O2673l306p3231
$$ plain form
14819 1532973 1529605 1490262 1493926 1497883 1523884 1477625 1407264 1475011 1489239 1495995 1501699 1515551
14807 1515551 1534318 1575716 1555167 1560095 1586727 1613769 1538529 1542556 1509920 1561210 1572029 1534995
14795 1534995 1524649 1521694 1539179 1585998 1604677 1541572 1527573 1447029 1495358 1545657 1472362
14784 1472362 1451259 1478138 1492701 1487361 1530955 1556606 1528431 1556708 1563651 1552089 1531945 1497976
14772 1497976 1517896 1511300 1524024 1511614 1506267 1562520 1565664 1561453 1437372 1480228 1504446 1504797
14760 1504797 1510083 1554587 1547327 1555038 1577919 1584438 1510559 1520810 1486286 1508926 1503707 1446530
14748 1446530 1480998 1419617 1416645 1490872 1480900 1467059 1451733 1515535 1511396 1510513 1577536 1492477
14736 1492477 1482372 1485915 1537656 1492221 1495931 1516051 1517282 1520099 1549841 1612514 1609208 1535977
14724A535977m1641p35m2239P2140O3709j2741o5124l5778O8419L6159l3638p406
14712A537102M0148l9589j9135k8293m697N109Q1710J3828K5369J5407o84l3440
14700A592835l2982n1465Q1600J1739p2546J5775n789r538q148K2342n325M1913
14688A580411m4256J3387K3635m0318L0547J6995j6861L4737M2260n8673m7686
14677A534178M6093J0052k1182k4601P93J42L9437l3848n9047Q0968j0646m1002
$$ plain form
14724 1535977 1494336 1493601 1451362 1523502 1587211 1574470 1509346 1473568 1541987 1578146 1544508 1537102
14712 1537102 1577250 1537661 1518526 1490233 1485536 1490645 1572355 1586183 1611552 1626959 1626275 1592835
14700 1592835 1559853 1508388 1589988 1601727 1529181 1544956 1539167 1529629 1521481 1543823 1538498 1580411
14688 1580411 1536155 1549542 1573177 1532859 1563406 1580401 1563540 1598277 1640537 1581864 1534178
14677 1534178 1580271 1590323 1569141 1544540 1545333 1545475 1584912 1551064 1492017 1572985 1562339 1521337
$$ [...]
##END NTUPLES=NMR SPECTRUM
##END=
