##TITLE=abcd
##JCAMPDX= 6.0         $$ Bruker NMR JCAMP-DX V2.0
##DATA TYPE= NMR SPECTRUM
##DATA CLASS= NTUPLES
##ORIGIN= UXNMR, Bruker Analytische Messtechnik GmbH
##OWNER= root
$$ XWIN-NMR		Version 3.5
$$ Wed Nov 19 17:22:42 2025 Russian Standard Time (UT+4h)  servis@DPX200
##.OBSERVE FREQUENCY= 200.131235884673
##.OBSERVE NUCLEUS= ^1H
##.ACQUISITION MODE= SIMULTANEOUS
##.ACQUISITION SCHEME= undefined
##.AVERAGES= 32
##.DIGITISER RES= 18
##SPECTROMETER/DATA SYSTEM= spect
##.PULSE SEQUENCE= zg
##.SOLVENT NAME= Acetone
##.SHIFT REFERENCE= (INTERNAL, Acetone, 0, 16.4885)
##AUDIT TRAIL= $$ (NUMBER, WHEN, WHO, WHERE, WHAT)
$$ ##TITLE= Audit trail, XWIN-NMR		Version 3.5
$$ ##JCAMPDX= 5.01
$$ ##ORIGIN= Bruker BioSpin GmbH
$$ ##OWNER= servis
$$ F:\spectra/data/av/nmr/H1/1/pdata/1/auditp.txt
$$ ##AUDIT TRAIL=  $$ (NUMBER, WHEN, WHO, WHERE, WHAT)
(   1,<2025-11-19 17:10:56.70 +0400>,<servis>,<DPX200>,
      <created by zg, POWCHK disabled, PULCHK disabled
       configuration hash MD5:
       00 E9 B6 7A A2 85 ED C7 34 08 36 98 17 FE 4E 26
       data hash MD5: 32K
       8E 8F B1 BC B2 4C 97 E6 9C 79 08 CA DC A1 3A 48>)
(   2,<2025-11-19 17:21:51.37 +0400>,<servis>,<DPX200>,
      <Start of raw data processing
       efp BC_mod = 2 LB = 0.05 FT_mod = 6 PKNL = 1 PHC0 = -263.2107 PHC1 = 6.301564 SI = 16K 
       data hash MD5: 16K
       B9 46 14 68 B2 12 6E BD 2C 65 15 37 7F 1A 4B 8D>)
$$ ##END=
$$ 
$$ hash MD5
$$ 46 62 7F 18 EC 9F 4F 02 2F 66 D5 F2 CF 4D F0 A2
##$RELAX= 
##$RELAX= 
##$RELAX= 
##$RELAX= 
##$RELAX= 
##$RELAX= 
##$RELAX= 
##$RELAX= 
$$ Bruker specific parameters
$$ --------------------------
##$DU= <F:\spectra>
##$EXPNO= 1
##$NAME= <H1>
##$PROCNO= 1
##$TYPE= <nmr>
##$USER= <av>
##$AMP= (0..31)
100 100 100 100 100 100 100 100 100 100 100 100 100 100 100 100 100 100 
100 100 100 100 100 100 100 100 100 100 100 100 100 100 
##$AQSEQ= 0
##$AQ_mod= 1
##$AUNM= <au_zg>
##$AUTOPOS= <>
##$BF1= 200.13
##$BF2= 200.13
##$BF3= 200.13
##$BF4= 200.13
##$BF5= 500.13
##$BF6= 500.13
##$BF7= 500.13
##$BF8= 500.13
##$BYTORDA= 1
##$CFDGTYP= 0
##$CFRGTYP= 5
##$CHEMSTR= <none>
##$CNST= (0..31)
1 1 145 1 1 1 1 1 1 1 1 1 1 1 1 1 1 1 1 1 1 1 1 1 1 1 1 1 1 1 1 1 
##$CPDPRG= <>
##$CPDPRG1= <>
##$CPDPRG2= <>
##$CPDPRG3= <>
##$CPDPRG4= <mlev>
##$CPDPRG5= <mlev>
##$CPDPRG6= <mlev>
##$CPDPRG7= <mlev>
##$CPDPRG8= <mlev>
##$CPDPRGB= <>
##$CPDPRGT= <>
##$D= (0..31)
0 2 0 0 0 0 0 0 0 0.06 0 0 0 0 0 0 0.0002 0 0 0 0 0 0 0 0 0 0 0 0 0 0 
0 
##$DATE= 1763557856
##$DBL= (0..7)
120 120 120 120 120 120 120 120 
##$DBP= (0..7)
150 150 150 150 150 150 150 150 
##$DBP07= 0
##$DBPNAM0= <>
##$DBPNAM1= <>
##$DBPNAM2= <>
##$DBPNAM3= <>
##$DBPNAM4= <>
##$DBPNAM5= <>
##$DBPNAM6= <>
##$DBPNAM7= <>
##$DBPOAL= (0..7)
0.5 0.5 0.5 0.5 0.5 0.5 0.5 0.5 
##$DBPOFFS= (0..7)
0 0 0 0 0 0 0 0 
##$DE= 6
##$DECBNUC= <off>
##$DECIM= 32
##$DECNUC= <off>
##$DECSTAT= 4
##$DIGMOD= 1
##$DIGTYP= 9
##$DL= (0..7)
0 120 120 120 120 120 120 120 
##$DP= (0..7)
150 150 150 150 150 150 150 150 
##$DP07= 0
$$ [...]
##$SUBNAM4= <"">
##$SUBNAM5= <"">
##$SUBNAM6= <"">
##$SUBNAM7= <"">
##$SUBNAM8= <"">
##$SUBNAM9= <"">
##$SW= 20.6817932712277
##$SWIBOX= (0..15)
0 0 3 0 0 0 0 0 0 0 0 0 0 0 0 0 
##$SW_h= 4139.07284768212
##$TD= 32768
##$TD0= 1
##$TE= 0
##$TE2= 300
##$TE3= 300
##$TEG= 300
##$TL= (0..7)
0 120 120 120 120 120 120 120 
##$TP= (0..7)
150 150 150 150 150 150 150 150 
##$TP07= 0
##$TPNAME0= <>
##$TPNAME1= <>
##$TPNAME2= <>
##$TPNAME3= <>
##$TPNAME4= <>
##$TPNAME5= <>
##$TPNAME6= <>
##$TPNAME7= <>
##$TPOAL= (0..7)
0.5 0.5 0.5 0.5 0.5 0.5 0.5 0.5 
##$TPOFFS= (0..7)
0 0 0 0 0 0 0 0 
##$TUNHIN= 0
##$TUNHOUT= 0
##$TUNXOUT= 0
##$USERA1= <user>
##$USERA2= <user>
##$USERA3= <user>
##$USERA4= <user>
##$USERA5= <user>
##$V9= 5
##$VALIST= <valist>
##$VCLIST= <CCCCCCCCCCCCCCC>
##$VD= 0
##$VDLIST= <DDDDDDDDDDDDDDD>
##$VPLIST= <PPPPPPPPPPPPPPP>
##$VTLIST= <TTTTTTTTTTTTTTT>
##$WBST= 1024
##$WBSW= 30
##$XGAIN= (0..3)
0 0 0 0 
##$XL= 0
##$YL= 0
##$YMAX_a= 120880
##$YMIN_a= -122410
##$ZGOPTNS= <>
##$ZL1= 120
##$ZL2= 120
##$ZL3= 120
##$ZL4= 120
##$ABSF1= 0
##$ABSF2= 0
##$ABSG= 0
##$ABSL= 0
##$ALPHA= 0
##$AQORDER= 0
##$ASSFAC= 0
##$ASSFACI= 0
##$ASSFACX= 0
##$ASSWID= 0
##$AUNMP= <proc_1d>
##$AZFE= 0.1
##$AZFW= 0.1
##$BCFW= 0
##$BC_mod= 2
##$BYTORDP= 0
##$COROFFS= 0
##$CY= 18.4799938201904
##$DATMOD= 1
##$DC= 0
##$DFILT= <>
##$DTYPP= 0
##$F1P= 9.9274215381318
##$F2P= -0.165520771350173
##$FCOR= 1
##$FTSIZE= 16384
##$FT_mod= 6
##$GAMMA= 0
##$GB= 0
##$INTBC= 1
##$INTSCL= 4.127829e-11
##$ISEN= 128
##$LB= 0.05
##$LEV0= 0
##$LPBIN= 0
##$MAXI= 10000
##$MC2= 0
##$MEAN= 0
##$ME_mod= 0
##$MI= 50
##$NCOEF= 0
##$NC_proc= -4
##$NLEV= 6
##$NOISF1= 3.799351
##$NOISF2= 2.8
##$NSP= 0
##$NTH_PI= 0
##$NZP= 0
##$OFFSET= 16.48848
##$PC= 4
##$PHC0= -263.2107
##$PHC1= 6.301564
##$PH_mod= 1
##$PKNL= yes
##$PPARMOD= 0
##$PSCAL= 4
##$PSIGN= 0
##$REVERSE= no
##$SF= 200.130005582386
##$SI= 16384
##$SIGF1= 3
##$SIGF2= 2
##$SINO= 400
##$SIOLD= 16384
##$SREGLST= <1H.CDCl3>
##$SSB= 0
##$STSI= 16384
##$STSR= 0
##$SW_p= 4139.07284768211
##$SYMM= 0
##$S_DEV= 0
##$TDeff= 32768
##$TDoff= 0
##$TI= <>
##$TILT= no
##$TM1= 0
##$TM2= 0
##$TOPLEV= 0
##$USERP1= <user>
##$USERP2= <user>
##$USERP3= <user>
##$USERP4= <user>
##$USERP5= <user>
##$WDW= 1
##$XDIM= 16384
##$YMAX_p= 470998523
##$YMIN_p= -202060
$$ End of Bruker specific parameters
$$ ---------------------------------
##NTUPLES= NMR SPECTRUM
##VAR_NAME=  FREQUENCY,     SPECTRUM/REAL,   SPECTRUM/IMAG
##SYMBOL=    X,             R,               I
##VAR_TYPE=  INDEPENDENT,   DEPENDENT,       DEPENDENT
##VAR_FORM=  AFFN,          ASDF,            ASDF
##VAR_DIM=   16384,         16384,           16384
##UNITS=     HZ,            ARBITRARY UNITS, ARBITRARY UNITS
##FACTOR=    0.252644378177508, 1,           1
##FIRST=     3299.83951724647, 0,            0
##LAST=      -839.233330435636, 0,           0
##MIN=       -839.233330435636, -202060,     0
##MAX=       3299.83951724647, 470998523,    0
$$ Real data points
##PAGE= N=1
##DATA TABLE= (X++(R..R)), XYDATA
$$ [...]
13352a1029o931L8548J576l7417Q6309l7005N042k554j0402m3841N6116J6262
$$ -11029 -17960 20588 22164 -15253 71056 34051 39093 36539 26137 -17704 38412 54674
13340E4674n4424M8779n5289O7842l3822m4965N5696k0558J825M848k7660K0611
$$ 54674 250 49029 -6260 61582 27760 -17205 38491 17933 19758 24606 -3054 17557
13328A7557l5712L5882K8707o0293L7475j0008m1536K9912k4881K2880J842L4826
$$ 17557 -18155 17727 46434 -13859 23616 13608 -27928 1984 -22897 -17 1825 36651
13316C6651n4111R519J1130j5715K2908k7240J1876J461L6699J0225j555o737
$$ 36651 -17460 -7941 3189 -12526 10382 -16858 -4982 -3521 33178 43403 41848 35111
13304C5111n8779L0001L1824l0774Q236j9285k0978L3127Q597J9780M534k4940
$$ 35111 -23668 6333 38157 7383 15619 -3666 -24644 8483 17080 36860 41394 16454
13292A6454J9060k4696K7953k8556p507J8424l4848M1904m2582N0343m2014K9493
$$ 16454 35514 10818 38771 10215 2708 21132 -13716 28188 -14394 35949 -6065 23428
13280B3428N1736o1869L1520o8889K9075P214r444N0826o0823L3286j3706r132
$$ 23428 75164 13295 44815 -24074 5001 12215 2771 53597 -7226 26060 12354 3222
13268C222L3578n1094L3602k1654K9828q491p588Q993l3921J8118k0487r015r697
$$ 3222 36800 -14294 19308 -2346 27482 18991 11403 20396 -13525 4593 -15894 -24909 -34606
13255c4606N3978l2810L5520m0020M9790n5691N198L1692P9408p3168j7965l5874
$$ -34606 19372 -13438 22082 -17938 31852 -23839 -18641 13051 92459 19291 1326 -34548
13243c4548P7980m0096K8169k2706J1142N092n5427N4090j5883J2292J9867o9705
$$ -34548 43432 3336 31505 8799 19941 25033 -30394 23696 7813 20105 39972 -29733
13231b9733N0804j0079n6004K9221L9502p4750P7687p1295L2242L3484m4174K2650
$$ -29733 21071 10992 -45012 -15791 23711 -51039 26648 -44647 -12405 21079 -23095 -445
13219d45J831j2185J176N3539q5349M7744J1006m3508K0535k7634N4301n581m0652
$$ -445 1386 -10799 -9623 43916 -41433 6311 17317 -26191 -5656 -33290 21011 15430 -25222
13206b5222P2663r924J3873n4871k4418L3872K1526j1901O957o113m1480K5366
$$ -25222 47441 37517 51390 -3481 -27899 5973 27499 15598 22555 16442 -25038 328
13194C28J3678k3506O4743j4959J9317m6632J9361M372l143k7608O3101m7531
$$ 328 14006 -9500 55243 40284 59601 12969 32330 36702 33559 5951 69052 21521
13182B1521n184M5477o4994N5418j0700k1248k1403L5223J673k9322O274J4115
$$ 21521 16337 61814 -3180 52238 41538 20290 -1113 34110 35783 6461 12735 26850
13170B6850j8389K3851k1753M9034p8520L1307K2716p0784Q1087n5949M4318l9769
$$ 26850 8461 32312 10559 59593 -18927 12380 35096 -35688 45399 -10550 33768 -6001
13158f001m676J5831j4984L0428k1471K3041k800L6377o0344J2902J9864j1695
$$ -6001 -10677 5154 -9830 20598 -873 22168 19368 55745 -4599 8303 28167 16472
13146A6472m2517N941O6465R486j8646k4030o5637P3833K7896k8266k9706J3556
$$ 16472 -26045 -20104 46361 55847 37201 13171 -52466 21367 49263 20997 -8709 4847
13134D847J0739j9466J8305n5178K5049m2222N1712p017O973K8012m6295L4830
$$ 4847 15586 -3880 14425 -40753 -15704 -57926 -6214 -13231 -6258 21754 -24541 10289
13122A0289K2402K9976k0487j5370R918l0780L7978n7845L7753j9868l7Q868J4335
$$ 10289 32691 62667 42180 26810 36728 5948 43926 -13919 23834 3966 3929 12797 27132
13109B7132k3582L6347k5028r244l3708O6300O354l9528L5091N75k9249O397l842
$$ 27132 3550 39897 14869 5625 -28083 38217 44571 5043 40134 40709 11460 17857 14015
13096A4015j0206K328k2131m5011O7792Q045k8438N0076o5754R108K4089K2570
$$ 14015 3809 6137 -15994 -61005 6787 14832 -13606 36470 -29284 -20176 3913 26483
13084B6483O428j1686o160j614K3515l6226K0605O0710j01192J2387j1475M3547
$$ 26483 32911 21225 15065 13451 36966 740 21345 82055 -19137 -6750 -18225 25322
13072B5322k0167o5602Q5092m891j3350J2079m3039J6004M0713k9461P9102p3671
$$ 25322 5155 -60447 24645 19754 6404 18483 -24556 -8552 32161 2700 81802 8131
13060H131P256M2115k6150n6171O6509m1288q432M4295P817M028o1483L1610L364
$$ 8131 15387 57502 31352 -24819 41690 402 -8030 36265 44082 48110 -13373 18237 21601
13047B1601P673Q337j5080l8628L680K6893j7839K3933k1187O692L1300j4546
$$ 21601 29274 37611 22531 -16097 -12417 14476 -3363 20570 -617 6075 37375 22829
13035B2829o678J2729n741m3489k7946O7962j0927K2536m8748K7358o642j4134
$$ 22829 16151 28880 23139 -20350 -48296 19666 8739 31275 -17473 9885 3243 -10891
13023a0891R571J6333l0445K8583L254j0549M6181M439p5509M7940k9987N056
$$ -10891 -1320 15013 -15432 13151 16405 5856 52037 56476 -19033 28907 -1080 3976
13011C976j0338P684J9494m1378M2511m3176k642L2744R910J0780m1814N3243
$$ 3976 -6362 1322 20816 -20562 21949 -21227 -23869 8875 18785 29565 -12249 40994
12999D0994n2450M531K6533n553P971n2p236k2003L0258J4376J2334k1133j681
$$ 40994 -11456 -6925 19608 14055 22026 21974 14738 -7265 22993 37369 49703 28570 26889
12986B6889o241n2762N0992k871J5137k3185k837k0947K6648j5721m730N118m8968
$$ 26889 20648 -32114 18878 16007 31144 7959 5122 -15825 10823 -4898 -9628 -4510 -53478
12973e3478K9623J6359M5010l6805L5130j8634m2522L9370L1805l7541M020J0212
$$ -53478 -23855 -7496 37514 709 35839 17205 -25317 14053 45858 8317 12337 22549
12961B2549K6738n2639K043j6257N6528n472l9824K436K8692m6495K4711n358
$$ 22549 49287 -3352 -1309 -17566 38962 33490 -6334 -3898 24794 -21701 3010 -2348
12949b348J7836L5736m4486P351k2878P4265o1580q816K9187M0550n6439j1792
$$ -2348 15488 51224 6738 14089 -8789 65476 3896 -4920 24267 64817 8378 -3414
12937c414L8919k5157j0668M4348m0101k8292L2568N3675m3435l1346l339M8536
$$ -3414 35505 10348 -320 44028 3927 -24365 8203 61878 18443 -12903 -16242 32294
12925C2294m7923K1483P670l5710M903o988J3704j2820Q9867n5015k4849M2266
$$ 32294 -15629 5854 13524 -22186 -17283 -24271 -10567 -23387 66480 11465 -13384 28882
12913B8882m7598K6212P199l6325L1977L1299l1530L5188n185q1751Q7319l3376
$$ 28882 -18716 7496 14695 -21630 10347 41646 10116 45304 40119 -41632 45687 12311
12901A2311j984k1137O8629k3610n3486j4532M6503j2800n7106N2186m78N791
$$ 12311 10327 -10810 57819 34209 -19277 -33809 12694 -106 -57212 -5026 -5504 287
12889B87j9980P227N7790k0214m8570O1017O563p5684J3568J2367K8184o08Q254
$$ 287 -19693 -12466 45324 25110 -23460 37557 44120 -31564 -17996 -5629 22555 21947 30201
12876C0201J268J4466j2854k0213K9452n6528L0980l7566J5503P927q327J3104
$$ 30201 31469 45935 33081 12868 42320 -14208 16772 -20794 -5291 2636 -5691 7413
12864G413j7130K9714J1485l6692Q947P640L0605m2109L1372k4845K8856K3443
$$ 7413 -9717 19997 31482 -5210 3737 11377 41982 -127 31245 6400 35256 58699
12852E8699k6161j9403k1163l5235P9960j9986j1251J4588j2530l7610R843N7064
$$ 58699 32538 13135 -8028 -43263 36697 16711 5460 20048 7518 -30092 -20249 36815
12840C6815L0537q3783Q3953n8226L3522l1412K7049r244J0460k1565j4918K2199
$$ 36815 67352 -16431 67522 9296 42818 11406 38455 29211 39671 18106 3188 25387
12828B5387j6631M6397p4143k7627O5775k6001L6963j6516l6561O1033o4939L2122
$$ 25387 8756 55153 -18990 -46617 19158 -6843 30120 13604 -22957 38076 -26863 5259
12816E259N2582j27571O6958L8390k4290K083m0292N5848o1951K2027j8505O2472
$$ 5259 57841 -69730 -2772 35618 11328 13411 -26881 28967 -32984 -10957 -29462 33010
12804C3010j6167K874n26m3624J5618K4806J7367n1287K2678j7611r009K0774
$$ 33010 16843 19717 19191 -24433 -8815 15991 33358 -17929 4749 -12862 -21871 -1097
12792a097O0643n4668J3738m468l2827O1021l2102J1835o639J733L279K2188j1131
$$ -1097 59546 4878 18616 14148 -18679 42342 10240 22075 15436 17169 20448 42636 31505
12779C1505O295j7097J2050k24j8516j8220j6592M8408M0645m9835j064J7733
$$ 31505 37800 20703 32753 32529 14013 -4207 -20799 27609 68254 18419 17355 35088
12767C5088l0164j67j1706J7662K4482n5529K1799o427M2364l1561M1355r198
$$ 35088 4924 4757 -6949 10713 35195 -20334 1465 -4962 37402 5841 47196 37998
12755C7998l7620O653L6411k3472J6711l8113j48N802N1425o4964N2551l0778
$$ 37998 378 7031 43442 19970 36681 -1432 -1580 4222 55647 -9317 43234 12456
12743A2456K3390j3435P530K1609k628m8239P818o882p746K3851j2349N1714P668
$$ 12456 35846 22411 29941 51550 48922 683 8501 1619 -6127 17724 5375 57089 64757
12730F4757r5477j622K0788L2584j0361O437Q155l4955K1087o665P083m872o511
$$ 64757 -30720 -32342 -11554 21030 10669 17106 25261 -9694 11393 4728 11811 6939 428
12717D28j9015J9081J0686P626J9946m292j9779n5718P4509l7701J7484K851j8545
$$ 428 -18587 494 11180 18806 38752 34460 14681 -41037 33472 -4229 13255 16106 -2439
12704b439M61J4730M542n285k6789M3868k6679p574K1990j1732k0280j5694K6490
$$ -2439 -1978 12752 17294 12009 -14780 29088 2409 -5165 16825 5093 -15187 -30881 -4391
12691d391l1601J6013K0378k7896J8558j8005N8802l5272l754K0388l110n2590
$$ -4391 -35992 -19979 399 -27497 -8939 -26944 31858 -3414 -7168 13220 10110 -42480
12679d2480Q5122l3624l8698N1936J5217l5502P957M5363k1246k8342l6971M7582
$$ -42480 42642 9018 -29680 22256 37473 1971 9928 55291 34045 5703 -31268 16314
12667A6314j2792R837k3681J7589K8408n4332K7002L7224q6706J16754p0990J25
$$ 16314 3522 13359 -10322 7267 35675 -18657 8345 45569 -41137 75617 4627 4752
12655D752J0499j0170M4885m198j8127j0365J7961n0295n382L9896p8747P8615
$$ 4752 15251 5081 49966 45768 27641 17276 35237 -15058 -20440 19456 -59291 19324
12643A9324N0899n4932j5042J9175L003l5357L4279K7445l0489l0589O5739n258
$$ 19324 70223 15291 249 19424 22427 -12930 21349 48794 18305 -12284 53455 48197
12631D8197m0172L0895m7981J1164N5583n7759J4370j9744M6533k6845p734J553
$$ 48197 8025 38920 -9061 2103 57686 -73 14297 -5447 41086 14241 6507 8060
12619H060l7731N2295l5740J5746J5098K4960m9588L6657J921m2679K9894j1769
$$ 8060 -29671 22624 -13116 2630 17728 42688 -6900 29757 31678 -11001 18893 7124
12607G124j5316N7733k6267k2743K2643J3239J2938l5436J0645M357l103L013
$$ 7124 -8192 49541 23274 531 23174 36413 49351 13915 24560 28917 25814 28827
12595B8827L903k2348j021l2963L0016L0230n768n3117J6403R241q49K1221k1119
$$ 28827 32730 10382 9361 -23602 6414 36644 30876 -22241 -5838 3403 2554 23775 2656
12582B656n3189K326M9404K1353L0902p3259M0636J7354l8238K1030K4799k3794
$$ 2656 -50533 -48207 1197 22550 53452 -19807 20829 38183 -55 20975 45774 21980
12570B1980R696m839k6425j5982K0800J318l3969P4318l4787j3884k7738L5227
$$ 21980 31676 26837 412 -15570 5230 6548 -27421 46897 12110 -1774 -29512 5715
12558E715j6533N2768j6938O861j1304j7085N357q107j1428O993R140j7148M3806
$$ 5715 -10818 41950 25012 31873 20569 3484 8841 734 -10694 -3701 5439 -11709 32097
12545C2097k3988K5813k7559j9027Q523J0355j152L128Q036l507Q711l4437M5580
$$ 32097 8109 33922 6363 -12664 -4141 6214 5062 8190 16226 12719 21430 -13007 32573
12532C2573J6604n29l7777K820K5872l2045l547n4237L8710K3298M255K6132k7552
$$ 32573 49177 48648 10871 13691 39563 7518 3971 -50266 -11556 11742 15997 42129 14577
12519A4577k1440L4953l5871Q221k426L7914j2214j7392N1678o1054K3326N16
$$ 14577 -6863 28090 -7781 440 -1986 35928 23714 6322 58000 -3054 20272 20788
12507B0788j6542L5663l4776k0829M309J4456K9503K1997o5839K5248p66R624
$$ 20788 4246 39909 5133 -15696 -11387 3069 32572 54569 -11270 13978 13212 22836
12495B2836n063J2045m2646K8706l780j7886N316L0984k2971k0182L5419m6714
$$ 22836 17773 29818 -12828 15878 12098 -5788 -472 30512 7541 -12641 22778 -23936
12483b3936K2947m708J2374r830p194L4891o879m0736N1294L570J0457j5503j3880
$$ -23936 -989 -5697 6677 -3153 -10347 24544 17665 -23071 28223 31793 42250 26747 12867
12470A2867m4731M0944m0924O2816K144m640m5290O6011n5955K5040q935K4809
$$ 12867 -31864 9080 -31844 30972 33116 28476 -16814 49197 -6758 18282 9347 34156
12458C4156m6633M7884m9601L2412L0539m4860j0612L1953k6066O455J6070j1214
$$ 34156 -12477 35407 -14194 18218 48757 3897 -6715 25238 -828 5627 21697 10483
12446A0483k5178M8077k9136m8129J01811p5632N4775n7971J9808J0101J5373
$$ 10483 -14695 33382 4246 -43883 57928 -17704 37071 -20900 -1092 9009 24382
12435B4382k580l1931K4830j9760L9797m3877N2955n783o3246K4364K9679k165
$$ 24382 21802 -10129 14701 -5059 34738 -9139 43816 38033 -25213 -849 28830 26665
12423B6665n212l8450N0854k7949J5425o809K4057l641K612r478j3464L4934j1782
$$ 26665 21453 -16997 33857 5908 21333 14524 38581 34940 37552 28074 14610 49544 37762
12410C7762P085l8142P51j213k1685L0214M935k3329j6640M627r14L5343j2646
$$ 37762 44847 6705 7456 6243 -15442 14772 19707 -3622 -20262 -15635 -16549 18794 6148
12397F148j481L1804l1660K2455r833K819n038L0007o9122R189M1649k5268L8580
$$ 6148 4667 36471 4811 27266 17433 20252 15214 45221 -23901 -14712 26937 1669 40249
12384D0249R260o0619N1410m77J614m5830p882L1772J4995j5075l4486Q5060m3126
$$ 40249 49509 -11110 40300 39823 41437 -4393 -12275 19497 34492 19417 -15069 69991 26865
12371B6865j8936K1409j8262k7012k062K2065M768j8961j0780L6753N791n5393
$$ 26865 7929 29338 11076 -15936 -17998 4067 8835 -10126 -20906 15847 21638 -33755
12359c3755M8398K911K1563k1161K926j4577P514l5314K1940j2931n4042P2832
$$ -33755 14643 17554 39117 17956 20882 6305 13819 -21495 445 -12486 -66528 6304
12347F304n351K710Q480k8945j8312L4097P914Q555j3497j0701L6524K1110p7494
$$ 6304 953 3663 12143 -16802 -35114 -1017 6897 15452 1955 -8746 27778 48888 -28606
12334b8606J8030K7318J4745l5224N3041m6505M2409m8104l251L7455J4492k6218
$$ -28606 -10576 16742 31487 -3737 49304 2799 45208 -2896 -6147 31308 45800 19582
12322A9582o867M3029m5695l0502O7235n7359N862L1598n6428l851M4618p10J5370
$$ 19582 12715 55744 10049 -20453 46782 -10577 -4715 26883 -29545 -33396 11222 10512 25882
12309B5882n3673N3821j4547j2615J9062j1870L261K3935m8980p126l2476R7399
$$ 25882 -27791 26030 11483 -1132 17930 6060 9321 33256 -15724 -22850 -55326 42073
12297D2073o1439L010m3137J9680R4353l9436k9739m4608N4019K1552l2525O1672
$$ 42073 -19366 -16356 -59493 -39813 54540 15104 -14635 -59243 -5224 16328 -16197 45475
12285D5475j03364O6681J287O21L5146l0005k3713K2606l0524N1689n1542N4233
$$ 45475 -57889 8792 10079 10700 45846 15841 -7872 14734 -15790 35899 -15643 38590
12273C8590j2573j0364M4557j1544k9053q547K2799Q022l6511Q673J9013R886
$$ 38590 26017 15653 60210 48666 19613 11066 33865 41887 5376 14049 33062 42948
12261D2948l5274q811L1202l3684J5888n1574R0426j7233n1451L9746o712k5155
$$ 42948 7674 -1137 30065 -3619 12269 -39305 51121 33888 -17563 22183 15471 -9684
12249i684N8396k1134n7480L7157L7003o7915J6549L5607l7272L5288q137k6424
$$ -9684 48712 27578 -29902 7255 44258 -23657 -7108 28499 -8773 26515 18378 -8046
12237h046N5879m9195K1964n852l3440J3481J3875l1955L936L3155M0181o2982
$$ -8046 47833 -1362 20602 14750 -18690 -5209 8666 -23289 -19353 13802 53983 -8999
12225h999J8680J3736k4588J7857j6443J3549L9267k0209l6620P862Q961j1795
$$ -8999 9681 23417 -1171 16686 243 13792 53059 32850 -3770 4092 13053 1258
12213A258K3119j2568k2526K2913m443l352K7930O20n1018L9589l9981j5617P6383
$$ 1258 24377 11809 -10717 12196 7753 4401 32331 32951 -18067 21522 -18459 -34076 42307
12200D2307l3093K1031l9971L3209J455J702l0293M3879p3556O5890J0208k3911
$$ 42307 9214 30245 -9726 23483 24938 26640 -3653 40226 -33330 32560 42768 18857
12188A8857J0774k7099j5464P9873o6885p4261R1965K6930m2004J3964j3645O062
$$ 18857 29631 2532 -12932 66941 56 -74205 17760 44690 2686 16650 3005 9067
12176I067j5646L8014j6971R873n42l633P731J0362m2651J4105r517j404N8646
$$ 9067 -6579 31435 14464 24337 23795 20162 27893 38255 -4396 9709 192 -1212 57434
12163E7434o7934L8772k5549J8j1200O0107p2079J9403J3149K9369M72j2120l3790
$$ 57434 -10500 28272 2723 2741 -8459 51648 -20431 -1028 12121 41490 41962 29842 -3948
12150c948k3239M5952J0715q792O608n3644K6554k9081O3218j5981K711l9157
$$ -3948 -27187 18765 29480 20688 27296 -26348 206 -28875 34343 18362 21073 -18084
12138a8084J5157J6875L7800m8011O0358m9956j6555J5758j6967J3390J5006k7387
$$ -18084 -2927 13948 51748 3737 64095 14139 -2416 13342 -3625 9765 24771 -2616
12126b616K5124q156j1224L110k9799J3243q676K8389P899p630O703j6076M211
$$ -2616 22508 14352 3128 6238 -23561 -10318 -18994 9395 17294 9664 16367 291 4502
12113D502o6700P9666J0541o1944N6192k373k3677J2173O712P019J0699l9033
$$ 4502 -62198 17468 28009 -33935 22257 19884 -3793 8380 15092 22111 32810 -6223
12101f223L4894m7561N0992n6990Q0562o3460J2196j7109N4937m3775o424M3605
$$ -6223 28671 -18890 32102 -24888 55674 -7786 4410 -12699 42238 -1537 -7961 35644
12089C5644j7263J0610L8757m5928m9077n585N1690L858k2962o290K043M0321
$$ 35644 18381 28991 67748 21820 -27257 -32842 18848 22706 -256 -6546 -4503 35818
12077C5818k2935R014q696K5950Q36N0689j07651J2394J7227L9852n1553K1696
$$ 35818 12883 21897 13201 39151 39987 90676 -16975 -4581 12646 52498 945 22641
12065B2641j3400l7855M9132k5149j0071N1957l400j6601K5486m5786K5070j8050
$$ 22641 9241 -28614 20518 -4631 -14702 37255 33855 17254 42740 -3046 22024 3974
12053C974M8379n2326K3398j6442J8739R598k2704j0034j026O2644r9047P1584
$$ 3974 52353 27 23425 6983 25722 35320 12616 2582 1556 64200 -34847 36737
12041C6737l2435j0543j9571L4225K9198j3638k8545J4864N3172n5282k5800N916
$$ 36737 4302 -6241 -25812 8413 37611 23973 -4572 10292 63464 8182 -17618 -11702
12029a1702M511J8678M0189m7912p165K2411n0348K0049L6546k3682K6640L4405
$$ -11702 -7191 11487 51676 3764 -3401 19010 -31338 -11289 25257 1575 28215 62620
12017F2620n7658R362p030R735R427j2363J414m7670J4128M1486q6534J22930
$$ 62620 4962 14324 7294 17029 26456 14093 15507 -32163 -18035 23451 -63083 59847
12005E9847o5481k3885M6695j20p140K7538k5437j4160J5020m2683J4970K9670
$$ 59847 -5634 -29519 17176 17056 9916 37454 12017 -2143 12877 -29806 -14836 14834
11993A4834M385m8732J03704n9744k8271K2666L4459j6547k9613J2297l7050N6509
$$ 14834 19219 -29513 74191 14447 -13824 8842 43301 26754 -2859 9438 -27612 28897
11981B8897k2661j1159j0401O5308o0358M0445K6557o6593J4450N8861l1987o697
$$ 28897 6236 -4923 -15324 49984 -10374 30071 56628 -9965 4485 63346 31359 24662
11969B4662l8636j4728m004P3593J9979m0738L20j7948j994K412N4776k6773l6294
$$ 24662 -13974 -28702 -32706 40887 60866 20128 20448 2500 506 2918 57694 30921 -5373
11956e373N0158j4821K4776o1990Q487O6576n6751l9895J6423J5846M2900j4893
$$ -5373 44785 29964 54740 -7250 1237 67813 11062 -28833 -12410 3436 46336 31443
11944C1443M4327m9965k9757J4194j0190J598l446j6285K9952O7670o0381m8060
$$ 31443 75770 25805 -3952 10242 52 1650 -1796 -18081 11871 79541 19160 -28900
11932b8900M8338m2799m8901Q3745n2148M7369m2542O6460k7757M9526p0591J5716
$$ -28900 19438 -23361 -72262 11483 -40665 6704 -35838 30622 2865 52391 -18200 -2484
11920b484J6258k038J8450p508k82j9036K6327m4060R172M4794J3433j0908k4717
$$ -2484 13774 11736 30186 22678 22396 3360 29687 -14373 -5201 39593 53026 42118 17401
11907A7401k4694J8277l162k5100N8039J3351o7165L1725M6857m3769K0376j2442
$$ 17401 -7293 10984 7822 -17278 40761 54112 -13053 18672 65529 21760 42136 29694
11895B9694n2876M7605k3359L9693j7220q365j8814K6831m2044k4381O8561j5833
$$ 29694 -23182 24423 1064 40757 23537 15172 -3642 23189 -18855 -43236 25325 9492
11883I492J9314J9306o3085L0670n6874M0059J0495k9083M4729j6785L2680m9671
$$ 9492 28806 48112 -14973 15697 -41177 -1118 9377 -19706 25023 8238 40918 -8753
11871h753L8607m7129P1224k8533j965l6390P9840o4971J9987K0821n1562r39
$$ -8753 29854 -17275 53949 25416 23451 -12939 66901 1930 21917 42738 -8824 -9763
11859i763J749P2552n8632P4972p4453j4985J1954Q219M2640n4100k6723N2278
$$ -9763 -8014 64538 5906 80878 6425 -8560 3394 11613 54253 153 -26570 25708
11847B5708l0739L8009J9142p3116N3733K5822j6909j8656j0413l942k9569K1758
$$ 25708 -5031 32978 52120 -20996 32737 58559 41650 22994 12581 8639 -20930 828
11835H28K9664k927m2756n214L4940J8515r546k8124L1693j859J0045M2052J647
$$ 828 30492 27565 -15191 -20405 14535 33050 23504 -4620 27073 25214 35259 77311 78958
11822G8958n4607K2728l1030n33l4507l983O2746o1352N4268l165n2070N5227
$$ 78958 24351 47079 16049 15516 -18991 -22974 39772 -21580 32688 29523 -22547 32680
11810C2680n6075K1850O84J9245J6875k1769j228Q114j1965J6530l9282M1459
$$ 32680 -23395 -1545 -861 18384 35259 13490 12262 20376 8411 24941 -14341 27118
11798B7118J9817n3425J9583k315M5246m7056m2275J2460M0801L948j0401l857
$$ 27118 46935 -6490 13093 10778 56024 8968 -33307 -20847 19954 23902 13501 9644
11786I644k0208N0647k7284k0501J2244J2229O50r127J5088k1771J3728Q37J7806
$$ 9644 -10564 40083 12799 -7702 4542 16771 17421 8294 23382 1611 15339 16176 33982
11773C3982k9600j1464N1760m3702k0764M9502Q043l8874J6171k1776l547j9324
$$ 33982 4382 -7082 44678 976 -19788 29714 37757 -1117 15054 -6722 -10269 -29593
11761b9593R719O7008j6175K9449k4958k8095L1144k6560k3222M3559l3999M0802
$$ -29593 -19874 47134 30959 60408 35450 7355 38499 11939 -11283 32276 -1723 39079
11749C9079j4500j4732M091J2537R08k3030L568q115M8971p4917J7770k2225Q4776
$$ 39079 24579 9847 13938 26475 27383 4353 7921 -194 48777 -26140 -8370 -30595 54181
11736E4181m1464j0686J9292K7820m0879l7961L6292K1545O036j8965k719q912
$$ 54181 12717 2031 21323 49143 8264 -29697 6595 28140 34176 15211 12492 3580
11724C580M5115m8552R186j737M1063n1068L2746K496j1140j2942J7474k2584
$$ 3580 48695 143 9329 7592 48655 -2413 30333 32829 21689 8747 26221 3637
11712C637j208M4397q870o3020N1021j4212j5013l2245O6047J9428m1067n2044
$$ 3637 2429 46826 37956 -25064 25957 11745 -3268 -35513 30534 49962 8895 -43149
11700d3149O8050j948j5662J28j5004j5016J1377J5416o9L9240k4738K0431k8565
$$ -43149 24901 22953 7291 7419 -7585 -22601 -11224 4192 4123 43363 18625 39056 10491
11687A0491l694K9233K930j5643L7993l4606k3273k6347m78J5717R389L5754k0324
$$ 10491 6797 36030 38960 23317 61310 26704 3431 -22916 -23394 -7677 1712 37466 17142
11674A7142J1267P164l0797K5412R592j2175l9973j1441K0509n152K2484o276
$$ 17142 28409 35573 4776 30188 39780 27605 -12368 -23809 -3300 -8452 14032 7756
11662G756J604P991R867k7913N646K9490k8282R176j0638J1328J9924N1k0146
$$ 7756 9360 17351 27218 -695 4951 34441 6159 15335 4697 16025 35949 36000 15854
11649A5854L017m9114P1044j7540N1911n9751j2467K679J9091j8040K476r792
$$ 15854 18871 -30243 40801 23261 75172 15421 2954 5633 24724 6684 9160 -632
11637f32j556L0524m4208L3854j5916K2229j5892K019K6949j7787Q692j1532J8248
$$ -632 -2188 28336 -15872 17982 2066 24295 8403 10422 37371 19584 28276 16744 34992
11624C4992J923j1978J4595k6165M58L2087k8272K0020l6916O5390p3312M9035
$$ 34992 36915 24937 39532 13367 13825 45912 17640 37660 744 66134 -7178 41857
11612D1857l1553J7162j8284N0096j7159k3439O067M3141q4053O9455r883m2166
$$ 41857 10304 27466 9182 59278 42119 18680 24747 67888 -16165 53290 43407 1241
11600A241K6456k7567N0983j8992j5809Q824l656k0531N3224j07528O8997M9394
$$ 1241 27697 130 51113 32121 16312 25136 21480 949 54173 -53355 15642 65036
11588F5036l3812m4082o340L762k1376K3345L424J1291O833N697l302l7627M1996
$$ 65036 31224 -12858 -19198 -15436 -36812 -13467 -10043 1248 8081 13778 10476 -27151 14845
11575A4845k6846O0570n1932L6583K160j0840j0234L9583l1923K9310k6204K0922
$$ 14845 -12001 48569 -3363 33220 35380 24540 14306 53889 21966 51276 25072 45994
11563D5994J5771o8134L3743M461k0995K3426j468l2756M5282o2955O3424n4891
$$ 45994 61765 -6369 27374 31835 10840 34266 32798 42 45324 -17631 45793 -9098
11551i098M5168m4993q616M2027Q967k9648L0030m122l0118L9018k6959J1952
$$ -9098 36070 -8923 -17539 24488 33455 3807 33837 29715 -403 38615 11656 23608
11539B3608K1078l9857l463k837L4031k958J1203r059L179j329j0030j1713n0806
$$ 23608 44686 4829 1366 -1471 32560 29602 40805 31746 34925 33596 23566 11853 -38953
11526c8953L7441l0628N1000n097K1697n7202P9879l8469M345l6954L4168j8864
$$ -38953 -1512 -32140 18860 13763 35460 -21742 58137 19668 24013 -12941 21227 2363
11514B363O3970k8768o912j3066k23n6393O3357O297m7162L0218K6879m107l7447
$$ 2363 66333 37565 30653 17587 17364 -39029 24328 30625 -16537 13681 40560 36453 -994
11501i94K0498n0423O7346n681k021k0271M6252k9074p0308R2623J1535L00L414
$$ -994 19504 -30919 36427 30746 28725 8454 54706 25632 -44676 47947 59482 59782 63196
11488F3196o5579P453q135J76K0527j2353k362L8364l6411k4120Q6865k8755k9076
$$ 63196 -2383 5070 -3065 -2889 17638 5285 2923 41287 4876 -19244 67621 38866 9790
11475I790J4455p359J5115l987j6875n102K9199j582K843j7786N783R111o8752
$$ 9790 24245 16886 32001 28014 11139 6037 35236 33654 36497 18711 24494 33605 -35147
11462c5147K7686K0941L3019k1879l7546K8767k0382K0580M267L2216j4781p1672
$$ -35147 -7461 13480 46499 24620 -12926 15841 -4541 16039 20306 52522 37741 -33931
11450c3931N9688n4456J5465K8393k4629J8607m3910P9389K2032o5171J9067K3405
$$ -33931 25757 -28699 -13234 15159 -9470 9137 -34773 44616 66648 1477 20544 43949
11438D3949n2052L3533J9466k2514K8388o2525L5995k4240L0923J7705j4951j7597
$$ 43949 -8103 25430 44896 22382 50770 -11755 24240 0 30923 48628 33677 16080
11426A6080l2315Q1742p7482M7090l6333n211K1558J2883J7698j1800j2064R67
$$ 16080 -16235 65507 -11975 35115 -1218 -6429 15129 28012 45710 33910 21846 22813
11414B2813k3726M5405j2177q419J7619m1725P1446m8523K8573j8819K0944k1419
$$ 22813 -913 44492 32315 23896 41515 -210 71236 22713 51286 32467 53411 31992
11402C1992J4774l0458p777n2447J06410j8619j4408r46k5481L4428m4010N3271
$$ 31992 46766 16308 8531 -43916 62494 43875 29467 28521 3040 37468 -6542 46729
11390D6729k6879o359P812o150K3019o1991N1937j6975K5177l3577K2149j9071
$$ 46729 19850 13491 21303 15153 38172 -23819 28118 11143 36320 2743 24892 5821
11378E821j3546K5113K6754n6928Q7901m1951k6345M0971r935m0692K9957m5234
$$ 5821 -7725 17388 44142 -12786 75115 33164 6819 47790 37855 -2837 27120 -18114
11366a8114O267J897K6827J1395l0421O6827n0458J503k436J7755l1489K2013
$$ -18114 -11847 -9950 16877 28272 -2149 64678 14220 15723 13287 31042 -447 21566
11354B1566J6073k1328j3020j274K3113k7158K0933j7900j0014K4288n894J7873
$$ 21566 37639 16311 3291 2017 25130 -2028 18905 1005 -9009 15279 9385 27258
11342B7258k170J7577r984j3832l942M044j0640l2294K5743J8158k4488K8645
$$ 27258 25088 42665 32681 18849 14907 18951 8311 -23983 1760 19918 -4570 24075
11330B4075m2312O2417k0255k2888l554O156m8454J21121o4349k7081O058P0931
$$ 24075 -18237 44180 23925 1037 -2517 3639 -44815 76306 11957 -15124 -9066 61865
11318F1865n9365M0370n6811J1645L2667n4015j592N1067k3337K9025O893n8962
$$ 61865 2500 42870 -13941 -2296 30371 -23644 -25236 25831 2494 31519 38412 -20550
11306b0550K9418K65J7367m7950L802N2330K4013l8353M752j1553J1166k4501
$$ -20550 8868 9133 26500 -21450 -17648 34682 58695 20342 25094 13541 24707 206
11294B06J412K5662r107L6141m365K8150k0064m200m0597j3752P1400O740r3097
$$ 206 1618 27280 18173 54314 49949 78099 58035 53835 13238 -514 70886 77626 -15471
11281a5471L6180N2118j0727m2075N153K3932j5733l1298M2579J7200K0590j11891
$$ -15471 20709 72827 62100 20025 25178 49110 33377 2079 44658 61858 82448 -29443
11269b9443M4359L3793m8902J7526Q515K8348q631l1996l6767L764M946L9688
$$ -29443 14916 48709 -193 17333 25848 54196 45565 13569 -23198 -19434 -14488 25200
11257B5200j7688j3901l2190K9434j0980M9984n455L5173p2718j4418O0028l5691
$$ 25200 7512 -6389 -38579 -9145 -20125 29859 24404 59577 -13141 -27559 32469 -3222
11245c222M6580j5120J0281j3866L2043l5237L2051n3325N4459k3410N131N135
$$ -3222 43358 28238 38519 24653 56696 21459 53510 185 54644 31234 36365 41500
11233D1500J2486k5502l551K3352l9160K3493k2408L0007k2414L687Q1376n8026
$$ 41500 53986 28484 24933 48285 9125 32618 10210 40217 17803 21490 102866 44840
11221D4840k4605j7712K213O8638r4618O0940M514l77p4052N1918O298N62O450
$$ 44840 20235 2523 4736 73374 -21244 39696 44210 43833 -30219 21699 27997 28559 35009
11208C5009J1832p3980R4201o3511M9457k1040J0790j6593M0553m6937L7031r432
$$ 35009 46841 -27139 67062 3551 53008 31968 42758 26165 66718 19781 56812 47380
11196D7380o2373J130L2639J8919k9221M2424M02J3029k0917p493K0465l1672
$$ 47380 -14993 -13863 18776 37695 8474 50898 51300 64329 43412 35919 56384 24712
11184B4712m4343M8609o2820P0138n1608M3837J5871n5823j1828J3252J7653L2415
$$ 24712 -19631 28978 -33842 36296 -15312 28525 44396 -11427 -23255 -10003 7650 40065
11172D0065m1732M43q319K2199O0926m5915j1179J5523J23K0696j6725p4329N7177
$$ 40065 -1667 -1224 -9543 12656 73582 27667 16488 32011 32134 52830 36105 -38224 18953
11159A8953L5498n716j3482N7754o7047m6475P8661k0669k1285k3885L21J5414
$$ 18953 54451 48735 35253 93007 25960 -20515 58146 37477 16192 -7693 -7372 8042
11147H042j2571M2693J6812o533l9085J1769J0298k2397p966l728q960Q1708q0976
$$ 8042 -4529 38164 54976 48443 9358 21127 31425 9028 1062 -2666 -11626 70082 -10894
11134a0894k5365M7706K2130l4413J4475l7277O1237l95n8927R1356n1420L770
$$ -10894 -36259 11447 33577 -836 13639 -23638 37599 37204 -21723 69633 18213 21983
11122B1983O9975o6779k9841o477L8129k4305L2203M545J1485m2721J5296j6889
$$ 21983 91958 25179 -4662 -11139 26990 2685 34888 39433 50918 8197 23493 6604
11110F604O072k1688J092J5045l5319M4448J5860L6537m3768l050L1236l0237
$$ 6604 12676 -9012 -7920 7125 -28194 16254 32114 68651 24883 21833 53069 22832
11098B2832L5007k1353m1281L6379k5581J3109J7910l6336J3925j6624M7395j4463
$$ 22832 57839 36486 -4795 31584 6003 19112 37022 686 14611 -2013 45382 30919
11086C0919J3529l5144K5880k5297k7774L5567K2497j7042K4886m2412L7461l3884
$$ 30919 44448 9304 35184 9887 -17887 17680 40177 23135 48021 5609 43070 9186
11074I186L7693n3239J0389J0935k4093O0357l0488O013J3563k8667j6373L289
$$ 9186 46879 -6360 4029 14964 -9129 51228 20740 26753 40316 11649 -4724 -1435
11062a435N7873R481l5935J1315m738l9685K1059J5622l8307O839N537K8589J8318
$$ -1435 56438 65919 29984 41299 36561 -3124 17935 33557 -4750 2089 7626 36215 54533
11049E4533m6447J1551N7902j7958j6190l269k6681N4938l9463k460j3501R441
$$ 54533 8086 19637 77539 59581 43391 40122 13441 68379 28916 26456 12955 22396
11037B2396J592l8917O361j4750M2806M3821r0551M9552M1862m1260N1642k6574
$$ 22396 23988 -14929 -8568 -23318 19488 63309 -27242 22310 64172 22912 74554 47980
11025D7980m6803K3104k596j0208j914M1127n5212l330K7688M1084k8319l6327
$$ 47980 1177 24281 21685 11477 9563 50690 -4522 -7852 19836 60920 32601 -3726
11013c726M0968M3527p7312K1240L3648j7497n9821K8238M5695n793n0475M9995
$$ -3726 37242 80769 3457 24697 58345 40848 -18973 9265 54960 49167 -1308 48687
11001D8687r446l7328J8885k6999M2192l8348M9888m2377P313N3339q8709J8677
$$ 48687 39241 1913 20798 -6201 35991 -2357 47531 5154 12467 65806 -22903 -4226
10989d226J9414J5507J370j9929m3062O2953p766J1795m2364J9252J9724j7212
$$ -4226 15188 30695 32065 12136 -30926 32027 24261 36056 -6308 12944 32668 15456
10977A5456o9388J10876p3535M2131J0661K2091p264m1204j717K1028J1709j9522
$$ 15456 -53932 56944 -16591 25540 36201 58292 51028 9824 8107 29135 40844 21322
10965B1322K0152J4964k2053K2764m1159j8254P7174n7659L685n82K0272j9876
$$ 21322 41474 56438 34385 57149 15990 -2264 74910 17251 20936 20354 40626 20750
10953B0750N905L2734k1958j7690J6450J2682k156k3864m7085R583M6665J2129
$$ 20750 26655 59389 37431 19741 36191 48873 46717 22853 -24232 -14649 32016 44145
10941D4145k8958L5046n8195J6125k000O711K3183N233j0946J1854l0659L1285
$$ 44145 15187 50233 -7962 8163 6163 12874 36057 41290 30344 42198 11539 42824
10929D2824l7793K0209R537j5355k946K7293j2794J8509m3901K2173j9331k59
$$ 42824 5031 25240 34777 19422 16476 43769 30975 49484 5583 27756 8425 8166
10917H166N8483m8857j444J154n01j9791l806M2920N014k6038K8025l522q6931
$$ 8166 66649 17792 16348 17502 17001 -2790 -6596 36324 41338 15300 43325 39803 -47128
10904d7128P0173K2904k5467K0950J3424l9604K3950J2622l3163k8549N042k2860
$$ -47128 23045 45949 20482 41432 54856 15252 39202 51824 18661 -9888 -4846 -27706
10892b7706K8887k3123N0329J5228k0206M2159m0302k4994Q666J4962n6487O3036
$$ -27706 1181 -21942 28387 43615 23409 65568 25266 272 8938 23900 -32587 30449
10880C0449RR329J3432n5100r386N082m6843K8513P5201m8024N2703o8218N1456
$$ 30449 30458 39787 53219 -1881 -11267 -6185 -53028 -24515 50686 2662 55365 -12853 38603
10867C8603j4036K9458m7391j8233r436M0332j8194p176O6855K9735q8492j7731
$$ 38603 24567 54025 6634 -11599 -21035 19297 1103 -6073 60782 90517 2025 -15706
10855a5706L3947M7406p3627M7081j1465j3282k224k072Q933N1814l1028K4045
$$ -15706 18241 65647 -7980 39101 27636 14354 12130 10058 18991 70805 39777 63822
10843F3822J4712n3022K9032j8893m9060M4007J834j9092R961K9848m2137o22
$$ 63822 78534 25512 54544 35651 -13409 30598 32432 13340 23301 53149 11012 10390
10831A0390K5816m0098K0593j5449L8937l8775N4485M815m7100O2951o4813K8513
$$ 10390 36206 -3892 16701 1252 40189 1414 55899 60714 13614 76565 11752 40265
10819D0265J1569j6886L3889l339k6614K7941k3426M7406j25267M3704J9724k6955
$$ 40265 51834 34948 68837 65498 38884 66825 43399 90805 -34462 9242 28966 2011
10807B011M4385m6407K641J5942L544R083K1370j1363j3507l0935L4301j5265
$$ 2011 46396 -11 2630 18572 22116 31199 52569 41206 27699 -3236 31065 15800
10795A5800K861K2950q262q528L4150l8721M3917m4336k0393O742R076j8654N2466
$$ 15800 18661 41611 33349 24821 58971 20250 64167 19831 -562 6180 15256 -3398 49068
10782D9068k9703R743m8537P8255p4088L3120L10P41L4746l6676q743o385k295
$$ 49068 19365 29108 -19429 58826 -15262 17858 18168 18909 53655 16979 8236 1851 -444
10769d44J4854k4324O6054j2158R18L7470o3268j0801j4630O6471q185m8064m3504
$$ -444 14410 -9914 56140 43982 44900 82370 19102 8301 -6329 60142 51957 3893 -39611
10756c9611O0916K4245m3106K3323Q777J5027n9314M2168J9837j0140l2224L7519
$$ -39611 21305 45550 2444 25767 34544 49571 -9743 32425 52262 42122 9898 47417
10744D7417K2371n6192j0181K1805J0823r714l23L3459n8560L7644l3744J5544
$$ 47417 69788 13596 3415 25220 36043 26329 26006 59465 905 38549 4805 20349
10732B0349k7295J0924q491j9682J6616k622O0485n7743Q479J18367j31321N9460
$$ 20349 -6946 3978 -4513 -24195 -7579 -10201 50284 -7459 1020 119387 -11934 47526
10720D7526p2439N8408L0014o5353M3789m682k554n2260J7375j1286k1396N6684
$$ 47526 -24913 33495 63509 -1844 41945 37263 34709 -17551 -176 -11462 -32858 23826
10708B3826k9208L5118O343K9028k8286j9129K3419J1012k5721J7322K8163r6146
$$ 23826 -5382 29736 36079 65107 36821 17692 41111 52123 26402 43724 71887 -24259
10696b4259N7672M6939R096o8310o211m9481L6926K2792O960L6463r3766N3354
$$ -24259 33413 80352 89448 21138 14927 -34554 2372 25164 32124 68587 -25179 28175
10684B8175L565j710K8204o5125J7471L6976l9719L2432j6104j860j9397J7653
$$ 28175 31740 30030 58234 -6891 10580 47556 7837 40269 24165 22305 2908 20561
10672B0561m0247M7194o76l3377K4441K2550k5062M2341m8601k1942P6009o5233
$$ 20561 -19686 27508 26832 -6545 17896 40446 15384 57725 9124 -12818 63191 -2042
10660b042J1901M0087M0839n4330k2049Q602k9529O7440k7753J2445n3092J9533
$$ -2042 9859 49946 90785 36455 14406 23008 -6521 60919 33166 45611 -7481 12052
10648A2052p3642P6256j5950K4920l2278L9827o693Q086k8078J6556j7946L8850
$$ 12052 -61590 14666 -1284 23636 -8642 31185 24492 32578 4500 21056 3110 41960
10636D1960p563j0287R109p396j3520L5418l1452k6996k5365M1160l5521N1629
$$ 41960 34397 24110 33219 25823 12303 47721 16269 -10727 -36092 5068 -30453 21176
10624B1176K5170N343k4032l5724N4256j4508P4560j46522P2843O896K8829k1772
$$ 21176 46346 51689 27657 -8067 46189 31681 106241 -40281 32562 39458 68287 46515
10612D6515n989k0548k2565N3361q1663P4020n204J8491n5430L6615m3992N9232
$$ 46515 40526 19978 -2587 50774 -30889 43131 37927 56418 988 37603 -6389 52843
10600E2843l5019L1094J418K503l6452j4301K5316j2209P589J1164K1834k7495
$$ 52843 17824 48918 50336 52839 16387 2086 27402 15193 22782 33946 55780 28285
10588B8285J1849l6709p526J1110J295m4669R1536l4555k9256L4925J569o98J3345
$$ 28285 40134 3425 -4101 7009 8304 -36365 55171 20616 -8640 26285 27854 27156 40501
10575D0501j7130j5425l3780J5639J8438J2176L41L8312l7158l2772K8535p334
$$ 40501 23371 7946 -25834 -10195 8243 20419 20760 59072 21914 -10858 17677 10343
10563A0343K2028n974J4606m354m9022L3337N308L2811m7905J0310j9382K5687
$$ 10343 32371 26397 41003 36649 -12373 20964 26272 59083 11178 21488 2106 27793
10551B7793K9107j4852l5365M7970m9654J9492k5106M2320j1498j0503O21m8802
$$ 27793 56900 42048 6683 54653 4999 24491 -615 41705 30207 19704 20325 -28477
10539b8477M8968J195l2928M2256J6120m8751K6133o4128M9614N28k9373K3849
$$ -28477 20491 21686 -11242 31014 47134 -1617 24516 -39612 10002 10530 -18843 5006
10527E006m268M0328k5827L4963k9663J1622o4875O2673j8104N847J147j928N917
$$ 5006 738 41066 15239 50202 20539 32161 -32714 29959 11855 17702 18849 16921 22838
10514B2838n703J5433m0217K0170J1901m4583q24N9394j9775n1507N4329l8321
$$ 22838 17135 32568 -7649 12521 24422 -20161 -20985 38409 18634 -32873 21456 -16865
10502a6865L3256j3207N876m140j7111Q475J0992N8922p3007L284L5151o755k621
$$ -16865 16391 3184 9060 4920 -12191 -3716 7276 66198 -6809 -3525 31626 24871 22250
10489B2250l2073k413M0327k6453r760N127l571M6224K305q513J9031m0084m1619
$$ 22250 -9823 -12236 28091 1638 -8122 -2995 -6566 39658 41963 33450 52481 12397 -29222
10476b9222M0188k2332L9239l1885M727K3647J9276O623l2301K6790j9369J0128
$$ -29222 10966 -11366 27873 -4012 715 24362 43638 50261 17960 44750 25381 35509
10464C5509j4320m1961O3231Q869N924l5656j5766j5023L1690J5789o0932P3061
$$ 35509 21189 -20772 42459 51328 57252 21596 5830 -9193 22497 38286 -22646 50415
10452E0415k4762j3073k3017N0429P888m2647p421N8718o902o3454L4070j5397
$$ 50415 25653 12580 -10437 39992 47880 5233 -2188 56530 49628 -13826 20244 4847
10440D847k348j783L2728n2522N2444k2988J1371K2690n4044O2668k9186K2056
$$ 4847 2499 716 33444 -19078 33366 10378 21749 44439 -9605 53063 23877 45933
10428D5933j9623r042j8097M188j5234L7007K7109k8855m7019M6865k1289k4283
$$ 45933 26310 17268 -829 3359 -11875 25132 52241 23386 -23633 23232 1943 -22340
10416b2340P1119l0622l8529L4051n7957K8375J8234M2512j901m2421j0560K3287
$$ -22340 48779 18157 -20372 13679 -44278 -15903 2331 44843 42942 521 -10039 13248
10404A3248K8248o1224M6876j4964k932j4570M4275q9197P9613k1466K0398k375
$$ 13248 41496 -19728 27148 12184 9252 -5318 38957 -50240 29373 7907 28305 25930
10392B5930k659j3609m101K3981O748q851K1628m1431K4484n6563K9371M3138
$$ 25930 23271 9662 5561 29542 36290 27439 49067 7636 32120 -24443 4928 48066
10380D8066l7933M3020M6871p4612K471k3882K5107k0737o92M161j8763j1909
$$ 48066 10133 53153 100024 25412 27883 4001 29108 8371 7679 11840 -6923 -18832
10368a8832K5233K7007l1917m536o781N3551n9594L6228k3490K1365N247m3520
$$ -18832 6401 33408 1491 -3045 -9826 43725 -15869 20359 -3131 18234 23481 -20039
10356b0039K8386M9278k5450J1971j491n2377M3869k3306j8408M7342l4314N1929
$$ -20039 8347 57625 32175 44146 42655 -9722 34147 10841 -7567 39775 5461 57390
10344E7390p4434l0136N7658m0940K1232M5193l7699K2243o1930M5205K482O82
$$ 57390 -17044 -47180 10478 -30462 -9230 35963 -1736 20507 -41423 3782 6264 6946
10332F946M7151l6161j6340o301O0526n6921L2577j75m5749M6259k8761L6383
$$ 6946 54097 17936 1596 -4705 55821 -1100 31477 31302 -14447 31812 3051 39434
10320C9434L3320n8332j2605J3168r698J8944k9232J3063L0309l3722K8192m625
$$ 39434 72754 14422 1817 14985 5287 24231 -5001 8062 38371 4649 32841 28216
10308B8216l4632P4355o5455k5025K7300j4065L8062m604K8775m1878k8563k5689
$$ 28216 -6416 67939 2484 -22541 4759 -9306 28756 24152 52927 11049 -17514 -43203
10296d3203K3793N1379K2825m4943K1467l6529J1828Q097J5033k5175K230J6479
$$ -43203 -19410 31969 54794 9851 31318 -5211 6617 14714 29747 4572 6802 23281
10284B3281k4337K6354l4288L0481o2011K1767J11184m6396o7635O039J7382j737
$$ 23281 -1056 25298 -8990 21491 -40520 -18753 92431 46035 -21600 -15561 1821 84
10272H4J0990Q273N845l728K9962l9308M4790p4968J8893L4792m2665l454K874
$$ 84 11074 19347 25192 21464 51426 12118 56908 -18060 833 35625 -7040 -10494 -7620
10259g620j1052l5432N3735R803k8877P1493n6458L4347k4124q721L0394p178
$$ -7620 -18672 -54104 -369 9434 -19443 52050 -4408 29939 5815 -2906 27488 20310
10247B0310j9266L5201m8319K7680J1079l7384M7486j9615j6454N4319n3408N4246
$$ 20310 1044 36245 -12074 15606 26685 -10699 36787 17172 718 55037 1629 55875
10235E5875p7307L16N3292L7418l6659j5344M9114p8620j6397M7678k761j5322
$$ 55875 -21432 -21116 32176 69594 32935 17591 66705 -11915 -28312 19366 16605 1283
10223A283N157O5268n9138K7440l952l4177L9471k2388J59j4889P899K8508k8147
$$ 1283 6440 71708 12570 40010 36058 1881 41352 18964 19123 4234 12133 40641 12494
10210A2494k6O180j5651K6809l6369J1928m272L6584N423p197m5267N6518j7903
$$ 12494 12468 18648 2997 29806 -6563 5365 1093 37677 43100 35903 -9364 47154 29251
10197B9251J8943j8625l0065K3047L90l523J0050J0209k1779N3274o6828j8771
$$ 29251 48194 29569 -496 22551 22941 19418 29468 39677 17898 71172 4344 -14427
10185a4427O0181l7768M7573l9077n2576M9916j1241J0126J2994k5267J6190r628
$$ -14427 45754 7986 55559 16482 -36094 13822 2581 12707 25701 434 16624 6996
10173F996n793l0737O2866j5186k1633J7468l3558K4977k3992K1225K3502l26
$$ 6996 1203 -29534 33332 18146 -3487 13981 -19577 5400 -18592 2633 26135 25809
10161B5809N5887p3366j5580n7P0131k8194L9310k2978n1104l256k00J3575K3988
$$ 25809 81696 8330 -7250 -7307 62824 34630 73940 50962 -142 -3398 -3598 9977 33965
10148C3965l3636L9663k3228J4315o922L447L6676j4044L4972n4856J0258j1942
$$ 33965 329 39992 16764 31079 24157 27604 64280 50236 85208 30352 40610 28668
10136B8668K0615Q76N918j8581J1419K8939o1703O4625l7084l4384J7353Q87K5907
$$ 28668 49283 50159 56077 37496 48915 77854 16151 80776 43692 9308 26661 27548 53455
10123E3455j18O3103Q430q5927P9247n8608l8825N5873l6524j2038N9464l7871
$$ 53455 53337 116440 124870 38943 118190 59582 20757 76630 40106 28068 87532 49661
10111D9661K0528k64L4128J3416l038K4882m9179M5796N9601K3336M4139j3664
$$ 49661 70189 69925 104053 117469 114431 139313 90134 135930 195531 218867 263006 249342
10099B49342J421J80477L20508Q42134J357576p14406q24322j96727k00695k25003
$$ 249342 250763 431240 751748 1593882 2951458 2237052 1412730 1216003 1015308 790305
10089G90305k62506j35268j17539j5660l8031m8683N286m2412q401k6793L7410
$$ 790305 527799 392531 274992 259332 221301 172618 177904 135492 127091 100298 137708
10078A37708n3447L5972l228l8382Q034k230M4k1544l389J555J5971k9085J4455
$$ 137708 84261 120233 117005 78623 86657 84427 84471 62927 59538 61093 77064 47979 62434
10065F2434Q089j9295j952R392L3583K2103o3937J3195q48l5348K4442r457J1330
$$ 62434 70523 51228 49276 58668 92251 114354 50417 63612 62764 27416 51858 42401 53731
10052E3731M3795l9051O025k4097L0145J7323j9573K9026l5182J3203q019m5042
$$ 53731 97526 58475 64500 40403 70548 87871 68298 97324 62142 75345 67326 22284
10040B2284J6421J4274K2339k7096K2891J667q7745N3167J905P795L3777p2547
$$ 22284 38705 52979 75318 48222 71113 72780 -14965 38202 40107 47902 81679 9132
10028I132N2627j2900M8926j2501k0422K1695o0920L5363O4578n7505m0699N3050
$$ 9132 61759 48859 97785 85284 64862 86557 25637 61000 125578 68073 27374 80424
10016H0424p1331K6754k41M9049k1411N930m8633L3586J594O7545n8862P65K565
$$ 80424 9093 35847 35606 84655 63244 69174 20541 54127 55721 123266 64404 65169 67734
10003F7734L6022j04521R1005m2228j374K3520L5912o6889N646l7665P9004k2931
$$ 67734 103756 -765 90240 48012 46638 70158 106070 39181 44827 7162 86166 63235
9991F3235M214J276M273j5883J1256K9266j5388L9911m3075J6844J8437m3960
$$ 63235 67449 68725 72998 57115 68371 97637 82249 122160 79085 95929 114366 70406
9979G0406L596K5101l1965K3717J0029K1061n770r366m6367J794L3895l0761j9129
$$ 70406 74002 99103 67138 90855 100884 121945 116175 106809 60442 62236 96131 65370 46241
9966D6241M4619K7557l9485L4216K0324l5514k6201O0904o7768J4491N0039l6039
$$ 46241 90860 118417 78932 113148 133472 97958 71757 132661 64893 79384 129423 93384
9954I3384L468M0193K195n1748n991J9697j871k8995r543K3075M2658K5435n1214
$$ 93384 96852 137045 139240 87492 81501 101198 99327 70332 60789 83864 126522 151957 100743
9941A00743q376L5801k4972J3996L0303l5954L0638J6551o6467Q457M3602j78
$$ 100743 92367 128168 103196 117192 147495 111541 142179 158730 92263 100720 144322 144144
9929A44144k9069L5140l7278L1269n1643P0958l9293J5349Q741j02L6391j718
$$ 144144 115075 150215 112937 144206 92563 163521 124228 139577 148318 148216 184607 182889
9917A82889r344K8565k7744K2376n2328l5944L1801l00j9601P6377l6513l5764
$$ 182889 173545 202110 174366 196742 144414 108470 140271 139971 120370 196747 160234 124470
9905A24470Q1401J4515L5318p1594N6356j5963k50n4085O1744n4694L4856J1289
$$ 124470 205871 220386 255704 184110 240466 224503 224253 170168 231912 177218 212074 223363
9893B23363K1840l2127J9912l3818Q561K7323p5247Q2852M5357q5206M1227r498
$$ 223363 245203 213076 232988 199170 207731 235054 159807 242659 288016 202810 244037 234539
9881B34539J7209K6562J3950j4133n6539N9221o1662J4812N4266J3988M303m328
$$ 234539 251748 278310 292260 278127 221588 280809 219147 233959 288225 302213 306516 302188
9869C02188j645m576K5930M862J6326L2607k9816K9463L5020j412p8690N5053
$$ 302188 300543 295967 321897 326759 343085 375692 345876 375339 410359 408947 330257 385310
9857C85310l9748M4561j23O1257n3503J6123K1842N6212k4733P77K4445j44125
$$ 385310 345562 390123 390000 451257 397754 413877 435719 491931 467198 467975 492420 348295
9845C48295l5917J21618p7772J8380P7009m0362K283K8572K8296j13217R2695
$$ 348295 312378 433996 356224 374604 451613 411251 413534 442106 470402 357185 449880
9834D49880m9308R2192m8511j8411K9981J7524N5039L2236k2466n9516Q9034j7335
$$ 449880 400572 492764 444253 425842 455823 473347 528386 560622 538156 478640 567674 550339
9822E50339M6562K699M7000l0264p1419K15M908R0750L1460m9182P2949l2276
$$ 550339 596901 599600 646600 616336 544917 545132 550040 640790 672250 623068 696017 663741
9810F63741L1420Q1960k4632j7557N890Q668j7584Q1019m5862R115O8806p8521
$$ 663741 695161 777121 752489 734932 740822 749490 731906 812925 767063 776178 844984 766463
9798G66463P8704k7121k5434M9209q8269O9493K5523N4750K6873K2871M390j1961
$$ 766463 845167 818046 792612 841821 753552 823045 848568 903318 930191 953062 957452 945491
9786I45491k3541L1252p393m535O267O7951J980M5392J30906j48768R2309l987
$$ 945491 921950 953202 945809 941274 947541 1015492 1017472 1062864 1193770 1045002 1137311 1133324
9774A133324J907O3452K0900J7752l194J7509Q087n5494J35120q323M7221Q7972
$$ 1133324 1135231 1198683 1219583 1237335 1234141 1251650 1259737 1204243 1339363 1331040 1378261 1466233
9762A466233n5894L9393O661K2413P7010m058M1491n2701J08515j9489K8609J4915
$$ 1466233 1410339 1449732 1456393 1478806 1555816 1551758 1593249 1540548 1649063 1629574 1658183 1673098
9750A673098J4776k7308Q1952K7270L5541k452R2997K2054J5007k99L5656N0184
$$ 1673098 1687874 1660566 1742518 1769788 1805329 1802877 1895874 1917928 1932935 1932636 1968292 2018476
9738B018476o3595J34875J12268j9033R9073L0790K5617L7458J9143R5563K0098
$$ 2018476 1954881 2089756 2202024 2182991 2282064 2312854 2338471 2375929 2395072 2490635 2510733
9727B510733L9562Q2508P6358O6004P0362J8104P6930P9419J27533l9727J00527
$$ 2510733 2550295 2632803 2709161 2775165 2845527 2863631 2940561 3019980 3147513 3107786 3208313
9716C208313O7869K4431Q7612P9613J67985k9747J10798J04048Q4386J11300J30595
$$ 3208313 3276182 3300613 3388225 3467838 3635823 3606076 3716874 3820922 3905308 4016608 4147203
9705D147203J46030J27227J47868J40107Q9750K89664K26842K15101K00782J74323
$$ 4147203 4293233 4420460 4568328 4708435 4798185 5087849 5314691 5529792 5730574 5904897
9695E904897K63088L04218L21294K60899K08248M39956O55747Q91532R76966J110113
$$ 5904897 6167985 6472203 6793497 7054396 7262644 7702600 8358347 9249879 10226845 11336958
9685A1336958J480362J234907J039159J391861K104558K502250K997390L078504
$$ 11336958 12817320 14052227 15091386 16483247 18587805 21090055 24087445 27165949
9677B7165949M075624N502785Q331340K1186926P2356917J73190711J59188271
$$ 27165949 31241573 36744358 45075698 66262624 138619541 311810252 470998523
9670D70998523j82919383r1426040k2869322k5439286m2817580l0250191k0987941
$$ 470998523 288079140 196653100 173783778 148344492 105526912 75276721 54288780
9663E4288780j2433460p615896o062122m267035l480447k739254j942371j142192
$$ 54288780 41855320 34239424 28177302 23910267 20429820 17690566 15748195 14606003
9655A4606003r46241p60227n74595n48546n27893n66891m87516l27534l71815
$$ 14606003 13659762 12899535 12324940 11776394 11248501 10681610 10194094 9866560 9494745
9646I494745k88148k48640l62317j64242j28883j73297j45631j48315k19574j57954
$$ 9494745 9206597 8957957 8595640 8431398 8302515 8129218 7983587 7835272 7615698 7457744
9636G457744p4617k24204k00626j83826k60107j78773k43188r2551j36767k34593
$$ 7457744 7383127 7158923 6958297 6774471 6514364 6335591 6092403 5999852 5863085 5628492
9626E628492j27284j92754j50456j64117r2505j29579j55740q9204j37439m3401
$$ 5628492 5501208 5308454 5157998 4993881 4901376 4771797 4616057 4526853 4389414 4346013
9616D346013l8995q6563r1318j34979p0823j38237k14697m0962j10213p7252l9600
$$ 4346013 4307018 4220455 4129137 3994158 3923335 3785098 3570401 3529439 3419226 3341974 3302374
9605C302374l4282n9899q4822o9805o1661j38123r17j6445q0539p8425J0648j08555
$$ 3302374 3268092 3208193 3123371 3053566 2991905 2853782 2852865 2836420 2755881 2677456 2688104 2579549
9593B579549k5127r3186o8000o0071Q2p5126m1285r4851q7717O0001p8032N1627
$$ 2579549 2554422 2461236 2393236 2333165 2333247 2258121 2216836 2121985 2034268 2094269 2016237 2067864
9581B067864n1053j18150n4361J8461J3051j570j8232m4180q6519o004o5157j1658
$$ 2067864 2016811 1898661 1844300 1862761 1875812 1874242 1856010 1811830 1725311 1719307 1654150 1642492
9569A642492n3158k0564J7432n1018j1111m3204k9150J4062k9933p0318K3503
$$ 1642492 1589334 1568770 1586202 1535184 1524073 1480869 1451719 1465781 1435848 1365530 1389033
9558A389033P598l6213k7913j3604r1170k1009o1244k1162N2510L7667n2857p724
$$ 1389033 1396631 1360418 1332505 1318901 1227731 1206722 1145478 1124316 1176826 1214493 1161636 1153912
9546A153912p1931J443n5279k6721K5820k1637q8172J0017l8154k6733n584J7391
$$ 1153912 1081981 1083424 1028145 1001424 1027244 1005607 917435 927452 889298 862565 856981 874372
9534H74372J1082j08835P4136j9843j1762N774j2262j3400O790L2235m5390m3227
$$ 874372 885454 776619 850755 830912 819150 824924 812662 799262 806052 838287 792897 749670
9522G49670M4595o7406n4904m0149O2486j0074m0107k7326j3580K5753N7087l3728
$$ 749670 794265 726859 671955 631806 694292 684218 644111 616785 603205 628958 686045 652317
9510F52317m2533K4052k5109j6000m4692J2495n3412N6732q289p0453M8787k0630
$$ 652317 609784 633836 608727 592727 548035 560530 507118 563850 555561 485108 533895 513265
9498E13265Q8369n6334j0555m1128q5369k512m8901l3913J2500j7562J4584k2632
$$ 513265 601634 545300 534745 493617 408248 405736 356835 322922 335422 317860 332444 309812
9486C09812O3364j7063l9677m2734J7678p09n2182K4122J6570n623L9681R168
$$ 309812 373176 356113 316436 273702 291380 290671 238489 262611 279181 273558 313239 322407
9474C22407n6165L6238m631k4479M1554m5496J2892j2072J633K0639k2880n7765
$$ 322407 266242 302480 297849 273370 314924 269428 282320 270248 271881 292520 269640 211875
9462B11875M9652r612m3315J777L8247p3591L5250k93K3764l3043k7940K7483
$$ 211875 261527 251915 208600 210377 248624 175033 210283 209990 233754 200711 172771 200254
9450B00254j8647l1264K1129M3181l6166n0773N2269k6031K1171k6258j5794l178
$$ 200254 181607 150343 171472 214653 178487 127714 179983 153952 175123 148865 133071 129893
9438A29893j1929M2398R96m793J4563k8293j3698K1173l3298K2550J9990n1250
$$ 129893 117964 160362 161358 156565 171128 142835 129137 150310 117012 139562 159552 108302
9426A08302O8121o6670L0541l3428J6685Q1151q1836j5941O590L1746n5141P148
$$ 108302 176423 109753 140294 106866 123551 204702 122866 106925 113515 145261 90120 97268
9414I7268j146m5707L1632o345K3403J0033l9761o467N7471o2013N7585J6810
$$ 97268 96122 50415 82047 75702 99105 109138 69377 62910 120381 58368 115953 132763
9402A32763k4573j9907k630m3717K124O0816m4078L4839K0388r3061M6393k239
$$ 132763 108190 88283 85653 41936 44060 104876 60798 95637 116025 22964 69357 67118
9390F7118m57N0565l3246n3183L8067M0533n4840J6178k503o5112M9854K3377
$$ 67118 66661 117226 83980 30797 68864 109397 54557 70735 68232 3120 52974 76351
9378G6351J2407l9852K9177k7639K9134n2493R0067n0978O956K0725k8637M1738
$$ 76351 88758 48906 78083 50444 79578 27085 117152 66174 73130 93855 65218 106956
9366A06956n9852j9462M7436m5440J0874K3294N377n0437M5480k4187N186M9316
$$ 106956 47104 27642 75078 29638 40512 63806 69183 18746 64226 40039 45225 94541
9354I4541l8614k2214j559K6871O318J21N7992n3006n8590O1486r921n5079O7621
$$ 94541 55927 33713 32154 59025 65343 65464 123456 70450 11860 73346 63425 8346 75967
9341G5967m9708p167Q1389l8305K4678k7528l3311l532M8243k438n0360M2537
$$ 75967 26259 19092 100481 62176 86854 59326 26015 22483 70726 68288 17928 60465
9329F0465m9086O0124k4186l5126M0841l8533N5275l8630k1824P0863k0152k8459
$$ 60465 11379 71503 47317 12191 53032 14499 69774 31144 9320 80183 60031 31572
9317C1572o25K3954N0840n9239J6071L3861o4m6649l3650Q103m679M2936J4196
$$ 31572 30947 54901 105741 46502 62573 96434 96370 49721 16071 24174 19495 62431 76627
9304G6627l9920k3193O2209j8626k908J3576m3796k3151M3199K8758k5453J9095
$$ 76627 36707 13514 75723 57097 54189 67765 23969 818 44017 72775 47322 66417
9292F6417k5360M6642l9188L4042o1147J7712j7676K4067L5440n8276L085J4783
$$ 66417 41057 87699 48511 82553 21406 39118 21442 45509 80949 22673 25758 40541
9280D0541M0083p1462L9125J7261M3060k2697P201o7158P3615j6913k432k8131
$$ 40541 80624 9162 48287 65548 108608 85911 93112 25954 99569 82656 80224 52093
9268E2093L0698j8786K8734j7070M7872l8920n0583N8927k3567L6972J2801Q360
$$ 52093 82791 64005 92739 75669 123541 84621 34038 92965 69398 106370 119171 127531
9256A27531J7835P459K78o369m1611J42849q8542N5661J1232J00797J27624M87089
$$ 127531 145366 152825 153103 146734 105123 247972 159430 215091 226323 327120 454744 941833
9244I41833J058834R87635j119019n90129j33403j63565k81553j54274j61669
$$ 941833 2000667 2988302 1869283 1279154 1145751 982186 700633 546359 384690
9235C84690r7483j7597j9882p7166L90o0208Q679k2307r167l2266O4085q598n53
$$ 384690 287207 269610 249728 172562 172952 112744 121423 99116 89949 57683 121768 113170 112617
9222A12617l1552j1372M1685j8544K4644l6848J6124m5365N3495j2115R079j0600
$$ 112617 81065 69693 111378 92834 117478 80630 96754 51389 104884 92769 101848 91248
9210I1248l6903j5747L4517j2113K0164K6419p4955O5110k7003j8559O1739m4576
$$ 91248 54345 38598 73115 61002 81166 107585 32630 97740 70737 52178 113917 69341
9198F9341m1065J7874j1628N3983Q261p3428L0083L0421K385m7464M9279k3683
$$ 69341 28276 46150 34522 88505 96766 23338 53421 83842 86227 38763 88042 64359
9186F4359j9465K404J5926K7775j3290p802m3791L8561p1475M7909k220K8651
$$ 64359 44894 47298 63224 90999 77709 69907 26116 64677 -6798 41111 38891 67542
9174F7542K956R542k3961m591l948m5677K3006j0072M1473m5454M9165l9699M7617
$$ 67542 70498 80040 56079 51488 47540 1863 24869 14797 56270 10816 59981 20282 67899
9161F7899m0137N1137R431p5443M9274m5713k2386K2273k5231O4996k7662K5845
$$ 67899 27762 78899 88330 12887 62161 16448 -5938 16335 -8896 56100 28438 54283
9149E4283n0829K7370O1827l4384l0231J7152p925k8329J7022N266L1406J0998
$$ 54283 3454 30824 92651 58267 28036 45188 37263 8934 25956 31222 62628 73626
9137G3626q3250M0234M7677k2318o2932Q0180J922m1852l7446M7537l6991N637
$$ 73626 -9624 30610 78287 55969 -6963 73217 75139 33287 -4159 43378 6387 12024
9125A2024M0929j7864k0168P2817q1666M4754l467k2184Q700N4200n9743M1342
$$ 12024 52953 35089 14921 87738 6072 50826 47359 25175 33875 88075 28332 69674
9113F9674n9681K5275O509K5687m3390M3222m3487O011J6095n0717N8507m5148
$$ 69674 9993 35268 41777 67464 24074 67296 23809 29820 45915 -4802 53705 8557
9101H557K0461M3910j4159k5859M6898k9828l8304K093K4637k4512J2482L0400
$$ 8557 29018 72928 58769 32910 79808 49980 11676 13769 38406 13894 26376 56776
9089E6776j793q471j8067l534K647k1779J2531O270J5269K269K9358l2641k4215
$$ 56776 54983 46512 28445 24911 27558 5779 18310 24580 39849 42118 71476 38835 14620
9076A4620Q198L2877k4250l212L8329l6927l7268P170j2984O9487q2588L3700
$$ 14620 22818 55695 31445 28233 66562 29635 -7633 -463 -13447 56040 -26548 7152
9064G152K6185K1118o4060N3684m0726N274J8657r690J2949q443J0518k8589J6437
$$ 7152 33337 54455 -9605 44079 3353 8627 27284 17594 30543 22100 32618 4029 20466
9051B0466L2035l0744J1616l894N9653l0500o1449L9061o4179P1059N44l6252
$$ 20466 52501 21757 33373 29479 89132 58632 -2817 36244 -27935 43124 43668 7416
9039G416P7255q2964M1208j4235P118J4536l0359k009j8176N5359m1295L14j1057
$$ 7416 84671 1707 42915 28680 35798 50334 19975 17966 -210 55149 13854 14168 3111
9026C111m0108J22661n2279J4802l2859k6013L1262p746l56M8830l4737N0963
$$ 3111 -36997 85664 33385 48187 15328 -10685 20577 12831 12475 61305 26568 77531
9014G7531m8543n317J1807J7780Q982m6310L8974m0775j4070L7902n8257j1433
$$ 77531 28988 23671 35478 53258 62240 15930 54904 14129 59 37961 -20296 -31729
9002c1729P6333n5474N5994m3871K576j4061J272O6720m4822K0670L90P818l8563
$$ -31729 44604 -10870 45124 1253 3829 -10232 -8960 57760 12938 33608 33998 41816 3253
8989C253o275M7352k5397q938l459j8685R5785r0131K7753J7368J0725m7332K1990
$$ 3253 -3022 44330 18933 9995 6536 -12149 83636 -6495 21258 38626 49351 2019 24009
8976B4009K1471l68m7105L5474j6906M1829l9362K8730k1800J4259n9288K9834
$$ 24009 45480 45112 -1993 33481 16575 58404 19042 47772 25972 40231 -19057 10777
8964A0777m313J9857L468j1938j8082K7143j5824l4153M4367K7048l9087m4k5947
$$ 10777 6464 26321 29789 17851 -231 26912 11088 -23065 21302 48350 9263 9219 -16728
8951a6728O5278K1911o7537K0061O7228m8634o2397N9456j3918k8144R6449p5391
$$ -16728 48550 70461 2924 22985 90213 41579 -20818 38638 24720 -3424 93025 17634
8939A7634K998J5249q167P891J7873j8806n880J04l7054K4987L3353m2927N020
$$ 17634 20632 35881 27714 35605 53478 34672 28792 28896 -8158 16829 50182 7255 12275
8926A2275k3921j5716K4013N8226n0185L8630j0127k9866J2304K3422n5613J8131
$$ 12275 -11646 -27362 -3349 54877 4692 43322 33195 3329 15633 39055 -16558 1573
8914A573J2591j361k4174N952M1009n9603N3349J1041k2623k202L8060m4441j8299
$$ 1573 14164 12803 -11371 -5419 35590 -24013 29336 40377 17754 15552 53612 9171 -9128
8901i128J6368j30K5963k7441P172l4190N0604k9554L1068k3238K3882l6657P2986
$$ -9128 7240 7110 33073 5632 12804 -21386 29218 -336 30732 7494 31376 -5281 67705
8888F7705m1379j6727p3014M438Q6592J8877j9733Q0k8230N9719q863j2546J3777
$$ 67705 26326 9599 -63415 -58977 27615 46492 26759 26839 -1391 58328 49465 36919 50696
8875E0696k2660J4916m2120L9259m5700j5529N5562k148J9567j5582r859J0841
$$ 50696 28036 42952 832 40091 -5609 -21138 34424 32276 51843 36261 26402 37243
8863C7243K8529m7138N885J6971k5854m120j6921M3962l8362L7565m7543J1889
$$ 37243 65772 18634 24519 41490 15636 11516 -5405 38557 195 37760 -9783 2106
8851B106j5172N21O495K4511l412k550q931K9775J6732m2634P910o066k7092O3027
$$ 2106 -13066 -12545 -6050 18461 15049 12499 3568 33343 50075 7441 15351 9285 -17807 45220
8837D5220j6210p0994N9247j1026K1040q602k4714K5237k3j9065J2114J7867M363
$$ 45220 29010 -41984 17263 6237 27277 18675 -6039 19198 19175 110 12224 30091 34454
8824C4454j472m123j096m5312M8078k5307N1690j9766j8077M8517p5033P0377
$$ 34454 32982 28859 27763 -17549 30529 5222 56912 37146 19069 67586 -7447 62930
8812F2930j7209m2098L0567J446p311P526K2248O880n6172r107P4314o8799K8651
$$ 62930 45721 3623 34190 35636 28325 35851 58099 64979 8807 -300 74014 5215 33866
8799C3866m8025j0614M6667o552J7520K7492n2507k5276L5589k3146j0242j963
$$ 33866 -14159 -24773 21894 15342 32862 60354 7847 -17429 18160 -4986 -15228 -17191
8787a7191j3664n5413J71924j02366M5667j1424K4622k1468M21j5741K3239k6212
$$ -17191 -30855 -86268 85656 -16710 28957 17533 42155 20687 21108 5367 28606 2394
8775B394O3797m9627l415j5082J0230L159P2481o4613j3053J3093M2990k3771
$$ 2394 66191 16564 13149 -1933 8297 11456 83937 19324 6271 19364 62354 38583
8763C8583K2514o0495R895L3284m0968K7359m2903K0503q884L4667o7r302R470
$$ 38583 61097 602 10497 43781 2813 30172 -12731 7772 -1112 33555 33488 24186 33656
8750C3656n0379M6020K924j404K5247L7709r2730J2497J0063k31J5762M6033k8324
$$ 33656 -16723 29297 32221 30817 56064 93773 1043 13540 23603 23372 39134 85167 56843
8737E6843m6337O389n773J0975j2205m406m1506N2784j347J7277k1210N0898J14
$$ 56843 10506 16895 11122 22097 9892 5486 -36020 16764 15417 32694 11484 62382 62496
8724F2496m9679r30m079p361L0859L6383n9029J8111M3673l1301j1807l1737J1265
$$ 62496 12817 11887 7808 447 31306 67689 8660 26771 70444 39143 27336 -4401 6864
8711F864M3461j2020R163k2924J6874K607l2490p566J1579N382j4836r80K4101
$$ 6864 50325 38305 47468 24544 41418 44025 11535 3969 15548 20930 6094 5114 29215
8698B9215l7407K3263K0389l2840K9156j9158L8572m5130L4169l5611j1823L1852
$$ 29215 -8192 15071 35460 2620 31776 12618 51190 6060 40229 4618 -7205 24647
8686B4647M8723j9541k5956j0844L711k0140M0074j6977m6787O7873n3951J6203
$$ 24647 73370 53829 27873 17029 20740 600 40674 23697 -23090 44783 -9168 7035
8674G035o597O647j4435K9683l2478J174L4137j7301K0491N899n5899L7831Q047
$$ 7035 438 7085 -7350 22333 -10145 -8971 25166 7865 28356 34255 -21644 16187 24234
8661B4234K2847J1998n9144J7110J7293m0452L2931K5707m8879L3938m1382J5969
$$ 24234 47081 59079 -65 17045 34338 -6114 26817 52524 3645 37583 -3799 12170
8649A2170m2649N9851l7180K0625J6008J0976k9308J4120r927q239K354M2235
$$ 12170 -30479 29372 -7808 12817 28825 39801 10493 24613 14686 6447 8801 51036
8637E1036m8330Q1906k9114M790n5070j8116L0405J5141k6874K8897n5765K0265
$$ 51036 2706 84612 55498 60288 5218 -12898 17507 32648 5774 34671 -21094 -829
8625h29N8614k0723l8360M1449O842O68m4290j2213K5413L0392k1979P0311j01826
$$ -829 57785 37062 -1298 40151 46993 47661 3371 -8842 16571 46963 24984 95295 -6531
8612f531Q217L1667n5837Q272J7427J2917l624K667j4878K8141L006J3024k4712
$$ -6531 1686 33353 -22484 -14212 3215 16132 12508 15175 297 28438 31444 44468 19756
8599A9756k2735K4892J086m8039L721Q1919o7352L2950L7524n7868J5365k5081
$$ 19756 -2979 21913 22999 -25040 -21319 60600 -6752 26198 63722 5854 21219 -3862
8587c862K9744J1985l650o0939O9182j2771J5982j1760K8613l6410j6267M385
$$ -3862 25882 37867 34217 -26722 42460 29689 45671 33911 62524 26114 9847 14232
8575A4232R040j8922j6029L249K9638k7877L2695m8657M7321N6853n7696k8851
$$ 14232 23272 4350 -11679 -8430 21208 -6669 26026 -22631 24690 81543 23847 -5004
8563e004r075K8249J6117j4458l726L0288k3286j0546L347k4580N5208n0458M6219
$$ -5004 -14079 14170 30287 15829 12103 42391 19105 8559 11906 -12674 42534 -7924 38295
8550C8295l8524n396L046O867J245K4520j407m3019N4215k5525L0367n3828l8278
$$ 38295 -229 -5625 -2579 4288 5533 30053 28646 -14373 39842 14317 44684 -9144 -47422
8537d7422O2743J1655p5722N3148k2287N8346o9940M61355m23092K6049k5564
$$ -47422 15321 26976 -48746 4402 -17885 40461 -29479 431876 8784 34833 9269
8526I269K1743J9830l0419J3733M0400m0549l3944M0965j2255k2057K9729j4795
$$ 9269 31012 50842 20423 34156 74556 34007 63 41028 28773 6716 36445 21650
8514B1650m0695L3850j9270L8151M3599q2645J8439n198k3009J5037p457K571
$$ 21650 -19045 14805 -4465 33686 77285 -5360 13079 7881 -15128 -91 -7548 -4977
8502d977j8083J4390L0010m4220M124J0216J0399N8852k3417q347r05n9329l8113
$$ -4977 -23060 -8670 21340 -22880 -18756 -8540 1859 60711 37294 28947 28042 -31287 -69400
8489f9400J03863m0185L3172J075j2526J1335J0246n5186j1355K2092Q3261r688
$$ -69400 34463 -5722 27450 28525 15999 27334 37580 -17606 -28961 -6869 76392 66704
8477F6704M8368j2787j9133m9467n7484M291J0044P5075J0545M5579p9677J218
$$ 66704 115072 102285 83152 33685 -23799 -19508 -9464 65611 76156 121735 42058 43276
8465D3276m2738j6934j181N6139R3294r0610Q8349o0566p3362N574j5825Q5340
$$ 43276 538 -16396 -17577 38562 131856 41246 129595 69029 -4333 1241 -14584 70756
8453G0756Q522k5505P2m779L2983p8745N2151j3964l3506K7535j4896k0915L9014
$$ 70756 79278 53773 53845 49066 82049 3304 55455 41491 7985 35520 20624 -291 38723
8440C8723m3601L7063o7639M4343k3035L9739m0305L4411M0163o8777N8587p4391
$$ 38723 -4878 32185 -35454 8889 -14146 25593 -14712 19699 59862 -8915 49672 -24719
8428b4719M5955N4337j9932q9676N3314j7149J1420j9975J9723K7393m1407N0906
$$ -24719 21236 75573 55641 -34035 19279 2130 13550 -6425 13298 40691 -716 50190
8416E0190M887k6767J5570R696k0049O151k0536O453l0726j8458N7694n757j8720
$$ 50190 55077 28310 43880 53576 33527 39678 19142 25595 -5131 -23589 34105 28348 9628
8403I628K2590p9002P2874L4024k2645Q185p732j1037k3867J4757M3703m6567
$$ 9628 32218 -46784 26090 60114 37469 45654 37922 26885 3018 17775 61478 14911
8391A4911L5974m5964R152k0904M8158k3178k4268J9370J5147J0349n431n9497
$$ 14911 50885 4921 14073 -6831 41327 18149 -6119 13251 28398 38747 33316 -26181
8379b6181j358P0723K0834p2849M1989n9187M1160L1503l8583J1913L0592j9722
$$ -26181 -27539 43184 64018 -8831 33158 -26029 15131 46634 8051 19964 50556 30834
8367C0834L8414m0790j7932J7394Q705k1115K2959j0414k0700K0112J2279l5157
$$ 30834 69248 28458 10526 27920 36625 15510 38469 28055 7355 27467 39746 4589
8355D589p098K7349Q344m2604N078Q0281j9277k5009L0419l0202k5715J0484O961
$$ 4589 -2509 24840 33184 -9420 -4342 75939 56662 31653 62072 31870 6155 16639 23600
8342B3600k2729L5706n385q5430O9711L7763n1388j9078L1996r649r830j1461
$$ 23600 871 36577 31192 -54238 15473 53236 1848 -17230 14766 5117 -4713 -16174
8330a6174K0517L6464l581o8933Q1178J6151k3712k8561m7067R4143o6359O6926
$$ -16174 4343 40807 37226 -31707 49471 65622 41910 13349 -33718 60425 -5934 60992
8318F0992m4464R978l2422M3609k6358J8010j2197Q956j4913M3276n9202n9068
$$ 60992 16528 26506 -5916 37693 11335 29345 17148 26104 11191 54467 -4735 -63803
8306f3803J20073L863o7639j0810L1626l2697M8397q435R810m814k3265J0105
$$ -63803 56270 60133 -7506 -18316 13310 -19387 29010 20575 30385 25571 2306 12411
8294A2411R704l5201L4512j6785L1800m8447M8006Q221j4194l8978J7659J6150
$$ 12411 22115 -13086 21426 4641 36441 -12006 36000 44221 30027 -8951 8708 24858
8282B4858j1833j9418j4582K2142R235K3243j3074J1536j4001P075K4554j7697
$$ 24858 13025 -6393 -20975 1167 10402 33645 20571 32107 18106 25181 49735 32038
8270C2038M1862j04827R123K9897j3482N0229k5636m380K0606l4012j8290K2312
$$ 32038 73900 -30927 -21804 8093 -5389 44840 19204 14824 35430 1418 -16872 5440
8258E440k0962K9345M7910n1305K1358J8303j8452J8345n4656j5343M5892q016
$$ 5440 -15522 13823 61733 10428 31786 50089 31637 49982 -4674 -20017 25875 17859
8246A7859k3232J5314j4149j7033M7820k2547K7706L687K7238j8049Q523k9329
$$ 17859 -5373 9941 -4208 -21241 26579 4032 31738 35425 62663 44614 53137 23808
8234B3808j1218o0j3527O2951n2137j4138M4714j9155l1532K9118L4986q7566
$$ 23808 12590 12530 -997 61954 9817 -4321 40393 21238 -10294 18824 53810 -33756
8222c3756M0861J2141m4511P9529l251n3660K5665n272o439Q619L343k0302K5445
$$ -33756 7105 19246 -25265 54264 51013 -2647 23018 17746 11307 19926 23269 2967 28412
8209B8412k5269M6669j0878J1333l5225n5897M0661l8145M959Q2965k5781j5325
$$ 28412 3143 49812 38934 50267 15042 -40855 -194 -38339 -33380 49585 23804 8479
8197H479Q125L1781n5606j29640L9750P40463m22531j49877p1968j2676M1098
$$ 8479 16604 48385 -7221 -136861 -97111 643352 220821 70944 -1024 -13700 27398
8186B7398J5717L0290m6619l6001j5750N7621m1252R3331n8298j1396M5480p8608
$$ 27398 43115 73405 26786 -9215 -24965 32656 -8596 84735 26437 15041 60521 -18087
8174a8087J8450O7148m0545j2509M810n5292L9130p723J5954M4467k5153l3748
$$ -18087 363 67511 26966 14457 19267 -36025 3105 -4618 11336 55803 30650 -3098
8162c098l2874M7316N5025n8838J3695r787Q9249o9880J3038j7281J2424o4754
$$ -3098 -35972 11344 66369 7531 21226 11439 100688 30808 43846 26565 38989 -25765
8150b5765N249O841P0382n7154k6141J7599O0821l5435J7535j3722J2290l0580
$$ -25765 -20516 -13675 56707 -447 -26588 -8989 51832 16397 33932 20210 32500 1920
8138A920L8147k9705J5212o477j7197M9774M455j3342q3875J21306n2897K8471
$$ 1920 40067 10362 25574 19097 1900 51674 56129 42787 -41088 80218 27321 55792
8126E5792k3971j5512M6250l9931n793O277J0807J5690k5459j9969K944j2821
$$ 55792 31821 16309 62559 22628 16835 23112 33919 49609 24150 4181 7125 -5696
8114e696M5712R792k5554j7745q115K3563l75j9334M6445r973p840m4195K2670
$$ -5696 40016 49808 24254 6509 -1606 21957 21582 2248 48693 38720 30880 -13315 9355
8101I355l6283L2194N3838j7964K3876k6733n2743M8377j4635k2641j7399L8724
$$ 9355 -26928 5266 59104 41140 65016 38283 -14460 33917 19282 -3359 -20758 17966
8089A7966L7367m0442n930j510J4839q976k8153N021n7308J05017J6385k9735
$$ 17966 55333 14891 8961 7451 22290 13314 -14839 -9818 -67126 37891 54276 24541
8077B4541j2385O742K9184l6506O362P4202p6865l507L9544p1006M4376o4077
$$ 24541 12156 18898 48082 11576 17938 92140 15275 11768 51312 -19694 24682 -39395
8065c9395P5869n631n885J9883p521j3988k8036L8864o6877N7854J2361L920k7409
$$ -39395 36474 30843 24958 44841 37320 23332 -4704 34160 -32717 25137 37498 41418 14009
8052A4009L2818r791k0057q13k724K5837l1632N8212r8709J6495J2999j9455P1155
$$ 14009 46827 37036 16979 16166 13442 39279 7647 65859 -32850 -16355 -3356 -22811 48344
8039D8344m2750j4673M3056k4989K8719n1789K6860m632J0878N914M0003n3748
$$ 48344 5594 -9079 33977 8988 37707 -14082 12778 8146 19024 24938 64941 11193
8027A1193O038J6063j7095k0222r035M1823k0780R445J2375k8512Q204Q254J9676
$$ 11193 17231 33294 16199 -4023 -13058 28765 7985 17430 29805 1293 9497 17751 37427
8014C7427m1340O5624l2891p54o3934Q2392J7492o2023J3477r460j4044K2163
$$ 37427 -3913 61711 28820 28066 -35868 46524 64016 1993 15470 6010 -8034 14129
8002A4129K666k0439R230L0049J6238j7195J9287l8889L0015l0766K0181J5949
$$ 14129 16795 -3644 5586 35635 51873 34678 53965 15076 45091 14325 34506 50455
7990E0455q570N833n2190J8494P327K760N967k1915J3946J3508n0131M7757O44
$$ 50455 41885 47718 -4472 14022 21349 24109 30076 8161 22107 35615 -14516 33241 33885
7977C3885m4123r228K0912P4287p1958k0276M2967l553j2203k6423N6571l3726
$$ 33885 -10238 -19466 1446 75733 3775 -16501 26466 22913 10710 -15713 40858 7132
7965G132J8850N875K127J7023j1811j1090k5361J7298M4387j1059K5125n9779
$$ 7132 25982 31857 33984 51007 39196 28106 2745 20043 64430 53371 78496 18717
7953A8717o951k484j857N3473p4020L4069O284j6138Q776M9072p8559L5532J4054
$$ 18717 11766 9282 7425 60898 -13122 20947 27231 11093 19869 68941 -9618 25914 39968
7940C9968n9572J09533j06591K0666M3914n3154L6402m130k1081K3909O10j4686
$$ 39968 -19604 89929 -16662 4004 47918 -5236 31166 27036 5955 29864 30474 15788
7928A5788J9403j9274j2013M4440n5037n386L9747o4990N0881r030O4546p4112
$$ 15788 35191 15917 3904 48344 -6693 -12079 27668 -37322 13559 4529 69075 -5037
7916e037k9536J04507j07199k968Q5226n6761M1405M1088n2664K2668j3612l6295
$$ -5037 -34573 69934 -37265 -40233 44993 -11768 29637 70725 18061 40729 27117 -9178
7904i178O7398k5144N911k4501M822o0310J9825N85K6294Q536J2842l659k500
$$ -9178 58220 33076 38987 14486 19308 -41002 -21177 -20592 5702 14238 27080 23421 20921
7891B0921J2640J8818m5095J0136l4087R864K0952J4320N815P993n597j8895N014
$$ 20921 33561 52379 7284 17420 -16667 -6803 14149 28469 34284 42277 36680 17785 22799
7878B2799K7030n1251L1945K0386l5553p533J8459l2678l1662J4989O3969K4339
$$ 22799 49829 -1422 30523 50909 15356 7823 26282 -6396 -38058 -23069 40900 65239
7866F5239q0888M3683k3553K7098k4820M3070n7393L6187L087m0406L5329m3475
$$ 65239 -15649 28034 4481 31579 6759 49829 -7564 28623 31710 -8696 26633 -16842
7854a6842J45647m8276k3007k1936n285l4795O3307R20l8014L3626o3865L0177
$$ -16842 128805 80529 57522 35586 30301 -4494 58813 59733 21719 55345 -8520 21657
7842B1657K8340l8698J8512m31j1021J8933M6705k7037j7354j7597k1645j257
$$ 21657 49997 11299 29811 29380 18359 37292 83997 56960 39606 22009 364 -893
7830h93N834J8112M6947j9335l3685J3148M7073m3888K7113J0564m0265j1160
$$ -893 4941 23053 70000 50665 16980 30128 77201 33313 60426 70990 30725 19565
7818A9565q340n08P044j8411K6678L1987o9940J2211L2003k5411M2142o6431P1084
$$ 19565 11225 10717 17761 -650 26028 58015 -11925 286 32289 6878 49020 -17411 53673
7805E3673m6470l5008P4817k5446P279r527N319K1765n644l6216J0485M6706l0714
$$ 53673 7203 -27805 47012 21566 28845 19318 24637 46402 40758 4542 15027 61733 31019
7792C1019J8771k8886P447Q562k1888J1330J3768l6120J310o482M4265Q776k1414
$$ 31019 49790 20904 28351 36913 15025 26355 40123 4003 5313 -1169 43096 51872 30458
7779C0458j8101J902L6944j9671j1934L3546j0117m4917R518j4490O7506m6060
$$ 30458 12357 14259 51203 31532 19598 53144 43027 -1890 7628 -6862 60644 14584
7767A4584k9741p035M9133k8730P920J2899L5834R67m1651J6024j5485l7712N0273
$$ 14584 -15157 -22192 26941 -1789 6131 19030 54864 55831 14180 30204 14719 -22993 27280
7754B7280M7951q5407J7646K303O160K8009n7826P9915m3236r65P625k1818K3474
$$ 27280 75231 -10176 7470 9773 15933 43942 -13884 66031 22795 21830 29455 7637 31111
7741C1111k7589L1308l8461K8551m1629L7254r657q21l0981L5537m5214O2157
$$ 31111 3522 34830 -3631 24920 -16709 20545 10888 10067 -20914 14623 -30591 31566
7729C1566J6261k2320K9359j6056K5097n5659L3127j2658K559K0576k557l1591
$$ 31566 47827 25507 54866 38810 63907 8248 41375 28717 31276 51852 49295 17704
7717A7704L7555p2990J1327N2669m903o0341M6455N623m2572M3484k7889Q363
$$ 17704 55259 -17731 -6404 46265 41362 -18979 27476 33099 -9473 34011 6122 14485
7705A4485j0815J882J4529j4069K1198J9704k819k1534j4336L2870j9077K7989
$$ 14485 3670 5552 20081 6012 27210 46914 44095 22561 8225 41095 22018 50007
7693E0007P139l4874o597l6330P1395n5450K1750M3042j1837k8356O775j2797
$$ 50007 57146 22272 15675 -20655 50740 -4710 17040 60082 48245 19889 26664 13867
7681A3867m6113L6323j0762M6689p602K6066m7839K2589l818J1507q49K9693l4736
$$ 13867 -32246 4077 -6685 40004 32402 58468 10629 33218 29400 40907 40058 69751 35015
7668C5015j1461o5207M2709N0920k0386k4228l6914P6726q5261L5577N8403l805
$$ 35015 23554 -41653 1056 51976 31590 7362 -29552 47174 -38087 -2510 55893 52088
7656E2088o702q0544N4834J3290l8935N5124m7824J1043L6999J4491l1880K2326
$$ 52088 45386 -35158 19676 32966 -5969 49155 1331 12374 49373 63864 31984 54310
7644E4310o5955P7J4343L6289n9036N5214l0343L0460pl2806k5325J3630K7602
$$ 54310 -11645 -11568 2775 39064 -19972 35242 4899 35359 35352 2546 -22779 -9149 18453
7631A8453L0522k4243Q063j9290L0042l3935p050L3624m251L23K2196m3838K6832
$$ 18453 48975 24732 32795 13505 43547 9612 2562 36186 31935 32258 54454 10616 37448
7618C7448n2790M8019l7017K191R6057q216p0936j4266j1388M3692O18j9462L7319
$$ 37448 -15342 32677 -4340 -2149 93908 85692 14756 490 -10898 32794 33412 13950 51269
7605E1269j9979O149m1621L7532m0297j2533P2631j04427M0829K0527K3745l9755
$$ 51269 31290 37439 -4182 33350 -6947 -19480 53151 -51276 -10447 10080 33825 -5930
7593e930o930j6833N5560K831m9222M1452o9392M4123K4192j4918P504l0914K5863
$$ -5930 -12860 -29693 25867 28698 -20524 20928 -48464 -4341 19851 4933 12437 -18477 7386
7580G386L0427l1497n928K7447R128o073k8745K1430L612l1529M809K2036m1997
$$ 7386 37813 6316 388 27835 36963 30890 2145 23575 27187 -4342 467 22503 -19494
7567a9494L1528j2938J8173n882M2250l9213L9763k5777m8847N7983o7985Q8128
$$ -19494 12034 -904 17269 11387 53637 14424 54187 28410 -20437 37546 -30439 57689
7555E7689m8340J0024M2636n1266O262m509N1720o3180M9035l4748k3746N7711
$$ 57689 9349 19373 62009 10743 17005 12496 64216 1036 50071 15323 -8423 49288
7543D9288l7522J4334j9186k7752K8320j7926O801M5782k4325J3024J0451j4377
$$ 49288 11766 26100 6914 -20838 7482 -10444 -3643 42139 17814 30838 41289 26912
7531B6912j2813Q491k84K6635J232l5783J611j454j1413M8197m1407j7312M9671
$$ 26912 14099 22590 22306 48941 50173 14390 16001 14547 3134 51331 9924 -7388 42283
7518D2283l9021J4651o5825P1836P597m7110p340M1918j670k764O020K9153l5691
$$ 42283 3262 17913 -47912 23924 31521 -15589 -22929 18989 17319 14555 20575 49728 14037
7505A4037q40r119O7904r6518O1204l7408L3320k0697p312J5160l1022j4434R1792
$$ 14037 13197 4078 71982 -24536 36668 -740 32580 11883 4571 19731 -11291 -25725 66067
7492F6067l8595M855j6799k2775J6669N7676m5273J2593j8922N0907m3843n5852
$$ 66067 27472 32327 15528 -7247 9422 67098 21825 34418 15496 66403 22560 -33292
7480c3292K6474N6182p7674R0161j4260o844n7711j6250O5236k6255K7613j2606
$$ -33292 -6818 49364 -28310 61851 47591 40747 -16964 -33214 32022 5767 33380 20774
7468B0774l4915M1940o39j0386K6252l1051J5494k7766j0384P455L0133k0309
$$ 20774 -14141 27799 27160 16774 43026 11975 27469 -297 -10681 -3226 26907 6598
7456F598J1726J9453k9653O1995m6349n1925M6287L729L0539p2342P938J6809
$$ 6598 18324 37777 8124 70119 23770 -28155 18132 21861 52400 -19942 -12004 4805
7444D805O6167o3844j0465K2039J2474k8616M1406m3924L1267l0503L8433m3549
$$ 4805 70972 7128 -3337 18702 31176 2560 43966 42 31309 806 39239 -4310
7432d310J5343j0485L5106R090k2165K8209j3841k2153m18j2885L4043m0754K4282
$$ -4310 11033 548 35654 44744 22579 50788 36947 14794 14376 1491 35534 -5220 19062
7419A9062K0017l6495P287K0141j1069J6926k6591l88O1589n9783j5516K8503
$$ 19062 39079 2584 9871 30012 18943 35869 9278 8890 70479 10696 -4820 23683
7407B3683n0764O6752j4420n6134L3042M9877k5602L8299p3563r410Q2216r4784
$$ 23683 -27081 39671 25251 -30883 2159 52036 26434 64733 -8830 -18240 63976 -30808
7395c0808N9519q65r9L7621m8856q763J972o418M0296K6525p8737J2584M3097
$$ -30808 28711 27846 27747 65368 16512 7749 9721 3303 43599 70124 -8613 3971 47068
7382D7068k9253q66L5242r980p0161P0989o195M0610m7437k5350L5091M7451k4450
$$ 47068 17815 16949 52191 42211 -27950 43039 36844 77454 30017 4667 39758 87209 62759
7369F2759k9706k0396O658O398K9612l7042K3641j4740j1344J2851m0585L4986
$$ 62759 33053 12657 19315 25713 55325 18283 41924 27184 15840 28691 -11894 23092
7357B3092J4504n7091J1174O4958r995Q656m4421m432n438K7759J941p5002N4242
$$ 23092 37596 -19495 -8321 56637 46642 55298 10877 6445 1007 28766 30707 -44295 9947
7344I947r213k4285Q425L1667k5398n4484J28646m5113K9555k4902m9501R9691
$$ 9947 734 -23551 -15126 16541 -8857 -63341 65305 20192 49747 24845 -24656 75035
7332G5035j0559r0682L1742K4049o075J0816j2178k5316R225N3568p6140M9670
$$ 75035 64476 -26206 5536 29585 23510 34326 22148 -3168 6057 59625 -16515 33155
7320C3155l0815q329L2473Q209k1745k5149L1036k5622N0661q458M0662j8853
$$ 33155 2340 -5989 26484 34693 12948 -12201 18835 -6787 43874 35416 76078 57225
7308E7225n4803p296J5997q852k1751N3870q605j252p926L8837q006j7512m0807
$$ 57225 2422 -4874 11123 2271 -19480 34390 25785 24533 16607 55444 47438 29926 -10881
7295a0881J3297R39j7850L8879j4796j604k606Q855j1902k73N49J1703k3256O3491
$$ -10881 2416 3355 -14495 24384 9588 7984 5378 14233 2331 2058 2607 14310 -8946 54545
7281E4545k5249j6753J4019k7980k7308N3691m1767P1917j3142p4565O1503m7297
$$ 54545 29296 12543 26562 -1418 -28726 24965 -16802 55115 41973 -32592 28911 -18386
7269a8386K7289l7508O1513k4224J2014J4122k3531k0393N6180l2097N7297p5433
$$ -18386 8903 -28605 32908 8684 20698 34820 11289 -9104 47076 14979 72276 -3157
7257c157M9548j7915j8028L1665o4318O1009l0688r616p531L0128j526j0714M0820
$$ -3157 46391 28476 10448 42113 -22205 38804 8116 -1500 -9031 21097 19571 8857 49677
7244D9677m4263K6437J1027n8397O1700P712j2501m3852l9938R8651q7360Q4306
$$ 49677 5414 31851 42878 -15519 46181 53893 41392 -2460 -42398 56253 -31107 53199
7232E3199M07k9825k1278J3316L7127k8015j8696M3303L868n6995j3144M8526
$$ 53199 53606 23781 2503 15819 52946 24931 6235 49538 53406 -3589 -16733 31793
7220C1793k3676M4699j5484l5547L418J4501M1143m263m8843j4656Q8296n5318
$$ 31793 8117 52816 37332 1785 5203 19704 60847 56584 7741 -6915 81381 26063
7208B6063P1756o1932k0732L0105m241Q0244j11422n250M2566K82k8927K2853
$$ 26063 97819 35887 15155 45260 41019 121263 9841 4591 47157 47439 18512 41365
7196D1365j0592N713n3867M5112J7062l9633O979L5033l643m6737O1213N680p1437
$$ 41365 30773 36486 -17381 27731 44793 5160 12139 47172 43529 -3208 58005 63685 -7752
7183g752N6217k6015k3462j6758M1511l9599o376M4997L1874n9870J2874k7752
$$ -7752 48465 22450 -1012 -17770 23741 -15858 -22234 22763 54637 -5233 7641 -20111
7171b0111Q5370j9590m0886k4297M5151K0412l0095k8885j3720l157M7285k425
$$ -20111 65259 45669 4783 -19514 25637 46049 15954 -12931 -26651 -29808 17477 15052
7159A5052J0736J3741L4300n8395k8148N9199J8725o8793L1460j429M3119j5849
$$ 15052 25788 39529 73829 15434 -12714 46485 65210 -3583 27877 26448 69567 53718
7147E3718l4733P4650j25350M9514k5855J8083K8950p2243J19946j06944O5495
$$ 53718 18985 93635 -31715 17799 -8056 10027 38977 -33266 86680 -20264 45231
7136D5231l8857k673K3957j4860j0219K6211q842K9058j31q641q775J2312J6810
$$ 45231 6374 3701 27658 12798 2579 28790 19948 49006 48875 40234 31459 43771 60581
7123F0581q9612Q0506o6569K9697K0244k6789P940J3297l9779O9912o6954L1311
$$ 60581 -29031 51475 -15094 14603 34847 8058 15998 29295 -10484 59428 -7526 23785
7111B3785j0027k2278O3634k9250M4578p1729K4482N1675m6056J6229l1236j8459
$$ 23785 13758 -8520 55114 25864 70442 -1287 23195 74870 28814 45043 13807 -4652
7099d652J9652l0072J0744L7666J1817j6668k7255L8325j9717K2311k5843r122
$$ -4652 15000 -15072 -4328 33338 45155 28487 1232 39557 19840 42151 16308 7186
7087G186M7231o2759N3172R409m7584K8190k5367O705J5536j1194J5165k0030
$$ 7186 54417 -8342 44830 54239 6655 34845 9478 16183 31719 20525 35690 15660
7075A5660L7692j2536K9296l5575n4250Q0275o2310J02847o6671k1557M8978n9210
$$ 15660 53352 40816 70112 34537 -19713 60562 -1748 101099 34428 12871 61849 2639
7063B639J2483L5829o3819N2730m752j8838o0068J2998N9247k0532J4766r242
$$ 2639 15122 50951 -12868 39862 35110 16272 -43796 -30798 28449 7917 22683 13441
7051A3441l4503M1117L6844l18k7225P647J1621o2517N7588k4642l367j4388J9427
$$ 13441 -21062 20055 56899 56581 29356 37003 48624 -13893 43695 19053 15686 1298 20725
7038B0725J9210k9028J787O740L919J2529M3406o0062j2301L5096l749m9357M2355
$$ 20725 39935 10907 12694 19434 23353 35882 79288 19226 6925 42021 38272 -11085 31270
7025C1270K3396K6640o4698J2923M3626n2883P949R360k1218J1167j1280j3200
$$ 31270 54666 81306 16608 29531 73157 20274 28223 37583 16365 27532 16252 3052
7013C052M8923j8005l2555K0470m827M467K0337N042o6359Q7910o2082L3563j4123
$$ 3052 51975 33970 1415 21885 17058 21525 41862 46904 -19455 68455 6373 39936 25813
7000B5813m3352K0308K6692j8983J6806R119L1248l8342l9165M7108K8626l5711
$$ 25813 -17539 2769 29461 10478 27284 36403 67651 29309 -9856 37252 65878 30167
6988C0167l2046M1927n7953O3315j7684j3099j0966O334P482j7593J7166J3223
$$ 30167 -1879 40048 -17905 45410 27726 14627 3661 9995 17477 -116 17050 30273
6976C0273P961n682K2664l1362o901K8630j6475k0311K0785J6892o1277R7576
$$ 30273 38234 32552 55216 23854 16953 45583 29108 8797 29582 46474 -14803 82773
6964H2773j4242p926l3313k0784R083j390K986j4628Q278j5363J1072m355M6465
$$ 82773 68531 60605 27292 6508 15591 14201 17187 2559 10837 -4526 6546 2191 48656
6951D8656k5314J5621N988j0407j4404j6431K0139P303j5305O624q261l697L569
$$ 48656 23342 38963 44951 34544 20140 3709 23848 31151 15846 22470 14209 10512 14081
6938A4081j5523K3152l0345N0233k6713l3628O5879n4693L2891P127m8790K9105
$$ 14081 -1442 21710 -8635 41598 14885 -18743 47136 -7557 25334 32461 -16329 12776
6926A2776j6905J2323J0690J0696J0953J2680j2030l6330O0664l6154k2570J7771
$$ 12776 -4129 8194 18884 29580 40533 53213 41183 4853 65517 29363 6793 24564
6914B4564l5712L8486K0989m9684M0381k2541J1952K9474m5802o2264J27785p8895
$$ 24564 -11148 27338 48327 -1357 39024 16483 28435 57909 12107 -50157 77628 -1267
6902a267K8795J9534n2293L0620j7040N036M2782l930j22421O9560J0451j7034
$$ -1267 27528 47062 -5231 25389 8349 13385 56167 52237 -70184 -624 9827 -7207
6890g207M0186N010J2708k9321j5574l1447N8971l3541J6373j2563k4170Q0119
$$ -7207 32979 37989 50697 21376 5802 -25645 33326 -215 16158 3595 -20575 59544
6878E9544l2963k718R766l1037j5531L6414J6176l5832L7881p0154J08975m9084
$$ 59544 26581 23863 33629 2592 -12939 23475 39651 3819 41700 -28454 80521 31437
6866C1437L8886j837k4785l7002J6708j6062P250m0140M5159J0346O257o1480
$$ 31437 70323 68486 43701 6699 23407 7345 14595 -25545 19614 29960 36217 -25263
6854b5263Q4375p7022J8565J5812k2813Q680j5251L9596K1509k7303K6085r052
$$ -25263 59112 -17910 655 16467 -6346 2334 -12917 26679 48188 20885 46970 37918
6842C7918q431k607j9722L4879n4757N4886m4665k8629J06245l4493o5855J7019
$$ 37918 29487 26880 7158 42037 -12720 42166 -2499 -31128 75117 40624 -25231 -8212
6830h212K5104j5075l7560J02563j5093m6860J4859R1692p9345p755j894o295
$$ -8212 16892 1817 -35743 66820 51727 4867 19726 111418 32073 24318 22424 16129
6818A6129O464J2989k6635J1168J8292l2611M5542m4670P3196m4384p1645N0214
$$ 16129 22593 35582 8947 20115 38407 5796 51338 6668 79864 35480 -36165 14049
6806A4049j0689J6020J1173K0271L0174r6914K5765L0320n5675K1595P329r847
$$ 14049 3360 19380 30553 50824 80998 -15916 9849 40169 -15506 6089 13418 3571
6794C571K1194N4836p8972n841J2977k1122N3346m3176j4360N5344Q939j903J2656
$$ 3571 24765 79601 629 -5212 7765 -13357 39989 -3187 -17547 37797 46736 44833 57489
6781E7489n7818O794K4302j5507J6486l0780k1746O9182j5336l5436O179J5262
$$ 57489 -329 6465 30767 15260 31746 966 -20780 48402 33066 -2370 3809 19071
6769A9071J3016J0221j4155J4077k0250R307j6406O3937p0014l464j2663N7297
$$ 19071 32087 42308 28153 42230 21980 31287 14881 78818 8804 5340 -7323 49974
6757D9974M007k6149K1214j0565p47j5531k4122j199L1007Q159m2064L4907k3848
$$ 49974 53981 27832 49046 38481 37734 22203 -1919 -3118 27889 36048 -6016 28891 5043
6744E043J3333j0252k7902O3508L2573m2499Q020m354n0693M2525k0212j2316
$$ 5043 18376 8124 -19778 43730 76303 33804 41824 37470 -13223 29302 9090 -3226
6732c226l3959Q1679k9448J253m079J4462K4847j5396l7280M3166m2943L305N4648
$$ -3226 -37185 44494 15046 16299 12220 26682 51529 36133 -1147 42019 -924 2381 57029
6719E7029o3638P6710k6770M546m4448L9996L0246m7385K6994n4119K3695j4691
$$ 57029 -6609 70101 43331 47877 3429 43425 73671 26286 53280 -839 22856 8165
6707H165n3389Q3539K2706m1534K6889m1977J7537p994L1412o1420M1743k166
$$ 8165 -45224 38315 61021 19487 46376 4399 21936 13942 45354 -16066 25677 23511
6695B3511l9066J6028l3872P5895k5633m3672K4629N4122m5269J1799l1454K7299
$$ 23511 -15555 473 -33399 42496 16863 -26809 -2180 51942 6673 18472 -12982 14317
6683A4317K0315O253l4428M16M368o681K7209j3945j1128K1510j2545L6852l3980
$$ 14317 34632 40885 6457 6873 11241 4560 31769 17824 6696 28206 15661 52513 18533
6670A8533M627k8624M3092j7956j6201N4283m1279L4920L876k0294o999J2451
$$ 18533 23160 -5464 37628 19672 3471 57754 16475 51395 55271 34977 27978 40429
6658D0429k2801J6065K0457p7905M9894J4459K778O924m4526L892M1713k861j9504
$$ 40429 17628 33693 54150 -23755 26139 40598 43376 50300 5774 9666 51379 48518 29014
6645B9014Q5610r4999N506l0569K3511K7271O199l2947n400j822L9121l4994j2568
$$ 29014 114624 19625 25131 -5438 18073 45344 51543 18596 13196 11374 50495 15501 2933
6632B933K4161m3646M3801k2363K0245l2585N4035m8618K0199J9456l1176K6752
$$ 2933 27094 -16552 27249 4886 25131 -7454 46581 -2037 18162 37618 6442 33194
6620C3194j8535J8225l638J2850o701J3641n0441J016j6967K4315P980l491J4134
$$ 33194 14659 32884 29246 42096 35395 49036 -1405 -389 -17356 6959 14939 11448 25582
6607B5582l3934R631N8028n3430J7609Q270Q731k122k4056o157j5250J1633K1167
$$ 25582 -8352 1279 59307 5877 23486 31756 40487 38365 14309 8152 -7098 4535 25702
6594B5702k7553L4848k1723K719Q593k7576L4065m3970N5637k4096J7375k4130
$$ 25702 -1851 32997 11274 13993 22586 -4990 29075 -14895 40742 16646 34021 9891
6582I891o278K5409r934K4936n5593O5102m8752O5834k3919j9389J2141j7927
$$ 9891 3613 29022 19088 44024 -11569 53533 4781 70615 46696 27307 39448 21521
6570B1521R378j7883p817M1415q1459O5819o025m1266M4544l5913Q9321p8845
$$ 21521 30899 13016 5199 46614 -34845 30974 24949 -16317 28227 -7686 81635 2790
6558B790O6459j6287k7340j3865J4054J8584l0163k130K1062k9916K2638L7244
$$ 2790 69249 52962 25622 11757 25811 44395 14232 12102 33164 3248 25886 63130
6546F3130k2648j9647J4308K1135p8087M832K3387K9530k562k765o932j7784M3075
$$ 63130 40482 20835 35143 56278 -21809 -16977 6410 35940 33378 30613 23681 5897 48972
6533D8972k7149q166m888Q3949m4497n6720m16J5779M0924r6031Q8760q615R892
$$ 48972 21823 13657 8769 92718 48221 -8499 -8915 6864 47788 -48243 40517 31902 41794
6520D1794P764k6684j640l920M3840l7916J7417K425r829j9626L4512l3226L4123
$$ 41794 49558 22874 21234 17314 61154 23238 40655 43080 33251 13625 48137 14911 49034
6507D9034j8106o1498M1423J0878k631K9307j7857R598l6011M3878m1610P757
$$ 49034 30928 -30570 10853 21731 19100 48407 30550 40148 4137 48015 6405 14162
6495A4162k4127M2896J326k4630n87m8093R3556p3691M1502L2931p1173Q7153
$$ 14162 -9965 32931 34257 9627 9040 -39053 54503 -19188 22314 55245 -15928 71225
6483G1225k7461J6317k163n7321L8096j2751R415J6599n1263M1384L437q120k405
$$ 71225 43764 60081 57918 597 38693 25942 35357 51956 693 42077 45514 37394 34989
6470C4989j2763k5174K7799n5606R4051p6624P9378n4536J6102k5944K7171Q124
$$ 34989 22226 -2948 24851 -30755 63296 -13328 66050 11514 27616 1672 28843 36967
6458C6967j8071J6132L1371O356o9361J592K5978l3450L2514p524m8217M0813
$$ 36967 18896 35028 66399 72755 3394 4986 30964 -2486 30028 22504 -25713 15100
6446A5100O8044k5556k9004l5813J5173J5947O0160n4030M4096k8967m274Q850
$$ 15100 83144 57588 28584 -7229 7944 23891 84051 30021 74117 45150 40876 49726
6434D9726j9891K8815o022n4752P8770r4786N1326r220J1087J6966n5095J7846
$$ 49726 29835 58650 52628 -2124 76646 -18140 33186 23966 35053 52019 -3076 14770
6422A4770L6107o4971L6928j2524L50J1562j3427K4572j4726l0722J1083L7889
$$ 14770 50877 -14094 22834 10310 10660 22222 8795 33367 18641 -12081 -998 36891
6410C6891r386j3455L7884p2032L5785Q960K1918p2331P9249j534L7645n8211
$$ 36891 27505 14050 51934 -20098 15687 24647 46565 -25766 53483 51949 89594 31383
6398C1383m080p823J8958j9749P163r100l67j0194j360O5090o9559L7519O665
$$ 31383 27303 19480 38438 18689 25852 16752 16385 6191 4831 69921 362 37881 44546
6385D4546k4532l43L5396o4288M9942J1211o1368N4273k3615N577q050J8244m7150
$$ 44546 20014 19671 55067 -9221 40721 51932 -9436 44837 21222 26799 18749 36993 -10157
6372a0157p350K9863j3759J6282K3838k3771N141n458k978P173j5624R014k456
$$ -10157 -17507 12356 -1403 14879 38717 14946 20087 14629 11651 18824 3200 12214 9758
6359I758J2208N1571n6038N941K2085l9195j4530L1292p082j0378J5119q162N4089
$$ 9758 21966 73537 17499 23440 45525 6330 -8200 23092 16010 5632 20751 12589 66678
6346F6678l8690J2899j3765J1946k6513J4600j1516O021K8282j7803j3132O0569
$$ 66678 27988 40887 27122 39068 12555 27155 15639 21660 49942 32139 19007 79576
6334G9576p2168o667P481M5152k5433P917j6942j8666O489R487M389K4696k975
$$ 79576 7408 741 8222 53374 27941 35858 18916 250 6739 16226 20615 45311 42336
6321D2336K1448m8437J7745l1563M1488q398k5665L7813l1844l7806M5600m5367
$$ 42336 63784 15347 33092 1529 43017 34619 8954 46767 14923 -22883 22717 -22650
6309b2650O174N3658l2176j3733J5119J8640M2068o391o0627K3369l2579N5977
$$ -22650 -16476 37182 5006 -8727 6392 25032 67100 60709 82 23451 -9128 46849
6297D6849R668o3266M5645j5191k9303q267K1934J5812L1653J4530o7865Q5856
$$ 46849 56517 -6749 38896 23705 -5598 -13865 8069 23881 55534 70064 2199 88055
6285H8055o7190n0203N6311p584k232K8424m6685L2825L1169n9639J9038K5359
$$ 88055 20865 -29338 26973 19389 17157 45581 -1104 31721 62890 3251 22289 47648
6273D7648l5723K4683n2169J2453K6045j4050J2606K1817l7187K2326m1064p381
$$ 47648 11925 36608 -15561 -3108 22937 8887 21493 43310 6123 28449 -12615 -19996
6261a9996O2195j2398O051k1657n831J7890L1728m6563L0409o710K0892j8368
$$ -19996 42199 29801 35852 14195 8364 26254 57982 11419 41828 35118 56010 37642
6249C7642O47K5329m3710J064J7310J7048m1331L1515K4328l3726J7907p1497
$$ 37642 38289 63618 19908 20972 38282 55330 13999 45514 69842 36116 54023 -17474
6237a7474L1445M6482k9624L208M309k6464J6246n9311K9640K0821l2680L0409
$$ -17474 13971 60453 30829 34037 38346 11882 28128 -31183 -1543 19278 -13402 17007
6225A7007l57L0845n3231M8948r480m2631N9947o925j9987K1208k4672J4670J56
$$ 17007 16650 47495 -5736 43212 33732 -8899 51048 44123 24136 45344 20672 35342 35498
6212C5498k9736M2123n2903k591K8666l073l7428Q6234p1936M4982J6721n9203
$$ 35498 5762 47885 -5018 -7609 21057 17984 -19444 66790 -5146 39836 56557 -2646
6200b646L6975m11k887K0798K249J5718J0781k5156o5828R3804l3965j7067O7025
$$ -2646 34329 33918 31031 51829 54078 69796 80577 55421 -10407 83397 49432 32365 99390
6187I9390q5285M745J3583o6242L7282L5077M6325l1167K803k4335O086K4091
$$ 99390 14105 18850 32433 -33809 3473 38550 84875 53708 56511 32176 38262 62353
6175F2353m5010K7457J9503j1396R086k964J7575K7536n2666j2865O8826q2074
$$ 62353 17343 44800 64303 52907 61993 59029 76604 104140 51474 38609 107435 25361
6163B5361N7683M4P5070m5754J4841O593k2963l2833m5069J7346Q922K3512J0212
$$ 25361 83044 83088 158158 112404 127245 133838 110875 78042 32973 50319 59241 82753 92965
6150I2965N784k949n1563J7322j1647L548k163j625K0004N3438l2992j2625O57
$$ 92965 98749 95800 44237 61559 49912 53460 51297 49672 69676 123114 90122 77497 78154
6137G8154N4249N955j5073k1750J1507M028j5098j6422k042m661j1650j4761K592
$$ 78154 132403 138358 123285 101535 113042 117070 101972 85550 83508 78847 67197 52436 55028
6124E5028R070p1169Q3125P303l5562M5064m5259J1067j5290K5364j8410L3032
$$ 55028 64098 -7071 76054 83357 47795 92859 47600 58667 43377 68741 50331 83363
6112H3363L7388m9170k104r057j3432L9139j0755J229l3197K0568L7422l5351
$$ 83363 120751 71581 69477 60420 46988 86127 75372 76601 43404 63972 101394 66043
6100F6043j8230N0534m7338J7325k5503K5441q7n1103L4791k3882j8554J6670
$$ 66043 47813 98347 51009 68334 42831 68272 68185 17082 51873 27991 9437 26107
6088B6107p933P661k9681L3322j6225j2404J3606N389R754M064j3506K3736m4852
$$ 26107 18174 25835 -3846 29476 13251 847 14453 19842 29596 33660 20154 43890 -962
6075i62K0287j7062O0805M797n1338J7303l0488P1898j8759q4887O1000k253L973
$$ -962 19325 2263 63068 67865 16527 33830 3342 75240 56481 -28406 32594 30341 34314
6062C4314L797m9287Q1825q103J280k8396n804K6074q769Q6512q4486q020K1342
$$ 34314 38111 -11176 70649 62546 63826 35430 29626 55700 46931 133443 48957 40937 62279
6049F2279j7648J2957j8773L4588p7006L0686Q442j886N0071p3588N2635K9017
$$ 62279 44631 57588 38815 73403 -3603 27083 35525 33639 83710 10122 62757 91774
6037I1774l8366K5406q878j0564k1288J6189J0006L853m0109J9469l5532Q8190
$$ 91774 53408 78814 69936 59372 38084 54273 64279 68132 28023 47492 11960 100150
6025A00150j05171M8070m3277M362O1484q1847P3628k0822m7034P2563m9710N6252
$$ 100150 -5021 43049 -228 4134 65618 -16229 57399 36577 -10457 62106 12396 68648
6013F8648j5305l3597j2931L8310P908k2715m560j4535m133P3468r3313N3608
$$ 68648 53343 19746 6815 45125 53033 30318 25758 11223 7090 80558 -12755 40853
6001D0853K3576n7569L3962j9948L8020K3383n9999L9493P498p0651N8128K614
$$ 40853 64429 6860 40822 20874 58894 82277 22278 61771 69269 -1382 56746 59360
5989E9360p281K1811m5318K7393m4335K5528m6412K4858k5688L0656J8764L936
$$ 59360 52079 73890 28572 55965 11630 37158 -9254 15604 -10084 20572 39336 43272
5977D3272k0617r976K2415K6326l3511L6882m5706q396j8218R337L8383l3375
$$ 43272 22655 12679 35094 61420 27909 64791 19085 10689 -7529 1808 40191 6816
5965F816N9085q6326K4966M8204m5834j7860L9912L0218l8146j0153N4038j04994
$$ 6816 65901 -20425 4541 52745 6911 -10949 28963 59181 21035 10882 64920 -40074
$$ [...]
##END NTUPLES=NMR SPECTRUM
##END=
