##TITLE=abcd
##JCAMPDX= 6.0         $$ Bruker NMR JCAMP-DX V2.0
##DATA TYPE= NMR SPECTRUM
##DATA CLASS= NTUPLES
##ORIGIN= UXNMR, Bruker Analytische Messtechnik GmbH
##OWNER= root
$$ XWIN-NMR		Version 3.5
$$ Sun Jul 13 13:22:55 2025 Russian Standard Time (UT+4h)  servis@DPX200
##.OBSERVE FREQUENCY= 200.131235884673
##.OBSERVE NUCLEUS= ^1H
##.ACQUISITION MODE= SIMULTANEOUS
##.ACQUISITION SCHEME= undefined
##.AVERAGES= 32
##.DIGITISER RES= 18
##SPECTROMETER/DATA SYSTEM= spect
##.PULSE SEQUENCE= zg
##.SOLVENT NAME= Acetone
##.SHIFT REFERENCE= (INTERNAL, Acetone, 0, 16.4885)
##AUDIT TRAIL= $$ (NUMBER, WHEN, WHO, WHERE, WHAT)
$$ ##TITLE= Audit trail, XWIN-NMR		Version 3.5
$$ ##JCAMPDX= 5.01
$$ ##ORIGIN= Bruker BioSpin GmbH
$$ ##OWNER= servis
$$ F:\spectra/data/av/nmr/H1/1/pdata/1/auditp.txt
$$ ##AUDIT TRAIL=  $$ (NUMBER, WHEN, WHO, WHERE, WHAT)
(   1,<2025-07-13 13:21:33.54 +0400>,<servis>,<DPX200>,
      <created by zg, POWCHK disabled, PULCHK disabled
       configuration hash MD5:
       00 E9 B6 7A A2 85 ED C7 34 08 36 98 17 FE 4E 26
       data hash MD5: 32K
       12 DF F0 E9 66 C5 D2 F2 A4 5B 6D F7 DF E9 70 69>)
(   2,<2025-07-13 13:21:39.78 +0400>,<servis>,<DPX200>,
      <Start of raw data processing
       efp BC_mod = 2 LB = 0.05 FT_mod = 6 PKNL = 1 PHC0 = -272.4572 PHC1 = 1.101538 SI = 16K 
       data hash MD5: 16K
       54 CD D3 A6 A5 A3 55 EB 2A 81 55 E6 09 4A 20 14>)
(   3,<2025-07-13 13:22:16.00 +0400>,<servis>,<DPX200>,
      <pk PHC0 = 3.738592 PHC1 = -10.6 
       data hash MD5: 16K
       AD CC 8F 72 F8 D4 D4 60 79 82 F5 32 4A 81 E7 7E>)
$$ ##END=
$$ 
$$ hash MD5
$$ AB 9D D3 42 D0 35 3C BC 5E 69 D2 53 5E 2C A0 DF
##$RELAX= 
##$RELAX= 
##$RELAX= 
##$RELAX= 
##$RELAX= 
##$RELAX= 
##$RELAX= 
##$RELAX= 
$$ Bruker specific parameters
$$ --------------------------
##$DU= <F:\spectra>
##$EXPNO= 1
##$NAME= <H1>
##$PROCNO= 1
##$TYPE= <nmr>
##$USER= <av>
##$AMP= (0..31)
100 100 100 100 100 100 100 100 100 100 100 100 100 100 100 100 100 100 
100 100 100 100 100 100 100 100 100 100 100 100 100 100 
##$AQSEQ= 0
##$AQ_mod= 1
##$AUNM= <au_zg>
##$AUTOPOS= <>
##$BF1= 200.13
##$BF2= 200.13
##$BF3= 200.13
##$BF4= 200.13
##$BF5= 500.13
##$BF6= 500.13
##$BF7= 500.13
##$BF8= 500.13
##$BYTORDA= 1
##$CFDGTYP= 0
##$CFRGTYP= 5
##$CHEMSTR= <none>
##$CNST= (0..31)
1 1 145 1 1 1 1 1 1 1 1 1 1 1 1 1 1 1 1 1 1 1 1 1 1 1 1 1 1 1 1 1 
##$CPDPRG= <>
##$CPDPRG1= <>
##$CPDPRG2= <>
##$CPDPRG3= <>
##$CPDPRG4= <mlev>
##$CPDPRG5= <mlev>
##$CPDPRG6= <mlev>
##$CPDPRG7= <mlev>
##$CPDPRG8= <mlev>
##$CPDPRGB= <>
##$CPDPRGT= <>
##$D= (0..31)
0 2 0 0 0 0 0 0 0 0.06 0 0 0 0 0 0 0.0002 0 0 0 0 0 0 0 0 0 0 0 0 0 0 
0 
##$DATE= 1752398493
##$DBL= (0..7)
120 120 120 120 120 120 120 120 
##$DBP= (0..7)
150 150 150 150 150 150 150 150 
##$DBP07= 0
##$DBPNAM0= <>
##$DBPNAM1= <>
##$DBPNAM2= <>
##$DBPNAM3= <>
##$DBPNAM4= <>
##$DBPNAM5= <>
##$DBPNAM6= <>
##$DBPNAM7= <>
##$DBPOAL= (0..7)
0.5 0.5 0.5 0.5 0.5 0.5 0.5 0.5 
##$DBPOFFS= (0..7)
0 0 0 0 0 0 0 0 
##$DE= 6
##$DECBNUC= <off>
$$ [...]
##$SUBNAM4= <"">
##$SUBNAM5= <"">
##$SUBNAM6= <"">
##$SUBNAM7= <"">
##$SUBNAM8= <"">
##$SUBNAM9= <"">
##$SW= 20.6817932712277
##$SWIBOX= (0..15)
0 0 3 0 0 0 0 0 0 0 0 0 0 0 0 0 
##$SW_h= 4139.07284768212
##$TD= 32768
##$TD0= 1
##$TE= 0
##$TE2= 300
##$TE3= 300
##$TEG= 300
##$TL= (0..7)
0 120 120 120 120 120 120 120 
##$TP= (0..7)
150 150 150 150 150 150 150 150 
##$TP07= 0
##$TPNAME0= <>
##$TPNAME1= <>
##$TPNAME2= <>
##$TPNAME3= <>
##$TPNAME4= <>
##$TPNAME5= <>
##$TPNAME6= <>
##$TPNAME7= <>
##$TPOAL= (0..7)
0.5 0.5 0.5 0.5 0.5 0.5 0.5 0.5 
##$TPOFFS= (0..7)
0 0 0 0 0 0 0 0 
##$TUNHIN= 0
##$TUNHOUT= 0
##$TUNXOUT= 0
##$USERA1= <user>
##$USERA2= <user>
##$USERA3= <user>
##$USERA4= <user>
##$USERA5= <user>
##$V9= 5
##$VALIST= <valist>
##$VCLIST= <CCCCCCCCCCCCCCC>
##$VD= 0
##$VDLIST= <DDDDDDDDDDDDDDD>
##$VPLIST= <PPPPPPPPPPPPPPP>
##$VTLIST= <TTTTTTTTTTTTTTT>
##$WBST= 1024
##$WBSW= 30
##$XGAIN= (0..3)
0 0 0 0 
##$XL= 0
##$YL= 0
##$YMAX_a= 55036
##$YMIN_a= -51271
##$ZGOPTNS= <>
##$ZL1= 120
##$ZL2= 120
##$ZL3= 120
##$ZL4= 120
##$ABSF1= 0
##$ABSF2= 0
##$ABSG= 0
##$ABSL= 0
##$ALPHA= 0
##$AQORDER= 0
##$ASSFAC= 0
##$ASSFACI= 0
##$ASSFACX= 0
##$ASSWID= 0
##$AUNMP= <proc_1d>
##$AZFE= 0.1
##$AZFW= 0.1
##$BCFW= 0
##$BC_mod= 2
##$BYTORDP= 0
##$COROFFS= 0
##$CY= 18.4799938201904
##$DATMOD= 1
##$DC= 0
##$DFILT= <>
##$DTYPP= 0
##$F1P= 9.9274215381318
##$F2P= -0.165520771350173
##$FCOR= 1
##$FTSIZE= 16384
##$FT_mod= 6
##$GAMMA= 0
##$GB= 0
##$INTBC= 1
##$INTSCL= 4.127829e-11
##$ISEN= 128
##$LB= 0.05
##$LEV0= 0
##$LPBIN= 0
##$MAXI= 10000
##$MC2= 0
##$MEAN= 0
##$ME_mod= 0
##$MI= 50
##$NCOEF= 0
##$NC_proc= -7
##$NLEV= 6
##$NOISF1= 3.799351
##$NOISF2= 2.8
##$NSP= 0
##$NTH_PI= 0
##$NZP= 0
##$OFFSET= 16.48848
##$PC= 4
##$PHC0= -268.7186
##$PHC1= -9.498463
##$PH_mod= 1
##$PKNL= yes
##$PPARMOD= 0
##$PSCAL= 4
##$PSIGN= 0
##$REVERSE= no
##$SF= 200.130005582386
##$SI= 16384
##$SIGF1= 3
##$SIGF2= 2
##$SINO= 400
##$SIOLD= 16384
##$SREGLST= <1H.CDCl3>
##$SSB= 0
##$STSI= 16384
##$STSR= 0
##$SW_p= 4139.07284768211
##$SYMM= 0
##$S_DEV= 0
##$TDeff= 32768
##$TDoff= 0
##$TI= <>
##$TILT= no
##$TM1= 0
##$TM2= 0
##$TOPLEV= 0
##$USERP1= <user>
##$USERP2= <user>
##$USERP3= <user>
##$USERP4= <user>
##$USERP5= <user>
##$WDW= 1
##$XDIM= 16384
##$YMAX_p= 316489168
##$YMIN_p= -1170573
$$ End of Bruker specific parameters
$$ ---------------------------------
##NTUPLES= NMR SPECTRUM
##VAR_NAME=  FREQUENCY,     SPECTRUM/REAL,   SPECTRUM/IMAG
##SYMBOL=    X,             R,               I
##VAR_TYPE=  INDEPENDENT,   DEPENDENT,       DEPENDENT
##VAR_FORM=  AFFN,          ASDF,            ASDF
##VAR_DIM=   16384,         16384,           16384
##UNITS=     HZ,            ARBITRARY UNITS, ARBITRARY UNITS
##FACTOR=    0.252644378177508, 1,           1
##FIRST=     3299.83951724647, 0,            0
##LAST=      -839.233330435636, 0,           0
##MIN=       -839.233330435636, -1170573,    0
##MAX=       3299.83951724647, 316489168,    0
$$ Real data points
##PAGE= N=1
##DATA TABLE= (X++(R..R)), XYDATA
$$ [...]
8666 417080 434083 860509 711978 779671 910560 953766 1358122 1343913 1329045 392779 1062267
8655 1062267 827866 1020932 1074616 737863 466348 945907 1021095 1058951 418941 1025053
8645 1025053 1124537 644489 665503 1410504 687686 331690 807229 -203 837985 248539
8635 248539 1159060 798709 547848 1276665 419155 1017391 785856 733917 314005 317960
8625 317960 1626718 1658142 762601 778942 457321 1320324 545062 910682 -172493 953109
8615 953109 1311375 926935 1649635 1322071 1758181 779961 630980 798164 809248 1329549
8605 1329549 1287285 1095361 435483 329731 827085 580864 1009894 806646 976409 -220072
8595 -220072 660890 884625 825629 795724 1524090 488885 727047 428429 1263301 700997
8585 700997 968636 860313 1949215 674128 1351158 1197374 728777 423217 674984
8576 674984 917043 136447 1333923 1319826 852920 623011 639804 617860 607987 1051829
8566 1051829 1108191 659869 1500213 1544248 1081813 305868 2120980 591785 1061062 608120
8556 608120 242509 308353 282379 536574 489877 742621 1103083 1033717 374011 753340
8546 753340 716461 1029190 792489 835123 790905 1048761 1378015 1579416 445966 1019561
8536 1019561 1084146 1482477 1026032 1021089 2529702 -1150126 689100 163618 701612 296834
8526 296834 569156 1095442 1862033 666458 1396571 308255 140536 1343906 1352205 804547
8516 804547 694607 938133 1356541 840432 560636 1034680 -44800 908774 -13846 688660
8506 688660 647328 980769 783242 219850 853363 815241 717973 747957 679644 140682 133548
8495 133548 131868 510 908810 1278820 644704 747734 1269845 1050640 288914 1279519
8485 1279519 517338 734346 1293703 880174 853062 614316 -74283 1513465 116426
8476 116426 988404 1242890 1023580 659512 823418 581071 810601 234974 1238661 967552
8466 967552 430867 831461 883315 644546 834638 739043 1540731 1371262 907747 17447
8456 17447 534432 1517835 642962 964503 432346 1327650 644190 303904 519626 575601
8446 575601 1375065 622992 543797 991250 718798 599406 824399 513997 758981 1262672
8436 1262672 849237 568364 91484 576505 655934 234822 770147 1007521 1401210 887524
8426 887524 924935 908575 964803 1018681 1307582 386398 70658 397561 1281116 330285
8416 330285 844860 598177 1254786 765946 676795 398823 986123 116869 966917 348626
8406 348626 286589 857265 797920 372862 736483 1857681 144421 656133 1122190 860048
8396 860048 960737 906234 1172399 888754 905787 582827 351336 512644 970537 1216404
8386 1216404 813375 509495 536316 1066034 568717 538357 1214839 1343302 1149235 674406
8376 674406 602809 527744 490503 990205 1389649 1250262 429215 1056227 555668 1191834
8366 1191834 445173 887012 803720 355908 749074 667046 993051 958143 792342 1021812
8356 1021812 845486 1278861 1155623 1192895 875529 601838 696497 483513 427230 498017
8346 498017 -681666 866148 394855 673147 518740 576695 84632 409514 594223 790742
8336 790742 -215669 539935 1223489 1383504 319985 812440 1085684 1100019 737650 951416
8326 951416 893744 1137952 768117 351797 691993 1160783 115538 562616 1158655 595980
8316 595980 756028 1128769 922476 1971464 1130831 674232 1207289 399525 2105722
8307 2105722 676802 751833 961800 1096578 530799 943458 -349573 238816 474052
8298 474052 785092 1452282 1036405 564647 480000 838799 511844 1338400 125751 773750
8288 773750 1039221 327836 335394 1190360 769846 1166099 508743 838710 1404327 1152012
8278 1152012 568385 1314081 736676 236088 174402 300375 648246 864229 290370 763962
8268 763962 1474471 887475 794260 951818 894035 359735 853339 1137880 682024 424667
8258 424667 767147 1228307 654926 41852 740111 626083 873130 16268 1001867 1101822
8248 1101822 942068 599076 1362684 822120 1073599 669137 204530 803814 1515332 431279
8238 431279 1050301 810759 1515802 952107 506845 523904 1445783 930598 231873 1107243
8228 1107243 489697 303286 697737 256059 797009 339956 1265485 953449 150033 362152
8218 362152 161409 854810 465965 301102 705995 160858 385207 455449 281065 -45835
8208 -45835 1295064 1203815 772036 459733 -158276 545872 702098 -400513 496998 690730
8198 690730 1171531 727593 1111756 857128 -51548 1342870 8402232 1970716 872786
8189 872786 1100922 825261 1153166 434174 866573 595166 274623 645002 610663 1168912
8179 1168912 1382054 440213 1081660 437956 1038749 -134842 1383030 852233 276138
8170 276138 662506 655012 1433354 524164 466196 543944 906958 737337 46922 542790
8160 542790 821742 1025399 507999 456628 733116 1058242 1331768 805059 1054306 910823
8150 910823 1177021 902850 1312096 248534 1613327 1398188 705042 1163077 619980
8141 619980 925863 917532 1092730 1145774 990352 441111 900016 1170582 695099 1271818
8131 1271818 690175 993837 955364 1137629 782614 1005103 777721 270051 920777 583069
8121 583069 787704 549310 332111 916182 616489 1249913 983048 383604 769141 1012878
8111 1012878 895044 1413596 129761 1086492 583106 1623846 1043140 1266478 827626
8102 827626 730084 1069198 1567469 -35613 660352 905771 659423 636795 1688322 1085784
8092 1085784 1349080 490970 1626657 1071678 1279026 1119646 773874 515998 303877
8083 303877 362415 358139 226142 1005953 536796 531078 453962 951206 876372 562389 733842
8072 733842 891717 293596 663908 596978 741164 933465 81802 238328 467114 859987
8062 859987 641162 844292 1239164 794461 148618 759958 131631 777693 1071397 1175781
8052 1175781 705615 902898 804251 1022474 1202141 543916 -346517 536727 302865 236210
8042 236210 452573 196625 1284953 417987 741650 652725 824495 603535 902149 592324
8032 592324 778184 808808 1459864 473104 1555512 479354 680893 1659110 -193628
8023 -193628 726933 944768 888153 856475 944035 1034655 -134303 223442 1352170 1046671
8013 1046671 64225 885559 832372 1610970 472650 -142609 1182646 1302259 868606
8004 868606 1249499 963971 736826 732488 1017706 568678 1517654 695068 804887 821687
7994 821687 1181531 941188 1225407 1091139 617072 912707 706956 865173 50238 938507
7984 938507 249354 1393507 1094070 1207957 1287016 553219 1409342 818062 301987 497420
7974 497420 829172 580848 503370 1233353 1012091 807926 1303431 -526764 1095092 1965928
7964 1965928 1652930 535454 872273 1052820 394743 1001831 394749 394043 824492 1063650
7954 1063650 769585 142025 949338 1413943 659494 510817 610034 1236084 570709 386531
7944 386531 1015604 610260 519458 1766573 181830 457932 1007340 426950 618232 251024
7934 251024 591861 750224 1371036 1549093 1001701 538285 584295 -437365 300932 930469
7924 930469 1253561 1775916 954162 -30423 1453821 1313643 646133 505017 1237624 1072631
7914 1072631 596486 -602855 843545 828252 431962 1064718 1615003 804537 822937 1184638
7904 1184638 372617 562513 427706 980352 346746 582408 446093 923480 654370 389180
7894 389180 895940 597133 706278 258304 333484 628230 695311 495700 499868 1063604
7884 1063604 827135 556717 714421 719614 87429 1023426 636321 1114072 625574 50574
7874 50574 867330 730546 247837 329536 626659 893712 1019076 599404 1605619 367285
7864 367285 912184 874308 1631787 911018 1534573 575640 1082298 1195399 490096 935879
7854 935879 187452 317244 -333560 471890 1229612 854551 941616 528105 1363477 939266
7844 939266 615187 780950 1013132 396466 849479 342250 1239577 1343389 1143279 424891
7834 424891 639346 830811 100258 673526 1524745 463059 678585 1106318 844798 1553222
7824 1553222 743454 1264547 656258 1001081 730869 320499 465521 662965 787529 121642
7814 121642 -685450 722527 351485 707295 1376399 870995 1352461 853471 988994 550316
7804 550316 468033 1431757 731454 989116 548516 -727421 1095295 492560 443094 1224408
7794 1224408 601158 728656 1040647 893107 1211708 1166212 1326465 1010122 445107 891206
7784 891206 1554952 867435 735212 1030523 1443499 1267707 590934 1516727 1358755 886331
7774 886331 842701 994153 904169 1313019 912877 1217446 1069981 977483 551982 1328414
7764 1328414 868454 749914 1063787 1120627 850378 1549193 566228 751019 833448 893211
7754 893211 538810 1401301 1079493 436206 747955 697172 985984 671764 573645 299713
7744 299713 1627695 944417 600397 936403 519389 654458 869803 879565 902704 908131
7734 908131 952261 1534455 404012 1075165 1342326 1743472 706773 756303 783069 1084875
7724 1084875 665913 748671 1275455 1678213 -234207 360798 304962 641582 884351 560635
7714 560635 850905 966903 378999 678469 793697 454377 223766 1153233 828929 723688
7704 723688 92830 1518253 69083 903617 1238104 1159307 570344 794382 1115583 1643601
7694 1643601 1218803 506459 642242 658336 1716884 754503 1236388 346812 668501 979221
7684 979221 852714 622464 876677 803232 810749 1043292 907552 434062 93541 1330036
7674 1330036 1153027 1238830 732971 642343 1115272 -35239 214955 578650 727494 1202870
7664 1202870 910739 995333 1143418 542056 1768210 189295 455343 1062569 711489
7655 711489 283679 1158284 976771 1016462 614489 1059626 933223 623296 782122 897455
7645 897455 899959 1279295 82256 1043372 831969 1376388 575433 1909248 844507 873462
7635 873462 591872 635796 477217 632810 638528 1763809 441025 612243 1362904 1461667
7625 1461667 484206 669328 547171 1057379 1160079 663307 1019486 1223037 586426 79934
7615 79934 96310 819684 1016002 1679863 949200 1101242 1124603 561745 279017 498904
7605 498904 505373 340469 270014 676414 661254 162800 35194 969318 1036717 1012907 496637
7594 496637 866982 881849 1357240 1094999 899852 1619508 1048698 187997 226140 509628
7584 509628 536306 912740 869778 871666 1188405 924626 839095 728022 1126351 528227 -11324
7573 -11324 1113099 57151 1249129 809361 631733 610029 1223791 840509 1000647 953797
7563 953797 335604 812000 372000 588547 784512 1174765 1183119 997611 1366502 907323
7553 907323 980476 973366 576251 665627 1043611 990311 1038786 1016379 1222202 602048 369643
7542 369643 1416274 825368 1049399 13245 1329338 962040 1031881 601857 1276408
7533 1276408 572753 1471293 1684544 1162622 666621 554586 1024271 33844 654160 1173459
7523 1173459 884709 293512 875973 793850 545750 464556 218032 998533 595330 494395
7513 494395 918835 1016094 1692449 943900 1088297 1037266 982558 334541 887927 861535
7503 861535 683950 1124130 1684826 628142 994265 1871892 835189 962932 940679 715545
7493 715545 1676410 913607 865895 856683 213663 1016927 978412 1025053 1694303 932995 809445
7482 809445 834655 797980 1286653 1121851 385166 709790 635570 972781 877485 493940
7472 493940 147984 320244 872688 451365 1421454 950108 825733 1393285 901610 289382
7462 289382 719799 1281511 338950 188351 334946 721137 1279570 1092835 1548857 234671
7452 234671 390640 1136288 1070438 1040600 780846 1262803 1102100 573435 847495 721748
7442 721748 1025675 623525 810494 778602 649280 132919 673123 578345 188844 1271843
7432 1271843 1178234 846781 937343 883822 1180001 993740 317931 1197645 1146656 952049
7422 952049 952079 785121 437725 1079165 1003483 1371320 337630 1338922 919679 406114
7412 406114 772849 813611 864053 369495 1172929 211055 932011 1115965 836221 313626
7402 313626 661397 157354 480682 1312887 1521928 866985 803961 805667 1180396 521994
7392 521994 962686 598705 802063 534540 334419 888328 969067 2055991 1109086 904276
7382 904276 567864 1198012 1416878 731543 1198186 981428 828139 164674 198342 790638
7372 790638 1208954 434952 840057 584561 781906 181794 1062300 -372002 566552 391364
7362 391364 1595465 371820 888195 1351595 712406 623194 1033488 648498 183274 444331
7352 444331 964736 95559 731586 1124972 1047027 1563416 832922 823458 171033 472502
7342 472502 1545307 1079571 978952 694405 536943 325982 371857 1773775 1256790 1341779
7332 1341779 1465917 594886 1085109 388404 1547748 851287 256427 274644 989482 528134
7322 528134 912912 488979 387194 1288023 407340 188310 413339 445267 621502 710237
7312 710237 675091 996425 1087151 1206069 1193288 554842 758264 973533 1066653 831453
7302 831453 589237 1224384 164480 1450666 916802 644468 760672 921225 1090205
7293 1090205 1043332 774322 664436 1009776 772633 974853 744930 654642 1255764 857579
7283 857579 1519260 980498 983474 448181 1099149 1060977 876710 939707 634914 876887
7273 876887 278633 1077963 546475 961846 409013 976047 1360427 1101378 977571 572314
7263 572314 -17575 677318 1387304 -78163 713058 535059 937173 673312 1314945 721032
7253 721032 1378333 1149046 1550643 679878 1248694 491733 1149253 640960 546964 239366
7243 239366 284300 1541195 938091 1295415 843616 752584 880309 955923 1117834 641206
7233 641206 418060 1092606 616401 451397 776139 443242 884217 1101163 1118080 296210
7223 296210 907909 456660 978719 1361248 912341 1189671 608292 1550541 995506 1230245
7213 1230245 1061165 641594 773384 730200 666412 721120 903764 754631 1247907 866923
7203 866923 1184470 491104 1297322 662383 1102034 1222877 846714 116367 496716 815844
7193 815844 308707 850523 140306 990026 641858 1345303 1272036 751321 945021 642531
7183 642531 963504 1472215 1848838 1065435 1278018 1477609 907821 1097080 942057 1596845
7173 1596845 237743 900406 116470 923093 808722 1928036 909378 802843 1066605
7164 1066605 1103790 588855 561943 736761 1018283 862294 1258012 1109606 882169 553321
7154 553321 652585 656947 919221 352576 1500875 711714 607431 966843 624719 915141
7144 915141 1758378 780150 112316 1158860 854218 795280 1278075 368455 833693 396935
7134 396935 991315 -390200 408396 1139315 1266550 637556 567266 1104993 539331 1061043
7124 1061043 1030731 1335237 1186561 1002820 964031 1450144 1059472 290391 392852 89486
7114 89486 1632546 1029930 1103259 626480 554514 1308366 1031047 784484 1495642 967019
7104 967019 1036411 848247 1747060 883074 618125 223421 1000537 1047415 276749 1207894
7094 1207894 -37042 843213 1221895 1038761 765807 1145946 1012776 963388 918504 777092
7084 777092 1276457 736605 912168 750951 1500532 505326 878272 1085109 473007 855316
7074 855316 1089521 301662 1674279 322734 1284338 465913 962313 751954 472840
7065 472840 1193886 1786678 268857 904189 542503 476068 753470 1597463 850228 628594
7055 628594 89836 1104276 252490 1008211 905119 708197 1004404 649177 1016825 923325
7045 923325 782384 1041139 321982 816398 519992 1351061 650203 679583 727031 1190510
7035 1190510 424494 1038355 1512942 639116 83703 804866 927409 1008602 949216 342441
7025 342441 1125019 433427 927226 617925 926565 691098 1110666 324987 -138685 516305
7015 516305 1213265 628702 1100442 327827 746222 379631 440640 559050 875534 1084597
7005 1084597 769210 1557831 847561 746646 500399 501428 638074 470951 655923 322990
6995 322990 1261081 593168 720876 772772 110353 1104954 1076439 1340372 375735 603120
6985 603120 1311134 915702 632220 684516 1070400 1462737 857701 745260 1299901 1364226
6975 1364226 1548615 1125132 973913 624179 991989 877152 1383626 1241444 1219082 830010
6965 830010 1474042 913643 1250087 658027 806322 1296795 953158 1703565 332423 1015894
6955 1015894 1706792 662186 1720351 453781 1025781 1421096 635180 1180823 1467909
6946 1467909 1349811 1145753 828563 986911 840007 417113 423755 499340 1172641 1026245
6936 1026245 1371763 916980 513059 820594 890217 593513 962143 1158661 1805089 681506
6926 681506 196636 306009 1078186 1390877 1073227 2186076 1094818 682965 718183 1039800
6916 1039800 953416 1236801 -163540 1348092 575446 1588185 1170433 763437 368366
6907 368366 1347953 1379210 577553 365958 612889 669230 367629 419899 601881 897431
6897 897431 1142842 561282 766683 973605 1020994 947805 272070 377155 513200 63564
6887 63564 1095128 1107345 1088168 761314 439811 601111 734300 765547 731048 471126
6877 471126 814926 914312 1181883 1171735 1050815 593500 1466368 927359 755070 980187
6867 980187 1119059 501888 1420426 982248 860782 611645 609299 455447 539068 284999
6857 284999 1323241 783534 487406 -113076 987788 730033 765566 723923 635130 -14034
6847 -14034 759795 1114903 1176515 765628 1031921 1166157 1029165 1069274 824393 1161289
6837 1161289 721553 1300420 1172085 1079424 1374075 1202738 1282105 977514 437928 787471
6827 787471 828235 1568793 1408289 1095377 1177171 1309841 1412890 874854 691916 1380950
6817 1380950 836805 949778 882320 1379435 1196444 1481032 1483554 1002074 2005550 1117563
6807 1117563 1115236 741027 884445 1128917 912718 646879 806513 936032 629538 1205338
6797 1205338 944052 877578 538096 899885 1427127 696896 690785 1375243 1395784 1123525
6787 1123525 757765 700002 1240892 599151 667916 914903 382983 853764 1007387 189499
6777 189499 996685 1301971 830244 56094 571109 1044668 819317 874748 810305 629804
6767 629804 1524342 518063 404732 812565 913248 947775 624055 1181822 561317 1645923
6757 1645923 766141 821707 841670 1565377 2021480 626652 674095 932752 1857833 896990
6747 896990 667734 1026425 1036845 362804 1226923 813736 719063 640196 1391289 1046308
6737 1046308 700270 1124935 1043058 1038464 526922 1158183 1115315 696524 1159655 1224439
6727 1224439 1157110 899388 969032 600091 583110 270528 1143127 1039319 899902 1245577
6717 1245577 1245347 1163692 810891 770190 896863 1397622 672653 -93070 1682574 887325
6707 887325 1381010 313988 1642517 1075954 1509706 386827 1089697 741432 574118
6698 574118 713651 990713 1023797 794797 747419 1030204 1156785 871669 716934 339542
6688 339542 1002478 213894 1096208 518383 357737 1006642 839176 929671 824340 593866
6678 593866 1711116 1315795 583871 771868 295579 1529465 875123 1026993 707944
6669 707944 779854 918878 511438 1107430 1152797 2007600 794932 1268512 1025553 229201
6659 229201 936516 1698010 1036582 913127 859162 133666 334705 594996 197759 1650753
6649 1650753 950088 737100 994391 1478226 1192884 1554906 776354 787900 292085 904011
6639 904011 701986 1596121 401576 1163970 298021 1807838 1187198 746927 686184 788728
6629 788728 1518229 1382186 743326 1812361 871825 856981 1425052 1073844 1259843 739080
6619 739080 926004 781240 1539881 961509 1270166 1356791 457167 1410932 1160734 515059
6609 515059 909801 208183 310258 909751 422241 1416096 1580993 783944 1373773 1011792
6599 1011792 1645920 558333 699495 834899 632673 989761 1551790 305973 908337
6590 908337 267553 918081 1016895 1280042 1639647 604606 471771 927262 180458 1426369
6580 1426369 551061 339482 1210710 606297 725388 784905 868875 290672 1440064 425508
6570 425508 1528470 1838518 855681 1414289 985091 667479 1149338 950022 530753 769938
6560 769938 804534 1156736 1592071 1583107 287478 431814 650594 1031335 1184542 642282
6550 642282 398271 597296 817381 820451 699910 708796 714692 585834 990381 1721911 953965
6539 953965 827169 1400154 1638218 621332 182712 517079 1147321 581693 448443 694517
6529 694517 814689 753306 224708 1313494 915136 1253267 774357 1018677 1049257 1459876
6519 1459876 930297 1154136 523066 517845 846670 1446190 988251 321052 1307319 823218
6509 823218 1306188 1121091 884794 1235573 1187218 689251 1503467 748607 735462 1117631
6499 1117631 362058 474049 978715 1188126 605650 1610201 613564 1810207 1724735
6490 1724735 1752429 1187143 702360 1604312 552923 1152014 469657 929788 416147 686635
6480 686635 1128340 1096224 840125 1192878 1103984 888764 824762 1047437 1229028 757984
6470 757984 933869 1303143 976293 766507 1247585 1118962 1242989 -30890 355373 635688
6460 635688 686582 1342276 1055414 1263438 205122 978842 525744 1227403 882984 1487524
6450 1487524 722822 555039 1248394 830070 1389706 974564 1025304 1042841 516534 957807
6440 957807 686499 921768 1057250 1207844 1307950 516088 621052 349320 623144 1265646
6430 1265646 610887 1328376 1436564 1315487 1706400 1424461 1364533 729794 782822 1634375
6420 1634375 1130606 1909589 1423337 1557437 1039186 1130982 1042127 1712187 1842591 1804235
6410 1804235 884362 984986 458100 694135 842906 963190 1597703 334447 383197 104839
6400 104839 30097 914071 1440464 425751 1277152 1208185 1343560 1214161 749590 1019584
6390 1019584 601391 1770093 439592 870559 1334408 1247542 941797 1485370 869957
6381 869957 1741243 689285 1266196 1417147 973519 1178893 578459 574086 907563 1223332
6371 1223332 1578252 1287469 668356 1438810 323827 445979 1432021 749378 980540
6362 980540 722876 1211186 1230155 1143574 1324543 1091331 408210 684006 1054357 806774
6352 806774 1583786 1250925 1080658 1996523 931532 1960044 1226428 764334 1589701
6343 1589701 1319079 729285 988011 1432687 952925 668569 1082140 287159 1027176 1478679
6333 1478679 1574019 1167921 1093585 1081667 1061216 1488120 1373865 750293 1326049 1319748 810229
6322 810229 1449159 1181466 1015566 1293654 2227990 1437701 1137633 1044413 433862 343547
6312 343547 1394874 827143 1091218 1726283 1352767 1250604 803753 1254347 1365381 677687
6302 677687 986702 714771 1180205 1340963 888423 1410454 1959293 1186906 767624 778300
6292 778300 1514877 1092092 1240445 1516217 1079785 896798 1256145 1693829 2192845 906175
6282 906175 1072790 679703 280224 528004 870147 1118330 404991 394387 851922 517794
6272 517794 557758 768652 1171025 1909191 1393092 1037542 728241 1110063 1603902 741869
6262 741869 1138522 1650347 1113336 1794690 1057727 1130065 1489872 723403 1122163 958299
6252 958299 1274185 1217295 439422 404481 941634 1599949 664738 1332307 869659 1475309
6242 1475309 1011709 1158024 174256 1113649 758421 1629081 976732 1178476 1462120 524875
6232 524875 584767 1227331 914629 1911097 1812588 846811 1780412 1248635 2055725 1193627
6222 1193627 1629353 1771055 468386 1056750 1137025 428234 857277 1104996 1111051 951433
6212 951433 1409462 1815055 1175202 1492014 1189406 1519383 1092301 1826309 1032843 2026961
6202 2026961 1823335 1379549 1152832 2164614 1638913 2574025 1771486 2694328 1681003
6193 1681003 2905841 2877407 3121237 2936867 3540532 3669082 3194006 3357599 3073250 1567245
6183 1567245 2782784 2591964 2913096 2440087 3124948 3088249 2189977 3019113 2067535 2143537
6173 2143537 2524596 2735497 2669068 2314480 3157952 3511808 4013427 4423291 4213007 6127987
6163 6127987 5278904 5919430 7469764 7895730 7081730 6207283 4590679 4928661 4836805
6154 4836805 4787793 4408743 4380730 3912452 4718834 3714941 3735300 3770423 2977409 4301213
6144 4301213 3146641 4198094 3569930 4107412 4488753 4070366 4528596 5516122 6198607
6135 6198607 6033035 6892831 6965621 8258343 6210594 6531795 5462044 5257443 4411896
6126 4411896 3994410 4734524 3953426 4394051 3844183 2969430 4420184 3169097 3567842
6117 3567842 3484127 3275434 2926236 3483734 2494186 2950434 2738347 3047846 3135009 3641105
6107 3641105 3965962 3844386 4258962 3822735 3824007 3651283 3128632 3454806 2637781 1619110
6097 1619110 2144784 2187707 2128683 2087166 2397978 2076513 2006632 2168830 1845976 1989050
6087 1989050 1994817 2444985 1540740 1925407 1764196 2180156 1559168 2721174 1799118 1493792
6077 1493792 1423676 1615353 2046843 1352236 2028248 1652796 1954125 1296211 1914810 1268786
6067 1268786 1302437 1558477 2011157 889166 1243852 1503443 1582075 1807452 1653375 1071980
6057 1071980 2217829 1366168 1627283 1815241 1364847 1567025 2125151 1630345 968559
6048 968559 1487883 1760802 1183703 1565838 1591604 1088916 1339475 1341593 1363845 1331199 1635555
6037 1635555 1884103 952971 1278843 706209 980664 676983 1328833 1335513 984591 1940174
6027 1940174 1739536 1468026 1514018 1615415 2145876 1465500 1901640 1441363 1336524 1056829
6017 1056829 1283160 1420641 2374027 1640722 558335 869487 685063 1252209 1255833 846413
6007 846413 1098952 651940 805392 764280 1538152 998305 1574887 2053940 1687430 2201158
5997 2201158 977626 1656259 1486608 1793287 1671235 1676196 1484068 1905142 1149991 374733
5987 374733 1501698 1231115 1407934 1477058 1331045 859993 1756420 1071611 1088001 1232250
5977 1232250 626831 646510 996489 1133941 1600566 1398722 1442404 1099792 1282693 577064
5967 577064 1253959 915626 846088 796293 1242131 1588364 1907853 1503007 792225 1308403
5957 1308403 1309987 1500655 1166617 1227047 2043593 1465072 1054442 1585840 1590251 1562765 1110125
5946 1110125 1416631 838352 1092881 842310 1021976 1819848 589871 1324759 997464
5937 997464 1335460 1057973 1166396 1081862 990477 997457 1338641 1963671 1365705 1097562
5927 1097562 1466497 1503629 1475231 479712 988418 845025 1167425 1456967 1196809 995251
5917 995251 1078974 614933 947379 1427064 971753 1218449 698990 1058708 749168 1355227
5907 1355227 1694919 1928253 962584 1553716 1238962 1167280 1348192 1767570 1149066 1382453
5897 1382453 1381582 989465 1210470 1526461 907901 824973 1036044 851392 734472 1772315
5887 1772315 1505876 1257449 2037980 786034 1407370 1112628 990716 520924 1081524
5878 1081524 1336430 1243749 943310 1064135 867915 1585890 823122 662196 2032667 715489
5868 715489 1515033 545905 1357713 1370655 1240773 828758 1236597 718755 871550 1293225
5858 1293225 1904842 1332588 1922406 1374285 1162904 1336929 634893 824266 1834822
5849 1834822 613461 1853797 1374246 2096816 905011 1011726 947918 2142300 1141196
5840 1141196 1079756 1712900 1954209 1335107 906099 990318 881292 738104 867568 1457046
5830 1457046 1728463 1578209 1434440 1018013 1312448 1494181 738139 936691 666534 1296994
5820 1296994 1000127 1368039 1018934 1007832 1245162 1266644 785651 1439759 1041940 1525988
5810 1525988 1819387 2000068 1721996 1328051 1212624 1737508 360062 1195956 1003513
5801 1003513 1449653 1163651 1477039 1160993 1354615 881608 1458032 860183 1019424 1351677
5791 1351677 1897460 1353716 2003065 1167814 775477 1101391 1430042 1601798 1032351 1178833
5781 1178833 1290351 1549622 1054517 1281191 1167840 1113557 1410333 1244716 1026476 1295807
5771 1295807 984462 1432911 1257567 1464088 1303074 825227 986590 2203292 1678465
5762 1678465 517140 379394 1048310 1198889 1765126 809444 1003086 1642362 1131362
5753 1131362 1833146 1026519 1282374 1431357 1248360 1498155 1349539 2202291 1430828 1534324
5743 1534324 1160779 1717294 1309574 1255189 1144539 1057303 709763 869618 1437382 757944
5733 757944 1224618 1417112 1639357 1408350 1132361 1436879 986160 1306693 1882966 1402477
5723 1402477 2083546 651608 1212071 1579841 1977048 836069 1015446 1182256 1392890
5714 1392890 1749105 1766747 1600862 1240418 1235015 1212763 1951648 1161105 1405422 1019559
5704 1019559 1527679 1595442 1704181 1457874 1590272 973717 1312900 1552626 1179771 1180694
5694 1180694 1041200 1822196 1423135 1226477 948753 560043 1027113 1604978 1301257 1476728
5684 1476728 853983 956976 1747721 1444860 2009362 1267037 1270587 1524269 762393 1260422
5674 1260422 693473 1988229 1117765 1282586 1197045 1603777 1098062 1496457 1466050 2503370
5664 2503370 1419582 681374 1159153 1578721 2014475 1190827 2094070 1842657 995069
5655 995069 1158488 1488571 1014113 1215167 1188608 1915168 1207485 1125530 1192119 1869512
5645 1869512 1288656 704827 1241362 1943079 972016 2039245 2327694 1036999 1429542
5636 1429542 1897908 1532416 1446506 1475450 1370840 1669784 708855 647462 1899955 2565210
5626 2565210 1545004 1711659 1170966 1823907 1227304 1727809 1386303 1173715 1768268
5617 1768268 1480901 1888482 1892592 1848980 1471471 1092091 1181254 1446423 1275206 2227849
5607 2227849 942459 1774349 1773393 1531110 1695833 1279179 1499303 1619412 1641249 1666257
5597 1666257 1638151 1393068 1166876 2493463 1434386 1520905 1505030 1241245 1655980 1308161
5587 1308161 1335567 1694081 2083357 1701930 1049418 2145969 2079075 1675365 1632024 1841162
5577 1841162 1642620 1108374 848740 1995736 2615649 1799283 1278292 1390406 1410162 1599940
5567 1599940 2021046 1379735 2427506 2081695 1529097 1771690 1821571 2056628 2367402 1674588
5557 1674588 2201297 1421624 1429447 1849612 1704327 2083715 1550386 1274686 1513568 1008981
5547 1008981 1628467 1712629 1750625 1967788 1327392 2144838 2307022 1671860 2443648 1679108
5537 1679108 2000060 1568828 1718354 2397804 1950875 1764982 1984932 1891043 2044286 1278865
5527 1278865 1107700 1952362 1340903 1305049 1293118 1543951 1709867 1873716 2075860 1978530
5517 1978530 751342 1687195 1438095 1522405 1453717 1589884 1675905 1881944 2156595 1585478
5507 1585478 1669518 2454252 784556 2997882 1405922 2003915 1811759 1963489 2426530
5498 2426530 1765270 1503329 1695528 2224444 1811497 1737789 2936058 1167940 2955141
5489 2955141 2207085 1710339 1669482 1061002 1932289 1930650 2280778 2115325 2058835 2197443
5479 2197443 1499994 2443696 2220947 1430798 1424589 1328393 2125094 1990995 2651100 2200928
5469 2200928 2071075 2493712 1604748 2245014 2139196 2270590 2392480 1496122 1979174 2740825
5459 2740825 2483676 2612527 2415740 2348617 1843338 2431598 1996997 1683292 1569658 2162546
5449 2162546 2206180 2875849 2443935 2378751 2319582 2720388 1772032 1941567 1888000 1853069
5439 1853069 2602382 2516657 3141406 2765469 2133023 2748291 2555282 2415461 1836767 1798798
5429 1798798 2279556 2358935 1969935 2508756 1988570 2140090 2516102 2791951 3556237 2391346
5419 2391346 2208158 2160299 1954467 2616061 2760823 1816650 1995585 2332998 2803715 2058529
5409 2058529 2243013 2124027 3015355 2291502 2683939 1806153 2982461 2657850 2404451
5400 2404451 1964999 1806870 2250032 1782164 2154454 2537561 1886024 1920989 1863661 1105286
5390 1105286 2503968 1785084 2517144 2823955 2718548 2746588 2676845 2583930 2116616 2660957
5380 2660957 2367489 2348698 2364735 2710842 2737013 2552293 2687571 1925349 2462415 2435728
5370 2435728 2066859 2391397 2013750 2239564 1657452 3098078 2774063 2832780 2886784 3151032
5360 3151032 2560342 2405290 2436960 2052845 2329358 2791115 2565704 1757122 2488137 2321732
5350 2321732 1720636 1747806 1732708 2363273 2308488 2580394 1897726 2485890 2375938 2082141
5340 2082141 2786965 2266251 2266771 1515374 1975232 2247895 1884206 2405429 2269899 3042859
5330 3042859 1915744 1784052 2287833 2607565 2697847 1977334 2503830 1907831 1986139 2112304
5320 2112304 1998805 2320913 2366423 2469300 2791231 2089290 2090615 2134313 2741592 2798399
5310 2798399 2639286 1581337 2144406 2972803 1991916 2088932 1995074 2679129 2655315 2508035
5300 2508035 2270755 2182319 2305110 1730959 2297231 2492555 2070168 2734424 1788277 2526475
5290 2526475 1592169 1477771 1981673 2217883 2180390 2078178 2641986 2057541 2900344 3063515
5280 3063515 2667148 2181170 1668203 2264003 1560586 2213512 2143532 2726595 2926509 2498337
5270 2498337 2202953 2116286 2682020 2933390 2355919 2367985 2158450 1902431 2983707 1693250
5260 1693250 2326987 2103916 2891425 2919108 2725392 1889842 2192970 2560465 2524039 2125466
5250 2125466 1719626 2314253 2287015 2205690 2557163 2185199 2226179 2163237 2574685 1984051
5240 1984051 1448749 2549475 2524191 2745713 2576492 1920101 1825472 2282166 2200824 1660368
5230 1660368 1706676 2002120 2245954 1599784 1989809 2261070 2142504 2365979 2324748 1673243
5220 1673243 1742392 2769931 1960238 2827457 1771832 2693959 2349914 1929953 2255453
5211 2255453 1695661 2621853 1503026 1459173 2234950 2242647 2008892 2979064 2380720 1804479
5201 1804479 1986583 2243325 1852051 1486118 1813053 2685963 2656848 1954602 2591004 2036876
5191 2036876 1799153 2435467 1794787 2301592 2620015 1857003 1691639 2393504 2619268 2054280
5181 2054280 1561781 2235552 2420714 2036242 2078433 2159115 2462823 1904708 2394628 2073987
5171 2073987 1577919 2502782 2036856 1672262 1951276 2374981 1656436 1971705 2779778 1503130
5161 1503130 2176054 2109607 1973586 1461560 2125386 2632038 2156902 1787313 1929677 2434192
5151 2434192 2367047 2060361 1639759 2173124 1117158 1837788 1380691 2346013 2675460 2188435
5141 2188435 2155931 2889968 2432841 2052928 1817311 2112906 2223887 1990867 1976774 2554026
5131 2554026 1309636 2561106 2219012 1922880 2568577 2210176 1884395 2291720 1671910
5122 1671910 2213999 1765541 2668745 2534897 2673346 1786751 3450582 2512144 2258959
5113 2258959 2317240 2368178 1833336 2659656 1947327 2407995 2639459 1676310 2471766 2165302
5103 2165302 2439510 2397979 2247486 2073778 2757250 2073883 3007940 2048868 2204051 2020176
5093 2020176 2588274 2637561 2322087 2562212 2498615 2249618 3304061 2382448 2047428 2113255
5083 2113255 2689727 1952964 1845403 2100358 1952565 2677160 2067620 1943747 2997309
5074 2997309 2685791 2171871 2873843 2596472 2817994 2567288 2666577 2737588 2625017 2473768
5064 2473768 2522926 3113194 2455338 2265001 2854517 2805121 2748487 2783547 2874095 2097131
5054 2097131 2573142 2239742 3264748 3177073 2358733 2483970 2226393 2452888 2383979 2753512
5044 2753512 1684937 2069919 2430866 2698856 2112676 3247433 2468117 3407709 2271762
5035 2271762 2107491 2348910 2317384 3080396 2864698 2619123 2775380 2527340 3509240 2731611
5025 2731611 3307660 2499970 2909538 2925808 2821113 2991804 2880513 2559350 3167685 2754168
5015 2754168 3337314 2942794 2708357 2478420 2920360 3707012 3321848 2709955 3784785
5006 3784785 3605274 3299146 3460172 4237986 4155257 3539222 4061886 4945389 4092553 4180788
4996 4180788 4139807 4103303 4060524 4605225 3752914 4403187 5066377 5183158 5798424 5424109
4986 5424109 5301862 6399920 5903491 6450378 6108169 7717076 7094970 8391200 8606695
4977 8606695 8705630 10398732 11964192 13304823 13979717 14545905 16469265 19012453 19066994
4968 19066994 19055414 19044626 20726824 22321130 23625625 26495634 29182524 30856956 28604541
4959 28604541 28250787 28704548 30011617 31262682 33160472 35247553 38135637 37442995 33452920
4950 33452920 31965659 30685883 30132280 30122992 30771768 31112884 32209412 29985186 26798716
4941 26798716 24686781 23377149 22366423 22226014 21285980 21756110 20649299 18801953 17415355
4932 17415355 14984239 14137519 13076291 12778934 11682536 11259628 10241112 9736228 9219638
4923 9219638 9157471 7819995 8372822 7211814 7755201 6802697 7003213 6118265 6241472
4914 6241472 6592507 5786281 5317029 5310263 5814231 5434184 5269783 5322896 4776701 5200258
4904 5200258 5059546 4779948 4415611 3948743 4779223 4168832 3472773 4383940 4582130 4632402
4894 4632402 4026079 3854786 4058157 2874424 4015853 4103855 4365400 3407589 3340973 2870701
4884 2870701 2967020 3867977 2832054 2901442 3640385 2980800 3147572 2720291 3853300 3157630
4874 3157630 2819211 3041339 3171978 3148168 3523883 2679964 2369091 2381489 2957828 3216087
4864 3216087 3304975 2400979 2960460 2498244 2828552 2337507 2740478 2909154 2638471 3192755
4854 3192755 3139160 2573432 2087057 1560659 2466946 2159027 2287782 2137052 2663572 2180608
4844 2180608 1919095 2189233 1806708 2380589 1708659 1643819 2805213 2683649 2412769 2577715
4834 2577715 2389031 2322220 2745628 2503587 2068985 1413225 2753569 2059780 2487927 2231275
4824 2231275 1856976 2684350 2456360 1418280 1379367 1633697 2070226 2318848 1838955 2333937
4814 2333937 1651649 2065346 1884244 1606745 2270295 1769911 1814434 1998147 1984948 1466570
4804 1466570 1628076 1198094 1881888 1728344 1849679 1694380 2747851 1854408 2070496
4795 2070496 1640813 1390850 1589946 2033403 2143441 2200040 1693670 2260149 1843750 1846586
4785 1846586 2276224 1966481 1947200 2212340 2348259 2016835 1965987 1745068 2448584 1218682
4775 1218682 1424828 2292744 1885480 2541574 1160948 2080260 979085 1603122 1414503
4766 1414503 1905441 907454 2187263 1711680 2426151 2144137 1840441 1876319 1811913 2521340
4756 2521340 1710850 1046681 1753793 2304785 1105900 1392418 1294664 1693268 1907116 1155417
4746 1155417 1926981 1559003 1343905 1398259 997913 807870 1446106 1706281 1122997 1114792
4736 1114792 1775582 2297742 1057676 2040593 1879054 1650156 1754994 1220729 1275453 1700831
4726 1700831 1056057 1084883 1576118 1623491 2029766 1897544 1434055 1466973 1125755 1293273
4716 1293273 1278965 425616 1552319 2090307 1385847 1181568 648208 2250255 1596525
4707 1596525 2096937 1253850 1137039 1833932 982161 1678124 1971519 2117585 1350853 1105378
4697 1105378 1015419 1769964 1021143 1679038 1282493 1283861 778807 1184928 1805550 1094662
4687 1094662 206542 713703 1610108 1770527 829279 1660887 1730293 1793090 1079479 1573987
4677 1573987 1000382 469220 847754 2142161 1791885 1598083 1051786 1283651 1294338 1690572
4667 1690572 1322236 1387005 590633 1222917 1361485 1079071 546025 1516976 1060321 770157
4657 770157 1862357 1685056 1604343 1872810 666573 1683831 995929 2010696 1676126
4648 1676126 1868501 1149424 826877 844105 1169231 1756439 1176048 1396637 726627 1294006
4638 1294006 1225494 1250020 936097 1772877 993796 1467121 1473462 1297113 1744505 1964617
4628 1964617 1695843 1064783 1942176 867519 885934 1164754 1673640 1672913 2063127 701321
4618 701321 1320664 1106864 1132792 1723233 655602 1906198 1473711 1369641 1083152 1407206
4608 1407206 439276 1321280 855724 2224326 1264741 1302205 2112233 1442956 1649221 182063
4598 182063 1100909 1198035 1656079 1839645 1688862 1486007 1199829 838369 1512582 808159
4588 808159 1251105 452858 1371146 1023623 1884776 2130950 1328635 1673867 1691998 1164249
4578 1164249 1355863 1037967 1417089 863015 1028761 1460297 1147484 772126 1372477 1397122
4568 1397122 1083341 749309 714262 568356 1359523 1241364 1440278 1083311 1623297 1692182
4558 1692182 1494292 1103429 1317263 1169430 1223390 1102735 870808 1391851 1491797 944737
4548 944737 1739464 691862 1993575 918789 1327817 677431 1105851 1769707 1780858
4539 1780858 1414285 903997 1255999 1074420 202339 1273324 993173 1731214 2317584
4530 2317584 2052220 1286148 641310 1435174 1371276 900874 1023229 1213071 1541438 1863092
4520 1863092 1347571 799563 2049028 1170610 1756362 1436760 1498282 1830991 1180932 1574746
4510 1574746 1574781 2200800 1467223 1124171 1640275 1168151 1151679 1536258 1162989 1301524
4500 1301524 2007736 1187575 689894 1497750 995078 2655782 1045260 1863198 1261996
4491 1261996 1479902 1612558 2333579 1288840 1511109 885349 88674 1429737 842788
4482 842788 1477528 1212447 862283 1066133 2001763 1562911 1532227 1617505 1383167 1749623
4472 1749623 820085 1176907 1480421 1368637 864772 802439 799911 1676527 926446 1251893
4462 1251893 1253040 1240607 1271880 1212756 1841422 1754648 848485 860847 1758631 1497474 2292848
4451 2292848 1676395 1156289 2019397 1395940 916389 1307357 1611408 921668 1498364 1915571
4441 1915571 1118970 2313689 917141 971257 1155867 1146027 1558814 1209861 1605115 1450798
4431 1450798 1052330 1899870 1213176 884528 1674508 1710844 1161836 1228958 1182810 1707083
4421 1707083 1498130 1249184 1455977 1332589 951019 1006420 745637 1878412 1837243 1501074
4411 1501074 2016167 1103571 1653868 988312 696504 1025247 1317136 1028858 1219330 1645232
4401 1645232 1644169 1327980 1179431 1534449 1216332 1230712 1328583 1783076 1155948 1746673
4391 1746673 1572393 1319150 1124236 1510013 1041375 1290830 1117684 1168481 1455138 1348550
4381 1348550 822559 2092599 1509436 1261134 2072044 942113 1773991 1815811 1331409
4372 1331409 1290129 1696217 1999968 1270427 1389746 1797779 1745650 1824891 2280750 1798000
4362 1798000 1200616 2019674 1026514 1928815 1452540 1729756 2059603 1625130 1879706 2117465
4352 2117465 1651338 1745423 2464783 2082830 1978533 2071138 2259097 1577229 1757737 1742870
4342 1742870 2182510 1904296 1692778 2484811 2072148 1437186 1874102 1616403 1788195 2350847
4332 2350847 1496704 1935450 805132 1270696 1803369 1825918 1600065 2193666 1853387 1839586
4322 1839586 2221911 1560496 1909628 1528256 2373184 2375847 2230241 2042875 1501622 2469830
4312 2469830 2152876 2189047 2370566 2316392 733724 1894169 1167513 1480490 1343658 1865333
4302 1865333 1534057 1594499 2104797 2739994 1797010 1591546 1060071 1341550 1292956 1761398
4292 1761398 1776854 1964738 2174126 2364367 1876305 1679900 2464659 2293310 2855277 1653026
4282 1653026 2034408 2107742 2387106 2467220 2232503 1994909 2897600 1887409 1141751 2201962
4272 2201962 1326125 2192425 2238686 2682400 2276259 1961630 1659098 1962457 1839085 2161823
4262 2161823 2310503 1849503 1889249 2663616 2350471 2244136 2966568 2790971 3067699 2793922
4252 2793922 3638735 2943963 2832497 3598549 3717985 4633836 4806009 5282610 5545885 7601011
4242 7601011 6694649 7913427 8147314 9096796 10390352 10666968 8445850 6805534 6383547
4233 6383547 6288239 6100125 6684576 5895298 5300183 5703441 5371287 5168453 5607842 5339618
4223 5339618 5352367 5241858 6191957 6453223 7377738 7362563 7991907 9602845 10656867 12430039
4213 12430039 12777442 14954588 15293702 18153492 14974827 13350351 11084478 10610408 8970151
4204 8970151 9476414 8650704 8529439 7467104 7953609 7027530 6230399 7192648 6618823
4195 6618823 5718955 6041787 5567754 6149557 6352309 6155966 7032403 7191098 7665657 9566617
4185 9566617 8721407 9204230 10590495 10994639 9079638 7984951 6878515 6634436 7114301
4176 7114301 6266118 6226739 5319159 4657445 4246404 4624261 4032118 4160683 4448026 2860658
4166 2860658 4015310 3380417 3642899 4063294 2792515 2980279 3223752 3449242 2972775
4157 2972775 2550320 3206511 3294701 2693985 2680241 2286572 2548759 2810733 3099581 2373625
4147 2373625 2653682 2587412 2436343 2094212 2747543 2296146 2686314 1680131 2178864 2277471
4137 2277471 1852154 2961799 2670628 3129169 2054957 1405967 1959513 1902209 2352066
4128 2352066 1895839 1425019 1622416 1897259 2006051 1730606 2310203 2216489 2112058 1844260
4118 1844260 1970840 1429001 1822121 1913782 2226990 1167090 1851509 2011133 1990461 1828033
4108 1828033 1424297 1503842 1988046 1194094 1675052 1597071 933789 1566204 1254629 2348111
4098 2348111 1185096 2057171 2691093 1639119 1882073 2160747 1657386 1507940 1355029
4089 1355029 1749328 1481522 1505049 1739916 2072217 1196372 1300236 1245635 1346088 1106436
4079 1106436 1570906 1502683 1861636 1585129 1445143 1306123 1185720 887793 985072 614075
4069 614075 1572988 1707984 2052019 1286520 1808946 1788304 2127486 1708389 1011998 2058060
4059 2058060 2156777 1134829 1538465 1258890 1443177 1473229 699101 1804274 949090 1760761
4049 1760761 1400519 1116064 1901078 1526084 1658757 1813303 810746 1262513 1084024
4040 1084024 1186523 949927 1476975 1686518 2400703 1399129 1088803 1904359 2124440
4031 2124440 1893382 1634309 1710826 1748944 1695169 1894610 2162713 1885166 1744999 2174410
4021 2174410 2185800 1624269 1928376 1256069 2170669 1252548 2571537 1910028 1656526 1596184
4011 1596184 968624 1740911 1932167 2245630 2121323 1967611 1593380 1228123 1348146 1621961
4001 1621961 1569748 1362976 2347126 1297421 1372333 929772 2213040 1617404 2455000 1017630
3991 1017630 2268681 1205942 1367495 1459261 1457191 1447501 1741931 1724096 1261485 1585564
3981 1585564 864796 1900514 1633778 1215149 2104435 1279059 641853 1201016 1474195
3972 1474195 1031770 1468510 1868231 1787733 1505709 1023210 2079988 1968031 2024191 1339237
3962 1339237 1478705 1223566 1675456 1314641 1399729 1756208 1688681 1338471 1301463 1297980
3952 1297980 1382601 1719342 1144186 1321917 1912524 1542908 1229217 1361728 1718967 1735612
3942 1735612 1317320 2235990 1033552 1828916 1602530 1340874 1033500 1790669 601436
3933 601436 689454 1250626 2294382 1750118 1113786 1762866 1674795 1347160 778455 495867
3923 495867 1687647 544116 1264783 1385405 918819 1433078 482580 929365 1670141
3914 1670141 1721313 842090 893103 1052727 1296403 1475810 1353712 1851733 1227380 1295482
3904 1295482 1739487 1501894 588597 1403518 1235256 1455919 450649 1605462 1435155
3895 1435155 824271 1635636 671786 854864 1216748 1548704 273442 1787955 831036
3886 831036 1376572 1337845 842490 1357443 1008215 1632722 858063 239030 720019 1744768
3876 1744768 727962 704082 1668694 1302018 1248882 1691081 952648 1593478 1025031 801910
3866 801910 1112625 1194796 911975 1392762 2106140 1346450 1417881 907055 1743089 792566
3856 792566 798530 1672848 1676082 1244539 1821169 529456 1473368 1412495 1306134 1185565
3846 1185565 412625 766720 1236526 1566808 1319907 963504 938372 579772 2293716 777739
3836 777739 1734345 1294934 393165 977892 1540913 988807 1024646 694405 1473964 1004103
3826 1004103 1478876 1094864 1108619 1381218 1144272 1320907 197511 880639 1798019 1298680
3816 1298680 1421995 1437286 1337104 1682751 951923 1159070 790801 676997 1160434 1118301
3806 1118301 645539 700274 950182 1208713 793875 1244911 1242758 478497 1221031 908993
3796 908993 1325440 971200 709833 982515 742969 1226415 1208141 419129 1218625 1231007
3786 1231007 1642585 658307 1741493 1136092 1615637 2045744 1144634 1208696 1751524 1443855
3776 1443855 1009189 1300580 1147633 1407013 1656006 1994363 1188765 791182 877840 1141373
3766 1141373 1835003 1141824 1068710 578500 1099563 1658286 1518675 2011919 1745749 1328977
3756 1328977 1268385 1868695 1945684 1004643 1504815 1141175 1366620 397926 710356 1128097
3746 1128097 1615966 785345 848876 1206932 1361377 782870 1298205 1702423 965303 1286383
3736 1286383 847180 1561017 1523441 1588903 1141665 1303004 710397 1459694 1012648 798721
3726 798721 956788 1096981 1522849 1022132 1403001 1530664 1762963 1563164 1367431 1366533
3716 1366533 1198824 1384227 721520 1611929 1691106 1292843 1160661 1573025 1079393 1392687
3706 1392687 1483521 1130489 598633 585666 1499567 1630662 2071712 1129342 1174270 1653514
3696 1653514 1359587 2311455 972919 1341459 1863420 1405086 1112887 1936095 992634
3687 992634 1390995 1038953 1444305 892128 1072713 1322182 748459 1258011 1721391 954333
3677 954333 1518579 1453970 1580951 1142662 1381272 1355615 1471854 1738525 1575887 2017214
3667 2017214 887373 1579008 1211324 1568549 1334256 1408010 1431757 1587401 1154356 1392520
3657 1392520 1087799 946651 1348992 1713625 1679871 1738276 1353900 505383 1451635 1606117
3647 1606117 1065429 1980305 1658056 698398 1651930 1518104 1493109 1039525 1074029 1842540
3637 1842540 1570527 1494228 669446 1286988 787208 1211678 692297 963249 787604 2023649
3627 2023649 1393397 1747705 1017224 1807523 662781 1837404 959211 1576281 1655706
3618 1655706 1312726 1799618 1155636 1432780 1678383 826508 1298151 1062510 1250308 1899949
3608 1899949 1747366 1502012 1869514 1005836 1088895 1217143 1359633 1969351 726825 1917344
3598 1917344 1710553 896929 1593835 1557982 1593207 1625682 1395777 1143462 1758742 2112390
3588 2112390 2293780 2064977 1724170 1437865 1102300 1536878 1050289 1498331 1115436 1392793
3578 1392793 1372796 2915008 1799633 1620637 1125851 1817304 2158920 1463693 2194088
3569 2194088 1690837 1621246 1970642 2009738 1941862 2211602 2091370 2202810 2017989 1885272
3559 1885272 3071628 3184596 3392614 3788947 3297574 3368137 3241377 2474381 2595545 2768903
3549 2768903 2828347 2749077 3634462 2615913 2198345 2547320 2125126 1978897 2438175 2191380
3539 2191380 2310332 2981167 1992702 2508616 2476180 2359336 1972959 2739544 3320645 2458600
3529 2458600 3232751 1417058 2271309 2392379 2200425 2388335 2006644 1814299 1945071
3520 1945071 2457821 3025493 2917687 2161271 2366630 2295325 2435366 2465966 2593435 2592976
3510 2592976 2536193 2109579 2177620 2090303 2537012 2681473 1613857 2909536 2556520 2960185
3500 2960185 2098615 1599830 2511714 2261980 3100201 2578545 2399003 2385137 2380513 2761898
3490 2761898 2975712 3273844 2821654 2483736 2928110 2956004 3206077 3142907 2585910 2577692
3480 2577692 2633570 2848410 2606355 3930964 3457600 2977735 2484570 3535190 3037335
3471 3037335 3303719 3125870 2739603 2719784 2614192 3447274 3333871 3708881 3252383 3128470
3461 3128470 3218866 3192859 3503566 2765057 3370899 3208969 3588873 3526233 3784565 3414699
3451 3414699 4469273 3695284 3040664 3630650 3754862 3335966 3357540 3743412 3934927 3455639
3441 3455639 4073079 3889826 3182386 3215090 3413831 3149565 3635633 4339776 4035886 4053703
3431 4053703 4517873 4223304 4013283 4094504 4127424 4476497 4402300 4186892 4077280 4002207
3421 4002207 4563428 4268864 4395244 4171140 3994176 4240740 4769721 4480098 3928108 4197706
3411 4197706 5073884 5343821 4365799 5298883 4508572 4692046 4734545 4652347 4692618 5781859
3401 5781859 5222924 5909761 5024439 5213144 4910799 5480487 5398139 5473987 5599557 5230320
3391 5230320 6260856 4998048 6076543 6278816 6134573 6586764 6639859 6279687 6674459
3382 6674459 7259436 6899435 6722399 6933505 6929648 7231889 7125381 7960229 7924471 7685776
3372 7685776 7756405 8140414 8136971 8997923 8577957 9578226 9935028 10160080 10101374 10385835
3362 10385835 9989292 10705975 11033926 11362889 11680231 12622980 13011921 13530745 14821078
3353 14821078 14969851 15675341 17272542 17427441 18860741 19786345 21668058 22348432 24168315
3344 24168315 25437200 27975314 30428013 32412825 35878394 38621374 42267704 46530711
3336 46530711 51784984 57958960 62355732 68187293 76012871 87552736 100015692 112958007
3328 112958007 132150666 164997782 200533766 218565514 224246741 256042429 311484287
3321 311484287 276844297 222913436 183622215 166442088 156078194 149751259 146051190
3314 146051190 129950644 114015403 103754859 95319083 86788080 79863817 72478379 66041083
3306 66041083 60664367 55145967 50613773 47950801 44759708 41616979 38519203 36631255
3298 36631255 35001055 32505684 31086122 29484518 28322523 27219624 25802327 25857651
3290 25857651 24016992 22540769 21844216 21147844 20040473 20016116 18937541 18733914 17324645
3281 17324645 17776054 16012985 15738839 15337255 15200160 14792202 14673442 13868953 13289318
3272 13289318 13424346 12491238 12033042 12062134 11898948 11145951 11688465 10923946 10313467 10258439
3262 10258439 9938588 9625181 10232142 9203129 9178481 8931871 8357815 8325936 8454002 8023953
3252 8023953 7887908 7742251 7994801 7405473 7595765 7307279 7361380 7169434 6651766 6187672
3242 6187672 6853291 6178089 6220378 6143205 6204033 5786709 6323681 6242276 5660150 6259101
3232 6259101 5048396 5564891 5338080 6305040 5691549 5768305 4898538 5047897 5077349 4816403
3222 4816403 5011580 5002625 4369771 4617812 4362055 4238388 3838549 4247676 4653263 5081566
3212 5081566 3920072 4062759 3423450 4416863 4160124 4240473 3811337 3843180 3065844 3524929
3202 3524929 4323726 3782163 3968914 4148537 3445925 4188614 3536782 3472699 2258321 3633256
3192 3633256 3544806 3511018 4226433 2881353 3795647 3352878 2843886 3439050 2924939 3182431
3182 3182431 3402956 2105665 2590330 2727274 2761048 2890400 2827264 2079231 3578914 2376263
3172 2376263 2435918 3118270 1816195 3056433 2875703 1643929 2950209 2397078 2416032
3163 2416032 3069860 2753672 2080989 2488042 2262536 1844823 2330994 1971499 2198603 2062669
3153 2062669 2587617 2169153 2282388 1943608 2370967 1808222 2203889 1466491 1602962 2493142
3143 2493142 2100806 1492612 1911607 1462263 1364858 1958449 1388546 1905975 1943564 1590141
3133 1590141 1573751 2411521 2392955 1668051 2344581 2061666 2056316 1861691 1196702 1827789
3123 1827789 1643863 1486399 1692730 1707097 1027950 1186121 2624018 979400 1180575
3114 1180575 1837561 1579262 959746 1411817 1352149 885845 1196743 1868789 1464075 1457654
3104 1457654 1768970 1379634 1734026 1863634 2875430 2417278 1592631 2388342 1606435
3095 1606435 1800253 2529010 2108278 2692171 2825543 2974481 2322847 2454807 3046711 2805928
3085 2805928 2069422 2749642 2333239 2393209 1818731 2060432 1979627 1087093 1372824 883199
3075 883199 1762930 1318872 1199586 1175679 1281262 1934509 1133252 871718 1468314 1172956
3065 1172956 1518924 1404919 1665237 1072060 1608049 1758830 1251130 1274998 636612 1009823
3055 1009823 140043 743148 685352 1027473 1127068 486096 1279712 259937 529230 701826
3045 701826 1516113 1488719 847811 626649 647834 400547 755974 1911255 657257 232965
3035 232965 989113 608378 1033490 853848 740733 949655 791599 1561077 1020145 823850
3025 823850 388061 932740 1168144 830522 1099389 360232 717876 1257839 619793 -109595
3015 -109595 1292001 607667 889747 480461 607795 1105420 999094 488728 895011 76141
3005 76141 1519378 1199277 858281 784194 516745 939670 196293 334509 392236 1071650
2995 1071650 599208 171176 622135 1095169 726805 794595 878966 1328263 384644 670837
2985 670837 604378 776707 11938 863110 1007977 650039 289407 1016930 447294 759940
2975 759940 1008903 670557 1526750 1115707 359342 603543 784636 637444 1152580 867956
2965 867956 -135157 935728 414166 524846 647127 678586 521512 203472 725672 54079
2955 54079 710698 666065 507452 883066 750974 -51159 198212 86260 1704124 172823
2945 172823 640733 179621 1004072 1170955 842327 828978 563632 291993 704028 1254990
2935 1254990 1034241 356055 535029 1046406 1206382 507667 862422 1003577 1321717 243839
2925 243839 216275 1245106 746821 668879 -223097 434077 57523 908432 622471 728368
2915 728368 973922 907280 387978 460094 -560667 749950 746439 504305 337280 791053
2905 791053 885452 172029 342701 729181 179295 768709 1090565 187077 398100 953065
2895 953065 331645 1033468 627431 359351 363211 411744 131491 107709 330774 585930
2885 585930 1303920 1284695 409586 1060283 1169973 302516 775322 446851 864451 845530
2875 845530 1179894 838148 1022351 615226 1072144 -104783 1064767 662542 318191
2866 318191 426166 820186 585549 375641 -181908 970964 971461 338146 144041 128213
2856 128213 1188018 917425 423681 81700 -14594 505497 180394 -222444 603063 926933
2846 926933 1036034 -421219 -115847 1318711 677954 1082952 327099 1270744 589980
2837 589980 973872 -28474 663032 149725 787983 368310 -81792 441917 52976 701605
2827 701605 685406 21649 324388 322316 87574 -20496 596960 99356 -157167 -126058
2817 -126058 -45555 91483 700740 944719 1041739 556160 526196 652512 655537 1153138 440518
2806 440518 484439 1415623 890421 617627 1144049 1274836 528605 -514976 21946 321967
2796 321967 1133350 821666 216316 539137 430383 1224421 276458 -27334 679369 707639
2786 707639 -131697 937926 513618 960230 346808 78175 530596 323602 622808 573057
2776 573057 762729 920975 852771 324120 365745 103370 367232 679290 636925 451551
2766 451551 444121 342633 247686 586533 -45449 343796 787646 718686 -83608 255451
2756 255451 307947 322594 300810 310802 811740 -141926 681853 824894 -41802 795902 975431
2745 975431 1287643 920042 652053 88401 694059 1393856 547842 610763 238192 164980
2735 164980 757791 611880 378917 884120 594480 696908 759559 587622 809600 392495
2725 392495 611940 548476 98090 -5753 940177 281101 720017 304138 399345 -474213
2715 -474213 644523 520891 438935 1369360 -443193 100167 69430 837837 386149 631499
2705 631499 1245570 756712 866494 600870 223351 1217171 1039270 663266 973893 437760
2695 437760 298676 306278 1145462 -203756 296408 540465 3532 1168987 1141638 760600
2685 760600 427855 910635 714139 37287 75947 633912 559244 790459 343572 1050146
2675 1050146 779174 904362 54012 401858 218243 673532 440961 690712 362122 1101040
2665 1101040 630658 -30196 489489 295275 726313 778647 28073 389980 842767 1220139
2655 1220139 685141 446444 896458 164677 641933 139361 221814 351437 875793 447185
2645 447185 1108044 583799 1307960 -256118 301812 1103073 505368 1104165 628172 330012
2635 330012 939582 383794 -282826 -27466 828461 -272582 796067 806407 673242 416997
2625 416997 592295 280314 375849 181783 918769 32950 920844 947037 599435 939776
2615 939776 439152 919763 -349448 1051369 242646 220554 381514 205143 1228807
2606 1228807 1241827 435795 757237 616263 277847 412745 124148 72514 573142 1020622
2596 1020622 766508 364604 59622 381364 693097 -62559 1040678 75141 141369 75266
2586 75266 798879 876597 239917 720036 43150 712385 489014 522900 101395 266362
2576 266362 495060 -4017 592027 834055 20611 962384 310138 660752 1379563 838565
2566 838565 237491 -32018 478516 474855 606352 562384 828385 1080371 1360419 549244
2556 549244 670484 -69552 7989 285428 419069 933173 697666 322824 903534 564372
2546 564372 877694 1034375 1179732 701576 606656 -136763 581149 351009 979388 200849
2536 200849 282128 674058 613429 866026 1046022 373075 -61729 183738 240958 127957
2526 127957 554351 1071748 619170 -116662 1315737 709768 -54137 216920 1012377 139683
2516 139683 1009390 549359 1362488 117172 792902 429150 1039206 367599 804395 641609
2506 641609 885148 687141 1384067 465135 139744 127990 512305 171067 848615 291763
2496 291763 348409 256759 621948 321146 -189860 -416229 579956 687046 91014 1090339
2486 1090339 757516 1081757 810964 334093 -103226 427529 352308 137963 211040 171436
2476 171436 870906 -267528 120599 930504 98973 133095 704653 510550 1180849 355577
2466 355577 653562 809781 1244348 1522144 267575 322166 -837759 408204 542296
2457 542296 473082 900205 592505 -173449 90120 560403 1503685 302734 794254 -132187
2447 -132187 360439 580182 972575 1702637 1053656 718076 138706 912510 292427 1329953
2437 1329953 339820 197052 710910 572107 379207 160725 581237 500549 762373 -949382
2427 -949382 830418 1263652 659124 929133 361329 105951 175004 668312 582413 1004054
2417 1004054 581183 601930 890659 346441 550496 387534 830303 313552 1018313 566147
2407 566147 930533 575929 882777 1035643 620220 1209985 482324 1058067 7952 538722
2397 538722 13946 513889 159303 623376 919857 830709 920592 1317101 600613 863742
2387 863742 853230 222633 390716 663912 564297 387545 506100 674149 98964 303352
2377 303352 347337 179073 370575 451193 778374 551569 609776 527092 761606 20568
2367 20568 717009 -233165 953247 579244 89303 446649 677789 383275 902461 554716
2357 554716 576837 1139194 530181 1074959 223934 177694 653915 -47301 76282 -10928
2347 -10928 -305678 656370 197638 69170 202544 432300 972943 994942 592317 1121689
2337 1121689 1088447 -89097 862543 562703 645543 413761 709499 237288 552442 472678
2327 472678 614727 1332666 151254 670597 -108430 320857 790385 52458 324344 542176
2317 542176 843978 -46126 467636 214993 374088 508600 -39358 934285 406727 -294641
2307 -294641 -75723 734607 885331 1664877 635329 758476 656235 329866 1331239
2298 1331239 2440 247121 181505 771697 884722 411704 775146 -48813 688335 416338
2288 416338 669796 584082 1198937 732230 271007 745326 772779 -7900 923928 981550
2278 981550 447034 -253503 600817 835853 404090 1049568 72916 -1449 582983 840915
2268 840915 874000 619155 385325 863157 489645 265175 385220 648366 4481 463915
2258 463915 717402 382207 -279614 -276697 242820 -252966 54135 268068 298195 1177324
2248 1177324 893974 746232 897547 -659889 787310 837140 1105808 320487 219528
2239 219528 537859 1378796 623006 389614 247032 80483 1197938 851360 1343148 1236564
2229 1236564 1160793 857845 886264 836102 823819 824584 -196251 -154491 467911 -61197 511573
2218 511573 8891 538274 470997 800727 -19371 -275750 804837 86397 -58174 -36688
2208 -36688 355713 686536 361676 336039 753400 -338928 815743 659928 260305 363300
2198 363300 82668 1693942 535584 450968 552417 559101 1188459 611118 368373 734902
2188 734902 518537 280135 338041 173571 601551 982250 369558 1313078 512227 355818
2178 355818 549930 1068261 314011 477549 1061017 476912 50043 876503 351809 695264
2168 695264 260999 367429 8495 748728 925135 863273 303918 1098094 1072122 614434
2158 614434 1463365 -121147 686218 1380013 464501 634056 948995 394195 317882 392520
2148 392520 643665 763935 93254 610538 442065 278234 463979 952766 48838 633279
2138 633279 620860 413189 896494 241494 128018 -98422 784286 825275 504088 953289
2128 953289 -434471 797218 245616 630454 189661 794473 559908 489055 472315 482320
2118 482320 5183 801735 1147368 137492 190414 230030 273345 1096298 -479555 80088
2108 80088 420856 656718 973803 113649 959908 640877 834019 -364502 223505 792248
2098 792248 478340 87323 42609 538201 254381 526345 469192 836321 907592 -119285
2088 -119285 -326344 79347 492028 347576 660607 329069 -454599 483142 6367 712085
2078 712085 609371 526076 290205 285810 145990 1234239 288693 773912 151180 -337754
2068 -337754 1621861 920655 538713 452210 631535 508351 839759 1005454 729402 551598
2058 551598 387499 423415 761096 279699 708790 19923 318687 691149 545771 741693
2048 741693 751467 -57345 1352188 514867 242891 321142 617470 -88603 1296601 597860
2038 597860 182065 352945 329912 135772 625716 1394454 -118461 -159091 -137880 703613
2028 703613 396594 351687 396256 -116384 433170 1006431 707474 681931 212317 1286370
2018 1286370 518777 224090 809640 786023 727829 551239 1053146 669115 233024 1124721
2008 1124721 931349 842437 216983 529065 384242 327411 175459 437440 -223389 393098
1998 393098 56512 -205785 704555 1036587 516815 1233404 625908 1322501 664835 454679
1988 454679 327224 579642 1021994 212681 962581 325465 148770 -470304 238295 82193
1978 82193 1151161 198446 224291 818348 716087 605066 299587 965791 638329 741120
1968 741120 640339 803418 537283 443453 623951 1056318 557474 265511 1166579 392696
1958 392696 575195 725453 368530 53007 -277798 400288 882646 92945 518293 147300
1948 147300 -468695 652468 83186 478418 911419 305328 928649 716145 353687 554927
1938 554927 593544 1117843 963996 971245 -217867 317480 921737 734954 1347770 -123731
1928 -123731 456318 164877 409960 105596 762955 607057 587478 517953 1045163 617132
1918 617132 112059 441875 -143437 510022 -105185 931023 956709 610883 -655087 -264622
1908 -264622 553834 407994 737983 -219111 -415287 287734 150757 614281 93786 585494
1898 585494 312664 655606 421895 953931 67723 743918 413621 29102 533434 691656
1888 691656 544716 -458436 779062 828629 669544 412316 309937 32602 417134 821658
1878 821658 -55333 144948 165421 561886 588375 230681 822729 672044 625056 665125
1868 665125 986334 648045 494083 919781 543642 465194 839299 522617 -88381 224007
1858 224007 1069424 503379 630657 644276 997104 569678 -90043 817129 486967 -43724
1848 -43724 476827 1460464 967061 769970 1179910 462012 -78985 552166 696738 216962
1838 216962 458666 202089 706998 -85252 130862 259652 663560 7519 616253 696104
1828 696104 829920 665162 524048 625051 17132 788331 -188056 932512 153050 899235
1818 899235 796081 465302 426220 1403006 877696 587376 168381 633196 1628795 661560
1808 661560 665077 315573 1108983 442945 740484 576011 766291 109674 222346 787624
1798 787624 -85354 -180011 770564 861581 263967 1080148 970418 1397153 789003 26622
1788 26622 509282 214344 954327 196752 580200 423688 -57017 48347 280297 -256790
1778 -256790 108390 120194 218073 1289507 887977 634569 906114 497259 732087 589165
1768 589165 677866 1260875 876244 490751 629613 -97501 792854 -168163 69266 608052
1758 608052 510432 1131061 233454 744278 251017 228064 877134 357886 302955 308135 535929
1747 535929 909041 836129 216484 1387043 559464 545092 684676 280570 652651 215935
1737 215935 740390 228221 549685 -163409 283538 1527971 580198 44234 419107 -272885
1727 -272885 395442 815887 784633 263847 545149 391384 -338679 -233444 603820 286095
1717 286095 47319 160952 925609 492956 748944 252408 220612 179559 -278971 935173
1707 935173 489251 557902 683573 70387 1112631 305329 351899 668856 232266 -400819
1697 -400819 1018937 685837 -18661 504638 68132 -82122 345802 1535794 726959
1688 726959 857522 787936 654397 553435 909401 510017 -268541 932390 308319 422042
1678 422042 551698 1034848 293933 613537 -162751 -441403 874641 1012947 1065584 271869
1668 271869 204237 258230 749384 653726 851954 731617 1114204 -35307 72526 409232
1658 409232 390676 -755 731913 244870 464519 304904 304437 453547 318666 296974 552218
1647 552218 299665 244674 233948 -340974 1099143 617548 547697 632678 842985 359434
1637 359434 634 446738 1211396 677450 -72168 506539 -154526 1266375 1070867 211816
1627 211816 1053118 139996 670927 -43992 -164500 642042 598169 284915 528010 142798
1617 142798 1168714 237057 43120 510720 99877 437018 411213 782543 832834 1471585
1607 1471585 580935 646600 661706 320423 706013 55445 17592 644414 278515 -372496
1597 -372496 246239 839551 1040345 660913 951563 379217 936856 157358 423416 300590
1587 300590 988867 1070734 -209151 492923 1019896 133437 1681624 26608 533936
1578 533936 -68042 17796 340928 617897 562546 190026 -32640 476682 27169 664263
1568 664263 919946 802069 1234667 723474 952222 771117 573790 533586 392355 -225870
1558 -225870 924593 340366 539913 510048 352486 -35995 341921 -210476 904558 385731
1548 385731 610785 592309 665097 468997 383362 228186 554314 475275 112492 -104723
1538 -104723 809842 666134 745673 152355 394680 347880 948655 1269931 763290 1041568
1528 1041568 -55469 1261416 902330 1186461 -34198 302890 1165993 401752 757638
1519 757638 -145997 1465935 500994 1240555 472910 286065 710494 243105 744926 -172059
1509 -172059 380536 1330946 906990 385108 795869 718674 267207 599795 960106 376619
1499 376619 74433 -166427 -168835 326269 276005 410009 368121 459967 213015 54357 573450
1488 573450 411046 810402 1307618 220960 1111056 204541 364467 819776 512931 470316
1478 470316 1234176 954156 625956 482982 744022 1169702 177417 597558 520651 813135
1468 813135 500643 -330588 497815 341236 -214569 -211510 390013 1056411 455896 658659
1458 658659 1325719 -82679 469097 400789 581578 558653 333091 523086 295718 992131
1448 992131 404096 323954 479120 753737 612093 604061 312296 451060 -417696 1065247
1438 1065247 993922 612131 279537 360840 1216099 578578 -24795 -83292 757409 322109
1428 322109 487355 419372 1122104 -137016 -90536 952611 305277 110968 402908 1074164
1418 1074164 666100 1389085 869524 628327 1255437 992678 1152208 378152 -111754 714245
1408 714245 202443 463792 282720 863006 960970 873626 305373 466891 728774 740713
1398 740713 454923 1027412 828201 704670 -22145 521762 -150948 490977 -185 743998
1388 743998 -314953 303421 464304 -12531 908847 1058369 -175033 394270 878778
1379 878778 1461694 330481 577412 730716 949670 627613 463000 544284 783700 408022
1369 408022 384659 548180 817172 917762 184361 276090 236747 782496 652789 200527
1359 200527 777361 504075 1071186 843905 768468 753678 -327308 651732 597974 931606
1349 931606 538624 747859 1021590 950599 950730 269214 318891 928947 14207 -70571 30689
1338 30689 982216 604423 302956 41337 -374390 278792 707847 412097 427069 584704
1328 584704 22601 944194 204292 -511749 390493 524497 316382 852486 394999 525403
1318 525403 804497 786812 668136 -176671 577992 751285 316422 647871 -544574 178990
1308 178990 434370 560290 517602 571067 383773 812642 799354 1035100 1512075 684493
1298 684493 646198 -205870 947579 320177 1049894 960484 952539 85992 627312 18880
1288 18880 146335 385650 -164128 238836 -457259 717553 276136 657838 647204 510234
1278 510234 505179 1190593 840563 881109 470607 307444 1066574 869551 478145 931899
1268 931899 560388 356838 528220 1009030 -134248 192520 1016322 828874 -5652 -306708
1258 -306708 345406 110977 497381 689961 585705 -210307 564248 510616 939656 -135780
1248 -135780 882788 738990 427855 723427 779772 872178 -571899 158741 942752 807270
1238 807270 -636027 829087 605388 709142 141227 9637 507149 732078 334064
1229 334064 221351 901339 105975 -227725 354061 -210475 895103 255918 612686 397835
1219 397835 537727 187690 222256 -466882 627742 663801 1334911 346391 874087 484347
1209 484347 856229 -65390 330270 430146 197843 1240928 684451 508610 578579 -290822
1199 -290822 271948 718358 709953 1339221 566362 618035 1076455 247916 747936 421367
1189 421367 810629 211005 967700 -39100 364006 400835 559720 930224 440775 464580
1179 464580 310852 -108631 338025 342613 622470 78174 539688 592237 204596 710059
1169 710059 198694 476918 610904 1046373 486138 157919 391740 362504 986159 400583
1159 400583 501436 -167330 943725 820404 -93592 1053858 712478 675213 1064475 799459
1149 799459 723147 963622 744429 597093 399564 517675 1283133 426723 788643 755354
1139 755354 367399 -413836 686376 -173932 169354 951867 297423 837153 47953 672146
1129 672146 1112022 521008 811358 147265 231538 556558 -439499 62603 452957 105355
1119 105355 1118028 405705 669761 505542 651 269046 709770 672401 592421 630964
1109 630964 92508 379950 373287 827256 490585 416662 599239 916254 428620 1422808
1099 1422808 -461134 847215 418688 378207 960158 741411 -315463 229132 892908
1090 892908 101247 1040323 1102325 734334 241946 1066717 256386 -355253 717740 574051
1080 574051 38380 37901 883226 994969 547719 1006385 1087877 -200928 138046 618038
1070 618038 1111930 151533 787760 197467 20703 1045997 190707 331672 848165 -107806
1060 -107806 404276 -44029 512153 665808 -26632 317280 166902 683905 215823 102977
1050 102977 517390 534458 1102085 469729 1095259 -23599 765340 185455 207416 681036
1040 681036 2318 1174584 507068 467269 1131982 -64702 581690 338048 379386 832630
1030 832630 357577 -126942 99736 265803 288795 -504819 169156 452897 122817 759101
1020 759101 1016488 658375 114691 637785 -43617 482996 770166 355679 73880 244047
1010 244047 1062755 198357 637203 22422 137939 363709 127481 342019 567587 -165826
1000 -165826 9885 -465968 841189 991055 374095 321957 332249 275981 1074004 133045
990 133045 1242705 436236 201160 756614 687568 730234 735932 734693 -298007 574003 751669
979 751669 284466 737264 477933 450720 345854 538072 -153827 1088745 992707 836942
969 836942 125926 981577 430806 399994 538640 700526 -796012 868293 252422 391433
959 391433 549133 -259253 858035 52292 375996 638751 464036 612525 827755 959177
949 959177 -555640 481020 343947 962045 787750 313142 630745 680400 -14572 772528
939 772528 852599 355258 -15010 475485 -322499 -223801 401904 779589 -68114 710656
929 710656 295966 43084 849529 1006943 761170 953908 654112 129027 889207 39910
919 39910 510126 95868 790765 85433 498853 34452 480155 1076170 695356 246228
909 246228 1138730 880256 620639 -337849 619161 451463 675959 1134246 209144 741682
899 741682 389451 659653 -110985 107083 1130244 230295 -725320 143032 529754 298568
889 298568 -89956 533047 964516 246206 -39457 625075 252627 622804 804986 731698
879 731698 -42066 652556 677446 742415 46967 133245 49219 1205851 -428367 897156
869 897156 73006 203754 953607 766808 -28522 968103 260321 888673 1230028 417854
859 417854 16202 347474 467993 334783 723318 12840 350883 163519 872921 96675
849 96675 -12575 663535 -353517 -1787 317944 325222 300791 275442 879286 460456 675376
838 675376 1037799 789253 462076 387679 298046 402068 367893 1511068 312879 447549
828 447549 283182 660175 421275 234408 696718 259674 1291051 815496 378125 1217474
818 1217474 420459 749602 1252364 379419 960065 260213 -36562 1040438 704506 -100870
808 -100870 873898 398916 -50515 778063 163158 696599 -352412 457965 259381 -277240
798 -277240 -286595 10477 608718 1017318 451690 -20131 348947 681892 607263 341965
788 341965 769229 334333 -61582 -73894 458410 554024 -442677 918578 538792 644788
778 644788 575571 97081 -90661 362795 883666 470340 548883 477736 1046561 455147
768 455147 301185 428007 587598 -64902 959721 624912 581659 123484 519945 979213
758 979213 -197747 672839 480618 866297 322892 338206 -73283 515249 607068 228278
748 228278 -599591 38484 -202007 -201557 1269597 920977 153142 181772 229899 198624 365219
737 365219 -37023 347251 442593 -89091 106177 22403 133556 119442 292274 354803 391805
726 391805 375256 852036 1232594 24032 1085452 854246 800537 815136 160379 634398
716 634398 240603 714008 433358 115302 156244 441928 407740 562287 -110585 885741
706 885741 932641 -41683 514744 81251 129637 1252126 608368 3517 692899 692238 263813
695 263813 720658 15539 -203655 712313 599029 250551 841222 -336501 1088648 155305
685 155305 165883 477956 146902 670573 470649 -12359 102366 -169716 286783 139054
675 139054 338375 1149737 710028 155121 387769 180011 270752 531488 205392 364525
665 364525 894049 14832 831956 898598 210716 357372 585140 571201 -56441 93330
655 93330 -21672 -113296 -378887 66679 555031 265779 320499 165319 991421 649220
645 649220 -40286 559602 -93610 1056891 619420 333852 605756 108424 52873 423305
635 423305 46057 302257 -309326 1131124 219265 496698 594050 -224504 332892 199110
625 199110 494086 329680 -231822 809026 731427 70506 910400 412960 737664 193233
615 193233 364090 -45572 -173673 229148 962908 945926 526834 570438 1492668 614426
605 614426 -3144 1071889 715600 239166 -190535 804285 421458 779738 1248722 769499
595 769499 858164 52259 78363 557900 307870 61266 248813 808666 548233 106943
585 106943 232919 12258 36664 520409 408474 583343 26513 635167 1575194 669392
575 669392 581990 303253 265388 1321428 387655 86878 446192 -204289 468131 674832
565 674832 54086 363169 210399 476651 805743 189711 225481 794046 210255 -138236
555 -138236 -57485 -77957 562519 -403847 829810 485264 867214 739263 667059 431650
545 431650 611477 382853 467688 716577 -83150 -404631 1003041 1152817 414854 56387
535 56387 334895 503737 1080180 836616 527703 247099 -74034 166495 -154248 501868
525 501868 1007047 95252 496788 398959 -474113 261090 285226 498611 409285 494916 621436
514 621436 411652 420822 -425421 687046 560245 478309 -45500 419585 340914 443764
504 443764 381662 1216125 587674 41888 340255 1033185 1191503 630312 818657 891422
494 891422 842864 183173 -338882 845881 50567 1147859 396108 1030365 -177676 747344
484 747344 508921 636144 509492 215404 684976 118510 844356 -263824 500839 567161
474 567161 555719 217401 478030 -193128 15147 109210 650148 364791 705587 440111
464 440111 585962 475449 370526 475857 310520 205599 147436 993662 968225 867479
454 867479 630724 950212 469845 425919 300720 348494 653866 912251 1296540 521363
444 521363 942722 915193 598657 345816 199455 990182 808020 454352 55730 459032
434 459032 572594 362826 779379 459057 -101829 289815 -123439 981894 429542 177775
424 177775 44825 663694 543954 1343714 1096375 712692 391973 699482 307050 392292
414 392292 912531 544659 545001 334494 314924 752749 -63452 33738 362528 -91252 938013
403 938013 202267 184680 552801 631270 378995 812621 573489 197727 -186718 -455157
393 -455157 145484 312480 697563 775389 943332 437863 465874 548096 464974 804569 1141838
382 1141838 81545 11961 256001 231990 -30613 497746 168650 1124662 755296 438495
372 438495 343344 420179 567160 305281 659321 582798 596780 -73083 -103881 863470 770346
361 770346 1238827 744798 703836 333422 185258 -262036 399936 136308 -498796 281684
351 281684 57277 677103 850924 981007 581085 -101532 104608 154646 421575 1379195
341 1379195 64370 106648 1013383 1004833 138116 -162918 119356 -310910 -327936 744439
331 744439 318849 397737 910463 974639 595288 823152 796870 101288 1234601 -348609
321 -348609 1166023 1122236 -180544 737712 307693 709269 942125 611000 241165 179908
311 179908 -379382 96708 -144627 358067 412028 567078 -35810 674054 537146 524407
301 524407 736689 597766 -198598 630725 -64693 -68360 670775 1007744 493026 278290
291 278290 937050 571671 479885 408102 1032290 552571 511794 839064 66556 -240907
281 -240907 432420 690031 196072 802934 701405 298327 424864 556585 295753 889276
271 889276 288210 351080 -6117 302912 484707 924919 268362 -92312 536224 945841
261 945841 638888 543056 812456 892834 243692 539586 397510 1287183 723534 119443
251 119443 706025 -166715 452052 542730 236122 147385 796104 76942 -58872 -198133
241 -198133 996039 571094 895816 -209920 1244242 645588 899931 613623 580188 40189
231 40189 774591 854661 64571 -177011 231783 -238994 881573 547658 616174 1183491
221 1183491 346113 308678 46586 797350 -151787 303661 -166389 680736 134621 747779
211 747779 262871 260252 -132673 817946 78568 917889 711368 1350403 -371992 980873
201 980873 414983 325069 462747 -308511 379335 204821 466252 224423 913459 498772
191 498772 345106 -38353 653620 465960 -303115 -23445 114445 1218065 333303 292928
181 292928 -22940 219588 661523 828391 191682 484932 -243414 204743 137915 564895
171 564895 730833 168175 855611 1089021 304248 471763 452031 589636 252479 363703
161 363703 111960 -85855 -263540 472818 519495 701000 245186 628419 714462 812704
151 812704 971679 101676 -142916 599918 742650 102739 766330 742013 -31941 872247
141 872247 225293 83838 456749 172709 1068148 669883 415138 138261 422922 -278289
131 -278289 1439096 511342 263442 613371 -60965 519120 463106 348209 885762 178925
121 178925 247341 199973 -59157 270608 497198 248925 474936 257540 557189 591186
111 591186 203268 703048 639805 385908 354384 494564 947542 506818 687637 -349611
101 -349611 14137 -132671 595275 239393 539377 515193 638438 202912 448608 606126
91 606126 329053 629570 376143 54448 436952 180251 597981 -200692 395681 807976
81 807976 504815 1181389 -259378 -93598 89073 752984 -137020 665019 185708 567854
71 567854 -132795 531478 375168 5971 428824 168664 503156 389541 -131816 162339
61 162339 255661 297307 106589 688413 912981 728975 306426 254406 848972 516052 693149
50 693149 -177382 894493 657578 268856 456709 890477 975303 188852 870441 455652
40 455652 445391 846946 143446 106010 681032 305069 434745 233484 45074 333667
30 333667 70223 452918 233204 873551 103586 39754 1068915 461742 278536 621243
20 621243 404560 630161 95410 471826 397494 644889 337674 221380 -80507 722592
10 722592 312510 147963 327370 246231 415094 1060764 339485 154182 654517 1077190
0 1077190
$$ Imaginary data points
##PAGE= N=2
##DATA TABLE= (X++(I..I)), XYDATA
16383 -141203 -235003 -29443 -402867 -615117 -152409 249885 -372411 -362095 378807 -702340
16373 -702340 166435 -178647 -514001 78574 -16978 209420 -437925 231168 -352663 227456
16363 227456 -366628 160119 -27924 365881 -116994 392382 54865 578224 25796 -3760
16353 -3760 290056 81748 321528 140181 321701 336339 -34276 278610 465228 305199
16343 305199 192470 254782 752724 -234273 360961 554524 -116265 472877 301484 65454
16333 65454 406634 520903 618840 300267 159833 -225390 762774 226895 -61243 250761
16323 250761 703865 519743 767695 386106 -206455 794605 267181 490296 750566
16314 750566 276404 127049 541719 711042 601432 608269 545189 -83036 260779 621501
16304 621501 796387 547562 936823 1177244 428101 1040946 683692 714576 1051211 647336
16294 647336 385364 460076 628461 241640 658859 738233 384298 1158923 107625 565464
16284 565464 354983 556671 1157073 -49224 973396 648975 689494 893358 742927
16275 742927 86786 947129 1051531 1604670 963848 883803 310151 762289 464511 772997
16265 772997 386647 1140912 912942 168106 877580 449685 1046087 669915 672558 490337
16255 490337 784896 499148 70034 1298465 783374 1071239 911430 896801 1290052 246609
16245 246609 470665 662010 551605 634669 1092728 974083 1061765 339362 1466925 1106766
16235 1106766 871174 700921 1227704 848498 726899 635772 469342 820912 785691 1125129
16225 1125129 1105154 1012625 1601356 1024383 902733 1265841 1541258 1670690 1329108 1019541
16215 1019541 1425315 1038435 1036171 1228168 775637 742799 1148770 1355034 1366275 1019459
16205 1019459 652442 896890 610435 733004 495345 865924 675024 899818 1230298
16196 1230298 703407 75005 1041065 1281825 1339084 990930 556051 1107045 1148388 1244627
16186 1244627 1191608 927289 782315 1936885 1214477 1540179 943317 1152963 1043109
16177 1043109 943228 1419160 1158389 1212444 1027459 174854 1436190 724202 1282839 1224649
16167 1224649 1569045 1686589 1507738 637749 703655 844423 1018818 824831 935995 1390853
16157 1390853 1047934 594740 1716446 1062706 929208 469990 932720 663606 1590965
16148 1590965 1096713 1645667 1195831 1382139 971346 602015 1182386 415458 1227164
16139 1227164 952404 935108 1127911 967485 1286688 1240701 655666 1084683 1025405 823391
16129 823391 974729 1163450 1226930 781033 993998 629482 940556 1447955 1266057 256585
16119 256585 1538315 1533208 648020 1443318 1289288 1466133 1064840 859672 1019800 678470
16109 678470 1662433 1230636 1578812 557270 1751122 1362319 1523773 1415192 1108584
16100 1108584 889924 749512 1206113 1818557 982750 1665427 1496722 1278104 696638
16091 696638 1652968 799421 1029359 1494138 940972 604687 1545584 986478 878041 1400897
16081 1400897 1832439 1217767 1323106 1438567 1600417 1949898 801806 1127710 1134055 1180329
16071 1180329 621163 554969 559183 1635484 1064563 1120170 1253764 957522 1207004 1462885
16061 1462885 1397022 1297946 1011480 1733154 1502954 1020990 2277997 1544143 1349707 1051764
16051 1051764 1922626 525851 1096045 1332522 932769 1586625 1041106 933953 995094
16042 995094 590043 1549299 385645 1281385 563448 1446167 1350711 1078922 1035960 1228999
16032 1228999 1492741 970821 1719535 791494 1003150 943829 1109062 1722183 966052 1503045
16022 1503045 1284423 1589456 716857 1526203 1140255 1398561 1790747 1198184 750822
16013 750822 1307796 1400612 968665 2111640 818544 984627 1096120 1603672 1809088
16004 1809088 1759487 1608559 1307141 620566 1174263 1402311 884292 904262 1043872 416785
15994 416785 1702399 1655138 1639112 1625014 578872 650366 930999 1563737 973293 228168
15984 228168 1017859 1656085 1217580 1807180 748249 1213468 509977 1318233 2417944
15975 2417944 1010900 1193504 1888726 1103261 1235497 1114123 637886 1804304 1498198
15966 1498198 1630106 1403288 644141 977847 1327994 1146785 1450049 1262611 923405
15957 923405 685992 822251 1242544 1072013 1345730 961450 1837458 1612159 906141 1392149
15947 1392149 1015650 406528 926703 1366107 1118707 1347059 809881 322141 988699
15938 988699 1132076 848486 1202019 1130900 1209245 1026296 1983655 931103 1390837 1295997
15928 1295997 1327341 791951 574353 1029406 1025690 1380487 641078 1162832 862315 1014331
15918 1014331 2236540 1830177 1205177 736930 1521903 1026993 2012170 1686411 71793
15909 71793 1347458 1089435 1134138 1184418 954703 1314345 1044880 1361675 1667589 558445
15899 558445 1458928 1550105 1501626 870228 1215212 1217678 990687 1024472 1566086 1721172
15889 1721172 837255 1618483 1080997 1029376 861433 906065 1766152 1687383 1497250 712425
15879 712425 1437197 904263 1296648 1151462 946582 1219771 1127519 1501695 1392441 2146411
15869 2146411 1632123 1246543 1103943 1408793 1438571 515110 1314982 497264 854704 1731855
15859 1731855 1538189 1414923 812478 508530 299905 1073162 1294147 1766566 938068
15850 938068 1315592 1473747 1319685 1348284 1154547 1757295 845007 941240 1630595 940508
15840 940508 1818555 1884787 1234150 836265 983254 1728082 1608085 1044529 1521874 838907
15830 838907 1954076 1254077 2239081 1142373 1414140 1386173 1801469 1325791 1320168 2180092
15820 2180092 1350036 712428 580228 1151519 1749623 1253499 1449659 1501578 1903043 1400978
15810 1400978 758763 1228758 1130287 1085399 650449 1708869 913516 1056872 1230821 1505148
15800 1505148 1436278 1360488 1888460 1236232 1357754 1152108 1450290 1608204 979031 1355556
15790 1355556 1306875 1645872 653460 918417 1459299 1067284 1784711 1365603 1493622 1931449
15780 1931449 1092122 1785039 1266940 1143330 1443148 1417733 951674 1677305 1174058 1263983
15770 1263983 1603921 1921201 1307253 1485772 369985 580544 2043093 1378874 1458299
15761 1458299 1835235 1052619 861078 1239292 1483562 1372587 774911 807513 1377184 1246439
15751 1246439 1218476 418188 799694 1302131 1688374 1124030 1041902 903270 916597 891787
15741 891787 638867 852014 1154727 1156054 950977 1525834 994741 1326768 1568785 1693161
15731 1693161 1034721 1446897 1837647 334542 1140093 1051324 1838662 1180500 1225952 754947
15721 754947 1559887 1529456 1524045 1076840 1022754 1214034 1445631 715502 1023457 1775246
15711 1775246 1216182 571939 674906 820888 448025 1029593 1067330 893036 1306445 1623294
15701 1623294 1404965 1380055 1010993 1611852 1622449 746427 1850679 780629 1114203
15692 1114203 1382309 1362349 1676704 1510245 1521528 780482 1099231 1124996 832439 861926
15682 861926 1441987 830879 1856234 1485503 893400 1409488 538793 2095363 1006547
15673 1006547 410662 1231109 845495 1859449 1152826 1254426 991525 1084094 982208
15664 982208 1614068 1022566 710803 1499394 1317549 1471948 1424844 1035763 992024 1446848
15654 1446848 1665807 888407 972827 1647675 1797180 784689 2230706 1429455 1453370
15645 1453370 1979464 1320728 1037267 1221480 1145804 843371 1268185 984641 738568 1415872
15635 1415872 693182 1705533 1617184 1219215 1208594 1298664 1553153 883770 1102243 1141991
15625 1141991 1362212 1456632 1171849 654327 1271738 1364795 387678 627391 1526096 1942163
15615 1942163 810335 1558877 1984725 1438085 544287 968865 1206345 1196909 1207862 930126
15605 930126 1586335 1137076 808741 1495403 1102863 1473776 1244882 1122091 1020420 513492
15595 513492 1121817 1747860 1245525 1732121 725442 1769002 680688 1767600 1587163
15586 1587163 1320771 1454527 787751 1096299 794375 1281498 2089531 858205 1655447
15577 1655447 1116990 932357 857958 1080177 1408088 1267825 892842 329524 1890803
15568 1890803 844120 1068942 1132818 929440 1447391 1881877 1995047 1002872 1594377
15559 1594377 1700569 961172 1223608 1137578 2051156 1413719 628869 1379365 1380255 1678691
15549 1678691 987452 1073290 1434737 1382410 1118289 1172072 1061387 1585253 987189 1335520
15539 1335520 753098 1034927 1424788 1372532 1004661 1404997 1325290 670316 1420872 1714006
15529 1714006 874903 1712373 811444 1365811 1917066 1279645 1172919 1184937 1641401 1508112
15519 1508112 791636 1230949 1641407 1785622 929512 1535075 1132832 582725 1093560
15510 1093560 1226276 699809 1172561 1256750 1236368 984485 1116138 1233542 1085786 1216597
15500 1216597 1191820 1382208 1040894 1053660 2301892 742787 1540941 1116995 1190717 1411169
15490 1411169 1657988 635953 1054045 1934084 1893860 1585313 1255336 1101791 1492471
15481 1492471 498267 1649008 795851 1274462 1399667 968135 1351675 1758001 1033552
15472 1033552 1832544 1524557 1544966 1382998 1795993 1129719 995857 1413099 1134808 677728
15462 677728 1605066 1406516 1110448 1644292 2292650 1483215 1254006 1734731 1900698 1153033
15452 1153033 1806561 1592341 1054120 698187 2321860 768307 1428473 1827583 2006397
15443 2006397 851716 1309073 1812226 1068835 1125547 1354934 1533156 795779 934620
15434 934620 1732215 806221 2051751 1357120 635208 1640395 1467598 1395480 1172816
15425 1172816 1006503 1476378 1949689 506444 1265289 907424 1746879 1078565 1018228
15416 1018228 1439884 1881868 1629221 845011 1479706 1780533 2226846 1108722 1084568
15407 1084568 1649171 1122779 1337971 1857576 746375 1057835 1028140 1274865 575446
15398 575446 1099231 787235 912383 1432174 1199430 1431928 1025515 1358960 1623500 1713167
15388 1713167 1603148 1258250 1339971 1187367 1572342 1191301 1608611 2046711 894343
15379 894343 1045018 1554941 1673039 1871568 829791 1519120 967227 1920923 1540478
15370 1540478 1854692 1582960 1632363 1482417 1132346 763349 1245859 1385975 1729771 1669093
15360 1669093 1622812 1246515 1437450 1328621 1252469 1130972 1271840 1225909 1992955 1319379
15350 1319379 1225612 1745566 2317470 1542280 1491997 2390798 644227 1371236 1399393 1492226
15340 1492226 741896 1803120 934673 1175041 689193 1515447 1154954 1472193 775942
15331 775942 2091485 580498 745784 1382163 1911929 1471108 1716681 1129353 2133009
15322 2133009 1774127 707254 1220946 1227588 1196245 1450901 1318062 2384397 2330555 1150956
15312 1150956 866707 990721 1834837 1327933 1688766 1348964 1833329 1690052 1637347 1367840
15302 1367840 1803719 1676989 1312397 1491760 1343119 1672215 1563978 1846807 1628027
15293 1628027 1556545 1542233 1007337 1198587 1504616 1425821 1520774 1158997 527210 1306072
15283 1306072 1407603 1305753 1043863 1544060 419412 665243 430875 1706367 1662656
15274 1662656 1388713 1714874 1936275 816750 1656691 1262807 1506025 1306466 792240
15265 792240 1342759 1332229 1541487 1219919 2457204 970070 1432501 1520264 1589664 990955
15255 990955 1934719 505350 943124 1482320 1314407 791557 1134601 1347730 352194
15246 352194 1002713 1412192 2070079 1618128 2005480 1917934 1094669 1564129 2206437 2265737
15236 2265737 1194757 1239169 1160339 1628393 847040 1661713 1120803 2249456 713093
15227 713093 1673969 103346 1731747 1755124 2074153 1279750 1727783 957083 1050825 1163209
15217 1163209 1896299 1634405 1060007 1388513 1718303 1670508 704385 1010905 1269399 1369190
15207 1369190 1905043 1346722 1356417 1366119 743377 2167119 1039382 1657155 1374831 740244
15197 740244 1651465 1175699 1836089 2258286 1762022 1387984 1205483 1939519 1735799 995389
15187 995389 527111 986172 835164 1381524 531364 877364 1636020 1230585 1912997 1212527
15177 1212527 1175935 1309809 1851647 1654556 1243889 1298321 1287933 1550286 908559 1172642
15167 1172642 1086327 1695050 1895992 1777184 1219602 1471245 598956 774860 1976736
15158 1976736 1481290 1405911 1127700 961309 1345905 2344795 1142219 1157617 1491330 773695
15148 773695 1637727 2156585 1103383 1816490 1148098 1223551 1339913 550695 1076213 1234294
15138 1234294 1348220 1350812 1579260 1258715 754290 1635218 1462796 1749605 690566 1224071
15128 1224071 1100510 540371 1028258 1158601 1865954 1546897 1269565 1541943 1630337 1525754
15118 1525754 1758869 1055007 1186088 1398410 1312305 2139670 1049681 1061661 1630611 1583660
15108 1583660 1637161 1315181 1051798 1255112 1707719 1121376 1014049 1661076 1585404 1220278
15098 1220278 1388945 708565 1323782 1844206 1346465 376033 1364195 944991 1218554
15089 1218554 1285617 1389869 1009308 1726102 748864 1375799 1064549 685367 539153 1287436
15079 1287436 1521352 1853585 2048002 1032151 1066429 1482586 739875 640338 1149299 1772295
15069 1772295 39865 582016 878786 1541891 1487866 1222202 1255108 1158246 1485102 1467089
15059 1467089 1461713 1098524 561642 597980 350394 2135269 1716309 902604 1182862 1951826
15049 1951826 1480820 677196 822229 698631 1737517 2084572 1085525 1941399 1251553
15040 1251553 1536982 1180195 1311896 1089807 932834 842612 283242 1099257 1472800 1282475
15030 1282475 1321005 1385344 828655 463045 758843 1432028 1486206 1269357 401406 2069149
15020 2069149 1900802 1752824 1574859 739814 1410199 1212700 804951 1444125 1342153
15011 1342153 656053 1491789 1868215 2349850 1751425 1241491 1260861 1513033 731239 1238811
15001 1238811 1366530 1516971 1529441 1312435 2080605 1590699 1528778 1209203 1557469 1050776
14991 1050776 1063853 1576201 1746336 802864 1608010 1082340 1272629 1659518 1524738 1549782
14981 1549782 964748 1654186 1009944 1115455 1366947 959028 1809493 1248304 1097640
14972 1097640 1631233 1209534 2035551 673986 1192333 807949 1300271 2087362 1203612
14963 1203612 1788305 1271322 1096302 2002882 1510942 1472626 1796243 828368 633105 1805371
14953 1805371 1191137 986928 1638144 1446519 1108477 1663395 2018560 1250568 1107629
14944 1107629 2096804 1492023 981464 1367506 525149 1025643 1546449 1340179 840902
14935 840902 1662251 1859323 1158285 1229778 1653579 1038701 1890590 1524663 1560147 1101391
14925 1101391 623265 1206741 1089432 1623140 990899 1942834 1803577 1247554 1031421
14916 1031421 2389432 1546703 1557687 903513 1209498 547487 605866 1149974 1020183 1450895
14906 1450895 1052897 1306826 1146071 1558413 1106820 1028113 1594896 1772306 1448482 1331259
14896 1331259 1151605 1041562 1735403 1355047 1752578 1471201 1007939 1117251 1046059 1660474
14886 1660474 1934651 1734076 981454 1684504 1816241 2019340 855864 188792 1089538
14877 1089538 72335 1201356 1347786 520573 907684 866503 459119 923823 592956
14868 592956 1255178 1514419 1678043 1400316 1244586 1662374 1863740 887739 1341069 841379
14858 841379 2400095 2081491 1004328 1384478 1230809 634601 1046095 1381595 1022282
14849 1022282 1188856 1247650 2082230 1740645 1999468 1626907 1315412 1530105 1554582 1395679
14839 1395679 1778715 1736564 814500 1443977 1852154 1611522 1519130 1465170 1572835 1547091
14829 1547091 1742757 1074420 1229791 1555671 997123 1671495 559589 1222049 1063617
14820 1063617 950618 1964578 1975726 1495009 670322 1492446 1437264 1719481 1834618 1781492
14810 1781492 2333280 1485302 1570867 1498875 1927820 654748 1256971 880586 1006816 980907
14800 980907 1326013 1339198 1494929 1033747 1495806 1989461 1485966 1666860 1836501 817223
14790 817223 345294 907227 965324 293490 1483723 973897 1138302 510602 764739 1921167
14780 1921167 971427 978728 1106519 1335255 1915697 1091717 307060 1746256 932612 1002368
14770 1002368 1609752 1679449 1496539 1008196 1416644 1377685 1186282 1617414 1329594 1346873
14760 1346873 322785 1443492 1123887 1065325 1243991 465201 1490930 1558680 630543
14751 630543 1230415 1759259 550019 1468926 1502610 849646 1502514 1166277 1623295 726588
14741 726588 1219759 1149904 1852768 931081 974155 1639106 1530798 1635460 820394 1193577
14731 1193577 731920 1265128 1239662 1297105 872461 1297777 1218113 1323465 1120629 1679723
14721 1679723 1148445 1821970 1645974 880783 784520 1372123 1571352 789641 1235842 2025134
14711 2025134 2309881 976201 1549730 1044413 1163752 1257490 1868270 1115359 1771399
14702 1771399 747719 1125064 1518723 1196971 837121 1431563 1830329 1320722 881442
14693 881442 1319325 1303735 1768315 1937151 1405460 1501947 748272 1316491 1389051 2024077
14683 2024077 1598298 984394 1098437 1348446 1228142 915675 1630887 1148708 1283299
14674 1283299 1204621 2142965 1785552 1752792 862736 2114419 905337 1174475 1440816
14665 1440816 657015 1072385 1555113 1802723 2046099 1533544 1322831 1445233 1468363 1077596
14655 1077596 1489293 1660349 1522500 1199067 1066263 1689206 1183189 1556144 1409250
14646 1409250 518286 1806080 2037920 1365400 789843 1757020 1906505 1192755 1468368
14637 1468368 1339243 1584152 1036450 1829938 1167762 1128962 1799137 2284811 2151338 1628926
14627 1628926 1437399 530341 1441242 1157412 2212460 1789034 1828533 1346016 970720
14618 970720 1092248 1607816 1342997 1343276 836639 963685 2055550 1515261 1315226 992227
14608 992227 1245986 865557 1059738 926668 877992 896415 2136485 409650 1381183 1848318
14598 1848318 1519372 1242120 936039 1635641 1317462 2276892 1451270 1723988 2144385
14589 2144385 1267522 547829 1017592 1735807 1105230 721570 1572409 1621066 1996675 1507902
14579 1507902 1833492 1353374 1743558 1843719 1558560 689707 1222087 979976 1176964
14570 1176964 1859307 1355418 595982 1254495 692652 902736 2374755 2069636 1020468
14561 1020468 1335347 1285780 1050885 1298987 1118787 1294705 1021990 1265260 1381760 1421845
14551 1421845 1915185 1290343 1278246 1519650 831742 943464 1889383 1849042 1654067 1754215
14541 1754215 1637744 933404 1012305 2315440 1329837 1766426 141432 847675 1354656
14532 1354656 1209653 1194445 1643974 1206558 2032868 1802719 817048 1463265 1138792 1351219
14522 1351219 1758340 817526 1343903 496520 891232 2161279 1393201 1007567 1403832
14513 1403832 698137 1224682 1414643 1816764 1498922 1712204 2032501 826579 1631191
14504 1631191 1941155 1747803 1385341 1404420 1683902 2100598 1359813 1512352 823491 1712022
14494 1712022 1059705 1246805 1865844 2207206 1132403 520687 666749 1163812 1882336
14485 1882336 1103541 2000541 645100 1976196 924756 1118387 1455035 1963445 1647094
14476 1647094 1867001 1491862 980413 1050656 996424 1721833 950180 1523748 1972572 1577026
14466 1577026 1127685 1663015 1659493 1444020 1397798 1449759 1847220 1450772 1714349 1529252
14456 1529252 1769984 1344376 1136891 1253577 1049411 1119927 1319330 1721844 827513 924600
14446 924600 1108400 1965837 1772296 1445602 1624031 2138307 1138044 1854877 968887
14437 968887 1305683 1591807 1422918 1624266 2407898 807480 1545553 1008978 1104454 1904133
14427 1904133 1023157 2039934 1211214 1575787 1614034 1523187 1432141 1297582 1587149 1684601
14417 1684601 526038 867771 2220215 1872339 1328864 1584948 1109089 737893 1111600
14408 1111600 1661710 1517690 1936223 1293577 1832116 1291993 807651 1481101 1609070
14399 1609070 882324 350372 1305979 1615648 761109 1206884 1434094 567743 811086
$$ [...]
##END NTUPLES=NMR SPECTRUM
##END=
