##TITLE=abcd
##JCAMPDX= 6.0         $$ Bruker NMR JCAMP-DX V2.0
##DATA TYPE= NMR SPECTRUM
##DATA CLASS= NTUPLES
##ORIGIN= UXNMR, Bruker Analytische Messtechnik GmbH
##OWNER= root
$$ XWIN-NMR		Version 3.5
$$ Mon Nov 17 13:46:50 2025 Russian Standard Time (UT+4h)  servis@DPX200
##.OBSERVE FREQUENCY= 200.131235884673
##.OBSERVE NUCLEUS= ^1H
##.ACQUISITION MODE= SIMULTANEOUS
##.ACQUISITION SCHEME= undefined
##.AVERAGES= 32
##.DIGITISER RES= 18
##SPECTROMETER/DATA SYSTEM= spect
##.PULSE SEQUENCE= zg
##.SOLVENT NAME= Acetone
##.SHIFT REFERENCE= (INTERNAL, Acetone, 0, 16.4885)
##AUDIT TRAIL= $$ (NUMBER, WHEN, WHO, WHERE, WHAT)
$$ ##TITLE= Audit trail, XWIN-NMR		Version 3.5
$$ ##JCAMPDX= 5.01
$$ ##ORIGIN= Bruker BioSpin GmbH
$$ ##OWNER= servis
$$ F:\spectra/data/av/nmr/H1/1/pdata/1/auditp.txt
$$ ##AUDIT TRAIL=  $$ (NUMBER, WHEN, WHO, WHERE, WHAT)
(   1,<2025-11-17 13:45:27.65 +0400>,<servis>,<DPX200>,
      <created by zg, POWCHK disabled, PULCHK disabled
       configuration hash MD5:
       00 E9 B6 7A A2 85 ED C7 34 08 36 98 17 FE 4E 26
       data hash MD5: 32K
       AA 5E A9 07 0F 9E 74 70 C9 86 B4 1D C8 19 E1 EF>)
(   2,<2025-11-17 13:45:48.92 +0400>,<servis>,<DPX200>,
      <Start of raw data processing
       efp BC_mod = 2 LB = 0.05 FT_mod = 6 PKNL = 1 PHC0 = -254.562 PHC1 = 1.301565 SI = 16K 
       data hash MD5: 16K
       B8 23 95 B4 52 12 68 6E 36 9B 6A 0D 26 46 40 A3>)
(   3,<2025-11-17 13:46:02.54 +0400>,<servis>,<DPX200>,
      <pk PHC0 = -2.4 PHC1 = 0 
       data hash MD5: 16K
       E1 DF 0B C5 67 F3 D5 A8 29 1F 7B A1 A8 50 FF 4B>)
(   4,<2025-11-17 13:46:09.14 +0400>,<servis>,<DPX200>,
      <abs ABSG = 5 
       data hash MD5: 16K
       92 EF FB 38 62 14 D0 7B A1 04 AF E4 71 0F 13 3D>)
$$ ##END=
$$ 
$$ hash MD5
$$ 3E 89 3F 90 2F 1B 55 B3 27 3D 76 23 D8 5F 50 BC
##$RELAX= 
##$RELAX= 
##$RELAX= 
##$RELAX= 
##$RELAX= 
##$RELAX= 
##$RELAX= 
##$RELAX= 
$$ Bruker specific parameters
$$ --------------------------
##$DU= <F:\spectra>
##$EXPNO= 1
##$NAME= <H1>
##$PROCNO= 1
##$TYPE= <nmr>
##$USER= <av>
##$AMP= (0..31)
100 100 100 100 100 100 100 100 100 100 100 100 100 100 100 100 100 100 
100 100 100 100 100 100 100 100 100 100 100 100 100 100 
##$AQSEQ= 0
##$AQ_mod= 1
##$AUNM= <au_zg>
##$AUTOPOS= <>
##$BF1= 200.13
##$BF2= 200.13
##$BF3= 200.13
##$BF4= 200.13
##$BF5= 500.13
##$BF6= 500.13
##$BF7= 500.13
##$BF8= 500.13
##$BYTORDA= 1
##$CFDGTYP= 0
##$CFRGTYP= 5
##$CHEMSTR= <none>
##$CNST= (0..31)
1 1 145 1 1 1 1 1 1 1 1 1 1 1 1 1 1 1 1 1 1 1 1 1 1 1 1 1 1 1 1 1 
##$CPDPRG= <>
##$CPDPRG1= <>
##$CPDPRG2= <>
##$CPDPRG3= <>
##$CPDPRG4= <mlev>
##$CPDPRG5= <mlev>
##$CPDPRG6= <mlev>
##$CPDPRG7= <mlev>
##$CPDPRG8= <mlev>
##$CPDPRGB= <>
##$CPDPRGT= <>
##$D= (0..31)
0 2 0 0 0 0 0 0 0 0.06 0 0 0 0 0 0 0.0002 0 0 0 0 0 0 0 0 0 0 0 0 0 0 
0 
##$DATE= 1763372726
##$DBL= (0..7)
120 120 120 120 120 120 120 120 
##$DBP= (0..7)
150 150 150 150 150 150 150 150 
##$DBP07= 0
##$DBPNAM0= <>
##$DBPNAM1= <>
##$DBPNAM2= <>
##$DBPNAM3= <>
##$DBPNAM4= <>
$$ [...]
##$SUBNAM5= <"">
##$SUBNAM6= <"">
##$SUBNAM7= <"">
##$SUBNAM8= <"">
##$SUBNAM9= <"">
##$SW= 20.6817932712277
##$SWIBOX= (0..15)
0 0 3 0 0 0 0 0 0 0 0 0 0 0 0 0 
##$SW_h= 4139.07284768212
##$TD= 32768
##$TD0= 1
##$TE= 0
##$TE2= 300
##$TE3= 300
##$TEG= 300
##$TL= (0..7)
0 120 120 120 120 120 120 120 
##$TP= (0..7)
150 150 150 150 150 150 150 150 
##$TP07= 0
##$TPNAME0= <>
##$TPNAME1= <>
##$TPNAME2= <>
##$TPNAME3= <>
##$TPNAME4= <>
##$TPNAME5= <>
##$TPNAME6= <>
##$TPNAME7= <>
##$TPOAL= (0..7)
0.5 0.5 0.5 0.5 0.5 0.5 0.5 0.5 
##$TPOFFS= (0..7)
0 0 0 0 0 0 0 0 
##$TUNHIN= 0
##$TUNHOUT= 0
##$TUNXOUT= 0
##$USERA1= <user>
##$USERA2= <user>
##$USERA3= <user>
##$USERA4= <user>
##$USERA5= <user>
##$V9= 5
##$VALIST= <valist>
##$VCLIST= <CCCCCCCCCCCCCCC>
##$VD= 0
##$VDLIST= <DDDDDDDDDDDDDDD>
##$VPLIST= <PPPPPPPPPPPPPPP>
##$VTLIST= <TTTTTTTTTTTTTTT>
##$WBST= 1024
##$WBSW= 30
##$XGAIN= (0..3)
0 0 0 0 
##$XL= 0
##$YL= 0
##$YMAX_a= 37624
##$YMIN_a= -39583
##$ZGOPTNS= <>
##$ZL1= 120
##$ZL2= 120
##$ZL3= 120
##$ZL4= 120
##$ABSF1= 16.48848
##$ABSF2= -4.193441
##$ABSG= 5
##$ABSL= 3
##$ALPHA= 0
##$AQORDER= 0
##$ASSFAC= 0
##$ASSFACI= 0
##$ASSFACX= 0
##$ASSWID= 0
##$AUNMP= <proc_1d>
##$AZFE= 0.1
##$AZFW= 0.1
##$BCFW= 0
##$BC_mod= 2
##$BYTORDP= 0
##$COROFFS= 0
##$CY= 18.4799938201904
##$DATMOD= 1
##$DC= 0
##$DFILT= <>
##$DTYPP= 0
##$F1P= 9.9274215381318
##$F2P= -0.165520771350173
##$FCOR= 1
##$FTSIZE= 16384
##$FT_mod= 6
##$GAMMA= 0
##$GB= 0
##$INTBC= 1
##$INTSCL= 4.127829e-11
##$ISEN= 128
##$LB= 0.05
##$LEV0= 0
##$LPBIN= 0
##$MAXI= 10000
##$MC2= 0
##$MEAN= 0
##$ME_mod= 0
##$MI= 50
##$NCOEF= 0
##$NC_proc= -8
##$NLEV= 6
##$NOISF1= 3.799351
##$NOISF2= 2.8
##$NSP= 0
##$NTH_PI= 0
##$NZP= 0
##$OFFSET= 16.48848
##$PC= 4
##$PHC0= -256.962
##$PHC1= 1.301565
##$PH_mod= 1
##$PKNL= yes
##$PPARMOD= 0
##$PSCAL= 4
##$PSIGN= 0
##$REVERSE= no
##$SF= 200.130005582386
##$SI= 16384
##$SIGF1= 3
##$SIGF2= 2
##$SINO= 400
##$SIOLD= 16384
##$SREGLST= <1H.CDCl3>
##$SSB= 0
##$STSI= 16384
##$STSR= 0
##$SW_p= 4139.07284768211
##$SYMM= 0
##$S_DEV= 0
##$TDeff= 32768
##$TDoff= 0
##$TI= <>
##$TILT= no
##$TM1= 0
##$TM2= 0
##$TOPLEV= 0
##$USERP1= <user>
##$USERP2= <user>
##$USERP3= <user>
##$USERP4= <user>
##$USERP5= <user>
##$WDW= 1
##$XDIM= 16384
##$YMAX_p= 490748139
##$YMIN_p= -4345401
$$ End of Bruker specific parameters
$$ ---------------------------------
##NTUPLES= NMR SPECTRUM
##VAR_NAME=  FREQUENCY,     SPECTRUM/REAL,   SPECTRUM/IMAG
##SYMBOL=    X,             R,               I
##VAR_TYPE=  INDEPENDENT,   DEPENDENT,       DEPENDENT
##VAR_FORM=  AFFN,          ASDF,            ASDF
##VAR_DIM=   16384,         16384,           16384
##UNITS=     HZ,            ARBITRARY UNITS, ARBITRARY UNITS
##FACTOR=    0.252644378177508, 1,           1
##FIRST=     3299.83951724647, 0,            0
##LAST=      -839.233330435636, 0,           0
##MIN=       -839.233330435636, -4345401,    0
##MAX=       3299.83951724647, 490748139,    0
$$ Real data points
##PAGE= N=1
##DATA TABLE= (X++(R..R)), XYDATA
$$ [...]
7919D5746k69836Q02163l54224n8824m43375O03201j94415j40066K93322m47956
$$ 45746 -224090 578073 223849 165025 -278350 324851 130436 -9630 283692 -164264
7909a64264o59036P19754O56762k70894K38059r01507l65870J10457Q13906N9916
$$ -164264 -823300 -103546 553216 282322 520381 -381126 -746996 -636539 177367 237283
7899B37283l28530N29048q70459L75985n1251K00594n27769P06109m89996Q51622
$$ 237283 -91247 437801 -432658 -56673 -107924 92670 -435099 271010 -218986 632636
7889F32636j07689m43743l50729k43020P89229j250909J256792J48181o40835
$$ 632636 524947 81204 -269525 -512545 276684 -974225 282567 430748 -210087
7880b10087P4573K23073J88970J7543k66958J38887k34942n5335k7700P26962
$$ -210087 -135514 87559 276529 294072 27114 166001 -68941 -124276 -151976 574986
7870E74986p87227J23356j60286L22007m38106M2606Q08983K6017p44789j053706
$$ 574986 -212241 -88885 -249171 72836 -365270 -322664 486319 512336 -232453 -1286159
7860a286159J387443L84738K59938J180742l556087K96601N38720N88275K65331
$$ -1286159 101284 486022 745960 1926702 -1629385 -1332784 -794064 -205789 59542
7851E9542k4194o16371k21350O96496j36903k81863K02466k50515P48151j127750
$$ 59542 35348 -581023 -802373 -105877 -242780 -524643 -322177 -572692 175459 -952291
7841i52291J084720j50445j47748n15295L15823Q76725q24852J62122q9387m49034
$$ -952291 132429 -18016 -165764 -681059 -365236 511489 -313363 -151241 -240628 -689662
7831f89662Q85562n65779Q97553p79497l12017K29432k11765M91397K0234k33407
$$ -689662 195900 -369879 527674 -251823 -563840 -334408 -546173 -54776 -34542 -267949
7821b67949K62178L18594m48368L16261k83921l23818K96638o05996L29704L35039
$$ -267949 -5771 312823 -135545 180716 -103205 -427023 -130385 -736381 -406677 -71638
7811g1638m97311N83650N601j91487M58739n84925J98178j03274j94037O46482
$$ -71638 -568949 14701 20302 -171185 287554 -297371 -99193 -202467 -396504 249978
7801B49978m98151K54059J98713k13418K10178j05l77391K49108K10282m26671
$$ 249978 -248173 5886 204599 -8819 201359 201254 -176137 72971 283253 -143418
7791a43418Q75497m56362o80048J12223L03096p71741P29682J04546j56141M10763
$$ -143418 732079 275717 -404331 -292108 10988 -760753 -31071 73475 -82666 328097
7781C28097L97372l61714k04781J58280K40974n65313N03977j1420o99489l22263
$$ 328097 725469 363755 158974 317254 558228 -7085 496892 485472 -214017 -536280
7771e36280R3627Q02378j126281M27403J464581j443797L93188j13643l55653
$$ -536280 -442653 359725 -766556 -339153 1125428 -318369 74819 -38824 -394477
7762c94477k6861O70437m36708m58115K22613N7434R38463o26571k31913j59309
$$ -394477 -421338 249099 -187609 -645724 -423111 -365677 572786 -53785 -285698 -445007
7752d45007M04561O0291k70556Q48476p01384k83650q47J0898M48204M15493l04245
$$ -445007 -40446 19845 -250711 597765 -103619 -387269 -388116 -377218 70986 486479 182234
7741A82234o01627Q54842j226007L99976j37741P08929p2641P7481p1219j82379
$$ 182234 -419393 435449 -790558 -390582 -528323 180606 107965 185446 114227 -68152
7731f8152M48579L0703m06739q2626n32402Q95675n30273K28925J07902j08038
$$ -68152 380427 411130 4391 -78235 -610637 285038 -245235 -16310 91592 -16446
7721a6446J45598j04723m1656L7218M93984m24439j08188J2119o8244Q3609k42328
$$ -16446 129152 24429 -17227 19991 513975 89536 -18652 -6533 -74777 8832 -233496
7710b33496K26234J92548o53418R1330m3751N4582L96883K35524l02086m6302
$$ -233496 -7262 185286 -468132 -376802 -420553 -365971 30912 266436 -35650 -81952
7700h1952p9548L99645l73402n71191P38800k37019J72957m9420j28251L164M0532
$$ -81952 -161500 238145 -135257 -706448 32352 -204667 -31710 -81130 -209381 -206217 -165685
7689a65685R46905j042378Q16743q56017j22386M05545o9058K95495R6012l47684
$$ -165685 781220 -261158 555585 -300432 -422818 -17273 -86331 209164 305176 -42508
7679d2508m74772L95533m56497Q62072r42343K90534R11478j027716O74488p05998
$$ -42508 -517280 -121747 -578244 283828 -658515 -367981 543497 -484219 190269 -515729
7669e15729O07569P3820J00598l11150l24810K22417k54611k50811m28795Q94458
$$ -515729 91840 165660 266258 -44892 -369702 -147285 -401896 -652707 -1081502 -187044
7659a87044P84745r26792m54947O36506O6497k96029J97552J9331l76424P36182
$$ -187044 597701 -329091 -784038 -147532 -81035 -377064 -179512 -160181 -536605 199577
7649A99577Q8899l69348k72533N12011l46343k32460P7859K08419k44900M20314
$$ 199577 288476 -80872 -353405 158606 -187737 -420197 -342338 -133919 -378819 41495
7639D1495m90682M74066N35218j105827L5501J53304K16979l88977k61397L58559
$$ 41495 -449187 24879 560097 -545730 -510229 -356925 -139946 -528923 -790320 -431761
7629d31761N76811J36283j208174P62167R68857r54887j16966n87569J97355R39108
$$ -431761 145050 281333 -926841 -164674 804183 -150704 -267670 -855239 -657884 281224
7619B81224o02779n04413K46281r7259O22729l70656L71895l69730m14176Q27826
$$ 281224 -321555 -825968 -579687 -676946 -54217 -424873 -52978 -422708 -836884 -9058
7609i058j94589j04916j82025J81400j62055J34491L62628l5628N86594r78445
$$ -9058 -203647 -308563 -490588 -309188 -471243 -336752 25876 -9752 576842 -401603
7599d01603l74807K758549j753969k38276J37992n32091L18786M02728j33476
$$ -401603 -776410 1982139 228170 -10106 127886 -404205 -85419 317309 183833
7590A83833k15608j15289n13810R25189j24766k7427M66895m06401n13249N57496
$$ 183833 -31775 -147064 -660874 264315 139549 112122 579017 172616 -340633 216863
7580B16863l46465M51458m27127J67654K09421l86569l00874L53127m6928N46906
$$ 216863 -129602 321856 -105271 62383 271804 -114765 -415639 -62512 -109440 437466
7570D37466m66366o8778L72912k15035n39232L65585k58766K51379R7623N07027
$$ 437466 -28900 -97678 275234 60199 -479033 -113448 -372214 -120835 -23212 483815
7560D83815n03813J25656r20949Q94396n11233J09962k37598p7483M20023L00979
$$ 483815 -19998 105658 -815291 79105 -432128 -322166 -559764 -637247 -217224 83755
7550H3755r03703M45087Q04498q49250K92857m13364N91452n7411R5298k46030
$$ 83755 -819948 -374861 429637 -419613 -126756 -540120 51332 -6079 89219 -156811
7540a56811o114j17364L10302k35249j550593J889002l68440k68722O77202L79258
$$ -156811 -162925 -280289 30013 -205236 -1755829 133173 -235267 -503989 173213 552471
7530E52471q50627j51746k05018R92669r10660O67059k44731O7276J99574n2937
$$ 552471 -298156 -449902 -654920 337749 -572911 94148 -150583 -83307 116267 63330
7520F3330q23267K58866R8854N74402j108264N65738J73256m0123M18545m98511
$$ 63330 -759937 -501071 -402217 172185 -936079 -370341 -197085 -237208 181337 -317174
7510c17174n14750M13005O78693j073110J208993q64944K52209J80599o42630
$$ -317174 -831924 -418919 259774 -813336 395657 -469287 -217078 -36479 -679109
7501f79109M86715L13188k75859p60179O99279Q80418o54772k62712j70467R03640
$$ -679109 -192394 120794 -155065 -915244 -215965 664453 9681 -253031 -423498 480142
7491D80142k76890n28975K16686n83017Q53491n26658N05787r40971K89468P95923
$$ 480142 203252 -325723 -109037 -692054 161437 -365221 140566 -800405 -510937 284986
7481B84986r43207O01916J83939N76284q22679L02716j3153L02521j71074M1277
$$ 284986 -658221 -56305 127634 703918 -118761 183955 170802 473323 302249 343526
7471C43526p05689P60284k79580K60476o18321o8240l17925K05589p5720K55674
$$ 343526 -362163 398121 118541 379017 -239304 -307544 -625469 -419880 -495600 -239926
7461b39926N30790k80537j68104R95334n95362j226749K04584Q02627q58639J426890
$$ -239926 290864 10327 -157777 837557 242195 -984554 -779970 22657 -835982 590908
7451E90908o78273l18924P47632j32412K98476o37583R68080p14850m46260J58709
$$ 590908 -87365 -406289 341343 208931 507407 -130176 837904 123054 -323206 -164497
7441a64497J48710J79627M28182j274029l8162J84000O47021J9516P9538j49248
$$ -164497 -15787 163840 592022 -682007 -720169 -536169 110852 130368 209906 60658
7431F0658j97117N20396j084474J191028k55547m85531N52459m42789j10408n27784
$$ 60658 -136459 383937 -700537 490491 234944 -250587 301872 -140917 -251325 -779109
7421g79109J55754P51156m68400J39788K83077N5911j99365J25974l33799J35763
$$ -779109 -623355 127801 -340599 -200811 82266 138177 -61188 64786 -269013 -133250
7411a33250L17774j057815R21979n40650j18167N98302J78741q01059K00303M426
$$ -133250 184524 -873291 48688 -491962 -610129 -11827 166914 -634145 -433842 -429416
7401d29416N11764J32907O40702p71817L14956q08391K65324J134185j330262
$$ -429416 82348 215255 855957 84140 399096 -409295 -143971 990214 -340048
7392c40048L43181k63239k59231P23073r38581J030495n8987o62178J958P19308
$$ -340048 3133 -260106 -519337 203736 -734845 295650 236663 -425515 -423557 295751
7382B95751o86102M86959Q99287j346345J08124j11450J95272J05829j39161N3234
$$ 295751 -390351 96608 995895 -350450 -242326 -353776 -158504 -52675 -191836 -138602
7372a38602k02643k74700J71207K11642J25266K19508l02917N88480k40286q67789
$$ -138602 -341245 -615945 -444738 -233096 -107830 111678 -191239 397241 156955 -710834
7362g10834R26082k50543l13368K69804L1016K72895p9875l67288O66556p74433
$$ -710834 215248 -35295 -348663 -78859 -47843 225052 145177 -222111 444445 -329988
7352c29988L97304P2122m55242l42999O76177O46661j166404K00559m83314J215724
$$ -329988 67316 139438 -315804 -658803 17374 664035 -502369 -301810 -785124 430600
7342D30600j072688R15140p60464N9266O47689O4287l15639o1320M31675q91645
$$ 430600 -642088 273052 -487412 -428146 219543 283830 -31809 -93129 338546 -553099
7332e53099O10451L26116j079131Q41966l57027M29093M07994q08829n81654R04895
$$ -553099 57352 383468 -695663 146303 -210724 218369 626363 -182466 -764120 140775
7322A40775k13522O511P48192n51859o30105k73571N19128Q47713m33371O1093
$$ 140775 -72747 -66236 681956 130097 -500008 -773579 -254451 593262 159891 220984
7312B20984O4172r60013N61074L97638p52373J304785m15157o44467l61955M65640
$$ 220984 285156 -674857 -113783 283855 -468518 836267 421110 -223357 -585312 -119672
7302a19672j20219J84165M15922k51102q3271L87150o58291p05413K97896R19022
$$ -119672 -239891 -55726 360196 109094 25823 412973 -245318 -950731 -652835 266187
7292B66187K5230j08401q1887O6034j222379J264059l4215j57725L73121n92506
$$ 266187 291417 183016 101129 167163 -1055216 208843 174628 16903 390024 -202482
7282b02482l01537M53073M21554o66466P9992l35968O06719m99193J076045q31114
$$ -202482 -504019 -50946 370608 -295858 -215866 -551834 54885 -444308 631737 -199377
7272a99377M87177r94523M04948M08589L39719j42952L51837l64276o13909r6763
$$ -199377 287800 -706723 -301775 106814 446533 303581 655418 291142 -322767 -419530
7262d19530J368786j284144p80882N59713R43898K1578n50054J41904J23028p2855
$$ -419530 949256 -334888 -1115770 -556057 387841 409419 -140635 1269 124297 51442
7252E1442l35934L73705K3098L58631P9321q68761Q76231o95526O101l21591P70478
$$ 51442 -284492 89213 112311 470942 550263 -318498 557733 -137793 -131692 -453283 317195
7241C17195m99919j73348L96686J29098o09791R29439p66095p39954N46606o25604
$$ 317195 -182724 -356072 40614 169712 -440079 489360 -276735 -1016689 -470083 -1095687
7231a095687J579091j163275K04325Q29314m94629m24999M10957l02805n7504
$$ -1095687 483404 -679871 -475546 353768 -140861 -565860 -154903 -457708 -515212
7222e15212N72856j94142N79662k20457o05349L24588K85289n53692P13415n9370
$$ -515212 57644 -136498 443164 222707 -382642 -58054 227235 -326457 386958 327588
7212C27588k66956J70365l96887l39586O27935n29406l0916J21493k8435k13944
$$ 327588 60632 230997 -165890 -505476 122459 -406947 -437863 -316370 -344805 -558749
7202e58749M72698k71133Q06669R6768j37766q73223K32949l95119q6236L55722
$$ -558749 -86051 -357184 449485 546253 408487 -464736 -231787 -626906 -713142 -357420
7192c57420N33740p64775J485319j193133q521R0453K31266J60080j25408K76487
$$ -357420 176320 -588455 896864 -296269 -304790 -214337 16929 177009 51601 328088
7182C28088q71576J377717j260173p8362k68071J129706q83899L33255o97597
$$ 328088 -543488 834229 -425944 -504306 -772377 357329 -526570 -193315 -890912
7173h90912L69304k19692L90176L4768P07087p97822L34123n8583N53077r25131
$$ -890912 -521608 -741300 -351124 -316356 390731 -407091 -72968 -131551 421526 -503605
7163e03605O79506q17676N15274J01249m27057O26349p51759M94072m46494Q78215
$$ -503605 175901 -641775 -126501 -25252 -452309 174040 -577719 -83647 -530141 348074
7153C48074j53659k91748j06417K83940m13167k15628J75554K78158n30080R01482
$$ 348074 194415 -97333 -203750 80190 -332977 -548605 -373051 -94893 -624973 276509
7143B76509k30969j92030J12790j79880l98505L45204j60375R83012p33817j20289
$$ 276509 45540 -146490 -33700 -213580 -612085 -266881 -427256 555756 -178061 -298350
7133b98350K74709m0751m72846N67161q29293R44473j10016k72744n625M58676
$$ -298350 -23641 -64392 -537238 29923 -799370 145103 35087 -237657 -243282 215394
7123B15394K34106j016001J32640k45810O92015p95644M86033m93700R26017o07553
$$ 215394 449500 -566501 -433861 -679671 12344 -783300 -297267 -790967 135050 -472503
7113d72503L20103k35014O90443k87812o70356P26164J72826L71811k76608m76398
$$ -472503 -152400 -387414 303029 15217 -655139 71025 243851 615662 339054 -137344
7103a37344M46485J18649n85022j41967N98809l40957O04688q07594j30781J004243
$$ -137344 309141 427790 -157232 -299199 299610 -41347 563341 -244253 -375034 629209
7093F29209o07523j11452k90534m04371J213101m67118J17657o8781l91471j6886
$$ 629209 21686 -89766 -380300 -784671 428430 -38688 78969 10188 -381283 -398169
7083c98169j30646K76903M76677l11556m20360M02794k88865M70876l45945J50108
$$ -398169 -528815 -251912 224765 -86791 -507151 -104357 -393222 77654 -268291 -118183
7073a18183m26100L50891O20588J07659o74934k82500P20842K10947m03001l07774
$$ -118183 -544283 -193392 427196 534855 -140079 -422579 298263 509210 106209 -201565
7063b01565j91599l97281K50087k036L58834R79571m98375q57185J96727K33954
$$ -201565 -393164 -790445 -540358 -542394 -183560 796011 297636 -559549 -362822 -128868
7053a28868o28420P17903j40142M7259l79283Q96227k05702j383163J385401J01403
$$ -128868 -757288 -39385 -179527 -132268 -511551 384676 178974 -1204189 181212 282615
7043B82615j253151J161284J01907o38919M83350l47670j17971L34235n52807
$$ 282615 -970536 190748 292655 -346264 137086 -210584 -328555 5680 -547127
7034e47127M75628m03820J11208N68917o04669L22193m7290K93475k44892Q49424
$$ -547127 -71499 -475319 -364111 204806 -399863 -77670 -124960 168515 -76377 773047
7024G73047j428826O40008m01447O91560l13061O00862l40205L89806n52937l39008
$$ 773047 -655779 -15771 -417218 274342 -38719 562143 221938 611744 58807 -280201
7014b80201K07652k61262L94291O8665j181235J315721m64344j90461J06932o13366
$$ -280201 -72549 -333811 60480 129145 -1052090 263631 -200713 -391174 -284242 -897608
7004h97608N41949N84839k89978K6051k47893j40081L15907l45532M97684p25406
$$ -897608 -355659 229180 -60798 -34747 -282640 -422721 -106814 -452346 45338 -680068
6994f80068O41344j025286R20499K09599L40586O4000Q270K93300k56727m80638
$$ -680068 -38724 -1064010 -143511 66088 406674 470674 478944 772244 515517 34879
6984C4879m85003J75749J95473Q83052o85087k15000O77681l65248n94747J73851
$$ 34879 -450124 -274375 -78902 804150 119063 -95937 581744 216496 -378251 -204400
6974b04400P37714m49370J70471q60631K79280M22801j41949j19025J050436j349453
$$ -204400 533314 83944 254415 -606216 -326936 95865 -46084 -165109 885327 -464126
6964d64126K36876l17814L75330l74500P65471p05874M0977N15766K4728P02095
$$ -464126 -227250 -545064 -169734 -544234 221237 -484637 -443660 72106 96834 798929
6954G98929j185582P2322M00969j07737j27642J46881M65341K4754q3212j73737
$$ 798929 -386653 -314331 86638 -21099 -148741 -1860 463481 488235 405023 231286
6944B31286p14690J15092N33983j739748J431492O44893j236579N50440j91271
$$ 231286 -483404 -368312 165671 -1574077 -142585 502308 -734271 -183831 -375102
6935c75102K19946O61816l87567M4387k57289J53862j017267J238325r31174O29064
$$ -375102 -155156 506660 119093 163480 -93809 60053 -957214 281111 -650063 -20999
6925b0999M8468k1692o00505R09409j357758N85116M71223q8124N8051n44507
$$ -20999 27469 5777 -594728 314681 -1043077 -457961 13262 -74862 -16811 -561318
6915e61318r1647r3806K62690K36563j191051J733668J15352M12316j443595K03380
$$ -561318 -652965 -746771 -484081 -247518 -1438569 295099 410451 822767 -620828 -417448
6905d17448j4448L67250m67789J49719J195095j056923m4438n3456m63560N59723
$$ -417448 -431896 -64646 -532435 -382716 812379 -244544 -288982 -342438 -805998 -246275
6895b46275K81229p35006P95002l47471k0988K96014m9775o11888L57527k56552
$$ -246275 34954 -700052 94950 -252521 -273509 22505 -27270 -639158 -281631 -538183
6885e38183K22815K98805o01376M05210k65169K65825M33062k22866R15292j409681
$$ -538183 -315368 -16563 -617939 -212729 -477898 -212073 220989 -1877 913415 -496266
6875d96266L02018N85842j018694J73398N25116K05947n46609K45888l22162L7158
$$ -496266 -194248 391594 -627100 -453702 71414 277361 -269248 -23360 -345522 -308364
6865c08364p62892k53597J481501n35216m12774J030274n42855O56324m82505
$$ -308364 -1071256 -1324853 156648 -378568 -791342 238932 -303923 352401 -130104
6856a30104L4278M41136j74725l63916M35731o96429R3604L87669J52966r14075
$$ -130104 -95826 345310 170585 -193331 242400 -454029 -360425 27244 180210 -733865
6846g33865P86329m88367O07176K0712j62524L174j50257p337J99329k68961j57718
$$ -733865 52464 -435903 171273 191985 29461 32635 -117622 -124959 74370 -194591 -352309
6835c52309L98600n1732p96317L73672J213652j442991K26819K36572n21567L43552
$$ -352309 46291 -5441 -801758 -428086 785566 -657425 -430606 -194034 -715601 -372049
6825c72049O79440j21616n17626n34882Q37612L5899m05046q9796N40878j222288
$$ -372049 307391 185775 -331851 -866733 -29121 6778 -398268 -488064 52814 -1169474
6815a169474J236426n71578M8568k02654n3352P52237M86881q79802L42707k81940
$$ -1169474 66952 -504626 -456058 -658712 -712064 40173 527054 -352748 -10041 -291981
6805b91981J17561q23880R53162l57557Q1158o08266N51496K29514o40561O57661
$$ -291981 -174420 -998300 -45138 -402695 -321537 -929803 -378307 -148793 -789354 -131693
6795a31693J28767K39137j19915R8814n38692M33010n57987L77447J08036K1212
$$ -131693 -2926 236211 116296 215110 -323582 109428 -448559 -71112 36924 58136
6785E8136j27998k35619r6219L01024J89539m99593L14413m673k59603j133115
$$ 58136 -69862 -305481 -401700 -100676 88863 -410730 -96317 -100990 -360593 -1493708
6775a493708R91297J70686j55614N64217m25832M76975r65028J373263j106925
$$ -1493708 -502411 -331725 -487339 76878 -348954 128021 -837007 536256 -570669
6766e70669M75186O4376j30611K9896q8939q16994J119374J4517j88220k57074
$$ -570669 -95483 -31107 -161718 -131822 -220761 -1037755 81619 96136 -92084 -349158
6756c49158j02623Q45525o22428P63441J19539r40060m89821o5266J002143k41
$$ -349158 -451781 393744 -228684 534757 654296 -285764 -775585 -840851 161292 161051
6746A61051L8556n53554m73896J021415r55419L85065M06833r0072R0289J03221
$$ 161051 199607 -353947 -827843 193572 -761847 -376782 30051 -60021 30268 133489
6736A33489l41405J453935j458605J24778p1837J56143k51477l18836m14059Q67160
$$ 133489 -207916 1246019 -212586 -87808 -159645 -3502 -254979 -573815 -987874 -120714
6726a20714n0451L11372P25529j174438O26961j333879J175866j78900L60176
$$ -120714 -171165 140207 865736 -308702 318259 -1015620 160246 -18654 341522
6717C41522p36439K02844M68121k59549j4630j46742M98273q03015m18634N25584
$$ 341522 -394917 -192073 276048 16499 1869 -144873 353400 -449615 -868249 -342665
6707c42665Q55059q83836M75803n24156K16259Q4197l46376O77602J55839K19400
$$ -342665 512394 -371442 104361 -419795 -203536 -119339 -465715 211887 367726 587126
6697E87126r18597J47248n8201J85499k43728k8513R1098J86730l62042J084447
$$ 587126 -331471 -184223 -242424 -56925 -300653 -329166 -238068 -51338 -413380 671067
6687F71067q71819J81121j257713J46502J737974n64818j40186l66793K12493
$$ 671067 -200752 -19631 -1277344 -1130842 607132 42314 -97872 -464665 -252172
6678b52172Q30399r83717J1973n46545J382640n01946O0828l47890O49139k50478
$$ -252172 578227 -405490 -393517 -940062 442578 -59368 1460 -346430 302709 52231
6668E2231K53562q21091O33375K22451p61973L54283N49617o8056j092303Q62196
$$ 52231 305793 -515298 118077 340528 -421445 -67162 482455 414399 -677904 184292
6658A84292K0629j48954l16359O50391m07821o73860P65623n79623O34212m3126
$$ 184292 204921 55967 -260392 389999 -17822 -691682 73941 -505682 128530 85404
6648H5404k21706P1760p99921R24124k93038n87487R16552L88658o53632p46451
$$ 85404 -136302 -64542 -864463 59661 -233377 -820864 95688 484346 -169286 -915737
6638i15737K41006K51319k21093L34050N6504r2963L3182l83744P28242l20442
$$ -915737 -674731 -423412 -644505 -310455 -253951 -346914 -313732 -697476 30766 -289676
6628b89676P08769p86383n8620L90323n075k94903L9394J51847K65757k43294
$$ -289676 419093 -367290 -425910 -35587 -40662 -335565 -296171 -144324 121433 -121861
6618a21861m2355j89985N90628n48512m4242l49761l56700J290408m54421Q43893
$$ -121861 -164216 -354201 236427 -312085 -356327 -706088 -1062788 227620 -226801 617092
6608F17092q57270k11505N28190k90409m63764N57548K57147k5633p62633P04912
$$ 617092 -240178 -451683 76507 -213902 -677666 -120118 137029 111396 -651237 53675
6598E3675l36921L53498j20385K62908K18459q54349N39155j40228m10446N10478
$$ 53675 -283246 70252 -50133 212775 431234 -423115 116040 -24188 -434634 75844
6588G5844j68514J35840j039937J290191j4398j96784l09484o64284J247469p17336
$$ 75844 -92670 43170 -996767 293424 279026 82242 -227242 -891526 355943 -361393
6578c61393R69112j52909m15183k80355m83317R28057m15134Q12739j129554Q69429
$$ -361393 607719 454810 39627 -240728 -724045 204012 -211122 601617 -527937 341492
6568C41492m46609m89228J49871O79413J8644j125493O93261l73279L23416l7197
$$ 341492 -105117 -594345 -444474 234939 253583 -871910 -178649 -551928 -228512 -265709
6558b65709k34546O62065p7337l87816J96977J16148r65599P82150M52564n80623
$$ -265709 -500255 161810 84473 -303343 -106366 9782 -955817 -173667 278897 -301726
6548c01726L73228o7555L64223o25809j08463o4381j71321P873j05296Q96710
$$ -301726 71502 3947 368170 -257639 -366102 -430483 -601804 -593931 -699227 197483
6538A97483p18837J019093l77453k23120J50240q48256J551304p34084l88503
$$ 197483 -521354 497739 120286 -102834 47406 -800850 750454 16370 -372133
6529c72133J017941p77834K4647K84477o13502j29983k30668P73055M640Q699
$$ -372133 645808 -132026 -107379 177098 -436404 -566387 -797055 -24000 -19360 -10661
6519a0661P44817j037384P10770m92897J10264L45842o76247J093956j81192n24541
$$ -10661 734156 -303228 407542 -85355 24909 370751 -305496 788460 607268 82727
6509H2727L94084n1823r1440p00144J12563J86550m38526L3430O38244l92125
$$ 82727 476811 424988 333548 -366596 -254033 -67483 -506009 -472579 165665 -226460
6499b26460N70239j053761O42196n38919K36927Q29377k96314j2823k64154j78849
$$ -226460 343779 -709982 -67786 -606705 -369778 459599 163285 150462 -113692 -292541
6489b92541Q1046j05691Q99187J11383j149978M3554M26982m21529l8441K86789
$$ -292541 -211495 -317186 582001 693384 -456594 -413040 13942 -407587 -446028 -159239
6479a59239j47504M42668q77480Q85024P43883j028145K60886J03897J37290m03448
$$ -159239 -306743 135925 -741555 143469 887352 -140793 120093 223990 361280 -42168
6469d2168L18202o96259K36141P7347j40537m98741O64924n26824N76230o25233
$$ -42168 276034 -420225 -184084 -106737 -247274 -746015 -81091 -607915 -31685 -656918
6459f56918O50544j76835M00391p37542P74974j180363P08663o64040O76809J270307
$$ -656918 -6374 -183209 217182 -520360 254614 -925749 -217086 -881126 -204317 1065990
6449A065990n77301o06056M01186j228874J020752n15729N40598l83963l70360
$$ 1065990 488689 -117367 283819 -945055 75697 -440032 100566 -283397 -653757
6440f53757K62448k64287m8840M93543k75672n4721O63679j70373p4516p8331
$$ -653757 -391309 -655596 -704436 -210893 -486565 -541286 122393 -47980 -122496 -200827
6430b00827O4044j109530J154419k50601k77561L71553l82631J173806p8713q51985
$$ -200827 -136783 -1246313 -91894 -342495 -620056 -248503 -631134 542672 463959 -388026
6420c88026m59513J171575n01412j40043k0707K955k23130K26650O8346o21066
$$ -388026 -847539 324036 -177376 -317419 -338126 -335171 -558301 -331651 -263305 -884371
6410h84371J315979p21119k29221Q4679r1248M41143k65515K49806o33465K89850
$$ -884371 431608 -289511 -518732 -434053 -525301 -84158 -349673 -99867 -733332 -443482
6400d43482L89975k25440j96489k22208J38687Q55870n52224J97739m85962J99615
$$ -443482 -53507 -278947 -475436 -697644 -558957 296913 -255311 -57572 -543534 -343919
6390c43919Q89291q40405J64175M33257M95264j006759J53073n5570L59187o07652
$$ -343919 545372 -295033 -130858 302399 797663 -209096 -56023 -111593 247594 -360058
6380c60058Q10109r82080k73076P96322k75851q5680J445716r30238l89598n46265
$$ -360058 450051 -532029 -805105 -8783 -284634 -370314 1075402 145164 -244434 -790699
6370g90699O63445Q57097o4128k07290j599454O26848O13209o94062J1679M19697
$$ -790699 -127254 729843 665715 458425 -1141029 -514181 99028 -595034 -583355 -163658
6360a63658k77312J81021K48548L81870m69255K70806p16882R78166o74280J77429
$$ -163658 -440970 -259949 -11401 370469 -98786 172020 -544862 433304 -240976 -63547
6350f3547l2929M008o71963Q16556m03060O16669o62946k09342Q7027L92065j67608
$$ -63547 -96476 -92468 -764431 52125 -350935 265734 -397212 -606554 -519527 -127462 -295070
6339b95070k58128N66254J70051j92264K66962k14047K52608j86130l44807Q0772
$$ -295070 -553198 13056 183107 -9157 257805 43758 296366 110236 -234571 -153799
6329a53799J42170N2910J43532J67531n21551Q27683j028036K94788j13380L6206
$$ -153799 -11629 41281 184813 352344 -169207 658476 -369560 -74772 -188152 -151946
6319a51946l58559m52717R33674o77318N53922N61587n80328l48873L05447N88950
$$ -151946 -510505 -963222 -29548 -706866 -152944 408643 -171685 -520558 -215111 373839
6309C73839k99532q46530N44560K460J64055P7466P65253j45551j377360K48906
$$ 373839 74307 -772223 -227663 -225203 -61148 16318 781571 636020 -741340 -492434
6299d92434J6505J18406j21977n31779R61069j89455Q01525J90229j196252N55865
$$ -492434 -475929 -357523 -479500 -1011279 -50210 -239665 561860 752089 -444163 111702
6289A11702J62976j91548q49592J105676r93322o9556L94783J66759j077900J278385
$$ 111702 274678 83130 -766462 339214 -654108 -723664 -328881 -162122 -1240022 38363
6279C8363k04079j56538K53674q99536N92179P29367q2656K82704j315867N81746
$$ 38363 -165716 -322254 -68580 -968116 -375937 353430 270774 553478 -762389 -180643
6269a80643j38422M016L65118j20298o53672R96090p00334K32175m04533N32759
$$ -180643 -319065 -315049 50069 -70229 -723901 272189 -428145 -195970 -600503 -67744
6259f7744K18144p88000M8457L49875j039716J164848k37836k28495K20418L31584
$$ -67744 150400 -637600 -589143 -239268 -1278984 -114136 -351972 -580467 -360049 -28465
6249b8465p18483M49930O42103p11470Q18082o10367j37974o9195O35388J5355
$$ -28465 -746948 -297018 345085 -366385 451697 -158670 -296644 -365839 269549 284904
6239B84904n65445K27369k37393k81777K82326q44234J296798L07989r53001j82432
$$ 284904 -280541 -53172 -290565 -572342 -290016 -1134250 162548 470537 -482464 -664896
6229f64896L67839k20093O8364l2218j71486Q16626j17579p1120N7264L97742
$$ -664896 -297057 -517150 -448786 -481004 -652490 164136 46557 -24563 32701 430443
6219D30443n30669l23435K84100j234654J032613L12566j19923k20662M03643
$$ 430443 -100226 -423661 -139561 -1374215 -341602 -29036 -148959 -369621 34022
6210C4022m43639N9367n5697J93353L67594K80941j440532J90976O66442j338618
$$ 34022 -409617 -350250 -405947 -212594 155000 435941 -1004591 -813615 -147173 -1485791
6200a485791O10022R21628n5299l23295J06897n10448n30707J126490K80930j05215
$$ -1485791 -875769 45859 -9440 -332735 -225838 -736286 -1266993 -140503 140427 35212
6190C5212l83497K08665j91315l43754J020147l52885j1522P27400o37531N37130
$$ 35212 -348285 -139620 -330935 -674689 345458 -7427 -18949 708451 70920 608050
6180F08050j72319n81391N88036j090331R95937L63988j207671P3540M27001n3228
$$ 608050 435731 -145660 442376 -647955 347982 711970 -495701 -422161 4840 -48388
6170d8388J27978K86475m97735K16294k27589N94901k96645l34389P115l65508
$$ -48388 79590 366065 -131670 84624 -142965 451936 155291 -179098 -171983 -537491
6160e37491j04097J76306k54650P53991k19491n1748N22149j33373j56521p5160
$$ -537491 -641588 -465282 -719932 34059 -185432 -237180 284969 151596 -4925 -80085
6150h0085m4872J26445k35136O9049K6353K6790j53235n24242R64629k81943N2773
$$ -80085 -124957 1488 -233648 -164599 -138246 -111456 -264691 -788933 175696 -106247 -53474
6139e3474j55258J76585j2061l17590R52937m87419m1358N3690n73863O19119
$$ -53474 -208732 -32147 -44208 -361798 591139 103720 62362 116052 -457811 161308
6129A61308J74981m0693n09448O5291K01554j56458j78803p1615L77913M01899
$$ 161308 336289 295596 -213852 -148561 52993 -103465 -282268 -353883 24030 425929
6119D25929o83234O19228m83122K25082o66343J235064m72196k31429r25382L12226
$$ 425929 -257305 361923 -121199 103883 -562460 672604 200408 -31021 -956403 -644177
6109f44177L50805m87510J108199j004971J59391J46676k51770R66961p96478
$$ -644177 -293372 -780882 327317 -677654 -518263 -371587 -623357 343604 -452874
6100d52874o2358O04378J10414l26332M286O81078r45575k91091J152064l49914
$$ -452874 -515232 89146 199560 -126772 -122486 558592 -386983 -678074 473990 124076
6090A24076R7438p58926M0859k02392P66717k38110m51099O16622j51563J018
$$ 124076 221514 -537412 -496553 -698945 67772 -170338 -621437 -4815 -156378 -155360
6080a55360l41583O13813m1073k06338j53769P9950l27187L53256K60794j64758
$$ -155360 -496943 116870 75797 -130541 -284310 -204360 -531547 -178291 82503 -82255
6070h2255k02346M59024O0219j072053P84932l45986J77215Q6156l47519N21104
$$ -82255 -284601 174423 234642 -837411 -52479 -398465 -221250 -135094 -482613 38491
6060C8491j28537j73676J188978k244000J067505m15726P19285q97529M64132
$$ 38491 -90046 -263722 925256 -1318744 -251239 -666965 52320 -845209 -381077
6051c81077N84355n44265J08118L17372p384p16466O96944k43169K18444m5563
$$ -381077 203278 -340987 -232869 84503 77119 -639347 57597 -185572 32872 -12691
6041a2691N21493l41703q3263L48453l42471j078599P52390k33041O13403P4865
$$ -12691 508802 167099 83836 432289 89818 -988781 -236391 -469432 143971 218836
6031B18836n02515K56482L79248K47506k16682o76661j87228N14310N11762q52475
$$ 218836 -283679 -27197 352051 599557 382875 -293786 -481014 33296 545058 -307417
6021c07417J66994K53950k71561n2278J08773j51378Q09948o15121k3403l57034
$$ -307417 -140423 113527 -158034 -210312 -101539 -252917 557031 -58090 -81493 -438527
6011d38527N37340o2511R4506k09136p71003R7746J02032M56027k84836Q96186
$$ -438527 98813 36302 130808 -78328 -849331 -751585 -649553 -193526 -478362 417824
6001D17824r58545P07781p40104M88354k93372Q22968K0253k51200n39060O02977
$$ 417824 -540721 167060 -573044 -84690 -378062 444906 465159 213959 -325101 277876
5991B77876k33053p12176N10094K18561L10106k23721k84361j00271j37252M05027
$$ 277876 44823 -667353 -157259 61302 371408 147687 -136674 -236945 -374197 30830
5981C0830n34541k73861R56172r25152J259886o77990p98968Q67948P86107r17884
$$ 30830 -503711 -777572 178600 -746552 513334 -164656 -963624 -95676 690431 -227453
5971b27453O11843m33778p95732P92402J73060L03725L35351r16039p5260L20424
$$ -227453 384390 -49388 -845120 -52718 120342 424067 759418 -156621 -231881 88543
5961H8543k78961o42891Q38527k28946N9261O77524j473939J095957m36441O33546
$$ 88543 -190418 -833309 5218 -223728 -164467 513057 -960882 135075 -301366 332180
5951C32180M3732l32889J50137r5658K58822p29548o29630J085901J82745o59414
$$ 332180 375912 43023 193160 97502 356324 -373224 -1002854 83047 265792 -393622
5941c93622O44267O52722r59552k89524k51454R26134n40798R1685j99246n59740
$$ -393622 250645 903367 -56185 -345709 -597163 328971 -211827 -120142 -319388 -879128
5931h79128R13282m25470M50713j49242j57598L9036k3939N39344o67078K99740
$$ -879128 34154 -391316 59397 -89845 -247443 -208407 -232346 306998 -360080 -60340
5921f0340K5080J82874r56798P7146J024046l64306r61500J265381j36636r85152
$$ -60340 -35260 147614 -809184 -732038 292008 -72298 -1033798 231583 94947 -890205
5911h90205J91259m61201J153481J05798o0929n12676N51021J67494n81592j30796
$$ -890205 -698946 -1160147 -6666 99132 38203 -474473 76548 244042 -337550 -468346
5901d68346m72658Q34738N09226K5585n55677m35777J16869k46114P31329M7590
$$ -468346 -941004 -106266 402960 428545 -127132 -562909 -446040 -692154 39175 86765
5891H6765j92548J55478l54835j2089J92599p3564j22885O12215Q1610n21513
$$ 86765 -105783 49695 -305140 -317229 -124630 -198194 -321079 291136 372746 -148767
5881a48767q4965l1218j6789O82803p07713J4238J34640L79324j175417J077633
$$ -148767 -233732 -264950 -281739 401064 -306649 -292411 -157771 221553 -953864 123769
5871A23769j23530J84223j00686m04074R3980L45023p66457N31868j07876K93391
$$ 123769 239 184462 83776 -320298 -226318 118705 -647752 -115884 -223760 69631
5861F9631k82604m30504R23577k48227R5845j70367M3232k53259J90410K89989
$$ 69631 -212973 -643477 280100 31873 127718 -42649 583 -252676 -62266 227723
5851B27723m82516o87229O43225Q93355q53007N19977m59113q0402K06034N91247
$$ 227723 -254793 -942022 -298797 594558 -258449 261528 -197585 -277987 -71953 519294
5841E19294n66071L75085o44260J30806k27242M59234L48670m40269J8072Q23037
$$ 519294 -46777 328308 -315952 -185146 -412388 46846 395516 -44753 -26681 796356
5831G96356j361438Q89324n8094l8730n35840J78670J107257n70594j087424N6095
$$ 796356 -565082 324242 266148 227418 -308422 -129752 977505 406911 -680513 -624418
5821f24418P66221j96940j97622L24839l0379o77230Q51002P6542k30915L10368
$$ -624418 141803 -55137 -252759 72080 41701 -635529 215473 292015 61100 371468
5811C71468o85435k27449J44961N28869n07588N73921L32374J14480m40942o54175
$$ 371468 -313967 -541416 -396455 132414 -375174 198747 531121 645601 204659 -449516
5801d49516P41781l37649l7475J12160j30517j31163K71765l15499p60156R91103
$$ -449516 292265 -45384 -82859 29301 -101216 -232379 39386 -276113 -1036269 -45166
5791d5166j15844K36400O29784K51993p94410j35039J32279R5413K47045n36425
$$ -45166 -161010 75390 705174 957167 162757 27718 159997 255410 502455 -33970
5781c3970L22597m29717p1162L68982m04724j29818K71102j78380q5433R43086
$$ -33970 288627 -141090 -212252 156730 -247994 -377812 -106710 -285090 -370523 572563
5771E72563k53926q5509m53487l13541R10305j171075J408645q81052O58616l31550
$$ 572563 318637 233128 -220359 -533900 376405 -794670 613975 -267077 391539 59989
5761E9989M18500p20797K22757k89429N78152j8978p36950M63650r90077J12394
$$ 59989 478489 -242308 -19551 -308980 269172 250194 -486756 -23106 -1013183 -900789
5751i00789Q97454N1974P64121j168166N49194j240520J474751l66105n0334p84524
$$ -900789 -3335 48639 812760 -355406 193788 -1046732 428019 61914 11580 -772944
5741g72944Q98261L36537L03755l56981r79521q7940O81292j94317L3838P67247
$$ -772944 125317 461854 765609 408628 -570893 -658833 22459 -171858 -138020 629227
5731F29227p33925N41659m7816m39897M68629O96512p75545K62185n58758L85082
$$ 629227 -104698 436961 389145 -50752 417877 1114389 338844 601029 42271 427353
5721D27353o95542Q65096l39315L06429j062051J040662m38397m12008L61683
$$ 427353 -268189 596907 257592 564021 -498030 542632 104235 -307773 53910
5712E3910L52454o30798O5811K84415J9971j71223l51938Q4048j80661L86022
$$ 53910 406364 -224434 -158623 125792 145763 -25460 -377398 -293350 -474011 -87989
5702h7989K55769K33164k64397K64811o96419J0080L48173k63032L06946j4874
$$ -87989 167780 400944 136547 401358 -295061 -284981 63192 -199840 107106 92232
5692I2232O10726l47808n36049o01422Q35177m92215J425044q85199J089673r68217
$$ 92232 702958 355150 -180899 -782321 52856 -439359 985685 100486 1190159 221942
5682B21942N90075j85501o14227M57992L9226j04155k59101Q23131K17564p4262
$$ 221942 812017 626516 12289 470281 509507 405352 146251 969382 1186946 1112684
5672A112684p23297J42185K22608l19685m391M12113k31055l64358J13979k07425
$$ 1112684 389387 531572 754180 434495 430104 842217 611162 246804 360783 153358
5662A53358M62968J70327L32942o37449q09692J620182j321227Q52309Q5153q98314
$$ 153358 616326 786653 1119595 482146 -327546 1292636 -28591 823718 908871 10557
5652A0557N83130J471448j200833m3614N6308J41282l81404P61463n86882L2800
$$ 10557 593687 2065135 864302 820688 876996 1018278 636874 1398337 811455 844255
5642H44255N89911R6807O05591o80006M10411p2174p83k20163m86794N20074R01396
$$ 844255 1434166 1530973 2136564 1456558 1866969 1794795 1794012 1573849 1087055 1607129 2508525
5631B508525o24274P55649l79183j78978j21056j05619j11682O49213R16667n58399
$$ 2508525 1884251 2639900 2260717 2081739 1960683 1855064 1743382 2392595 3309262 2750863
5621B750863J48514J13481J112567M42799J094933Q19557J311403K048371O09917
$$ 2750863 2899377 3012858 4125425 4568224 5663157 6482714 7794117 9842488 10452405
5612A0452405K407087J798232J439285K305666K486336L135544L288948L026967
$$ 10452405 12859492 14657724 16097009 18402675 20889011 24024555 27313503 30340470
5604C0340470J753697P99675P07681n68217k90105j575778j815924j357596k187851
$$ 30340470 32094167 32893842 33601523 33033306 32743201 31167423 29351499 27993903 25806052
5595B5806052j268180j072408k833427k250233k650792k173986r34359j057490
$$ 25806052 24537872 23465464 20632037 18381804 15731012 13557026 12622667 11565177
5587A1565177p76640j742901J022642l48511n19829O99799O77713K66462K14627
$$ 11565177 10788537 9045636 10068278 9719767 9199938 9899737 10577450 10843912 11058539
5578A1058539M64586o46368K76279j92977Q60011p53863N69966j382512J929j214137
$$ 11058539 11523125 10876757 11153036 10960059 11820070 11066207 11636173 10253661 10255590 9041453
5568I041453o30891l74787m36195p68742q85199r72350J39798n80804j055122
$$ 9041453 8410562 8035775 7599580 6830838 5945639 4973289 5113087 4532283 3477161
5559C477161R8316p89646o49576M75472j071278J75937j92187P8156j37068p98619
$$ 3477161 3575477 2785831 2136255 2611727 1540449 1716386 1524199 1602355 1465287 666668
5549F66668R23394p52170Q41021o92607K05299l35692K95297j86167J02722j178813
$$ 666668 1590062 837892 1678913 986306 1191605 855913 1151210 965043 1067765 -111048
5539a11048J173537n29850j4109M859j25748n11165O36049o14777J006797k18409
$$ -111048 1062489 532639 518530 523389 397641 -113524 522525 -92252 914545 696136
5529F96136l61076K77781p1836o4433O38014j46140j86506o74276K4325J05610
$$ 696136 335060 612841 541005 476572 1114586 968446 781940 107664 131989 237599
5519B37599k9290O52717q41345K49653O31100q86950M15287l51790N62594j98287
$$ 237599 208309 861026 19681 269334 900434 13484 428771 76981 639575 441288
5509D41288j47824K42388L44386m56494j02669M14269m27469J53161m8220L89429
$$ 441288 293464 535852 880238 423744 321075 735344 307875 461036 412816 802245
5499H02245j90132j52585J54580j35162j29230Q32385j016894R7398O78266j53852
$$ 802245 612113 459528 614108 478946 349716 1182101 165207 262605 940871 787019
5489G87019j015774k9937Q78493n01071M18963k72760L06636j8973J33953q81599
$$ 787019 -228755 -258692 619801 118730 537693 264933 571569 552596 686549 -195050
5479a95050L46000O69226r9225n21382P26146j04225J1605K74344k97494l9163
$$ -195050 150950 820176 720951 199569 925715 821490 833095 1107439 809945 770782
5469G70782m47472J97879j68896j01064n63717L87745N54988j53965O26787q13341
$$ 770782 323310 521189 352293 251229 -312488 75257 630245 476280 1103067 289726
5459B89726O09749m31500k8691P40323j167487J83601K56581L3084n02327M66928
$$ 289726 899475 467975 439284 1179607 12120 195721 452302 485386 -16941 449987
5449D49987M25921N23692j267773L98454j38978j008467J199150j15198J89066
$$ 449987 875908 1399600 131827 530281 391303 -617164 581986 466788 655854
5440F55854q63120J320863n13116j2110M65756m46170k74915m64814K82119P17317
$$ 655854 -207266 1113597 600481 588371 1054127 607957 333042 -131772 150347 867664
5430H67664j337288J010899M49859o78357L59949j17845k68904k39084K94230
$$ 867664 -469624 541275 991134 312777 672726 554881 285977 46893 341123
5421C41123N709P36809r04313J166876j442427q9158Q36573k39456o37975N62320
$$ 341123 346832 1083641 179328 1346204 -96223 -185381 651192 411736 -226239 336081
5411C36081J51886N15378n82470M19489K57558o88462J39822R35J44809K9534
$$ 336081 487967 1003345 420875 840364 1097922 409460 549282 550217 695026 724560
5401G24560k69694n13676J007258k8894m15167j38753J73523k52453L8909J98161
$$ 724560 454866 -58810 948448 919554 504387 365634 539157 286704 325613 523774
5391E23774P9284n29530N56260j20766k82941M12754N09758m49549K77917k39163
$$ 523774 603058 73528 629788 509022 226081 638835 1148593 699044 976961 737798
5381G37798k30624k56115N9514M12300J04016l1520m92268J124763j150365k75479
$$ 737798 507174 251059 310573 722873 826889 795369 303101 1427864 277499 2020
5371B020m9076Q41232l67676K60207L50609m41816n00458R19097m94399k95247
$$ 2020 -47056 794176 426500 686707 1037316 595500 95042 1014139 519740 224493
5361B24493L06505K82287o82883N76472J97941k30944K07343l56016L35544r0703
$$ 224493 530998 813285 130402 706874 904815 673871 881214 525198 860742 770039
5351G70039n3259L61181m21389l20378R5195L61021J9651n40496R35223p58712
$$ 770039 716780 1077961 656572 336194 431389 792410 812061 271565 1206788 448076
5341D48076K11742l47975j5515Q11219J09927p95256O0275L62490k15812Q8193
$$ 448076 659818 311843 296328 1107547 1217474 422218 482493 844983 629171 717364
5331G17364P9711O21698m97724l02334J85018L87849M38382r93763q8999j44242
$$ 717364 797075 1418773 921049 618715 803733 1191582 1629964 636201 547202 402960
5321D02960p3423N34060N29987n48834j041566K63391R15814j047214m55173J489170
$$ 402960 329537 863597 1393584 844750 -196816 66575 982389 -64825 -519998 969172
5311I69172j006402P03025N6654J88552J82502l16108k90441J54746P62303o73617
$$ 969172 -37230 665795 722449 911001 1093503 777395 486954 641700 1404003 730386
5301G30386J30685r96422J214461m23639P8603O41824l52343q4689q92904l38
$$ 730386 861071 -135351 1079110 655471 734074 1375898 1023555 938866 45962 45624
5291D5624P90243j25836r5378j78182J29924K86608O0066M57109j57831j323843
$$ 45624 835867 710031 614653 436471 566395 853003 913069 1370178 1212347 -111496
5281a11496J121606n39539m72309L64032K86558O89541n41707j24904l32301P5501
$$ -111496 1010110 470571 -1738 362294 648852 1338393 796686 671782 339481 414982
5271D14982n1650N50714k65678K93786k13279n00738P22060M5114r01238J174808
$$ 414982 363332 914046 648368 942154 728875 228137 950197 995311 94073 1268881
5261A268881k46302m84737O47094p19281R2576O89749k69440n3686m31068O57974
$$ 1268881 1022579 537842 1184936 465655 558231 1247980 978540 924854 493786 1151760
5251A151760m22370k56018m85719J231953j261799J234036m31058P1401q20906
$$ 1151760 729390 473372 -12347 1219606 -42193 1191843 760785 832186 11280
5242A1280M78138M42383p78231J51583M80033M74613j36030n29793k21788j83304
$$ 11280 489418 931801 153570 305153 785186 1259799 1123769 593976 372188 188884
5232A88884N70198K73153L4747k07373k87940j41652R0749J02310P81953o79974
$$ 188884 759082 1032235 1066982 859609 571669 430017 520766 623076 1405029 725055
5222G25055K6422R04952L2178O97r55265J126548L72578n91518M167J0370M89202
$$ 725055 751477 1656429 1688607 1689304 734039 1860587 2233165 1641647 1645814 1656184 2145386
5211B145386l67161J97249L8083O60750l80767p09469J311543n9249L49383J70664
$$ 2145386 1778225 1975474 2013557 2674307 2293540 1584071 2895614 2836365 3185748 3356412
5201C356412J50956M86938j334028O87602j116457J179757K6752k36372L13898
$$ 3356412 3507368 3994306 2660278 3347880 2231423 3411180 3437932 3201560 3515458
5192C515458r24056J20208r14197J419417r86561j697K58134O20047n91771N54771
$$ 3515458 2591402 2711610 1797413 3216830 2230269 2228572 2486706 3106753 2514982 3069753
5182C069753j17304j232097N48872K66184m68692j270485N83340l44517p95516
$$ 3069753 2952449 1720352 2269224 2535408 2066716 796231 1379571 1035054 239538
5173B39538K25470N80213o37832k71431N59667L34922m36961O6309J53734m28069
$$ 239538 465008 1045221 407389 135958 695625 1030547 593586 659895 813629 385560
5163C85560J059964l49498j84488l80680m75498P87098L65642l52856l30580m07412
$$ 385560 1445524 1096026 911538 530858 55360 842458 1208100 855244 524664 117252
5153A17252L64992l9389J61612K30320n3606l02212M16885j07694J38677o67841
$$ 117252 482244 442855 604467 834787 781181 478969 895854 788160 926837 258996
5143B58996O51291m92779J155836r51629N32845m13039Q22545r8564n8635o80655
$$ 258996 910287 417508 1573344 621715 1154560 741521 1564066 1465502 1406867 726212
5133G26212J25845N38068J83433R1630o0227n69998M4814Q18665j122190M63147
$$ 726212 852057 1390125 1573558 1665188 1604961 1034963 1079777 1898442 776252 1239399
5123A239399j78788M57350O84J04096l1992m43401P60598l78066l22067M95350
$$ 1239399 1060611 1517961 1518645 1622741 1590749 1147348 1907946 1529880 1207813 1703163
5113A703163J126142p29213l69263M05656k64669L33947O44592p37820K44949
$$ 1703163 2829305 2100092 1730829 2136485 1871816 2205763 2850355 2112535 2357484
5104B357484J95253o19311K89201k02058N35333o51733l1939O29744n42626Q01305
$$ 2357484 2552737 1933426 2222627 2020569 2555902 1904169 1872230 2501974 1959348 2760653
5094B760653o23623P42282j52777q4046J93143r3273m47807J83908O35414m74169
$$ 2760653 2137030 2879312 2726535 2642489 2835632 2742359 2294552 2478460 3113874 2639705
5084B639705O31592m73720N45415m60619m14070P71393J66583J05644m48432L82248
$$ 2639705 3271297 2797577 3342992 2882373 2468303 3239696 3406279 3511923 3063491 3445739
5074C445739k91023L46594J33079l07725L24000P1500O59263k96550l11085M59575
$$ 3445739 3154716 3501310 3634389 3326664 3650664 3722164 4381427 4084877 3773792 4233367
5064D233367k99383P89707K16804J48894m71836j28154M65121l12074L80855K39119
$$ 4233367 3933984 4723691 4940495 5089389 4617553 4489399 4954520 4642446 5023301 5262420
5054E262420l906P50806J28758j389775R85570O09058J77820o3910J76039K9485
$$ 5262420 5258514 6009320 6138078 4748303 5733873 6342931 6520751 6456841 6632880 6662365
5044F662365j19994K20372R51105l07612J253861j060765M10936Q39844J08466
$$ 6662365 6542371 6762743 7713848 7406236 8660097 7599332 8010268 8850112 8958578
5035H958578N1656J24480O27594n92365Q19911J02273N7516J168398J89723j95230
$$ 8958578 9010234 9134714 9762308 9169943 9989854 10092127 10149643 11318041 11507764 11312534
5025A1312534L20698j19936J136196L933R03452j129700J398224P4362O20396
$$ 11312534 11633232 11513296 12649492 12653425 13556877 12427177 13825401 13899763 14520159
5016A4520159L82597K38349K94953K58805P10709K26871J5094J235121j05462
$$ 14520159 14902756 15141105 15436058 15694863 16405572 16632443 16647537 17882658 17777196
5007A7777196O10732M78548J071099L71097P56447L17626O99284R57579M47022
$$ 17777196 18387928 18866476 19937575 20308672 21065119 21382745 22082029 23039608 23486630
4998B3486630N78134J493674O40593M14491J322706J137780J042637J201118J595049
$$ 23486630 24064764 25558438 26199031 26613522 27936228 29074008 30116645 31317763 32912812
4989C2912812Q69165J388563K011412K505516L540410L360330M259488M456883
$$ 32912812 33781977 35170540 37181952 39687468 43227878 46588208 50847696 55304579
4981E5304579N610738N235378P647931P198024Q576526J0452992J3370577J3602304
$$ 55304579 60915317 66150695 73798626 80996650 89573176 100026168 113396745 126999049
4973A26999049J6196544J5402923J8041180J5555860J6580434J6796185J7393378
$$ 126999049 143195593 158598516 176639696 192195556 208775990 225572175 242965553
4966B42965553J8765209K1894907K1813847K3045257J9907377J7624964J6920284
$$ 242965553 261730762 283625669 305439516 328484773 348392150 366017114 382937398
4959C82937398J3768440J4005798J3969612J6421737J6058765J4726203J0602396
$$ 382937398 396705838 410711636 424681248 441102985 457161750 471887953 482490349
4952D82490349O277079J980711j173052o110567o421662n066271q024874q092074
$$ 482490349 488767428 490748139 489575087 483464520 477042858 471976587 463951713 455859639
4944D55859639r920985j2790304j6024463j8094617k3331775k0155930j9266060
$$ 455859639 445938654 433148350 417123887 399029270 375697495 355541565 336275505
4937C36275505j8559195j7035880j8929949j8414450j8629716k2900620k1649362
$$ 336275505 317716310 300680430 281750481 263336031 244706315 221805695 200156333
4930B00156333k0438176j7660582j6606646j4874805j3104609j2962259j1260236
$$ 200156333 179718157 162057575 145450929 130576124 117471515 104509256 93249020
4923I3249020j2440848j0668856r146513p120507n792439m812314m326748m291174
$$ 93249020 80808172 70139316 60992803 53872296 48079857 43267543 38940795 34649621
4915C4649621k903911l481567k722529j584222m99972k111336q56778j338795
$$ 34649621 31745710 28264143 25541614 23957392 23457420 21346084 20489306 19150511
4907A9150511j289340L12585q18256n82230j809345J97789j3106j116467m80378
$$ 19150511 17861171 18173756 17355500 16773270 14963925 15161714 15148608 14032141 13551763
4898A3551763j130229M21908j35386n77089j285901l8185r7228q11574M58355
$$ 13551763 12421534 12843442 12708056 12130967 10845066 10806881 10709653 9898079 10356434
4889A0356434o5497j073655j93012J1529n16707j70062j01872p40398O62332p47588
$$ 10356434 10290937 9217282 9024270 9035799 8519092 8349030 8247158 7506760 8169092 7421504
4879G421504M69168J42759r17298j074478K93602J78997r707N02566p66914K25758
$$ 7421504 7890672 8033431 7116133 6041655 6335257 6514254 6504547 7007113 6240199 6465957
4869F465957j33326j345859O31264j17684J21838r71630Q62736l72451l49448
$$ 6465957 6332631 4986772 5618036 5500352 5622190 4650560 5513296 5140845 4791397
4860D791397K3954r2189K58235j83357l91960j16387l21012J92323n30086P65246
$$ 4791397 4815351 4723162 4981397 4798040 4406080 4289693 3968681 4161004 3630918 4396164
4850D396164m57261L03157q52005L37228M66961o83031n61580N2719M32829p3620
$$ 4396164 3938903 4242060 3390055 3727283 4194244 3511213 2949633 3002352 3435181 3361561
4840C361561L69049p47634J89892l21670J76059O369K9550n28864J93781j83114
$$ 3361561 3730610 2982976 3172868 2851198 3027257 3033626 3063176 2534312 2728093 2544979
4830B544979K60478O67978n37348p48172R60265k29729m56616J02941n23065J48847
$$ 2544979 2805457 3473435 2936087 2187915 3148180 2918451 2461835 2564776 2041711 2190558
4820B190558K55543l38604M68134n42919L21826l7382m57539m91000K15781k42383
$$ 2190558 2446101 2107497 2575631 2032712 2354538 2317156 1859617 1368617 1584398 1342015
4810A342015k18553O43763k79267K73389k10829N52455N8525l09719K34864j89868
$$ 1342015 1123462 1767225 1487958 1761347 1550518 2102973 2161498 1851779 2086643 1896775
4800A896775m99790l5898J55525j36195J25985P9134L1727n74108n38138P23678
$$ 1896775 1396985 1361087 1516612 1380417 1506402 1585536 1617263 1043155 505017 1228695
4790A228695L74816J10360n14770k44863L90046Q5646O920n36110n5630N86750
$$ 1228695 1603511 1713871 1199101 954238 1344284 1429930 1436850 900740 845110 1431860
4780A431860n79262j5877J94106k15016O89237m38083l53529J260467q81634L91945
$$ 1431860 852598 836721 1030827 815811 1505048 1066965 713436 1973903 1092269 1484214
4770A484214J23676j370690M83748M59083n97026P87006K99714q49871M04351
$$ 1484214 1607890 237200 720948 1180031 583005 1370011 1669725 819854 1224205
4761A224205p77675Q19877j59141L94776m41796J70805P86540j275899J3691J226410
$$ 1224205 446530 1266407 1107266 1502042 1060246 1231051 2017591 741692 755383 1981793
4751A981793p88790J86234n65515J22304L11360j69463O76204r4715j012151R71273
$$ 1981793 1193003 1379237 813722 936026 1247386 1077923 1754127 1659412 647261 1618534
4741A618534l30265j74042M3450k43360M08931m04211N75838o02075L88014M48212
$$ 1618534 1288269 1114227 1157677 914317 1323248 919037 1494875 892800 1280814 1729026
4731A729026l34814J58645N466J4127K21942p65843N21245M4578n61394J091395
$$ 1729026 1394212 1552857 1558323 1572450 1794392 1028549 1549794 1594372 1032978 2124373
4721B124373o49521K7251K28493M57010p8516K72124k38086l49498L25377M09687
$$ 2124373 1474852 1502103 1730596 2187606 2109090 2381214 2143128 1793630 2119007 2528694
4711B528694q8708o67759M16915L44638K73456K68179l76921K32762J70246M16458
$$ 2528694 2439986 1772227 2189142 2533780 2807236 3075415 2698494 2931256 3101502 3517960
4701C517960m6854o0325n06781P81773r71544P45097M89767n43168l63397K16434
$$ 3517960 3471106 3410781 2904000 3685773 2714229 3459326 3949093 3405925 3042528 3258962
4691C258962k11803l39809j01215O60717k003362R78221K85823r72194P92814
$$ 3258962 3047159 2707350 2606135 3266852 1263490 2241711 2527534 1555340 2348154
4682B348154j6305q04762k95869n8597n8135o3692M88233k50486m39363j79837
$$ 2348154 2331849 1527087 1231218 1172621 1114486 1050794 1539027 1288541 849178 669341
4672F69341L37273j22246P2959J91653k24461O85031o42210m33079J7932m44588
$$ 669341 1006614 884368 957327 1148980 924519 1609550 967340 534261 552193 107605
4662A07605J055199K77315q53765j73203P07718j17615l45987P15953l04820n44170
$$ 107605 1162804 1440119 586354 413151 1120869 1003254 657267 1373220 1068400 524230
4652E24230M34087k66584L1359K640J89042j40282q83897P09976m42525O68331
$$ 524230 958317 691733 723092 725732 914774 774492 -109405 600571 158046 826377
4642H26377J96934r53427K16882N08677l66163Q03618m11191p13962j02566J15048
$$ 826377 1023311 69884 286766 795443 429280 1232898 821707 107745 5179 120227
4632A20227L90602K3869k44545K4379m76445Q19553o55511R28225j53800q64710
$$ 120227 510829 534698 290153 314532 -161913 657640 2129 930354 776554 -88156
4622h8156M51414P95825j345718K78342M46931l42303m45362J106626p47681K80904
$$ -88156 363258 1159083 -186635 91707 538638 196335 -249027 857599 109918 390822
4612C90822K70013n63996J499340j001826M15295j348224N05605L50329L57700
$$ 390822 660835 96839 1596179 594353 1009648 -338576 167029 517358 875058
4603H75058m56011j46338J32214L7255p8707O87565K14919j252696R72072j41782
$$ 875058 419047 272709 404923 442178 363471 1051036 1265955 13259 985331 843549
4593H43549l33897M85774k60186m91083N38254p83470O43493J07754r6606l0964
$$ 843549 509652 995426 735240 244157 782411 -1059 642434 750188 653582 622618
4583F22618l20925m02549J95272K28808k87340L28570R77176o09557j12728O3703
$$ 622618 301693 -100856 94416 323224 35884 364454 1341630 732073 619345 683048
4573F83048j025122P38064n75948K926M29583L2158M45000P13103j211573l3153
$$ 683048 -342074 395990 -179958 -177032 252551 284709 729709 1442812 231239 198086
4563A98086K36332m55450L61040J16253o74029Q70843m21733j49520J75521k1908
$$ 198086 434418 -21032 340008 456261 -217768 653075 231342 81822 257343 235435
4553B35435O3107M78912j13015r78926K59630N19547J04779l88881J5551l2062
$$ 235435 298542 777454 664439 -314487 -54857 464690 569469 180588 196139 164077
4543A64077k58780K04805J61941J47157K63872m34485K13589K19298r41564R73383
$$ 164077 -94703 110102 272043 419200 683072 248587 462176 681474 -260090 713293
4533G13293m98017m97124J377094k33174l07923r55499O38537j09248j34319q4646
$$ 713293 215276 -281848 1095246 862072 554149 -401350 237187 127939 -6380 -91026
4523i1026K24288o42696J339546R8594M33015o30222o36700l95433M62950j67805
$$ -91026 133262 -509434 830112 928706 1361721 731499 94799 -300634 162316 -5489
4513e489R5634M04538n73146J050236q40822L27377n52627j65740M29186m80155
$$ -5489 90145 494683 -78463 971773 130951 458328 -94299 -260039 169147 -311008
4503c11008J109780q84897l98250J710979j216319K45314R73134o83132J158687
$$ -311008 798772 -86125 -484375 1226604 10285 255599 1228733 545601 1704288
4494A704288j425539j99017M89324q46735Q70130r35944R60641j64297n38777
$$ 1704288 278749 79732 569056 -277679 592451 -343493 617148 452851 -85926
4485h5926L60748N8983j34676j84342j81394N12642K51516R8120m49912J91960
$$ -85926 274822 333805 199129 14787 -166607 346035 597551 695671 245759 437719
4475D37719m88817P1210j07282j27258N95409l74517J02425l36583P29990o70495
$$ 437719 -51098 20112 -87170 -214428 380981 6464 108889 -227694 502296 -168199
4465a68199L71566K07385M58421p13987K45276L80229o05360l19402M2511J18003
$$ -168199 203367 410752 869173 155186 400462 780691 175331 -144071 -101560 16443
4455A6443N23510j01045P02039o29922k39399L97618J42726r22397K39311L95338
$$ 16443 539953 438908 1140947 511025 271626 669244 811970 -110427 128884 524222
4445E24222J09829m67273n23776Q20265m98374J04416L58022p61390o1937J134926
$$ 524222 634051 166778 -356998 463267 -35107 69309 427331 -334059 -395996 738930
4435G38930j032229Q59127o31752j69736P43970J65641J9443J97838n01678p24465
$$ 738930 -293299 565828 -65924 -235660 508310 673951 693394 891232 389554 -334911
4425c34911J16757M11493J75719o08124J114610m74358k00907n8226p0886j32162
$$ -334911 -218154 193339 369058 -239066 875544 401186 200279 142053 71167 -60995
4415f0995M52208q82761J163190r98111K98N98941K60061m27203j66111L28946
$$ -60995 391213 -491548 671642 -326469 -326171 272770 532831 105628 -60483 268463
4405B68463N3069j7426J40693k39189j71279K53071o8852Q25473n08020j96856
$$ 268463 321532 304106 444799 205610 34331 287402 218550 1044023 536003 339147
4395C39147l64023J96899R0082M0245j19314j02625K35170l97017K97126j17150
$$ 339147 -24876 172023 262105 302350 183036 80411 315581 -81436 215690 98540
4385I8540K72824R0582o87324Q41898j53663M71858j000859N28350M71151j072590
$$ 98540 371364 461946 -225378 616520 462857 934715 -66144 462206 933357 -139233
4375a39233n73015J317736l50591J090230r28825m55150K93961Q510L90353q461
$$ -139233 -712248 605488 254897 1345127 416302 -38848 255113 263623 653976 645515
4365F45515l63480o05461J432198n84129N39089p59317Q57388p06602Q53351q02682
$$ 645515 282035 -323426 1108772 524643 1063732 304415 1161803 455201 1308552 505870
4355E05870P18364n28935K07278l08856K11252o788o99660j3046Q26694K75662
$$ 505870 1224234 695299 902577 593721 804973 798185 98525 85479 912173 1187835
4345A187835J82042o84519K20649M52626k6461m05873j49483k6407o1028J31712
$$ 1187835 1369877 685358 906007 1358633 1332172 926299 776816 750409 689381 821093
4335H21093l17755L37820q88164R17090p56085M640K72930L00857n19752N12411
$$ 821093 503338 841158 -47006 870084 113999 118639 391569 692426 172674 685085
4325F85085p08113n054R4072j39659J67568J89226j40967J35987k06221M71703
$$ 685085 -23028 -28082 65990 -73669 93899 283125 142158 278145 71924 543627
4315E43627L48881k19618j258052P61146K46322k04047M33988o15387R14899q42759
$$ 543627 892508 672890 -585162 175984 422306 218259 652247 36860 951759 109000
4305A09000M73901r80264J247907l29154n27041K73393m44083J231683o45032
$$ 109000 582901 -397363 850544 521390 -5651 267742 -176341 1055342 410310
4296D10310m6879m84118O51805M93214j096687O76387m59891l2821k6818N94608
$$ 410310 363431 -120687 531118 1024332 -72355 604032 144141 111320 84502 679110
4286F79110o26593J76956p8360J36742J31549L68725q83777O30971l13276O82388
$$ 679110 52517 229473 151113 287855 419404 788129 -95648 535323 222047 904435
4276I04435j041670K00977j65046N78917K12188n56820N52243n86352J00935M72048
$$ 904435 -137235 63742 -101304 477613 689801 132981 685224 98872 199807 671855
4266F71855k47393L35923r57366N53472N8936n49494k12794J79001L90010n31721
$$ 671855 424462 760385 -196981 356491 415427 -134067 -346861 -167860 222150 -309571
4256c09571M91774M23382l49858M16144p23609M62754r20385J493587p78222k22295
$$ -309571 182203 605585 255727 671871 -51738 411016 -509369 984218 205996 -16299
4246a6299N15312r75897N61268P05211n01067R53721r30993L63519o63507n6770
$$ -16299 499013 -476884 84384 789595 288528 1242249 311256 674775 11268 -45502
4236d5502l15977K54728n22305N50671L81025j66730j32719K37310O51790j392071
$$ -45502 -361479 -106751 -629056 -78385 302640 135910 3191 240501 892291 -499780
4226d99780O08916Q6266P5836K89942j088185P34082k25874P00957k00174J07978
$$ -499780 109136 195402 271238 561180 -527005 207077 -18797 682160 481986 589964
4216E89964J5405p07024P26317n49573M92326k51121J46102O4490n58840K93106
$$ 589964 605369 -101655 624662 75089 567415 316294 462396 526886 -31954 261152
4206B61152L41268j35586l78839j20468P27835m72420K90933L03920j086574R92900
$$ 261152 602420 466834 87995 -32473 695362 222942 513875 817795 -268779 724121
4196G24121q33811P56582j162665J130881l87379l01795L93757J48766q95626
$$ 724121 -109690 646892 -515773 615108 227729 -74066 319691 468457 -427169
4187d27169L91171l59534O99369n44940k75260L00238R72280n93904l85158O26011
$$ -427169 -35998 -395532 303837 -241103 -516363 -216125 756155 162251 -222907 403104
4177D03104q13630P09281n29621J96919j7993Q77530k94287K32502j63070L16967
$$ 403104 -410526 298755 -230866 -33947 -51940 825590 531303 763805 600735 917702
4167I17702r08545l6894m5209k57376P91060r44224P60673n55520M24269L0994
$$ 917702 9157 -27737 -72946 -330322 460738 -483486 277187 -278333 145936 176930
4157A76930Q5250k54603j45061M10896l98906J088660l69386j05174p04106R8980
$$ 176930 262180 7577 -137484 273412 -125494 963166 593780 488606 -215500 -116520
4147a16520L98622M68889m47635K05877o31768p9410K47690j57526Q92925l05476
$$ -116520 282102 750991 303356 509233 -122535 -201945 45745 -111781 781144 475668
4137D75668j67864k87546j77226K19824M12287q69597L79849K04549R2697m83221
$$ 475668 307804 20258 -156968 62856 475143 -394454 -14605 189944 282641 -200580
4127b00580n5866L67426N8858J95761j10172k19588K58841k98295L49708j93533
$$ -200580 -256446 110980 169838 365599 255427 35839 294680 -3615 346093 152560
4117A52560l33977L71467N7485K57072j162394Q52347l15691P90984k99568o85602
$$ 152560 -181417 190050 247535 504607 -657787 194560 -121131 669853 370285 -315317
4107c15317N41006K03313J42301n02112L0565O33277j58952k80536J59592k35448
$$ -315317 225689 429002 571303 69191 99756 733033 574081 293545 453137 217689
4097B17689p36286O44001K68782j52742J30939K05745k41255j77263K30938m05691
$$ 217689 -518597 125404 394186 241444 372383 578128 336873 159610 390548 -15143
4087a5143K50021l02360K5323l52786R95427o80839n4504M29048n57026P7210
$$ -15143 234878 -67482 -42159 -394945 600482 -80357 -134861 294187 -262839 -185629
4077a85629n1986N19514p84539Q71272m4975M8862N3131K31502l37167R3277L89645
$$ -185629 -237615 281899 -502640 368632 323657 372519 425650 657152 319985 413262 802907
4066H02907o87979N36968j418098M23164J87664R7131O05078k68377J51589m43013
$$ 802907 114928 651896 -766202 -343038 -155374 -58243 546835 278458 430047 -12966
4056a2966Q83113m68340m02272L93748J27372p20540J047265n01853m62943R29248
$$ -12966 870147 401807 -465 393283 520655 -199885 847380 345527 -117416 811832
4046H11832n54707M35943o99956n09816Q36036r56741O85928l19371M88287N98956
$$ 811832 257125 693068 -6888 -516704 319332 -637409 48519 -270852 217435 816391
4036H16391m17467L65275j99671q773M43433J11627r08324K67834n09425L36505
$$ 816391 398924 764199 564528 555755 999188 1110815 202491 470325 -39100 297405
4026B97405M61604k23556r02585M13975N6453K26844P439p61475R33778N52588
$$ 297405 759009 535453 -367132 46843 103296 330140 337579 -423896 509882 1062470
4016A062470j573384K17828L50513k07652r2266n09562O36693J27867l81647j32191
$$ 1062470 -510914 -293086 57427 -150225 -242491 -752053 -115360 12507 -369140 -501331
4006e01331l78867Q51456O78879l57205Q9833o95670O81965l63778m27415R16298
$$ -501331 -880198 -28742 650137 292932 382765 -312905 369060 5282 -422133 494165
3996D94165K51822j50929o35598p03753M09980L64379J69228J98800O37423r34902
$$ 494165 745987 595058 -40540 -744293 -334313 30066 199294 398094 1035517 100615
3986A00615o3602m49063J20348K46752O23294K06037k83658j411134R28548K02336
$$ 100615 37013 -412050 -291702 -44950 578344 784381 500723 -910411 18137 220473
3976B20473O88111q05455M99984k57950J05262m06264l0118N86780n82327O87424
$$ 220473 908584 103129 603113 345163 450425 44161 14043 600823 18496 705920
3966G05920k49184m42300j65636N78572n21571N39594K6920m7234j62386J08830
$$ 705920 456736 14436 -151200 427372 -94199 445395 472315 425081 262695 371525
3956C71525o29927L04918M73020k23503l14782P92704J4667p66616L4295o22912
$$ 371525 -258402 46516 519536 296033 -18749 773955 788622 22006 56301 -566611
3946e66611R77703N7136k22895m65463N97123l81086k42700J158058j164493K49336
$$ -566611 411092 468228 245333 -220130 376993 -4093 -246793 911265 -253228 -3892
3936c892o5378l31274O50696n00903Q84112K70341o81438m48111j14911P60469
$$ -3892 -69270 -400544 250152 -250751 633361 903702 222264 -225847 -340758 419711
3926D19711j48051j184102J252397k98040k38234P13648o6451J55133j376317
$$ 419711 271660 -912442 339955 41915 -196319 517329 450878 606011 -770306
3917g70306J62609Q43270j15836O94537l05401l05077M66820j123995P64682R422
$$ -770306 -607697 235573 119737 814274 508873 203796 670616 -453379 311303 320725
3907C20725n75029N30103l64337j05474L44785J54417l25173K89381k58542l95841
$$ 320725 -254304 275799 -88538 -194012 150773 305190 -19983 269398 10856 -384985
3897c84985O51013j7994m25523o59712Q97029m6231K41138L91971n47853K88150
$$ -384985 266028 248034 -177489 -837201 59828 13597 254735 646706 98853 387003
3887C87003l85968m56476J058724p08289O22950M2433p8877k74998J9834L04625
$$ 387003 1035 -455441 603283 -105006 517944 560377 481500 206502 226336 530961
3877E30961p63611L98202k43218n36338M14126k67656Q9705O37590J03346l89053
$$ 530961 -232650 165552 -77666 -614004 -199878 -467534 -377829 259761 363107 -25946
3867b5946M1046m61020R38803q5237k72135k82124P97828r50302M09864J95850
$$ -25946 15100 -445920 492883 407646 135511 -146613 651215 -299087 110777 306627
3857C06627q39354O95694R0339m63941K84060p80J00279l12108N30630q09423
$$ 306627 -532727 162967 253306 -210635 73425 72645 172924 -139184 391446 -417977
3847d17977J59294J008363n15548j61423O16103l39391k41315n0254N91223r54037
$$ -417977 -258683 749680 234132 72709 688812 349421 108106 57852 649075 -304962
3837c04962J89927K40897J57497K05102j17119l1675j004214O63576n34758p8534
$$ -304962 -115035 125862 283359 488461 371342 339667 -664547 -971 -535729 -614263
3827f14263Q69499l64112k99625R45288j16099m40196N5398j83889j28675O16992
$$ -614263 255236 -108876 -408501 536787 420688 -19508 35890 -147999 -276674 340318
3817C40318j97284Q18965l31367o2551j105133K84126Q38774p93576L38071n69119
$$ 340318 143034 961999 630632 568081 -537052 -252926 585848 -207728 130343 -438776
3807d38776J46597K6993L13891l01895j60288J089536p65825k72501K27012N05684
$$ -438776 -292179 -265186 48705 -253190 -413478 676058 -89767 -362268 -135256 370428
3797C70428j117301J01165R00702l82718K74421p26661R71460l65541K16997K3595
$$ 370428 -746873 -645708 254994 -127724 146697 -579964 391496 25955 242952 266547
3787B66547m2p02461J58844L75926K26597l07067j51425n50517M77887M07072
$$ 266547 266505 -435956 -277112 98814 325411 18344 -133081 -683598 -205711 201361
3777B01361Q8693k98335j9692L03063k99787K72169p26638K40749O87138l36326
$$ 201361 290054 -8281 -27973 275090 -24697 247472 -479166 -238417 448721 112395
3767A12395O84123j041822l0898P7454P1549m01331K47825N92874q5649j35755
$$ 112395 796518 -245304 -276202 -198748 -127199 -528530 -280705 312169 226520 90765
3757I0765J03259k79588Q62550o87038j47117j08594j2337J38623r6425J94503
$$ 90765 194024 -85564 776986 89948 -57169 -165763 -178100 -39477 -135902 58601
3747E8601O80373j120007L62417J47330m4820m01890J36685J29313N11627m47246
$$ 58601 738974 -381033 -18616 128714 83894 -317996 -181311 -51998 459629 12383
3737A2383K5666o94037J266285j04398J24179p17094R2536L35391n75162Q4183
$$ 12383 38049 -655988 610297 505899 630078 -87016 5520 340911 -234251 -150068
3727a50068J5465K64539j73387p2732K76006N85092j143340Q94071M57131j94811
$$ -150068 -134603 129936 -43451 -116183 159823 744915 -398425 495646 952777 757966
3717G57966o63561l57229j30363K22882L60259p47450L99015j31234K25324j48519
$$ 757966 94405 -262824 -393187 -170305 189954 -557496 -158481 -289715 -64391 -212910
3707b12910k20195O65494n94185L14293R33293j044877j0475M2528K267K10361
$$ -212910 -433105 232389 -361796 -47503 885790 -159087 -169562 -127034 -124767 85594
3697H5594J85577P5376k93951o14704Q41095m41785M11262j93821Q09750o43000
$$ 85594 271171 346547 52596 -562108 278987 -162798 248464 54643 864393 221393
3687B21393n15654P65115r10340P16558n17903P6095N27225j214230O55512K11882
$$ 221393 -294261 470854 -439486 277072 -240831 -164736 362489 -851741 -196229 15653
3677A5653o44073M67812j54504L66535k63705j42616Q7931m19814J050123o632
$$ 15653 -628420 -160608 -315112 51423 -212282 -354898 -266967 -686781 363342 356710
3667C56710m56928O71355o61949K66916N5069J48528L44042r89195J224289j311155
$$ 356710 -100218 571137 -90812 176104 231173 379701 723743 -265452 958837 -352318
3657c52318M9970O65156j041374j8303R25665m21226j94782J09182L55666L66845
$$ -352318 -302348 362808 -678566 -696869 228796 -192430 -387212 -278030 77636 444481
3647D44481l98100l41623O73712m23778k93297P09900n7088l57868L33443J61269
$$ 444481 46381 -295242 378470 -45308 -338605 371295 314207 -43661 289782 451051
3637D51051o01195l49412J025373m46733O632Q4805M7978m61069M02345m2898
$$ 451051 -150144 -499556 525817 79084 85716 170521 218499 -242570 159775 116877
3627A16877J05125p9533k60256J46806k43056K90192J96307k41272J97232l41942
$$ 116877 222002 142469 -117787 29019 -214037 76155 272462 31190 228422 -113520
3617a13520m47258K3072O47339J97988j152925M15091M93782q25422N82637N7939
$$ -113520 -560778 -537706 109633 307621 -845304 -430213 63569 -761853 -179216 -121277
3607a21277L95350j12750j93620Q22372l10572o78633q55439N93665Q35208p65125
$$ -121277 274073 161323 -32297 790075 479503 -199130 -1054569 -460904 374304 -390821
3597c90821N51384n71258M29618l63504O55733p69250k07882R26049j02783p1663
$$ -390821 160563 -410695 18923 -344581 311152 -458098 -665980 260069 157286 85623
3587H5623k51025J78679L99369j074761M34938P58763j45381n18687L38691k90254
$$ 85623 -165402 13277 412646 -662115 -227177 531586 386205 -132482 206209 -84045
3577h4045o10980k265Q77832j38232r6568N50171m77834n14065M24280k99448
$$ -84045 -695025 -697290 180542 42310 -54258 495913 18079 -495986 -71706 -371154
3567c71154J3569M33704J14327j59655M82738l96339l80807j71515J07019M65104
$$ -371154 -357585 76119 190446 30791 513529 117190 -263617 -435132 -328113 136991
3557A36991k99226L88719J93774m81539K00655j81634k63295k04972P03317M94232
$$ 136991 -162235 226484 420258 -61281 139374 -42260 -305555 -510527 192790 687022
3547F87022m46447M89970L6618k03418o08490l28066L00204j05772K87297l11213
$$ 687022 240575 730545 767163 563745 -44745 -372811 -72607 -178379 108918 -202295
3537b02295M3997j61350M42929l99431L66608O2947n25388O43913n31760r947
$$ -202295 -158298 -319648 123281 -276150 90458 153405 -371983 271930 -259830 -269777
3527b69777J04403L69443k34236M25456m11901j34751O95872l00972K87830l82063
$$ -269777 -165374 204069 -30167 395289 -16612 -151363 544509 243537 531367 149304
3517A49304k74155J04149J65599m0535n60983P52759k18197Q0390K22054j93304
$$ 149304 -124851 -20702 144897 104362 -456621 296138 77941 158331 380385 187081
3507A87081k19737l87950O57813M9566n32010O51265o49198J62288k3754P00329
$$ 187081 -32656 -420606 237207 286773 -245237 406028 -243170 -80882 -104636 595693
3497E95693k06864j18206K19135n11472q73141N23166n05940J600770l46183K9176
$$ 595693 388829 270623 489758 -21714 -894855 -371689 -877629 723141 376958 406134
3487D06134k84755l434l20056M90645n1229r77241K18610J82526L07672k3964
$$ 406134 121379 117945 -202111 288534 237305 -739936 -521326 -338800 -31128 -55092
3477e5092o65350R60691o77605l96293J84971Q42653j4615O5470l30945J030348
$$ -55092 -720442 240249 -437356 -833649 -648678 193975 179360 244830 -86115 944233
3467I44233j616399L37054N42362R7395k42916O1575m27486N70080J18466n20324
$$ 944233 -672166 -335112 207250 304645 61729 123304 -304182 265898 384364 -135960
3457a35960k3380k93770O00945k26788J14148O5135m38953Q27740p88280L13217
$$ -135960 -159340 -453110 147835 -78953 35195 100330 -338623 489117 -299163 14054
3447A4054O7121k04364K00135j34532l04429Q95051j374662Q47411n34373M30337
$$ 14054 81175 -123189 76946 -57586 -362015 533036 -841626 5785 -528588 -98251
3437i8251K63138K92037m56370P1903L04664j53416q7664k90765J15847m57141
$$ -98251 164887 456924 554 72457 377121 223705 136041 -154724 -38877 -496018
3427d96018P64602J85359k74944j56183P31847j017552J52598J69788l11391n8067
$$ -496018 268584 453943 178999 22816 754663 -262889 -110291 59497 -251894 -309961
3417c09961J186075m82333q6655K8594O27316k83153j06358j038889Q03584L40403
$$ -309961 876114 393781 307126 335720 963036 679883 573525 -465364 338220 678623
3407F78623q74938m0152M04684R0478r72680J343169k64014L95770j077505R62768
$$ 678623 -196315 -236467 168217 258695 -713985 629184 365170 760940 -316565 646203
3397F46203p25592J95610J13878J26335J02360O99717n25308q77553L77298P05473
$$ 646203 -79389 116221 230099 356434 458794 1158511 633203 -244350 132948 838421
3387H38421j12397l54345N78694n83957m42138K97096P54252m57082J8611m68321
$$ 838421 726024 371679 950373 366416 -75722 221374 975626 518544 537155 68834
3377F8834R91570j68224l14741q46802P50009L09156k99097J3149p39395M9357
$$ 68834 1060404 892180 577439 -269363 480646 789802 490705 503854 -235541 -186184
3367a86184N97426L43051O2978L83062k83863R51989o43185m06802l79559R24421
$$ -186184 411242 754293 817271 1200333 916470 1868459 1225274 818472 438913 1363334
3357A363334n28781k44832j24320L30627R4604O2450R2366O46043l84402M12757
$$ 1363334 834553 589721 465401 796028 890632 953082 1045448 1691491 1307089 1719846
3347A719846J25003P6232J09596j120007K672198j344803j77254J290666J76408
$$ 1719846 1844849 1921081 2030677 910670 3582868 2238065 2060811 3351477 3527885
3338C527885O22J525003J791145Q62268O66223J465152J272670J138547J506401
$$ 3527885 3528507 5053510 6844655 7706923 8373146 9838298 11110968 12249515 13755916
3329A3755916J847076K845922K814734J988403L220159K222424J491397R35884
$$ 13755916 15602992 18448914 21263648 23252051 26472210 28694634 30186031 31121915
3321C1121915P22707l61930n29221j855048r54729k017823k425405j425375j653910
$$ 31121915 31844622 31482692 30953471 29098423 28143694 26125871 23700466 22275091 20621181
3312B0621181k186159k483377l100991p46615k052092j007956j380206j029092
$$ 20621181 18435022 15951645 12850654 12104039 10051947 9043991 7663785 6634693
3304F634693j670063j060985j31455o69318m79938j28732P4526p34953N84666
$$ 6634693 4964630 3903645 3772190 3102872 2622934 2494202 2568728 1833775 2418441
3295B418441j220360j25414J038543n64461l69389M53020q45793N45474m75520
$$ 2418441 1198081 1072667 2111210 1546749 1177360 1630380 784587 1330061 854541
3286H54541P50167o89100q47553L2320J66444R91914j197594K3374J352459q36992
$$ 854541 1604708 915608 68055 100375 266819 1258733 61139 84513 1436972 599980
3276E99980p57559J490884l65057j04707q92408l87720M34177K90137L61927m31348
$$ 599980 -157579 1333305 968248 863541 -28867 -416587 17590 307727 669654 238306
3266B38306j81857N06460l52923k37821M68366l76554J052241j126403L27802
$$ 238306 56449 562909 209986 -27835 440531 63977 1116218 -10185 317617
3257C17617j13515n97123P14474k9361l39109K90118Q7169M70344j254202M33810
$$ 317617 204102 -393021 321453 292092 -47017 243101 330270 800614 -453588 -19778
3247a9778M50493l1815k30927J36234l9986m57541N88477q09620J64999R90837
$$ -19778 430715 398900 167973 304207 264221 -193320 395157 -414463 -249464 741373
3237G41373q79823N0946M51642m02238l53781J025630m05079m57263N92493O6181
$$ 741373 -138450 -87504 364138 -38100 -391881 633749 228670 -228593 363900 430081
3227D30081j365092O34399k86821M39413J93475r3452L17461l74315M72572K7808
$$ 430081 -935011 -300612 -587433 -148020 45455 -47997 269464 -104851 367721 395529
3217C95529l89397j82985P0867M00047l92010N54940k93600O24349n0391m12310
$$ 395529 6132 -176853 -105986 294061 -97949 456991 163391 787740 737349 325039
3207C25039p49407O68365J14919q12219O91537l04400j60966L31129k02472k92912
$$ 325039 -424368 243997 358916 -453303 238234 -66166 -227132 103997 -98475 -391387
3197c91387o935P66932n54336J253J6500j36544K54806n52049Q40349K9893r1503
$$ -391387 -398322 368610 -185726 -184473 -167973 -304517 -49711 -601760 238589 268482 176979
3186A76979k59021l94150M79891O00532m56318k99540n8565j98430j23371L50249
$$ 176979 -82042 -476192 3699 604231 147913 -151627 -210192 -408622 -531993 -181744
3176a81744L33092k04262k00154R06179J08351o29092l19610P46993j275983J1300
$$ -181744 151348 -52914 -253068 653111 761462 132370 -187240 559753 -716230 -704930
3166g04930J324294j20235j47076m87192N12799p08J48122j116830J076596p98352
$$ -704930 619364 499129 352053 -135139 377660 376952 525074 -591756 484840 -313512
3156c13512N89792j015499K46196L73480J64595n05783K68793K18743K04480Q8918
$$ -313512 276280 -739219 -493023 -119543 45052 -460731 -191938 26805 231285 320203
3146C20203n93877M04797o44663O24845r348K34363m84683q02001J010240p75556
$$ 320203 -273674 131123 -513540 111305 101957 336320 -148363 -950364 59876 -715680
3136g15680K32722L07927j95898p49842J137709k67311J70895J33351o7817K64243
$$ -715680 -482958 -175031 -370929 -1120771 16938 -250373 -79478 53873 -13944 250299
3126B50299m01839m52999Q47982o32884J037551j84780o26132q8811L93280q2241
$$ 250299 -151540 -604539 243443 -389441 648110 463330 -162802 -251613 141667 59426
3116E9426k4919l32332M4525n9975Q5674j27893N06128L8873n24230R20399k62656
$$ 59426 34507 -297825 -253300 -313275 -227601 -355494 150634 189507 -334723 585676 323020
3105C23020r21233k26390P68817k50241k9r928K47367n2382k62980q9139O77717
$$ 323020 -598213 -824603 -55786 -306027 -306056 -315984 -68617 -120999 -383979 -473118 204599
3094B04599r4315j67011K58652K60974j080121J177795o11869K00250k80331Q16169
$$ 204599 110284 -56727 201925 462899 -617222 560573 -51296 148954 -131377 684792
3084F84792r34274O28950j79811j75449j010072J433974n62597O87024j322453
$$ 684792 -249482 379468 199657 24208 -985864 448110 -114487 572537 -749916
3075g49916L22531O66167n96532p5079l61285K61765K52419L99302n08043N52834
$$ -749916 -427385 238782 -357750 -432829 -794114 -532349 -279930 119372 -388671 164163
3065A64163J93266o34244P8900L37699m77637K14164J74252K93071m69953P66523
$$ 164163 357429 -276815 -197915 139784 -337853 -123689 50563 343634 -126319 640204
3055F40204j38306j77917q32450J03181J72751K87566o21277O51355o7336O62417
$$ 640204 501898 323981 -508469 -405288 -232537 55029 -566248 85107 17771 680188
3045F80188n78722o7441K21349K06793n91208n51962O31439o32504K94503N08691
$$ 680188 101466 34025 255374 462167 -129041 -681003 -49564 -682068 -387565 121126
3035A21126M50023o11349O52368j125076J90240m73541P53203J15098l94895p8463
$$ 121126 571149 -40200 612168 -512908 -322668 -796209 -43006 72092 -322803 -401266
3025d01266M51744O1363J25815m55677p61068J348442r04334M54937O8522n17635
$$ -401266 50478 111841 237656 -218021 -979089 369353 -534981 -80044 -11522 -529157
3015e29157P73516P2002n27211M7033q74269J304728l12778N7443J21244K19140
$$ -529157 244359 316361 -210850 -163817 -1038086 266642 -46136 11307 132551 351691
3005C51691o82483O52421r02157O91164l9519j8353K04061j12777k16653L63160
$$ 351691 -330792 321629 -580528 110636 71117 52764 256825 144048 -72605 290555
2995B90555j27409m00073M0334Q7668K12541J62436n89945O13285k42067n28617
$$ 290555 163146 -236927 -196593 -108925 103616 266052 -323893 289392 47325 -481292
2985d81292O33515K00195p01836Q9274M45435p12977L82008q2440Q41467k94821
$$ -481292 152223 352418 -349418 -260144 185291 -527686 -145678 -228118 613349 318528
2975C18528o40384M59980L39124o14769j58830J84468L36775q1051l8728p49098
$$ 318528 -321856 138124 477248 -137521 -296351 -111883 224892 143841 105113 -643985
2965f43985M22521o14282M60702N33191N70515m56677j34116k10342J10432j23389
$$ -643985 -221464 -835746 -375044 158147 728662 271985 137869 -72473 37959 -85430
2955h5430K7976N04368K94396j286161l0532R0012P08166m65897j65242J92176
$$ -85430 -57454 446914 741310 -544851 -575383 -485371 222795 -243102 -408344 -216168
2945b16168N95115p80452N61376m32252M28126q8951q49696N27162P81029n64858
$$ -216168 378947 -401505 159871 -272381 155745 66794 -782902 -255740 525289 -39569
2935c9569l00485J32437O0211l35904L45465j60264Q05146p56290P6847N89366
$$ -39569 -340054 -207617 -147406 -483310 -137845 -298109 507037 -249253 -172406 416960
2925D16960j2500r80163J95199R8126K60141n22655N42786o89172P73249L33126
$$ 416960 404460 -575703 -380504 -282378 -22237 -544892 -2106 -691278 81971 415097
2915D15097j339114Q06421M687J63638k0422p4423K28510n98513L14066r9336
$$ 415097 -924017 -117596 -112909 50729 30307 -44116 184394 -414119 -100053 -199389
2905a99389k00785P866N3311M08552k47951P3637j53634N75147O2556k62567L80223
$$ -199389 -400174 -392308 -338997 69555 -178396 -104759 -258393 316754 379310 116743 496966
2894D96966m20068P86960j093420m63971O06375l212l34029J72509K17308l42673
$$ 496966 76898 863858 -229562 -693533 -87158 -90370 -424399 -251890 -34582 -377255
2884c77255N36732m66102K76037J61139M95572r55532M58267K74124q63543n575
$$ -377255 159477 -306625 -30588 130551 626123 -329409 128858 402982 -460561 -466136
2874d66136N31556m69475j8091l19688M48670J65743k96290k34113J067584l74996
$$ -466136 65420 -404055 -422146 -741834 -293164 -127421 -423711 -657824 409760 34764
2864C4764n34625M11178L69492j248008M15101J253046n17429o59761M17159m19995
$$ 34764 -499861 -88683 280809 -967199 -552098 700948 183519 -476242 -59083 -479078
2854d79078N94880k57195M6699m04421J35084O34299o63673Q46059n81858o5310
$$ -479078 115802 -141393 -94694 -499115 -364031 270268 -393405 452654 -129204 -194514
2844a94514l4053M02259L32930Q4652q45747J34155J02839K25456R0059m44418
$$ -194514 -228567 173692 506622 591274 -254473 -120318 -17479 207977 298036 -146382
2834a46382o3262J54231o92276P78508j416m18932J039491q47852k72365Q54098
$$ -146382 -209644 -55413 -747689 30819 29403 -389529 649962 -197890 -470255 383843
2824C83843m57275l53259K39074L68753k00429L33730L32236j189163R89324n96382
$$ 383843 -73432 -426691 -187617 181136 -19293 314437 646673 -542490 446834 -149548
2814a49548o48962P60195q12847P49935K09691o27313P85130k79104n15027P85524
$$ -149548 -798510 -38315 -851162 -101227 108464 -518849 266281 -12823 -527850 257674
2804B57674o15836Q90996r15933P88221k29513j91055j21068m26183J85572M40129
$$ 257674 -358162 532834 -383099 405122 175609 -15446 -136514 -562697 -377125 63004
2794F3004n48710n38711J214504m85438L23093p9408K32581j12458J3418j62386
$$ 63004 -485706 -1024417 190087 -295351 27742 -51666 180915 68457 81875 -80511
2784h0511k57061N009L08323o01899K85798L51279M13204j001063N54733m94247
$$ -80511 -337572 -332563 -24240 -626139 -340341 10938 424142 -576921 -22188 -516435
2774e16435P18210j27565K6710L3192K96651n15262l67890Q55126q46577k26981
$$ -516435 201775 74210 100920 134112 430763 -84499 -452389 402737 -443840 -670821
2764f70821K77610j77593Q95802m77906j75053M52634p50237J200602r96366L88792
$$ -670821 -393211 -570804 324998 -152908 -327961 124673 -625564 575038 -421328 -32536
2754c2536L16577p86912L64788J62692J99873l32561r92709Q96689l16388Q48584
$$ -32536 284041 -502871 -138083 24609 224482 -108079 -1100788 -204099 -520487 328097
2744C28097r04814L98718M71582q57734R27962l52686k16200n20415P14028L47395
$$ 328097 -576717 -177999 293583 -564151 363811 11125 -205075 -725490 -11462 335933
2734C35933l50683j65130j13801M08544J18060j221081J450048k84118m28971
$$ 335933 -14750 -179880 -293681 114863 232923 -988158 461890 177772 -251199
2725b51199L02720l04814K89850J38296l15858p7996k40301j22552Q67482K8615
$$ -251199 51521 -253293 36557 174853 -141005 -219001 -459302 -581854 285628 314243
2715C14243m33163j18025J31160L43185j13062n32634O35591m09171N46483q64764
$$ 314243 -118920 -236945 -105785 237400 124338 -408296 227295 -181876 364607 -500157
2705e00157M54451m16865j56612K82322L3388O0174o59098L94297P26023l04988
$$ -500157 -45706 -462571 -619183 -336861 -303473 -243299 -902397 -508100 217923 -87065
2695h7065l17245N17598m20527M37000m65352J436M06015M06339q72351r163O7706
$$ -87065 -404310 113288 -307239 129761 -335591 -334155 71860 478199 -394152 -403315 -335609
2684c35609M26899m8736O8562l24096N73674j5295j36386j046571K03349N59944
$$ -335609 91290 42554 111116 -212980 360694 345399 209013 -837558 -634209 -74265
2674g4265j36831n35647N58870M73117m1824n02942j4877j30165M03079n28392
$$ -74265 -211096 -746743 -187873 285244 243420 -259522 -274399 -404564 -1485 -529877
2664e29877J315696m57714l23189j040182J377268n69557O226p06019M91244R56983
$$ -529877 785819 328105 4916 -1035266 342002 -227555 -221329 -927348 -436104 520879
2654E20879j60931j031728K31342K80600k51678R46049j9992p64514r0463m12799
$$ 520879 359948 -671780 -440438 -159838 -411516 534533 514541 -249973 -340436 -753235
2644g53235O39144K3840M43684J25078j160020J064076j021477O47626k41894
$$ -753235 -114091 -90251 353433 478511 -681509 382567 -638910 8716 -233178
2635b33178j31820K15504J78442n79101N76682l90854k24581K54291P57412q60022
$$ -233178 -364998 -149494 28948 -550153 26529 -364325 -588906 -334615 422797 -437225
2625d37225O19820l30202M83672p38545J64693P7280M26493k72835m27088P41049
$$ -437225 182595 -147607 336065 -402480 -237787 -160507 265986 -6849 -433937 307112
2615C07112m94454m9050J07890J20266K53156o8141l84564k93488O15179r97514
$$ 307112 -187342 -236392 -128502 -8236 244920 176779 -207785 -501273 113906 -883608
2605h83608P53768J62410p11308j9919O4095K94589L19320m20069J53273L37784
$$ -883608 -129840 32570 -678738 -698657 -634562 -339973 -20653 -440722 -287449 50335
2595E0335O9545K18829n28561j76240L17410K84218m14486L83705O1535J549n57219
$$ 50335 119880 338709 -189852 -366092 -48682 235536 -178950 204755 266290 267839 -289380
2584b89380j06777J83461k77068O49872o92672K94206J35791n26360M01057l22339
$$ -289380 -396157 -212696 -489764 160108 -532564 -238358 -102567 -628927 -227870 -550209
2574e50209O06442O7153K62126q15426r0789N42874R76088j369838l52436P76998
$$ -550209 56233 123386 385512 -429914 -520703 22171 998259 -371579 -724015 52983
2564E2983n54688L23297j69406J97097M93649o71938J00792j88093q1107L38359
$$ 52983 -501705 -178408 -347814 -150717 342932 -329006 -228214 -416307 -497414 -159055
2554a59055N03984o88709P84441m87560L40142j21050L95069o20721k36874N6080
$$ -159055 344929 -343780 440661 -46899 293243 172193 567262 -53459 -290333 -234253
2544b34253k66678K41887R4608n5946k71268O12665p47517L85974M75202j343754
$$ -234253 -500931 -259044 -164436 -220382 -491650 121015 -626502 -240528 234674 -1109080
2534a109080L44761L56845L13357L19087k56580j90195L76180J27149o11960q2453
$$ -1109080 -764319 -407474 -94117 224970 -31610 -221805 154375 281524 -330436 -412889
2524d12889P04758o04592Q01953l87751P84333j223219N12719o80952J69428O65374
$$ -412889 291869 -312723 489230 101479 885812 -337407 175312 -505640 -336212 329162
2514C29162p8651p67408P48099k61739k74153j61122M55989n08709q03336J122320
$$ 329162 250511 -516897 231202 -30537 -304690 -465812 -9823 -518532 -1321868 -199548
2504a99548m35211N41121l81511L75820k84580L44662m44946M26333O13244l69317
$$ -199548 -634759 -93638 -475149 -99329 -383909 -39247 -484193 -57860 555384 186067
2494A86067o66120k69521J329295r23867J98421k6623P03375j074324P91972k64462
$$ 186067 -480053 -749574 579721 -344146 -145725 -172348 531027 -543297 248675 -15787
2484a5787j74886m78734O39495m29359K87402P8329N08632r32191K36244O12146
$$ -15787 -190673 -669407 -29912 -459271 -171869 -93540 415092 -517099 -280855 331291
2474C31291J08717p99577N26826r3560k32160J95223l77219m36913N98020K13889
$$ 331291 440008 -359569 167257 73697 -158463 36760 -340459 -777372 -179352 34537
2464C4537m27428J27429m66719O3503M97555R672Q91779o18828K0643l05037n75682
$$ 34537 -392891 -265462 -732181 -668678 -171123 -161451 730328 111500 132143 -172894 -748576
2453g48576J021357p5723j31214o12958L35289k73133P9654M47453l12469k6292
$$ -748576 272781 197058 65844 -547114 -211825 -484958 -405304 42149 -270320 -296612
2443b96612M34360O9393l52012L44251q18850P99425L39240o32434O92113j150913
$$ -296612 137748 207141 -144871 199380 -619470 179955 519195 -113239 578874 -572039
2433e72039J8830p01011J070469J97328j73145Q54908p54131N36164j43573q56232
$$ -572039 -553209 -1254220 -183751 13577 -159568 695340 -58791 477373 333800 -522432
2423e22432J42802J03541K7693K34642o78476J17636J364391m48030o35895k21392
$$ -522432 -379630 -276089 -248396 -13754 -692230 -574594 789797 341767 -294128 -515520
2413e15520K27424j68533j92312Q9479N06342l7126K76260m85967L89656n59296
$$ -515520 -288096 -456629 -648941 -559462 -53120 -90246 186014 -299953 89703 -469593
2403d69593j99166P19146q37570P87345L6071o74679N33321l34547J07822L88695
$$ -469593 -668759 50387 -787183 162 36233 -638446 -105125 -439672 -331850 56845
2393E6845n8448l3557j48398N07290l67845l40905J45026K41046o5848P78632
$$ 56845 -1603 -35160 -183558 323732 -44113 -385018 -239992 1054 -64794 713838
2383G13838j129509q2540K27601k41261J057914j54464k51527m12056M22734K20784
$$ 713838 -415671 -498211 -270610 -511871 546043 391579 140052 -272004 150730 371514
2373C71514o57897J82272M904m24578K7273L01373K98726l13009N18377o69002
$$ 371514 -286383 -104111 -99207 -523785 -496512 -195139 103587 -209422 308955 -360047
2363c60047M97822k70527l72745m1598O60814m25909k18039J30746K13222L9548
$$ -360047 137775 -132752 -505497 -547095 113719 -312190 -530229 -399483 -186261 -146713
2353a46713k91781P66380n08034K03537k78580m76064P74987j34204k10979M29303
$$ -146713 -438494 327886 -180148 23389 -255191 -731255 43732 -90472 -301451 127852
2343A27852p65650L92533l6746M01422q14011Q3829M80473k73339O44306l32421
$$ 127852 -637798 -245265 -282011 119411 -694600 -610771 -130298 -403637 240669 -91752
2333i1752j02445l27854M93351q17905J249522j119492L70861L99837j29250K13472
$$ -91752 -194197 -522051 -28700 -846605 402917 -716575 -345714 54123 -75127 138345
2323A38345o28641L89023K53218p30000J27344r911j36898K77731l76368M43729
$$ 138345 -490296 -101273 151945 -578055 -450711 -460622 -597520 -319789 -696157 -252428
2313b52428j77107K94834j85848L58699l53273L29543o82193J245702j077553
$$ -252428 -429535 -134701 -320549 38150 -315123 14420 -667773 577929 -499624
2304d99624O78260j68812L7776Q0594k55583O24982j116214N10385O2872n00114
$$ -499624 178636 9824 47600 128194 -127389 497593 -618621 -108236 -45364 -545478
2294e45478J88920M15552L72335n11636M1216N22331j021408N38814r45594J344277
$$ -545478 -356558 58994 431329 -80307 -39091 483240 -538168 646 -944948 399329
2284C99329o04598k46330Q45039n54188q2328j67363J20835k95898K82536J22407
$$ 399329 -205269 -451599 393440 -160748 -243076 -410439 -289604 -585502 -302966 -180559
2274a80559N03546n63483k58686M22429k25031K98727o1354l93022N26951n30643
$$ -180559 322987 -240496 -499182 -76753 -301784 -3057 -64411 -457433 69518 -461125
2264d61125K64938J1506N57247n55217n7760M42569o24703L96181r9108l1704
$$ -461125 -196187 -184681 372566 -182651 -240411 202158 -422545 -26364 -125472 -157176
2254a57176N08603l16287N81569q09359j56908K18296P14684n71148N04203o23175
$$ -157176 351427 35140 616709 -192650 -349558 -131262 583422 12274 516477 -106698
2244a06698K93582J42225k91987m36643K57638k11330P6724J83914j68211l6875
$$ -106698 186884 329109 37122 -399521 -141883 -353213 -276489 -92575 -260786 -297661
2234b97661K50812n89616L5221L56209M81642m31687N03609n02147o09127L69411
$$ -297661 -46849 -636465 -601244 -245035 236607 -195080 308529 -193618 -802745 -433334
2224d33334R01676q92123K46274L52817p12192M09623l59419J54789J180019r25905
$$ -433334 468342 -423781 -177507 175310 -536882 -127259 -486678 -331889 848130 -77775
2214g7775N49609j213833J015685k43638j90484K9859p53746J163333j94453n0248
$$ -77775 471834 -741999 273686 30048 -160436 -130577 -884323 279010 84557 34309
2204C4309K64931p69472N8969K91670k5045J27364j045720J098965j168412N89759
$$ 34309 299240 -470232 -411263 -119593 -144638 -17274 -1062994 35971 -1132441 -542682
2194e42682P79228J16710o45576k37337j2733j06093O50837O92589o55286j38750
$$ -542682 236546 353256 -292320 -529657 -542390 -648483 2354 694943 39657 -99093
2184i9093J65507J12926k76547N7145m70502J02395O48220J4098j258726J389063
$$ -99093 66414 179340 -97207 -40062 -510564 -408169 240051 254149 -1004577 384486
2174C84486j363978R16454O11289q17915l03569Q51240q57982J46159j31430M57744
$$ 384486 -979492 -63038 548251 -269664 -573233 278007 -579975 -433816 -565246 -107502
2164a07502l38862L14149j86762O38765n44468j37966p8839P27567k48099P69806
$$ -107502 -446364 -132215 -318977 319788 -224680 -362646 -441485 286082 37983 807789
2154H07789n87738n26246j52317l39750J184R87258l39442p95077J301493j34774
$$ 807789 220051 -306195 -458512 -798262 -797078 190180 -149262 -944339 357154 222380
2144B22380P5307m00873K5530m10542K49603J046460l81619k00739k28316l08315
$$ 222380 297687 -103186 -77656 -488198 -238595 807865 426246 225507 -2809 -311124
2134c11124R53026m16187k68527m28490K71369N4310m30352N65126O9146p7269
$$ -311124 641902 225715 -42812 -471302 -199933 -145623 -575975 -10849 58297 -18972
2124a8972J20249o49661J09701n07587M40265N74813j56819L16066p1535n45514
$$ -18972 101277 -548384 -438683 -946270 -506005 68808 -88011 228055 156520 -388994
2114c88994L66806k10258M89404m61187j70693M03375m71173L44723l87616k3726
$$ -388994 -22188 -232446 256958 -204229 -374922 28453 -442720 -97997 -485613 -509339
2104e09339Q99143m99129K78103M3101o4904j62760l66138R3932m1435N73892
$$ -509339 389804 -109325 168778 211879 146975 -15785 -381923 -287991 -329426 244466
2094B44466k51627K46971k97459k27896P83985o00427P81282j221197L53393M99971
$$ 244466 -7161 239810 -57649 -285545 498440 -101987 679295 -541902 -188509 311462
2084C11462n73078l80660P27126r197j79674K13614K7819k33107k76270m19314
$$ 311462 -261616 -642276 84850 75653 -104021 109593 137412 -95695 -371965 -791279
2074g91279N04879K27565N71395n8872p06083l98745R23106j118424L44863L64832
$$ -791279 -286400 -58835 512560 453688 -252395 -651140 271966 -846458 -501595 -136763
2064a36763l08903M1372k06988P41955l24318N0219L81923r36766J034295M64576
$$ -136763 -445666 -404294 -611282 130673 -193645 -143426 238497 -698269 336026 800602
2054H00602j210185P6879O35906l22795l6184m27499J14113K05704N65990k28981
$$ 800602 -409583 -332704 303202 -19593 -55777 -483276 -369163 -163459 402531 173550
2044A73550k67217P6782M56738l70641k18142Q9817k47432n93109J018165n82463
$$ 173550 -93667 -16885 439853 69212 -148930 -59113 -306545 -899654 118511 -463952
2034d63952K00312k64768O00220n48339K33834M96778k30407k23277J18584k95902
$$ -463952 -263640 -528408 71812 -476527 -242693 254085 23678 -199599 -81015 -376917
2024c76917m74971K0176J113570k98117l65544J14740q4298M6437K70529p84944
$$ -376917 -851888 -831712 281858 -16259 -381803 -267063 -351361 -304924 -34395 -819339
2014h19339Q72237K14286k51038l78111K85948o02341J73711J46864K41571N70510
$$ -819339 52898 267184 16146 -361965 -76017 -678358 -504647 -357783 -116212 454298
2004D54298n56785L06097l77428m73204J138633n28199J0651j5918o2720L25269
$$ 454298 -102487 203610 -173818 -647022 491611 -36588 -25937 -41855 -104575 220694
1994B20694o41229J208957q63224N2280k63548M20249j94170o17757M66373J35250
$$ 220694 -420535 788422 -74802 -22522 -286070 134179 -59991 -677748 -211375 -76125
1984g6125K85710n91003L39999K60543j45401L91194R1107r23592l54207K41212
$$ -76125 209585 -381418 -41419 219124 73723 464917 556024 -367568 -721775 -480563
1974d80563j75181R97796j197007J213177l59154k45517N55603N88212j280210
$$ -480563 -655744 342052 -854955 358222 -932 -246449 309154 897366 -382844
1965c82844J28847q36355P68419P5241K73167J84679p40712Q80418K37257q90390
$$ -382844 -253997 -1090352 -321933 -246692 26475 211154 -529558 350860 588117 -302273
$$ [...]
##END NTUPLES=NMR SPECTRUM
##END=
