##TITLE=abcd
##JCAMPDX= 6.0         $$ Bruker NMR JCAMP-DX V2.0
##DATA TYPE= NMR SPECTRUM
##DATA CLASS= NTUPLES
##ORIGIN= UXNMR, Bruker Analytische Messtechnik GmbH
##OWNER= root
$$ XWIN-NMR		Version 3.5
$$ Mon Nov 17 15:10:31 2025 Russian Standard Time (UT+4h)  servis@DPX200
##.OBSERVE FREQUENCY= 200.131235884673
##.OBSERVE NUCLEUS= ^1H
##.ACQUISITION MODE= SIMULTANEOUS
##.ACQUISITION SCHEME= undefined
##.AVERAGES= 32
##.DIGITISER RES= 18
##SPECTROMETER/DATA SYSTEM= spect
##.PULSE SEQUENCE= zg
##.SOLVENT NAME= Acetone
##.SHIFT REFERENCE= (INTERNAL, Acetone, 0, 16.4885)
##AUDIT TRAIL= $$ (NUMBER, WHEN, WHO, WHERE, WHAT)
$$ ##TITLE= Audit trail, XWIN-NMR		Version 3.5
$$ ##JCAMPDX= 5.01
$$ ##ORIGIN= Bruker BioSpin GmbH
$$ ##OWNER= servis
$$ F:\spectra/data/av/nmr/H1/1/pdata/1/auditp.txt
$$ ##AUDIT TRAIL=  $$ (NUMBER, WHEN, WHO, WHERE, WHAT)
(   1,<2025-11-17 15:09:13.18 +0400>,<servis>,<DPX200>,
      <created by zg, POWCHK disabled, PULCHK disabled
       configuration hash MD5:
       00 E9 B6 7A A2 85 ED C7 34 08 36 98 17 FE 4E 26
       data hash MD5: 32K
       8C BE BB 5C 37 41 13 90 A0 82 CD 03 47 DB 3A 95>)
(   2,<2025-11-17 15:09:56.48 +0400>,<servis>,<DPX200>,
      <Start of raw data processing
       efp BC_mod = 2 LB = 0.05 FT_mod = 6 PKNL = 1 PHC0 = -256.962 PHC1 = 1.301565 SI = 16K 
       data hash MD5: 16K
       3D 54 7D 01 90 D0 92 E7 1B A2 49 89 DF FD 9E 01>)
(   3,<2025-11-17 15:10:10.43 +0400>,<servis>,<DPX200>,
      <abs ABSG = 5 
       data hash MD5: 16K
       EB E5 E2 1B 41 26 7D 04 4D CC 10 AB 55 EB CD 88>)
$$ ##END=
$$ 
$$ hash MD5
$$ 83 6D 9D 66 4A A7 AC CA E9 02 54 E8 30 97 06 44
##$RELAX= 
##$RELAX= 
##$RELAX= 
##$RELAX= 
##$RELAX= 
##$RELAX= 
##$RELAX= 
##$RELAX= 
$$ Bruker specific parameters
$$ --------------------------
##$DU= <F:\spectra>
##$EXPNO= 1
##$NAME= <H1>
##$PROCNO= 1
##$TYPE= <nmr>
##$USER= <av>
##$AMP= (0..31)
100 100 100 100 100 100 100 100 100 100 100 100 100 100 100 100 100 100 
100 100 100 100 100 100 100 100 100 100 100 100 100 100 
##$AQSEQ= 0
##$AQ_mod= 1
##$AUNM= <au_zg>
##$AUTOPOS= <>
##$BF1= 200.13
##$BF2= 200.13
##$BF3= 200.13
##$BF4= 200.13
##$BF5= 500.13
##$BF6= 500.13
##$BF7= 500.13
##$BF8= 500.13
##$BYTORDA= 1
##$CFDGTYP= 0
##$CFRGTYP= 5
##$CHEMSTR= <none>
##$CNST= (0..31)
1 1 145 1 1 1 1 1 1 1 1 1 1 1 1 1 1 1 1 1 1 1 1 1 1 1 1 1 1 1 1 1 
##$CPDPRG= <>
##$CPDPRG1= <>
##$CPDPRG2= <>
##$CPDPRG3= <>
##$CPDPRG4= <mlev>
##$CPDPRG5= <mlev>
##$CPDPRG6= <mlev>
##$CPDPRG7= <mlev>
##$CPDPRG8= <mlev>
##$CPDPRGB= <>
##$CPDPRGT= <>
##$D= (0..31)
0 2 0 0 0 0 0 0 0 0.06 0 0 0 0 0 0 0.0002 0 0 0 0 0 0 0 0 0 0 0 0 0 0 
0 
##$DATE= 1763377752
##$DBL= (0..7)
120 120 120 120 120 120 120 120 
##$DBP= (0..7)
150 150 150 150 150 150 150 150 
##$DBP07= 0
##$DBPNAM0= <>
##$DBPNAM1= <>
##$DBPNAM2= <>
##$DBPNAM3= <>
##$DBPNAM4= <>
##$DBPNAM5= <>
##$DBPNAM6= <>
##$DBPNAM7= <>
##$DBPOAL= (0..7)
0.5 0.5 0.5 0.5 0.5 0.5 0.5 0.5 
##$DBPOFFS= (0..7)
0 0 0 0 0 0 0 0 
##$DE= 6
##$DECBNUC= <off>
##$DECIM= 32
$$ [...]
##$SUBNAM5= <"">
##$SUBNAM6= <"">
##$SUBNAM7= <"">
##$SUBNAM8= <"">
##$SUBNAM9= <"">
##$SW= 20.6817932712277
##$SWIBOX= (0..15)
0 0 3 0 0 0 0 0 0 0 0 0 0 0 0 0 
##$SW_h= 4139.07284768212
##$TD= 32768
##$TD0= 1
##$TE= 0
##$TE2= 300
##$TE3= 300
##$TEG= 300
##$TL= (0..7)
0 120 120 120 120 120 120 120 
##$TP= (0..7)
150 150 150 150 150 150 150 150 
##$TP07= 0
##$TPNAME0= <>
##$TPNAME1= <>
##$TPNAME2= <>
##$TPNAME3= <>
##$TPNAME4= <>
##$TPNAME5= <>
##$TPNAME6= <>
##$TPNAME7= <>
##$TPOAL= (0..7)
0.5 0.5 0.5 0.5 0.5 0.5 0.5 0.5 
##$TPOFFS= (0..7)
0 0 0 0 0 0 0 0 
##$TUNHIN= 0
##$TUNHOUT= 0
##$TUNXOUT= 0
##$USERA1= <user>
##$USERA2= <user>
##$USERA3= <user>
##$USERA4= <user>
##$USERA5= <user>
##$V9= 5
##$VALIST= <valist>
##$VCLIST= <CCCCCCCCCCCCCCC>
##$VD= 0
##$VDLIST= <DDDDDDDDDDDDDDD>
##$VPLIST= <PPPPPPPPPPPPPPP>
##$VTLIST= <TTTTTTTTTTTTTTT>
##$WBST= 1024
##$WBSW= 30
##$XGAIN= (0..3)
0 0 0 0 
##$XL= 0
##$YL= 0
##$YMAX_a= 59043
##$YMIN_a= -61037
##$ZGOPTNS= <>
##$ZL1= 120
##$ZL2= 120
##$ZL3= 120
##$ZL4= 120
##$ABSF1= 16.48848
##$ABSF2= -4.193441
##$ABSG= 5
##$ABSL= 3
##$ALPHA= 0
##$AQORDER= 0
##$ASSFAC= 0
##$ASSFACI= 0
##$ASSFACX= 0
##$ASSWID= 0
##$AUNMP= <proc_1d>
##$AZFE= 0.1
##$AZFW= 0.1
##$BCFW= 0
##$BC_mod= 2
##$BYTORDP= 0
##$COROFFS= 0
##$CY= 18.4799938201904
##$DATMOD= 1
##$DC= 0
##$DFILT= <>
##$DTYPP= 0
##$F1P= 9.9274215381318
##$F2P= -0.165520771350173
##$FCOR= 1
##$FTSIZE= 16384
##$FT_mod= 6
##$GAMMA= 0
##$GB= 0
##$INTBC= 1
##$INTSCL= 4.127829e-11
##$ISEN= 128
##$LB= 0.05
##$LEV0= 0
##$LPBIN= 0
##$MAXI= 10000
##$MC2= 0
##$MEAN= 0
##$ME_mod= 0
##$MI= 50
##$NCOEF= 0
##$NC_proc= -7
##$NLEV= 6
##$NOISF1= 3.799351
##$NOISF2= 2.8
##$NSP= 0
##$NTH_PI= 0
##$NZP= 0
##$OFFSET= 16.48848
##$PC= 4
##$PHC0= -256.962
##$PHC1= 1.301565
##$PH_mod= 1
##$PKNL= yes
##$PPARMOD= 0
##$PSCAL= 4
##$PSIGN= 0
##$REVERSE= no
##$SF= 200.130005582386
##$SI= 16384
##$SIGF1= 3
##$SIGF2= 2
##$SINO= 400
##$SIOLD= 16384
##$SREGLST= <1H.CDCl3>
##$SSB= 0
##$STSI= 16384
##$STSR= 0
##$SW_p= 4139.07284768211
##$SYMM= 0
##$S_DEV= 0
##$TDeff= 32768
##$TDoff= 0
##$TI= <>
##$TILT= no
##$TM1= 0
##$TM2= 0
##$TOPLEV= 0
##$USERP1= <user>
##$USERP2= <user>
##$USERP3= <user>
##$USERP4= <user>
##$USERP5= <user>
##$WDW= 1
##$XDIM= 16384
##$YMAX_p= 317645352
##$YMIN_p= -1473741
$$ End of Bruker specific parameters
$$ ---------------------------------
##NTUPLES= NMR SPECTRUM
##VAR_NAME=  FREQUENCY,     SPECTRUM/REAL,   SPECTRUM/IMAG
##SYMBOL=    X,             R,               I
##VAR_TYPE=  INDEPENDENT,   DEPENDENT,       DEPENDENT
##VAR_FORM=  AFFN,          ASDF,            ASDF
##VAR_DIM=   16384,         16384,           16384
##UNITS=     HZ,            ARBITRARY UNITS, ARBITRARY UNITS
##FACTOR=    0.252644378177508, 1,           1
##FIRST=     3299.83951724647, 0,            0
##LAST=      -839.233330435636, 0,           0
##MIN=       -839.233330435636, -1473741,    0
##MAX=       3299.83951724647, 317645352,    0
$$ Real data points
##PAGE= N=1
##DATA TABLE= (X++(R..R)), XYDATA
$$ [...]
12756i4605K22177o14751O59600N8019j92612k81038j89635L96286K32511j19480
$$ -94605 127572 -487179 172421 230440 37828 -243210 -432845 -36559 195952 76472
12746G6472K6888K33317o40745K50101l9287M65675k24313n37547L39087K18431
$$ 76472 103360 336677 -304068 -53967 -93254 372421 148108 -389439 -50352 168079
12736A68079j29373j6600J23357j38983m3359K22999l04499J63359K5120J96325
$$ 168079 38706 22106 145463 6480 -36879 186120 -118379 44980 70100 266425
12726B66425m1131j46071J32012L8292P2954k47224m60174L22289l48766M70706
$$ 266425 225294 79223 211235 249527 322481 75257 -384917 -62628 -411394 59312
12716E9312L42014j56222k90057L28595j85716J59544K9020j09380j99599k39487
$$ 59312 401326 245104 -44953 283642 97926 257470 286490 177110 -22489 -261976
12706b61976N39302R7419n04338m79607N76801J06687J14923q5977J03778j13356
$$ -261976 277326 374745 -129593 -609200 -32399 74288 189211 103234 207012 93656
12696I3656J76560k60963J55327m57560J86894K12992O4093j10596l4051m3557
$$ 93656 270216 9253 164580 -292980 -106086 106906 170999 60403 26352 -17205
12686a7205K02336q1469K37397o11958L67480k59676j14687L50894p9054j46664
$$ -17205 185131 103662 341059 -270899 96581 -163095 -277782 73112 -5942 -152606
12676a52606K78626j15497K50203k41030P9009N0546j80195m5383K45667r1223
$$ -152606 126020 10523 260726 19696 98705 149251 -30944 -76327 169340 78117
12666G8117j17838M2680L79878l36701l83254M00828M1486l42987J53307O6957
$$ 78117 -39721 2959 382837 46136 -337118 63710 105196 -237791 -84484 -17527
12656a7527J60178l52503L40124L9338p8925J9122J8116k48416K35862J65335
$$ -17527 142651 -209852 130272 169610 90685 109807 127923 -120493 115369 280704
12646B80704l52635K13255l38501Q0080L5556J14204J95560l33600L00308J66690
$$ 280704 -71931 141324 -197177 -117097 -81541 32663 228223 -105377 194931 361621
12636C61621k62274k94915l65126L43567L30136k75168M34932K53597n85370j7233
$$ 361621 99347 -195568 -560694 -217127 113009 -162159 272773 526370 -59000 -76233
12626g6233j22464K98587j58519Q1672m3914J2012m52677N28464k39473J3095
$$ -76233 -198697 99890 -58629 23043 -20871 -8859 -461536 66928 -172545 -159450
12616a59450J44601J33309k1797R8963J07864k81719k73153M80105l00994K32491
$$ -159450 -14849 118460 96663 195626 303490 21771 -251382 228723 -72271 160220
12606A60220k25982j81029K08442L41000n89884N35118R3123k52947l36926N08206
$$ 160220 -65762 -246791 -38349 302651 -287233 247885 341008 88061 -248865 259341
12596B59341l48891L5371J87587o5613L09198n5680j17538k94153M6256J83506
$$ 259341 -89550 -54179 133408 67795 376993 321313 203775 -90378 -44122 139384
12586A39384j29344K01364k74161K70866m12630L24650l58601k89374M98082O3107
$$ 139384 10040 211404 -62757 208109 -204521 120129 -238472 -527846 -29764 33343
12576C3343L8684k2120L31588o46597J52179K74672j93840R6342k31991K41945
$$ 33343 72027 49907 381495 -265102 -112923 161749 -32091 64251 -167740 74205
12566G4205m21603M07893o4108k45638M75135j08095j04350j6763J00054k88715
$$ 74205 -347398 60495 -3613 -249251 225884 117789 13439 -3324 96730 -191985
12556a91985K70466l45999N14161k25367Q1914j68965K24553j46043L36982j92226
$$ -191985 78481 -267518 246643 21276 103190 -65775 158778 12735 349717 157491
12546A57491k32632J34202O1673k67469j65305K20762l2255J84911K21086m90397
$$ 157491 -75141 59061 120734 -146735 -312040 -91278 -123533 61378 282464 -207933
12536b07933J91681J49961J30951j60781L07474l64718R8628K7221K38993m94390
$$ -207933 -16252 133709 264660 103879 411353 46635 145263 172484 411477 -82913
12526h2913Q5843J70075M732J80354p10791M21501L3352p7827R942n38978O81007
$$ -82913 2930 173005 177737 358091 -352700 68801 102153 24326 34268 -504710 176297
12515A76297k49928q9392M86843j87206r4388L56590n89812k09347L40439J93200
$$ 176297 -73631 -163023 323820 136614 42226 398816 -190996 -400343 -59904 133296
12505A33296k01851k35932J90130L42529l90571q1075L9818M12834m46221M03770
$$ 133296 -68555 -304487 -114357 228172 -162399 -243474 -203656 209178 -237043 166727
12495A66727k43696j66214M01493j23467L1261J91018k65532j34855J57333L47155
$$ 166727 -76969 -243183 158310 34843 66104 257122 -8410 -143265 14068 361223
12485C61223L6172k3176n27860n4140O1075J3250L40170Q365l04240j16086R7121
$$ 361223 397395 374219 -153641 -207781 -146706 -133456 206714 215079 -89161 -205247 -108126
12474a08126O369J08630m6937L22240m28798k73378N83783j97856L32191o22646
$$ -108126 -101757 6873 -40064 282176 -146622 -420000 163783 -34073 298118 -324528
12464c24528K36707M5939K16681k37272J36611J01414K02470k58144L8830k89559
$$ -324528 -87821 -41882 174799 -62473 74138 175552 378022 119878 158708 -130851
12454a30851K84725n8000j32196Q3770j06345j82040J20947P2996j06379K36306
$$ -130851 153874 95874 -36322 47448 -58897 -240937 -119990 -46994 -153373 82933
12444H2933j93921J23922K1628L91897K8580m43072P6218J93662m92847q3282
$$ 82933 -110988 12934 34562 426459 455039 11967 88185 281847 -211000 -294282
12434b94282K28003J13817k65306O4936M19736k39298k36337K73444l04020L16952
$$ -294282 -66279 47538 -217768 -152832 266904 27606 -208731 64713 -239307 77645
12424G7645j61886J74425m25739R0498M63062k28975K00703O6125k86656l4311
$$ 77645 -84241 90184 -335555 -245057 218005 -10970 189733 255858 -30798 -65109
12414f5109o3634k54763O98905l9324j80580j92207K0980O9251J109J36434k58523
$$ -65109 -128743 -383506 315399 276075 95495 -96712 -75732 -6481 -5372 131062 -127461
12403a27461K62079n09934L35461k31378K10918k77386k6189J06612O52402l94585
$$ -127461 134618 -375316 -39855 -271233 -60315 -337701 -363890 -257278 395124 539
12393E39K95532k06911l8514k96059L9793J59427J79451j25189k74910L47992
$$ 539 296071 89160 50646 -245413 -205620 -46193 133258 8069 -266841 81151
12383H1151l77798O9648K06113K11789k59583m1299K77331l01836L43935k16502
$$ 81151 -296647 -226999 -20886 190903 -68680 -109979 167352 -134484 209451 -7051
12373g051n6929j51006K44679m36531K65860J95795O2906l25001q3774L67407
$$ -7051 -63980 -214986 29693 -406838 -140978 54817 117723 -207278 -291052 76355
12363G6355K83616n36518L86232k8843l81976J93948N7137J51884j90320K664
$$ 76355 359971 -176547 209685 180842 -201134 -7186 49951 201835 11515 14179
12353A4179j92211L21093m3691j58669K9781n2809R2237N1451J32642j76869J84165
$$ 14179 -178032 143061 99370 -59299 -29518 -82327 9910 61361 194003 17134 201299
12342B01299l70560L55700k79108l5852k59733N59897K3390k02368n5958N28745
$$ 201299 -169261 186439 -92669 -128521 -388254 171643 195033 -7335 -63293 465452
12332D65452m20315J22626m93593J51722M15706N6513m74012O62803n68069J43847
$$ 465452 45137 167763 -325830 -174108 241598 298111 -175901 486902 -81167 62680
12322F2680k02721J58327j73203J26932R7053k60262L77397L9708P007J13123
$$ 62680 -140041 18286 -154917 -27985 69068 -191194 186203 225911 232918 346041
12312C46041q0597l96395M42651k35766O8635j70444P5730Q6322k92965k18835
$$ 346041 265444 -130951 311700 75934 144569 -25875 49855 136177 -156788 -375623
12302c75623J04280k7604R9576P8607L2648M00533k6945j74256M6430J10039o5616
$$ -375623 -271343 -298947 -199371 -120764 -88116 312417 285472 111216 157646 267685 202069
12291B02069j43127j86653L36392k66253Q5688j25194J16604n8839J07618j26857
$$ 202069 58942 -127711 208681 -57572 28116 -97078 19526 -39313 68305 -58552
12281e8552O4068k11142J91754J5788J26350K00035l77226j6012J88648m31200
$$ -58552 5516 -205626 -13872 1916 128266 328301 -48925 -64937 123711 -307489
12271c07489J95111N0848j05957o9956K30135o0645K10817j69598j21648j34113
$$ -307489 -112378 -61530 -167487 -237443 -7308 -67953 142864 -26734 -148382 -282495
12261b82495P82983l49508j91843J36886j39528j0126j81036L43665l78923M31696
$$ -282495 500488 150980 -40863 96023 -43505 -53631 -234667 108998 -269925 161771
12251A61771k15760J05091J26690R4266m16222o8505j07786K14187j43108J29930
$$ 161771 -53989 51102 177792 272058 -144164 -212669 -320455 -106268 -249376 -119446
12241a19446Q3275N473M01424n72999L42970l34904k3089K18992m67576M28859
$$ -119446 -36171 -30698 370726 -202273 140697 -194207 -217296 1696 -465880 -37021
12231c7021J79327J50472k96799j49400K72463P4239K4514k55402l85809O56133
$$ -37021 142306 292778 -4021 -153421 119042 193281 217795 -37607 -423416 232717
12221B32717o97455M41645p3584O8065k38669L84014j22037M4586n75787L11375
$$ 232717 -464738 -23093 -96677 -28612 -267281 116733 -5304 39282 -536505 -225130
12211b25130n19952Q03601p9400K23192m23502J69013K31871P581l17697K78352
$$ -225130 -745082 58519 -20881 202311 -221191 -52178 179693 187274 -130423 147929
12201A47929k89043m4831n2027K66323q9422L85833m8583j61031k40951J58514
$$ 147929 -141114 -185945 -237972 28351 -61071 324762 276179 115148 -125803 32711
12191C2711m26006K13001L31140k78821l5871j0795N34676k860l03611j56211
$$ 32711 -393295 -180294 150846 -127975 -163846 -174641 360035 357175 53564 -102647
12181a02647P3691J76763l30778L0231L70362l87218M8381K06336l5564j71750
$$ -102647 -28956 147807 -182971 -152740 217622 -169596 -121215 85121 49557 -122193
12171a22193L2249r1396K11449l85698N77831k92880O7009L02637q0558k71220
$$ -122193 -89944 -181340 30109 -355589 222242 -70638 -3629 299008 218450 -52770
12161e2770j07511J93708j59645p4633M13781k51242N0627J19332l32898K81689
$$ -52770 -160281 33427 -126218 -200851 212930 -38312 12315 131647 -201251 80438
12151H0438k26547J76208J02569K7254o4715l01030Q5895K55177q6360j63912
$$ 80438 -146109 30099 132668 159922 95207 -205823 -119928 135249 48889 -115023
12141a15023p3160J18586K86122l33089J69714m71855L95081J14812J9688k53727
$$ -115023 -188183 -69597 216525 -116564 53150 -418705 -23624 91188 110876 -142851
12131a42851M8563J03374K30231o70013N32059K6186j06654J47940K15560n79910
$$ -142851 -94288 9086 239317 -430696 101363 127549 20895 168835 384395 -195515
12121a95515J07254J52696J70918n06633M58250m36852K33983o083P9368j95821
$$ -195515 -88261 64435 235353 -271280 186970 -249882 -15899 -21982 57386 -138435
12111a38435J58482j78453N9107L52604j88171O9661K4574L03099n57926L90740
$$ -138435 20047 -158406 -99299 253305 65134 134795 159369 462468 -95458 295282
12101B95282j71436j05634j16781m7554K29917q8624l76349L0801M38943K60329
$$ 295282 123846 18212 -98569 -146123 83794 -4830 -381179 -350378 88565 348894
12091C48894j88665Q3219r4922l09324K60305J24817l08508K50892k58911K647
$$ 348894 160229 243448 148526 -160798 99507 224324 -84184 166708 -92203 -89556
12081h9556K28875m08351n4969N3570N2078q4162M06456k87350L22825j71539
$$ -89556 139319 -269032 -324001 -270431 -218353 -302515 103941 -183409 139416 -32123
12071c2123J29541m0277K89833j29577J09148k08518L12236m40683k3328N09332
$$ -32123 97418 57141 346974 217397 326545 118027 430263 -10420 -33748 475584
12061D75584k53425m28781l9302J70625m5548n5160L31848n51534K45766J7336
$$ 475584 222159 -206622 -245924 -75299 -120847 -176007 155841 -395693 -149927 -132591
12051a32591J82671q2395K76081j64768J74097l88784k55133M72783k59231K3603
$$ -132591 50080 -32315 243766 78998 253095 -135689 -390822 81961 -177270 -153667
12041a53667K35418J9352j41700j9564m6610j3812n0804K3197K71537K68569o80061
$$ -153667 81751 101103 -40597 -60161 -106771 -120583 -171387 -148190 123347 391916 -288145
12030b88145Q4227Q0875J64675l10765L36964j80913K19860J52006n53360J28572
$$ -288145 -203918 -123043 41632 -269133 67831 -113082 106778 258784 -294576 -166004
12020a66004J45730K4471l11653M08940K46306m59419J8830l3482J84796j22239
$$ -166004 -20274 4197 -307456 101484 347790 -111629 -92799 -126281 58515 -63724
12010f3724L1354J05823J19760k14289K4048N1698l83531O8707J75532P7864J93041
$$ -63724 -32370 73453 193213 -21076 2972 54670 -328861 -260154 -84622 -6758 186283
11999A86283n4275j28105m36484M52344j2422K26147j09702j13536Q3178m1913
$$ 186283 132008 3903 -432581 19763 7341 233488 123786 10250 93428 51515
11989E1515m256j26171J53524J25251n6713m86241K4835L01441J31641L0497m00691
$$ 51515 47259 -78912 74612 199863 143150 -343091 -318256 -16815 114826 145323 -255368
11978b55368M09354k24462j18803m62979N81901R3511j36486M05876M7446j58393
$$ -255368 153986 -70476 -189279 -652258 -70357 23154 -113332 292544 339990 181597
11968A81597k21251j5465L92086l9671n3251m13042K66432K75509n69465K29058
$$ 181597 -39654 -55119 336967 297296 244045 -168997 97435 372944 -196521 32537
11958C2537l8898j17800J91707K13442m70699P7935j89666O6530K15483P7451
$$ 32537 -6361 -124161 67546 280988 -189711 -111776 -301442 -234912 -19429 58022
11948E8022j15376L26012k26831o2573J65634k19526k3179N4434l55421O04636
$$ 58022 -57354 268658 41827 -20746 144888 -74638 -97817 -43383 -398804 205832
11938B05832l16363j60061L13456j12213K30205o65066M06789N7917J15682N8990
$$ 205832 -110531 -270592 42864 -69349 160856 -504210 -97421 -39504 76178 135168
11928A35168k57228K11734k75042J89760Q0214j40740k15978K69900K84467L37346
$$ 135168 -122060 89674 -185368 4392 84606 -56134 -272112 -2212 282255 619601
11918F19601q70208K24797L7671l76395K83754J03911P9592k10477J94647j57663
$$ 619601 -250607 -25810 11861 -364534 -80780 23131 102723 -107754 86893 -70770
11908g0770J81369J25370r5243p0232J68908j04034K8173o8945j19536L29266
$$ -70770 110599 235969 140726 70494 239402 135368 163541 94596 -24940 304326
11898C04326l52187Q2294l21081M40694n19321L73327M0231j19956r7518M950
$$ 304326 -47861 34433 -286648 154046 -365275 8052 48283 -71673 -169191 -164241
11888a64241M44882n13284L64561m34014J13070P08228n25692j59397J04928J52883
$$ -164241 280641 -232643 131918 -302096 -189026 519202 -6490 -165887 -60959 91924
11878I1924Q5595k86990m0473J10181m60401O33926p3919M70919m24814k52299
$$ 91924 177519 -109471 -149944 -39763 -500164 133762 59843 530762 105948 -146351
11868a46351j42149J07086L95228k52281J72473j6537J29180k89355k10795K81378
$$ -146351 -288500 -181414 213814 -38467 134006 117469 246649 -42706 -253501 27877
11858B7877j48826K84282k95607J80227j20992K03715J568r4210l49338L77789
$$ 27877 -120949 163333 -132274 47953 -73039 130676 132244 38034 -311304 66485
11848F6485l16412J92564j59804K72625o6543J27245J0824N7428j96025J53941
$$ 66485 -249927 -57363 -217167 55458 -11085 116160 126984 184412 -11613 142328
11838A42328l93612K53932k65101J23365K10274j28828r4972o9595K42145k09683
$$ 142328 -251284 2648 -262453 -139088 71186 -57642 -152614 -222209 19936 -189747
11828a89747K15002p1803K12894k19173q8831J00310m43289O84665k09097R1668
$$ -189747 25255 -46548 166346 -52827 -141658 -41348 -484637 200028 -9069 82599
11818H2599k94160J12823N04627k81285k51628K38749l44770J97646O1136j36107
$$ 82599 -211561 -98738 405889 124604 -127024 111725 -233045 -35399 25737 -110370
11808a10370r7504J77301j04112M35420l55680Q6558l5936o2643K87698l5527
$$ -110370 -207874 -30573 -134685 300735 -54945 31613 -4323 -66966 220732 185205
11798A85205j62121j02991j86180L3167O52697p66925J25405K31674k77347K05433
$$ 185205 23084 -79907 -266087 -232920 419777 -347148 -221743 9931 -267416 -61983
11788f1983M82646m51450K40269K7373o4315k96480K66542j46836j17448O4979
$$ -61983 420663 -30787 209482 236855 172540 -123940 142602 -4234 -121682 -56703
11778e6703Q957j26460j44698M79388l66318L36728j48816j30685N15926l60068
$$ -56703 -47746 -174206 -318904 160484 -205834 130894 -17922 -148607 367319 7251
11768G251l79678M8393O1259K51817l85743P10518k04664L19490l69792j02574
$$ 7251 -372427 -324034 -262775 -10958 -396701 313817 109153 428643 58851 -43723
11758d3723J83692l82986L72577n9815n3540Q7407k04580J96056m0902K19342
$$ -43723 139969 -243017 129560 69745 16205 103612 -100968 95088 54186 273528
11748B73528j70261j95403N91318m73041j22418m00832L33903p6106L23727k66600
$$ 273528 103267 -92136 499182 26141 -96277 -497109 -163206 -239312 84415 -182185
11738a82185l01269K75642J82298N1044J29194L57897o18711O10076p2370k77874
$$ -182185 -483454 -207812 -25514 25530 154724 512621 -106090 503986 431616 153742
11728A53742j89626N8435j40143L0173j67432M49874j16297K8017j39835j3631
$$ 153742 -35884 22551 -117592 -87419 -254851 195023 78726 106743 -33092 -46723
11718d6723P0322J17727k8674k98502J67811m8646p2543K60128j80208q992M14634
$$ -46723 23599 141326 112652 -185850 -18039 -66685 -139228 120900 -59308 -68300 346334
11707C46334m72934j4364Q6765J49492l12554o1358K24596m2841q6074K30597
$$ 346334 -126600 -140964 -54199 95293 -217261 -278619 -54023 -96864 -182938 47659
11697D7659o6066k72264J01792K69470k5196J95843k07266K20712j89630o2498
$$ 47659 -18407 -290671 -188879 80591 55395 251238 43972 264684 75054 12556
11687A2556L0129j19596q396N6672n845n9902K06306l70107k67827M54449N9606
$$ 12556 42685 -76911 -85307 -28635 -34480 -94382 111924 -258183 -526010 -71561 -11955
11676a1955m755n4440K7104j08731p8044N12115k16748k10373M55319j06629p3142
$$ -11955 -16710 -71150 -44046 -152777 -230821 281294 64546 -145827 309492 202863 129721
11665A29721k75629K32817k15625k28694L61069l8388q2406j49101P06211n35424
$$ 129721 -145908 86909 -128716 -357410 3659 -34729 -117135 -266236 439975 -95449
11655i5449L83468m29277j6772J08677L84819k97197k53655L65769n40682J54507
$$ -95449 288019 -141258 -158030 -49353 335466 38269 -215386 150383 -390299 -235792
11645b35792L03223p1072J18096m6677k11996L05825k53442J37557M37172l19098
$$ -235792 67431 -3641 114455 67778 -144218 161607 -91835 45722 482894 163796
11635A63796l11572K30009l27301Q8790M47272m24115L69787k60697l0388J81374
$$ 163796 -147776 82233 -245068 -156278 290994 -133121 236666 -24031 -54419 126955
11625A26955l67903N3386m78762M58173N62395k00716l21029K9944J21841L56651
$$ 126955 -240948 -187562 -666324 -208151 354244 153528 -167501 -137557 -15716 340935
11615C40935k92494O4423m7287r6963j01041P8140n6942K76829n87587L30530
$$ 340935 48441 112864 65577 -31386 -132427 -54287 -111229 165600 -421987 -91457
11605i1457L20028k55874K51869m23991K96495L5580n93003N34898j7437k14915
$$ -91457 228571 -27303 224566 -199425 97070 132650 -460353 74545 57108 -157807
11595a57807M02536r3314j52281J63576l08679Q2328l99196N28820j73419L71243
$$ -157807 244729 151415 -866 162710 -145969 -63641 -462837 65983 -107436 263807
11585B63807l46030l73520M15191k98786M06029o3824J3858K39520k75514l93406
$$ 263807 -82223 -455743 -40552 -339338 66691 2867 16725 256245 -19269 -412675
11575d12675K50069J55954n79612O43157j08950J90795r4166j62015L60415j66583
$$ -412675 -162606 -6652 -586264 56893 -52057 138738 44572 -117443 242972 76389
11565G6389J0875J76456n28224K41552k41289J80965n5151j6116m3734M28651
$$ 76389 87264 263720 -264504 -22952 -264241 -83276 -138427 -154543 -198277 230374
11555B30374p59141Q30314m22405R2350o9154R7106j63506J86995J86472J2564
$$ 230374 -528767 301547 -120858 -28508 -97662 -556 -164062 22933 209405 221969
11545B21969j66344j05275k6612M9159Q4618j85751P59321l71202o7763j47936
$$ 221969 55625 -49650 -76262 -27103 57515 -128236 631085 259883 192120 44184
11535D4184K0196r7579j68234k63326L13182J15636M54751n11699L02555l89277
$$ 44184 64380 -33199 -201433 -464759 -151577 -35941 418810 -92889 209666 -179611
11525a79611L20564l64256L90895J07214k94646P1670L93913k90528J61849m92530
$$ -179611 140953 -223303 167592 274806 -19840 51830 445743 155215 317064 -175466
11515a75466K87986j72294J55802R5084l24106k79114M10494r3460J56758J7224
$$ -175466 112520 -59774 96028 191112 -132994 -412108 -1614 -95074 61684 78908
11505G8908J2372j88278l21820L20193R4908l12041M37636j88157L8340j76393
$$ 78908 91280 -96998 -418818 -98625 -3717 -315758 121878 -66279 -27939 -204332
11495b04332K95380K2060J7962k23955j14392N9503K56824n09622P06897k91536
$$ -204332 91048 113108 131070 -92885 -207277 -147774 109050 -400572 306325 14789
11485A4789j32248K17988J84750j60604l74499L41049l00078L18683L83564p24728
$$ 14789 -117459 100529 285279 124675 -249824 91225 -208853 109830 493394 -231334
11475b31334K26176J6326L11836o24777R9072K05414k6290l36682K54835L40446
$$ -231334 -5158 11168 323004 -301773 -202701 2713 -23577 -360259 -105424 235022
11465B35022j42314m24195L66041K71484q29281L13017Q3545J22435o11512L66575
$$ 235022 92708 -331487 34554 306038 -523243 -210226 -126681 -4246 -615758 -249183
11455b49183M4160j6668K73030j07040j45292Q7951j95696L06944R9775j02411
$$ -249183 -205023 -221691 51339 -55701 -200993 -113042 -308738 -1794 97981 -4430
11445d430j24402J87827N9826j42441Q1601l8418K36222r8388j38044n1375J25118
$$ -4430 -128832 58995 118821 -23620 57981 19563 255785 157397 19353 -32022 93096
11434I3096j72437P5599p4629J81376l28583K77702K1900k04063L04728K385j20544
$$ 93096 -79341 -3742 -78371 103005 -225578 52124 74024 -130039 174689 177074 56530
11423E6530o9501K00915j15691m00146M33221k60279R6503R0607j76310M71509
$$ 56530 -12971 187944 72253 -327893 105328 -154951 -58448 32159 -144151 327358
11413C27358l82692r5670L11410j79263j89241M9898J1341J60202L08077j57817
$$ 327358 -55334 -151004 160406 -18857 -208098 -158200 -146859 13343 321420 163603
11403A63603n37400L89072O2599r7918R2188J11320j40984j27895j14033M10396
$$ 163603 -373797 15275 77874 -20044 72144 183464 42480 -85415 -199448 210948
11393B10948k01579Q0007K11148k67534O9970j65641j43039J63400L41876m99980
$$ 210948 9369 89376 300524 32990 102960 -62681 -205720 -42320 299556 -200424
11383b00424J82942O1472m8936K05359j18991n4451N4945j3951j85909L53750
$$ -200424 -17482 43990 -4946 200413 81422 26971 81916 67965 -117944 235806
11373B35806k85107R4939M2628j95809L14066M118q01492J72312O91015j30216
$$ 235806 -49301 45638 88266 -107543 206523 210641 -590851 -418539 272476 142260
11363A42260l52773L01371j33116N9419J4148j46622j34074L12944k53277J97678
$$ 142260 -210513 90858 -42258 17161 31309 -115313 -249387 63557 -189720 7958
11353G958l1481K9269q1053l9667j86722J03444M51331m05528l69364M96696M57873
$$ 7958 -23523 5746 -75307 -114974 -301696 -198252 253079 -152449 -521813 -25117 432756
11342D32756p07252K34033o1510J49422j71475K30705K7006l99328Q6027K45477
$$ 432756 -274496 -40463 -101973 47449 -124026 106679 133685 -265643 -179616 65861
11332F5861J58218j64239J62802o3462J51630l24365J8933J15543J87250l03504
$$ 65861 224079 59840 222642 159180 310810 -13555 5378 120921 308171 4667
11322D667M3997J00677O4002l07270j15092K86866O7473l97462J73761j54252
$$ 4667 48664 149341 213343 -93927 -209019 77847 145320 -252142 -78381 -232633
11312b32633Q4450J19939O1050k33554K03869k5234j1679m9889L2553R0274k2292
$$ -232633 -148183 -28244 32806 -200748 3121 -22113 -33792 -83681 -51128 39146 16854
11301A6854N03214n60428N329K06897m33070J38289J35364r7250j6064L61968
$$ 16854 520068 -40360 -35031 171866 -261204 -122915 12449 -84801 -100865 261103
11291B61103j34149J51985j39424K4367k98031J90959k15056j97610L32732J80110
$$ 261103 126954 278939 139515 163882 -134149 56810 -158246 -355856 -23124 156986
11281A56986N8710K53666l57119k20099k02772L61261J78873o39650K66699N5217
$$ 156986 215696 469362 112243 -107856 -310628 50633 229506 -410144 -143445 -88228
11271h8228L07857m05962J58041J61813n3687j84629L39127j63888J3797M38624
$$ -88228 219629 -186333 -28292 133521 79834 -104795 234332 70444 84241 522865
11261E22865o25892J83771n40182P8466O58546l34924n6382k2176Q1702j2173
$$ 522865 -103027 80744 -459438 -380972 277574 -57350 -113732 -135908 -54206 -66379
11251f6379K5865L39837m02163J56427j11268l28548M25822n1880l92714K19216
$$ -66379 -40514 299323 -102840 53587 -57681 -386229 39593 -12287 -405001 -185785
11241a85785L34608l73706J81716M59318l59771K65053l29997k27849p6403O00490
$$ -185785 148823 -224883 -43167 416151 56380 321433 -8564 -236413 -312816 287674
11231B87674n68232L53732k02344k43565K89084J80236j62694O7622J06873l9921
$$ 287674 -280558 73174 -129170 -372735 -83651 96585 -66109 1513 108386 68465
11221F8465R6790o2790l0288n1113j02132M41823o8305n29180J68794P8120K85552
$$ 68465 165255 102465 72177 21064 -81068 360755 292450 -236730 -67936 10184 295736
11210B95736m69737J79094j12829l20470Q9569K83570m7119J05722k4780J08587
$$ 295736 -174001 5093 -107736 -428206 -338637 -55067 -102186 3536 -21244 87343
11200H7343q4615K08628l48890K83384j72477K02990k36074K04758k45609K37786
$$ 87343 2728 211356 -137534 145850 -26627 176363 -59711 145047 -100562 137224
11190A37224m7847J51586l19538J71638L71454m07316k84629L06880j90869q6315
$$ 137224 89377 240963 -78575 93063 464517 57201 -227428 79452 -111417 -197732
11180a97732J61767l0135r732J64783Q7265l73021J67562j78320L36180K18374
$$ -197732 -35965 -66100 -75832 88951 176216 -196805 -29243 -207563 128617 346991
11170C46991j69120j96920k45139M95111l27901J58630j0301J77011l37214O5897
$$ 346991 177871 -19049 -264188 230923 -96978 61652 51351 228362 -108852 -42955
11160d2955P8909o6876R1011l5818N1392k62941J64614l1472k89261N43469k30529
$$ -42955 35954 -30922 60089 24271 75663 -187278 -22664 -54136 -343397 200072 -30457
11149c0457j91185K02555q0114K4943q614K44230k19056l44515J8386M00691k7302
$$ -30457 -221642 -19087 -99201 -74258 -82872 161358 -57698 -402213 -383827 16864 -10438
11138a0438J02467m5761j88482L32196L317n49429L07399O8183J51253k60100
$$ -10438 92029 46268 -142214 189982 193299 -356130 -48731 19452 170705 -89395
11128h9395K2278J52155o11177O64280l83040j53294R5080Q5477j19469K60326
$$ -89395 -67117 85038 -526139 138141 -244899 -398193 -303113 -217636 -337105 -76779
11118g6779K70283k47851k14681L72209k66191K00924p2992o1791k0249J23464
$$ -76779 193504 -54347 -269028 103181 -163010 37914 -35078 -96869 -117118 6346
11108F346n5550N668J76060k45234K29289l72209J72196P0116p7867M64891k65992
$$ 6346 -49204 -43536 132524 -112710 116579 -255630 -83434 -13318 -91185 373706 107714
11097A07714k32358k55003K90825M63593r39500O49138r2634M30075o93264M23998
$$ 107714 -124644 -379647 -88822 374771 -564729 84409 -8225 421850 -271414 152584
11087A52584J28839n95209L78926l81678M43948J36969j65978K52359k69178J86669
$$ 152584 281423 -313786 65140 -316538 127410 264379 98401 350760 81582 268251
11077B68251n00317J08012n6584O38387n04718j1778L2204j1233N7201L9052l12118
$$ 268251 -232066 -124054 -180638 457749 -46969 -58747 -26543 -37776 19425 58477 -253641
11066b53641M73188l68752L88948j52291l2445j51725K76173p0901m90168l3329
$$ -253641 219547 -149205 239743 87452 55007 -96718 179455 108554 -381614 -414943
11056d14943O80191j90187o0023k06873L14927l94873J95980o6814K98749n22204
$$ -414943 265248 75061 15038 -191835 123092 -271781 -75801 -142615 156134 -366070
11046c66070K46711J37287L28776j82519k04254l03682N01894k71569L00360r7952
$$ -366070 -119359 17928 346704 164185 -40069 -343751 158143 -113426 186934 88982
11036H8982l30239j78610L83121K2019J71942n8436J02572k32932j38723j54034
$$ 88982 -241257 -419867 -36746 -14727 157215 98779 201351 -31581 -170304 -324338
11026c24338L79126j47184J04011j89820J28547l3600p6236M4568r4395L17864
$$ -324338 54788 -92396 11615 -178205 -49658 -83258 -159494 -114926 -209321 108543
11016A08543k23239J92069K38258n38288k46320P04195k37761P640m0549L6801
$$ 108543 -114696 77373 315631 -222657 -468977 235218 -2543 5097 -35452 1349
11006A349K34808j93958M1826j83483O5078M60719l94226l10242K82925R1712
$$ 1349 236157 42199 84025 -99458 -34380 426339 32113 -278129 4796 96508
10996I6508m82283M7735J87527M5415L81463n18915N61702j43026k66332K59953
$$ 96508 -385775 -338040 -150513 -105098 276365 -242550 319152 176126 -90206 169747
10986A69747k51035l09890L00823J25100j0333n2836O822j21091K01164k70696
$$ 169747 -81288 -391178 -90355 34745 24412 -28424 -21602 -142693 58471 -212225
10976b12225L03001J26885j33529q4873K2487j12912l01439L47506L14177n94176
$$ -212225 90776 217661 84132 -741 21746 -91166 -392605 -45099 269078 -325098
10966c25098J33601K16902k38933N06124l86894O2832j15270J4991J78096J75066
$$ -325098 -191497 25405 -213528 292596 -94298 -31466 -146736 -131745 46351 221417
10956B21417o6220m69711L83372j93851p3885N56125n0014p26067J20796L32616
$$ 221417 155197 -314514 68858 -124993 -198878 357247 307233 -418834 -298038 34578
10946C4578j73148j92743R9327N2854J51281k61893M14715k18292K48327l71530
$$ 34578 -138570 -331313 -231986 -179132 -27851 -289744 124971 -93321 155006 -216524
10936b16524L58167j86479K30980k15935N4978r6975K67699r9337L43069l53720
$$ -216524 141643 -44836 186144 -29791 25187 -71788 195911 96574 439643 85923
10926H5923J18082p32650l5224M50567L83820k28866M0855p3870l47318L31433
$$ 85923 204005 -528645 -563869 -113302 270518 41652 82507 8637 -338681 -7248
10916g248n984J09024j48336l7082K49574j30248m69192O66150j83749k8458k62112
$$ -7248 -13232 95792 -52544 -89626 159948 29700 -439492 226658 42909 14451 -247661
10905b47661M18187m95889L49176o8486m0661J27560R1971j87458J3510J98874
$$ -247661 170526 -325363 23813 -44673 -85334 42226 134197 -53261 -39751 159123
10895A59123k73795j22851O5547K61217L5571J06068k19068K9721k64409L45147
$$ 159123 -114672 -237523 -171976 89241 124812 230880 11812 41533 -222876 122271
10885A22271j06171q4584K79496k48225L6076M9289l35537K96511J79255k73380
$$ 122271 16100 -68484 211012 -37213 -1137 48152 -287385 9126 188381 -84999
10875h4999J43975p1263o0261J41789j17144L49691n1369j49233k11823K24250
$$ -84999 58976 -12287 -72548 69241 -47903 301788 250419 101186 -110637 113613
10865A13613l67228N93316l74753L0510M0908k84944M54389k72655O10123o71348
$$ 113613 -253615 339701 -35052 -4542 36366 -248578 205811 -66844 543279 -128069
10855a28069k05342P00202o93579N0165J31076O1831J75967j07728J418L05943
$$ -128069 -333411 366791 -326788 -276623 -145547 -83716 92251 -15477 -14059 291884
10845B91884k91543p3395o011K03613o1621k10311L07717l92r7293J34881k13836
$$ 291884 341 -73054 -79065 124548 62927 -147384 160333 159941 62648 197529 -16307
10834a6307K04802l9427k0723m37114N0162J91964n3968K46974Q645l84094J65809
$$ -16307 188495 149068 128345 -308769 -258607 -66643 -120611 126363 135008 -249086 -83277
10823h3277r2856L71299j93948m16842K17474l5703k70214K70605J49215M45844
$$ -83277 -176133 195166 1218 -415624 -198150 -233853 -504067 -233462 -84247 361597
10813C61597m66060K65436N9435o76539N15110j68315j26415N29368m72530K11346
$$ 361597 -104463 160973 220408 -456131 58979 -109336 -235751 293617 -178913 32433
10803C2433J16791k96511L67985k14475k9758m2856J757P5822n7288K87885m12192
$$ 32433 149224 -147287 220698 6223 -23535 -66391 -64634 11188 -46100 241785 -170407
10792a70407L96301j36252r8682K98820n18051K36832m007O4028k26665J11471
$$ -170407 225894 89642 -9040 289780 -228271 8561 4554 68582 -158083 -46612
10782d6612L65910m39149J34853J730l2944k14318j40917L41550K1858O37493
$$ -46612 319298 -119851 15002 16732 -16212 -230530 -371447 -29897 -8039 629454
10772F29454r07073N59882q18761O14161m50189N97257l28656K09949K9837J31724
$$ 629454 -277619 282263 -536498 77663 -372526 224731 -103925 106024 135861 267585
10762B67585j99197L3561r81L86884n79793J76165j56127n5430K12603p7912K92573
$$ 267585 68388 101949 100968 487852 -91941 84224 -71903 -127333 85270 7358 299931
10751B99931l9122l86859J75878R636m80229O28769j08573k32056Q7018r6583
$$ 299931 260809 -126050 49828 59464 -420765 208004 99431 -132625 -45607 -142190
10741a42190M60994P2535n78466K51813l33703J66752j19133P6634m22692M75403
$$ -142190 318804 391339 -187127 64686 -269017 -102265 -221398 -144764 -567456 -92053
10731i2053q3544K03414L90220k79984k19822K1022n9065L17582l85111N6308
$$ -92053 -175597 27817 418037 138053 -81769 -60747 -119812 197770 -187341 -131033
10721a31033Q2421j53388Q01739l22957m11403J88749k39846J88767Q1611L13361
$$ -131033 -48612 -202000 599739 276782 -134621 54128 -185718 3049 84660 398021
10711C98021o55485n6775L00478p0591j27746m1437l8345K50385K94300l79315
$$ 398021 -257464 -314239 -13761 -84352 -212098 -253535 -291880 -41495 252805 -126510
10701a26510L01022k35972J3708K2294J17540J42096j52334k7151l22369M59340
$$ -126510 174512 -61460 -47752 -25458 92082 234178 81844 54693 -267676 191664
10691A91664l67471K06541R1524r9869r609j64765P1207k8027J04018J52317j93532
$$ 191664 -175807 30734 122258 22389 12780 -151985 -80778 -108805 -4787 147530 -46002
10680d6002n9818M10343j60781J66168p67362J44244L50837m53434M63085l16962
$$ -46002 -105820 304523 143742 309910 -457452 -313208 37629 -415805 47280 -269682
10670b69682N0179J66944J80944K4647o49607N51887J78098j31703L99183p21114
$$ -269682 -219503 -52559 128385 153032 -496575 55312 233410 101707 500890 -220224
10660b20224K18112n5784K86189q7625K86723l48750l83173M92875m02872J24356
$$ -220224 -2112 -57896 228293 140668 427391 78641 -304532 188343 -214529 -90173
10650i0173p7875m39485O58764k04252J2277j6535J6132L91565J00666k4865m39676
$$ -90173 -168048 -607533 51231 -153021 -140744 -157279 -141147 250418 351084 326219 -113457
10639a13457j7625J80497j64250K62370k5081p4721j56442j3558Q7985m4653p764
$$ -113457 -131082 49415 -114835 147535 122454 47733 -108709 -122267 -34282 -78935 -86699
10628h6699N2805K28851l69927K32122j85522J13854K64851K75630m98531m57469
$$ -86699 -33894 194957 -174970 57152 -128370 -14516 250335 525965 27434 -430035
10618d30035O03266j58025L1786l37891L75541k26724Q9377J51350J54181m21065
$$ -430035 173231 15206 46992 -290899 84642 -142082 -52705 98645 252826 -168239
10608a68239K62537k95371O0237N10176n30626L52720o56212M51791k35098L12145
$$ -168239 94298 -201073 -140836 369340 -161286 191434 -464778 -12987 -248085 64060
10598F4060k57499J79027k89268k66772N00253Q5581R967p6451l17511P7191N51434
$$ 64060 -193439 -14412 -303680 -570452 -70199 15382 25349 -51102 -368613 -291422 260012
10587B60012m60842K18150j39222n3368K50563k90661p7853J69819L83047l22482
$$ 260012 -200830 17320 -121902 -175270 75293 -215368 -293221 -123402 259645 -62837
10577f2837L35155k17457k39259L93847p7940m42358K76795M1869K28747m17067
$$ -62837 272318 54861 -184398 209449 131509 -310849 -34054 7815 236562 -180505
10567a80505J57623L15452k07198p4101O989J30688j3277m75214K09677M46175
$$ -180505 -22882 292570 85372 11271 18260 148948 135671 -339543 -129866 316309
10557C16309l46446N453J78538l52353K51146l34370M60226k98983o2152J61944
$$ 316309 -30137 -24684 153854 -198499 52647 -281723 178503 -120480 -182632 -20688
10547b0688n0649j2896m1254L43959k06617k36010J73474m03918M13309k18382
$$ -20688 -71337 -84233 -125487 218472 11855 -224155 -50681 -454599 -41290 -259672
10537b59672M17719o3576K4937n6533k2702n09522J41671M58198l6724m65676
$$ -259672 158047 94471 119408 62875 40173 -469349 -327678 130520 93796 -371880
10527c71880K52848K52078m07018K95632N2538k14133P5137r8332N81022l86520
$$ -371880 -119032 133046 -273972 21660 74198 -139935 -64798 -163130 417892 31372
10517C1372l04140j43939N12499J40766q3169M6281l66562K48528l64247J34163
$$ 31372 -272768 -416707 95792 236558 153389 199670 -166892 81636 -282611 -148448
10507a48448Q5794J12740R6305k95176R0847j9303j11503L9104M39829l28892
$$ -148448 -62654 50086 146391 -148785 -57938 -77241 -188744 -149640 290189 -38703
10497c8703o6491Q3618J72913j80816j20297j80734M43725j01545J60286l34964
$$ -38703 -105194 -21576 151337 -29479 -149776 -330510 113215 11670 171956 -163008
10487a63008m3751q8018J404K69463M1617J05677J585K34356R0375k71743k88450
$$ -163008 -206759 -294777 -293373 -23910 17707 123384 124969 359325 449700 177957 -110493
10476a10493J24874L09738j73137K764q4281n6834o4078k28137J65131o884m75703
$$ -110493 14381 324119 150982 153746 69465 12631 -51447 -279584 -114453 -121337 -597040
10465e97040O34854R3841m03414l00492O29088j26572r2499J36783j8574R3489
$$ -597040 37814 131655 -271759 -572251 56837 -69735 -162234 -25451 -44025 49464
10455D9464m70771N06463m456o2334j24599J01773j78216k168J62309K49230l18213
$$ 49464 -421307 85156 80700 18366 -106233 -4460 -182676 -184844 -22535 226695 -91518
10444i1518J56748k75993j4775N95672j85139l50788M69642l54551p3373j12235
$$ -91518 65230 -210763 -225538 370134 184995 -165793 303849 -50702 -124075 -236310
10434b36310j6053J09122K26579L53232k51979l05644k43933K84844K2648J55789
$$ -236310 -252363 -143241 83338 436570 184591 -121053 -364986 -80142 -57494 98295
10424I8295n25115L21264L14961K7991n68397J17044L4155L51139J10411k35881
$$ 98295 -426820 -105556 209405 237396 -331001 -213957 -179802 171337 281748 45867
10414D5867j77587L21922k10232O5114K09687o10708M24266J41159k10915p4099
$$ 45867 -131720 190202 -20030 45084 254771 -355937 68329 209488 -1427 -75526
10404g5526j02761J76478k1529r4945J40892j51008K47488K9515j84442J00477
$$ -75526 -178287 -1809 -23338 -118283 22609 -128399 119089 148604 -35838 64639
10394F4639o637j16456j06844J66534p8602K41771J3131l86775L71635j10077
$$ 64639 58002 -58454 -165298 1236 -77366 164405 177536 -209239 162396 52319
10384E2319j30436K35720k52048q7167O6430p7686R4235J20229l06616N80045
$$ 52319 -78117 157603 -94445 -181612 -115182 -192868 -98633 21596 -285020 295025
10374B95025l01384J41269q7778k76726N139J88976k63068j53751K50898M95762
$$ 295025 -6359 134910 47132 -229594 -224455 -35479 -298547 -452298 -201400 294362
10364B94362Q541k34509L97292o40460L24495Q4043k44644K25755m19814J28420
$$ 294362 302903 68394 465686 -174774 149721 233764 -10880 214875 -204939 -76519
10354g6519o7621l3582j05473K53863j26724K25471k31113J17262k9943j3861
$$ -76519 -144140 -177722 -283195 -29332 -156056 69415 -161698 -44436 -74379 -88240
10344h8240j06916o4206M24364m55762K00182K62296o71394M63040K43676o85954
$$ -88240 -195156 -259362 165002 -290760 -90578 171718 -499676 -36636 207040 -478914
10334d78914J53634L50781k31943R7933M14456j24438m25815J48054J59154j55575
$$ -478914 -325280 25501 -206442 -108509 305947 181509 -244306 -96252 62902 -92673
10324i2673P7665Q5441O5501p8798M9252r2832L13643j35634J38090m22874m37529
$$ -92673 -15008 70433 135934 57136 106388 13556 327199 191565 329655 -93219 -530748
10313e30748M65125q8024J2291J08052M43224n85426k9024l27847L44729K57828
$$ -530748 -65623 -153647 -141356 -33304 409920 -175506 -204530 -532377 -187648 70180
10303G0180j27891K31567j87122q2550k65356L30519K408K34798m69174P8912
$$ 70180 -57711 173856 -13266 -95816 -361172 -30653 -28245 206553 -262621 -183709
10293a83709M7861M13862o44287N34227n1876k9251q9981L80429n93449M14419
$$ -183709 -135848 278014 -366273 167954 116078 86827 -3154 377275 -216174 198245
10283A98245j35083j59420k37752O43929r9943k02677J33413j07375J05374n35254
$$ 198245 63162 -96258 -334010 309919 209976 7299 140712 33337 138711 -396543
10273c96543k80132L07191K31444k85149M22983r35l46038O08718p8672n39330
$$ -396543 -676675 -369484 -138040 -423189 -206 -1141 -347179 261539 182867 -356463
10263c56463O25641n70159P8251Q9536Q8121N8750L37420j31127k71251L03499
$$ -356463 269178 -300981 -222730 -133194 -45073 13677 351097 219970 -51281 252218
10253B52218l37501p9698J21551j79912K85195O1169K3043k36108K92506J71519
$$ 252218 -85283 -164981 -43430 -223342 61853 123022 146065 -90043 202463 373982
10243C73982m85530K93096j19432k71787K32473k48334J8292K29941O9670M0634
$$ 373982 -111548 181548 62116 -209671 22802 -225532 -207240 22701 92371 133005
10233A33005l22222q8562J67400J25239M4240n39303J35742K87956j25215n37
$$ 133005 -189217 -277779 -110379 14860 59100 -480203 -344461 -56505 -181720 -182257
10223a82257j32828J47555j08379N83074m02051k07816O48052l43610o41590N59203
$$ -182257 -315085 -167530 -275909 307165 -94886 -302702 345350 1740 -639850 -80647
10213h0647q9396j86431J23081N50831k85161L5643k13904M339L28350J38944
$$ -80647 -170043 -356474 -233393 317438 32277 67920 -145984 -141645 186705 325649
10203C25649l32060J59181j72177l7814J25826L0394l67761O7923O9805Q0422
$$ 325649 -6411 152770 -19407 -57221 68605 98999 -268762 -200839 -131034 -50612
10193e0612m40092P68575l29657k66390K71237M6523l05980k0676K13537j18466
$$ -50612 -490704 277871 -51786 -318176 -46939 -416 -306396 -327072 -113535 -232001
10183b32001j47399P3047J25404J45243O8439j50759K56911m07034L0207l7420
$$ -232001 -379400 -306353 -180949 -35706 32733 -118026 138885 -268149 -237942 -275362
10173b75362J66710R3642l86129N78434j59185M2181k90188J50654K3014l60991
$$ -275362 -108652 -15010 -401139 177295 18110 60291 -229897 -79243 -56229 -417220
10163d17220L59525J08159q7301j18522K62290Q4356k14275L1502K08870j98533
$$ -417220 -57695 50464 -36837 -155359 106931 191287 -22988 8514 217384 18851
10153A8851K1674R8554k57178J14017j45435K74394j04220k04783j43194M34512
$$ 18851 40525 139079 -118099 -4082 -149517 124877 20657 -184126 -327320 107192
10143A07192n40728P84790r2432m42952M95528K44017p39393l34240R36721j01848
$$ 107192 -433536 351254 258822 -184130 311398 555415 -183978 -518218 418503 316655
10133C16655m73320L0855J44089j77728J62211j71379J15228J71203K11886q0067
$$ 316655 -156665 -125810 18279 -159449 2762 -168617 -53389 117814 329700 249633
10123B49633k21290M10054l67618J03215L48381j11065J77873J66867L39773J72895
$$ 249633 28343 438397 70779 173994 522375 411310 589183 756050 1095823 1268718
10113A268718j2394J2042j58344M42253M27422j60385J60124k91822J87966l98688
$$ 1268718 1256324 1268366 1110022 1552275 1979697 1819312 1979436 1687614 1875580 1476892
10103A476892Q3291K88786n35539K6051k23401o3470O6072j32750m50712j17737
$$ 1476892 1560183 1848969 1313430 1339481 1116080 1052610 1118682 985932 535220 417483
10093D17483N62000r82393K76360j86349j25676J14915r3438l4921J68309j41027
$$ 417483 979483 -2910 273450 87101 -38575 76340 -17098 -52019 116290 -24737
10083b4737L26391j11078n2260M2138m45703K97520j4485P7099J18536k72775
$$ -24737 301654 190576 138316 180454 -265249 32271 17786 94885 213421 -59354
10073e9354K9646k54839J81320k77178K98876k68425N56955k35427p0748M9113
$$ -59354 -29708 -284547 -103227 -380405 -81529 -349954 207001 -28426 -99174 -50061
10063e0061M99465n03866m98052O26166p3997l27008J31477Q7115l4858o742K04404
$$ -50061 449404 -54462 -552514 73652 -345 -327353 -195876 -108761 -143619 -150361 54043
10052E4043l07612j56651K40295K97324J67708j34882l80735L91811l62222r0830
$$ 54043 -253569 -410220 -169925 127399 295107 160225 -220510 171301 -190921 -281751
10042b81751L34967j36145k8128m1819K14465N4046n28979M99298n35588M95764
$$ -281751 53216 -82929 -111057 -152876 61589 115635 -413344 85954 -449634 46130
10032D6130j02574k43490J74166n75181O02933j95147K61613k1096J39946N3716
$$ 46130 -56444 -299934 -125768 -700949 -98016 -293163 -31550 -52646 87300 141016
10022A41016j18716j6909L1095j97249L44367j61734q9234Q997N8073l38611K48974
$$ 141016 22300 5391 36486 -160763 183604 21870 -67364 -58367 -294 -338905 -89931
10011h9931j41277j49536M06532P4484l01197J6496m2695j21842L47439N702j06902
$$ -89931 -231208 -380744 25788 100272 -200925 -184429 -227124 -348966 -1527 4175 -102727
10000a02727K10554k90275J26036P1019k64987q3559M63937j91086J0185J68543
$$ -102727 107827 -182448 -56412 14607 -250380 -333939 129998 -61088 -50903 117640
9990A17640j64491J01092j76469K29066l10185J98031k98921K26050M43892k59676
$$ 117640 -46851 54241 -122228 106838 -203347 -5316 -304237 -78187 365705 106029
9980A06029J55973l70561K55049k34038K10486j17813j34533P460J06271p9277
$$ 106029 262002 -108559 146490 -87548 122938 5125 -129408 -121948 -15677 -94954
9970i4954l41642J81935L5455P7456J10304l15278M70090m27038J61470K57635
$$ -94954 -436596 -254661 -219206 -141750 -31446 -346724 123366 -303672 -142202 115433
9960A15433k20879J66107O7484j84680J793J80967j64842N5275j60377J19213
$$ 115433 -105446 60661 128145 -56535 -54742 126225 -38617 16658 -143719 -24506
9950b4506k44474R4400M32835l99493M97654l06088l87398K40395r4319j3608
$$ -24506 -268980 -174580 258255 -141238 356416 50328 -337070 -96675 -190994 -204602
9940b04602r3950N52344l50615J40118k90777R8220L41900j42792M19562q6758
$$ -204602 -298552 253792 -96823 43295 -247482 -149262 192638 49846 469408 382650
9930C82650l3480n59807O48963n66798K75942K49119k40432k6437J41664m78958
$$ 382650 349170 -210637 438326 -128472 147470 396589 156157 129720 271384 -207574
9920b07574P6887K10794j55895K06090o2876k94477L56383l49313L68109k06278
$$ -207574 -130687 80107 -75788 130302 67426 -227051 129332 -219981 148128 -58150
9910e8150m338m083K02481n76123K93165M97398m50090P7457m3140J50679n5307
$$ -58150 -62488 -66571 135910 -440213 -147048 350350 -99740 -22283 -65423 85256 29949
9899B9949J44022k11071K41581p35053K74382j73930N09511J69571N6248l20536
$$ 29949 173971 -37100 204481 -530572 -256190 -430120 79391 248962 305210 -15326
9889a5326r9536J287m3336q8907M37140q9575r7441L26167m06504L9556K62923
$$ -15326 -114862 -113575 -156911 -245818 191322 101747 4306 330473 -76031 -36475 226448
9878B26448J5181m21377P92125l61185j90870J09542j53094J87395k1206J62870
$$ 226448 241629 -179748 612377 251192 60322 169864 16770 204165 182959 345829
9868C45829k68948J7713L96101j98073P5961n3745K34880n56701J48373J79994
$$ 345829 76881 94594 490695 292622 368583 314838 549718 -6983 141390 321384
9858C21384r6232J74862Q4923k88500L33078k20653J03074j55951M1171N6520
$$ 321384 225152 400014 484937 196437 529515 308862 411936 255985 297156 353676
9848C53676K82971j69153j76319M65591m18054J42601Q7588l05326R9533K2343
$$ 353676 636647 467494 291175 756766 338712 481313 568901 263575 363108 385451
9838C85451J71373n9851J00017J49631J53683q77151O90011m09882K92600R4519
$$ 385451 556824 496973 596990 746621 900304 23153 713164 303282 595882 690401
9828F90401J79051j53395K0820Q9611r7623r9404L64645L5466m18873K07005M9973
$$ 690401 869452 716057 736877 826488 728865 629461 994106 1029572 610699 817704 867677
9817H67677M1546l43476P9365J98766P482k6711K86660j50215k06080J97381J54264
$$ 867677 909223 565747 645112 843878 851360 824649 1111309 961094 755014 952395 1106659
9806A106659j11428m07449N29090q9888J79562R8704n7834j88679L44062m42128
$$ 1106659 995231 587782 1116872 1026984 1206546 1305250 1247416 1058737 1402799 960671
9796I60671P24708l80525r4820K93210J6554P5982k85442M45546J81900m37840
$$ 960671 1685379 1304854 1210034 1503244 1519798 1595780 1310338 1755884 1937784 1499944
9786A499944M81515J24707l75819J9725K0715K5391P2729J89965j0930N911L4104
$$ 1499944 1981459 2106166 1730347 1750072 1770787 1796178 1868907 2058872 2047942 2053853 2087957
9775B087957K33970L30148m73082J86066L89775L0898M27400j81968J01602k61419
$$ 2087957 2321927 2652075 2178993 2365059 2754834 2785732 3213132 3031164 3132766 2871347
9765B871347K12183J62545r8420j07514N43302J75719J3061k11619J99955n3296
$$ 2871347 3083530 3246075 3147655 3040141 3583443 3759162 3772223 3560604 3760559 3707263
9755C707263M47433K90265m87996P12548k02603P3367M60925L4057o8688K13807
$$ 3707263 4154696 4444961 3956965 4669513 4466910 4540277 5001202 5035259 4966571 5180378
9745E180378J36111J17723M65344m17688J09250L58984K78428J45120K21811J35898
$$ 5180378 5316489 5434212 5899556 5481868 5591118 5950102 6228530 6373650 6595461 6731359
9735F731359j79003O58663K91907L48473R9996J33406M22664J19911Q2439J80954
$$ 6731359 6552356 7211019 7502926 7851399 7951395 8084801 8507465 8627376 8709815 8890769
9725H890769N42716M27640M86939K99731Q00604K51623J67702O23162N38921R21234
$$ 8890769 9433485 9861125 10348064 10647795 11448399 11700022 11867724 12490886 13029807 13951041
9715A3951041K64565J105550M46130Q06546J291374Q68667P83227R87436J207833
$$ 13951041 14215606 15321156 15767286 16573832 17865206 18733873 19517100 20504536 21712369
9706B1712369J098123J370345J318298J331740K801391L704871Q574264J1257871
$$ 21712369 22810492 24180837 25499135 26830875 29632266 33337137 41911401 53169272
9698E3169272R600169J1226002J4552807J3035426J3438397J4878875J6764763
$$ 53169272 62769441 73995443 88548250 101583676 115022073 129900948 146665711
9691A46665711K1356975K5327714K9814563K5372014K4172397K3958500J3381324
$$ 146665711 168022686 193350400 223164963 248536977 272709374 296667874 310049198
9684C10049198P311688K84466p299969j0560689j3229975k3180928k2311801j7939020
$$ 310049198 317360886 317645352 310345383 299784694 286554719 263373791 241061990 223122970
9676B23122970j8929072j8280157j9637327k4742625k1320203j8513087j5489671
$$ 223122970 204193898 185913741 166276414 141533789 120213586 101700499 86210828
9669H6210828j3967243j0711570r728996q662786p393875o010018l853972l165131
$$ 86210828 72243585 61532015 51803019 43140233 35746358 29736340 25882368 22717237
9661B2717237j985177j808406j950144r99505j475927o19951n71765r92082j90232
$$ 22717237 20732060 18923654 16973510 15974005 14498078 13878127 13306362 12314280 12124048
9652A2124048o16965l29222p81486j08642n20836m58038k03270n02757m27389
$$ 12124048 11507083 11177861 10396375 10287733 9766897 9308859 9105589 8602832 8175443
9643H175443k60977n9674m82632l95023j63485k59006m07866J67889j16942m72420
$$ 8175443 7914466 7854792 7372160 6977137 6813652 6554646 6146780 6314669 6197727 5725307
9633E725307p0849m37647J23793O329n61366j64088k15629M50791l08974l91928
$$ 5725307 5654458 5216811 5340604 5346933 4785567 4621479 4405850 4856641 4547667 4155739
9623D155739R085j41708J59680m57849j75369J57632j51894l57395L79587r3010
$$ 4155739 4164824 4023116 4182796 3724947 3549578 3707210 3555316 3197921 3577508 3484498
9613C484498K33825m05379O1424m8234l35655j91684K73188q0155l97625M65387
$$ 3484498 3718323 3312944 3374368 3326134 2990479 2798795 3071983 2991828 2594203 3059590
9603C059590J5714j57079j83964K2615j33343j28315J37637o3167l715j38771
$$ 3059590 3075304 2918225 2734261 2756876 2623533 2495218 2632855 2569688 2565973 2427202
9593B427202m45387L51244K18320m71332N26715m64703k740K12704p4176j14052
$$ 2427202 1981815 2333059 2551379 2080047 2606762 2142059 2139319 2352023 2277847 2163795
9583B163795N27341l98211m68610J70442j18231l30203N58212j42627m14556K83372
$$ 2163795 2691136 2292925 1824315 1994757 1876526 1546323 2104535 1961908 1547352 1830724
9573A830724m46916L24508n43866M69621M200p6640k98293K18231K75176k98430
$$ 1830724 1383808 1708316 1164450 1634071 1638271 1561631 1263338 1481569 1756745 1458315
9563A458315M16414n00689K4599K62556k04574M505l54717K99488o8544K10177
$$ 1458315 1874729 1374040 1398639 1661195 1456621 1461126 1106409 1405897 1337353 1547530
9553A547530k80416k56039J10713j71566K71201k0135j94130J64039P3754k13955
$$ 1547530 1267114 1011075 1121788 950222 1221423 1201288 1007158 1171197 1244951 1030996
9543A030996n4168j3355K6795j22408l1186J55322l43325j62544N23530l97227
$$ 1030996 976828 963473 990268 867860 836674 991996 648671 486127 1009657 612430
9533F12430J64584J99079o3473j8362j34204J5291M86996m22596j4596n71073
$$ 612430 777014 976093 912620 894258 760054 775345 1262341 839745 825149 254076
9523B54076K07064M64187P6790m27966M0725K05J9586j75484j59107L01345l58417
$$ 254076 461140 925327 1002117 574151 614876 615081 634667 459183 300076 601421 243004
9512B43004K13027J16769O8628j37575j44039K799K99318J02419l54611M33593
$$ 243004 456031 572800 641428 503853 359814 362613 661931 764350 409739 843332
9502H43332k65550M17961m66284J16691O9851l76558L17754n24206N08631p9004
$$ 843332 577782 995743 529459 646150 716001 339443 657197 132991 641622 562618
9492E62618j37562p6223k62902J77753K72131K31507n71073L65822p5146o5129
$$ 562618 425056 348833 85931 263684 535815 767322 196249 562071 486925 421796
9482D21796M24223K0391p32733N30848n9121k71682j65988L72500j93768j82018
$$ 421796 846019 866410 133677 664525 605404 333722 167734 540234 346466 164448
9472A64448M68854n10504l74314Q10788l56651p1827N9977L35261k37555k33116
$$ 164448 633302 122798 -251516 559272 202621 130794 190771 526032 288477 55361
9462E5361L94364r9736j24986j21745O24755o55596M56629j39470o00436M48345
$$ 55361 449725 349989 225003 103258 728013 72417 529046 389576 -210860 237485
9452B37485P5951j2152j15605L57528o44718K58320J68549k71957M79934l69440
$$ 237485 313436 301284 185679 543207 -101511 156809 325358 53401 533335 163895
9442A63895J84442Q5487m60848K00869J34620j57880l04961M74252J46208l22649
$$ 163895 348337 433824 -27024 173845 308465 150585 -154376 319876 466084 143435
9432A43435L52039j48950k99408K96269p5248N50312n19875l36311K42011j26403
$$ 143435 495474 346524 47116 343385 268137 818449 298574 -37737 204274 77871
9422G7871L766L86828R62o39430L72850k34776N24754q3341J6825j36050L4334
$$ 77871 81637 468465 469427 -170003 202847 -31929 492825 409484 426309 290259 324593
9411C24593j2435k5487K31602m95919L01182M33854o28337k9994L02626q8703
$$ 324593 312158 286671 518273 22354 323536 757390 129053 99059 401685 312982
9401C12982L45615l88017p2171j53261N38192l51482R8260k65132L8135M69133
$$ 312982 658597 270580 198409 45148 583340 231858 330118 64986 103121 572254
9391E72254q943l10081m54704K26597K59466l29179O13920p39417M36054l9138
$$ 572254 563311 253230 -201474 25123 284589 -44590 569330 -170087 265967 226829
9381B26829J73076L7575j94834J32960k24461p546K47568k09932q8127q4438r0904
$$ 226829 399905 437480 242646 375606 151145 143599 391167 181235 93108 8670 -82234
9370h2234Q45428n17560l45864N54870j21598k45263K86209j23568k71497r2837
$$ -82234 763194 245634 -100230 454640 333042 87779 373988 250420 -21077 -113914
9360a13914K32541M23756k70871J45200m86251K31180o3549L95361j50992k36759
$$ -113914 118627 542383 271512 416712 -69539 161641 98092 493453 342461 105702
9350A05702L55291r9604m67821M71954l14169j30580M00565j66253p82N4461k73161
$$ 105702 460993 361389 -106432 365522 51353 -79227 321338 155085 154303 208764 -64397
9339f4397L43202k1682L8257j18658L01809k62699L4169p6364J72907j52685K10403
$$ -64397 278805 257123 295380 176722 478531 215832 250001 173637 346544 193859 404262
9328D04262P5192l0523l85072m7981L9850K81112l58545J61002P3159r9164J4477
$$ 404262 479454 448931 63859 15878 55728 336840 -21705 139297 212456 113292 127769
9317A27769j40797j05790L74548P8128m68822N66100m27608L33421M6004k04112
$$ 127769 -13028 -118818 255730 333858 -134964 431136 3528 336949 382953 178841
9307A78841J75968k40255k28388M88628n0059l33398M32521m40164K71684J67462
$$ 178841 354809 114554 -113834 374794 324735 -8663 423858 -16306 255378 422840
9297D22840p17957M85797k54196J91006J93628r0189m0402j21002K52187j75938
$$ 422840 -295117 190680 -63516 127490 321118 230929 190527 69525 321712 145774
9287A45774j09522N01470l64523l11893N59689n42662K30912J73340p3442J69405
$$ 145774 36252 537722 173199 -138694 420995 -121667 109245 282585 209143 378548
9277C78548j37518L89830l94427J13287j99019M83657m74134L95411j45693O59969
$$ 378548 241030 630860 236433 349720 150701 634358 160224 555635 409942 1069911
9267A069911P7763n08895K95968J44018N23057q8511j00640J95249J31374J45322
$$ 1069911 1147674 638779 934747 1078765 1601822 1513311 1412671 1607920 1739294 1884616
9257A884616J06732k6463k9149M01396k34128j85285j93422p5083m07032N74241
$$ 1884616 1991348 1964885 1935736 2337132 2103004 1917719 1724297 1649214 1242182 1816423
9247A816423k52371p32611J946J07157n32044J72299l23885o1539K57403J51365
$$ 1816423 1564052 831441 833387 940544 408500 580799 256914 195375 452778 604143
9237F04143k89883k3769Q0852m74454J34329N14646k96304R6624n7395m85126
$$ 604143 314260 290491 371343 -103111 31218 545864 249560 346184 288789 -196337
9227a96337L88587k97416J329P7904K62930J18814l08711J29715l5452j31858
$$ -196337 192250 -105166 -103837 -25933 236997 355811 47100 176815 141363 9505
9217I505J11347N5098J50738m00685J76068j07460m9428K31202O3608m07169M05038
$$ 9505 120852 175950 326688 -73997 102071 -5389 -54817 176385 239993 -167176 237862
9206B37862l37784j61603M58227j09167L23349m70550l7854j16288J03273L35415
$$ 237862 -99922 -261525 196702 87535 410884 -59666 -97520 -213808 -110535 224880
9196B24880L2928k09947j08892J60083J9590K3999K2524k85427M98051j96224
$$ 224880 257808 47861 -61031 99052 118642 142641 165165 -120262 377789 181565
9186A81565R9840k62459k02898K84776m48489J52489P98043k03495o9643k08154
$$ 181565 281405 18946 -183952 100824 -347665 -195176 602867 399372 329729 121575
9176A21575J70836O756k73166K81609l70481J6966K29523m574k34430L76442l06605
$$ 121575 292411 299167 26001 307610 -62871 -45905 183618 179044 -55386 321056 14451
9165A4451L24357k19596K8769K85757m75733J14146J11109R7788l61275J7451
$$ 14451 338808 119212 147981 433738 -41995 72151 183260 281048 -80227 -62776
9155f2776J10359K0632K81417m12061K30492r2629L8006J79197j96594k53822
$$ -62776 47583 68215 349632 -62429 168063 75434 113440 292637 96043 -157779
9145a57779j5999N60138l49785o0931L07161k43189R5264j38086N37430j51882
$$ -157779 -173778 386360 36575 -24356 282805 39616 134880 -3206 534224 382342
9135C82342m0719j51379L08093n90575K58315J62597j64909K83836k93351L41329
$$ 382342 341623 190244 498337 -92238 166077 328674 163765 447601 154250 495579
9125D95579l06102o20833L58084m970N16182j98496k93623m8861K3768Q4704J99372
$$ 495579 189477 -431356 -73272 -78242 437940 239444 -54179 -103040 -79272 5432 204804
9114B04804j39234r3180l00930K51673L07658j52077J1747p7573M13927m47133
$$ 204804 65570 -27610 -328540 -76867 230791 78714 90461 12888 426815 -20318
9104b0318L94387l38676j60944M27922n99691M50495O4691p794J57834p15089
$$ -20318 374069 35393 -125551 302371 -297320 153175 217866 210072 367906 -347183
9094c47183N34193N9689r0776j55265l34486O41431k74307j47874P0062k38149
$$ -347183 187010 246699 155923 658 -333828 307603 33296 -114578 -44516 -282665
9084b82665K79348J33202K8003j82663J4824O1181J57810m5556J75762j14981
$$ -282665 -3317 129885 157888 -24775 -9951 51230 209040 163484 339246 224265
9074B24265m20223L29238J4119M681l50672J07004k16448L86838J19646j37201
$$ 224265 -195958 133280 147399 152080 -198592 -91588 -308036 78802 198448 61247
9064F1247M7071J58481J82264k16597P0797m80010J98763J74007l35089K26075
$$ 61247 108318 266799 449063 232466 303263 -176747 22016 196023 -139066 87009
9054H7009M3126O8571l84400J82548k05529K76953N5637k60910J33204n5431J84198
$$ 87009 130135 198706 -185694 -3146 -208675 68278 123915 -136995 -3791 -59222 124976
9043A24976j82717J37749k50084L9797J79996R3965k4447q4352j19587L91895
$$ 124976 -57741 80008 -170076 -130279 49717 143682 119235 34883 -84704 307191
9033C07191o86312L39208K12519k14776J90489J06680J89929l28752k58394k7958
$$ 307191 -379121 -39913 172606 -42170 148319 254999 444928 116176 -142218 -170176
9023a70176K97584o3989k32344r293M1627J98959p7730Q2330k66220N71921n39477
$$ -170176 127408 63419 -168925 -178218 -136591 62368 -15362 66968 -199252 372669 -166808
9012a66808L27289N7583n03560J45453k8007M49125J55962m45186m51171O16222
$$ -166808 160481 218064 -285496 -140043 -168050 281075 437037 -8149 -459320 156902
9002A56902l04757O38779n75439L79554o4342p3482j77451k12403L48872k77623
$$ 156902 -147855 490924 -84515 295039 230697 157215 -20236 -232639 116233 -161390
8992a61390K52711P6798k35366p6936K16052J65854o6475o7220k07188J2636K68734
$$ -161390 91321 168119 -67247 -144183 71869 237723 171248 104028 -103160 -90524 178210
8981A78210j27137o1428J22771l12562L2251J11422P0715j02246j12616L95753
$$ 178210 51073 -10355 112416 -200146 -167895 -56473 14242 -88004 -200620 195133
8971A95133j95607j62258J85365M29677m31215Q8553K9958j08873L6271K92005
$$ 195133 -474 -162732 22633 452310 21095 109648 139606 30733 67004 359009
8961C59009n68904M03130k45807N81716l93471J53186J34733o2005r7763k38849
$$ 359009 -209895 193235 -52572 529144 135673 288859 423592 361587 263824 24975
8951B4975J97144m40904j1702J88407R5116Q2990L83389l36151l56537K60658
$$ 24975 222119 -218785 -230487 -42080 53036 136026 519415 183264 -173273 87385
8941H7385R8045k5281l21148J10727Q5438l44395L11808K03048m7900k91493O50232
$$ 87385 185430 160149 -160999 -50272 35166 -309229 2579 205627 157727 -133766 516466
8930E16466k60681k17956O6956L8647L63513k76847l28909l8224L70387j24747
$$ 516466 255785 37829 104785 143432 506945 230098 -98811 -137035 233352 108605
8920A08605Q6610l2818n68748N11025P4612L9854j97677L02881n69750K68123
$$ 108605 195215 162397 -406351 104674 179286 219140 21463 324344 -245406 22717
8910B2717K59308l15806K19621o03013J61653P0771K66040q17M1044M00571n72665
$$ 22717 282025 -33781 185840 -417173 -255520 -184749 81291 80474 121518 522089 -50576
8899e0576J68736j39195N1754J23040l87955M12651K6453l0952m55831L30348
$$ -50576 118160 -21035 30719 153759 -234196 178455 204908 173956 -281875 48473
8889D8473K28244o11408N88810j96831P249R5249j35128l17226J62368j49605
$$ 48473 276717 -334691 254119 57288 64537 159786 24658 -292568 -130200 -279805
8879b79805M69678J26670k60565j56379K77756o6416o8770r5378j04204Q8283
$$ -279805 189873 316543 55978 -100401 177355 110939 42169 -53209 -157413 -69130
8869f9130K53163j8046k83276L83760j33377k49470l11070L93967L39172n30174
$$ -69130 184033 165987 -117289 266471 133094 -116376 -427446 -33479 305693 -224481
8859b24481P51484l82271l6293m18973L59601K759j89903K37212j4831r0197j344
$$ -224481 527003 144732 108439 -310534 49067 51826 -138077 99135 84304 -5893 -7237
8848g237j22053R3709J3137P8919p2150n9609J36668J64105r9936K46467m22616
$$ -7237 -129290 -35581 -22444 56475 -15675 -75284 61384 225489 125553 372020 -50596
8837e0596M78398o97586J61551J20233L21811l05700j70377K73303m74350L48457
$$ -50596 427802 -269784 -108233 12000 333811 28111 -142266 131037 -343313 5144
8827E144J71002j526O3712k98016m440J17824n8887j40064J34171l56153Q05743
$$ 5144 176146 174620 238332 -59684 -64124 53700 -5187 -145251 -11080 -367233 438510
8816D38510n65684L40730J35097p3186J04877m01122L90124l45246n19613L87033
$$ 438510 -127174 213556 348653 275467 380344 -20778 369346 24100 -495513 -108480
8806a08480K16771k28894M79842l42542J24506m83122J77188K97365J8634l52201
$$ -108480 108291 -120603 359239 16697 141203 -341919 -164731 132634 151268 -200933
8796b00933K66212j99186L18525q6668J49249k26518M8634j92024K32193K47991
$$ -200933 65279 -133907 184618 97950 247199 20681 69315 -122709 109484 357475
8786C57475m42936l4501m7620K66871l34355J71817N1802j00508k38768J03399
$$ 357475 -85461 -119962 -167582 99289 -235066 -63249 -11447 -111955 -350723 -247324
8776b47324L79596L7312L20852k88084k32798M74767l76661j06490j41316L87160
$$ -247324 132272 169584 490436 202352 -30446 444321 67660 -38830 -180146 207014
8766B07014j12256j33859L5449j39106J1109N73083m10526J24373o21629L40120
$$ 207014 94758 -39101 -3652 -142758 -131649 441434 30908 155281 -466348 -126228
8756a26228J00386r1589J49868R4295l26350M58031O4231j98186k94631M88375
$$ -126228 -25842 -117431 32437 126732 -199618 258413 322644 124458 -170173 318202
8746C18202l1682l22567q2039L05505K08623m84417L5908q8484o4635L89439j09058
$$ 318202 286520 -36047 -118086 187419 396042 -88375 -52467 -140951 -205586 183853 74795
8735G4795J9974m2613J71690j63198J30206l01362k46385K73080L5097K62012
$$ 74795 94769 52156 223846 60648 190854 -110508 -356893 -83813 -48716 213296
8725B13296j5460k75559M80253M7458l57265l64076K06716L62768j42417p65558
$$ 213296 197836 -77723 402530 449988 92723 -271353 -64637 298131 155714 -609844
8715f09844M65837J05843o720M49737n66940n5663K24482m08845O26179k17962
$$ -609844 -144007 -38164 -44884 404853 -162087 -217750 6732 -402113 224066 6104
8705F104m85632N71288n0492L52498k17914r3940J53373p1227M8327k91102J36148
$$ 6104 -479528 91760 41268 393766 175852 81912 235285 164058 212385 -78717 57431
8694E7431k55699K96823l50637L54376L33054m53362j51530Q0069K51445j40398
$$ 57431 -198268 98555 -252082 102294 435348 -18014 -169544 -89475 161970 21572
8684B1572j0544M20811q5380k59315P4348n31707l2297N00527j06071L56265l72355
$$ 21572 11028 431839 346459 87144 161492 -370215 -402512 98015 -8056 348209 -24146
8673b4146j4633k30953L14628j34777j11016K21367J28466j72179j372J13968
$$ -24146 -38779 -269732 44896 -89881 -200897 20470 148936 -23243 -24615 89353
8663H9353k1285k25114L69112J51834m32740j37488L77081j57759m788L88965
$$ 89353 68068 -157046 212066 363900 -68840 -206328 170753 12994 8206 397171
8653C97171l72288l43108K80907J21051O0997l53122L13087J58085m04546J11777
$$ 397171 24883 -318225 -37318 83733 144730 -208392 104695 262780 -141766 -29989
8643b9989J99793j91876k11088L73403n08234J10521K92626o597k26324L03051
$$ -29989 169804 -22072 -233160 140243 -367991 -257470 35156 28559 -197765 105286
8633A05286L9377j45327o2255j31741L01670j6077l59048n995K29094k26925K41535
$$ 105286 144663 -664 -62919 -194660 107010 90933 -268115 -274110 -45016 -271941 -30406
8622c0406P2947l325n6020J76200j30p75240O62088r4336J63384q8057j81258
$$ -30406 42541 39216 -16804 159396 159266 -615974 46114 -48222 115162 27105 -154153
8611a54153J75950p7387l7375O9978J69232k64764K95582k26087P5389j90197
$$ -154153 21797 -55590 -92965 -22987 146245 -118519 177063 -49024 26365 -163832
8601a63832L67202n3852j20300O3445J21143m39893J6396J45276K67701j28672
$$ -163832 203370 149518 29218 92663 213806 -226087 -209691 -64415 203286 74614
8591G4614k80118q0129L65327n42762M31648j83407K75682k07108J41078J52607
$$ 74614 -205504 -285633 79694 -463068 -31420 -214827 60855 -146253 -5175 147432
8581A47432J7821k26650J20850l52876K49993M31497p18771K88595K6473L51178
$$ 147432 165253 -61397 59453 -293423 -43430 388067 -330704 -42109 -15636 335542
8571C35542l70353K52887l71756J86682J65656l14973J88021K4237j97265J8660
$$ 335542 -34811 218076 -153680 33002 198658 -116315 71706 95943 -101322 -82662
8561h2662o1628Q638O2929k78404L37296J96839k50248J0151P283m06710O13471
$$ -82662 -144290 -135652 -72723 -351127 -13831 183008 -67240 -57089 -49806 -456516 156955
8550A56955l41522q6673K08336k7293l56130M74440k02573j06435R4756j10157
$$ 156955 -184567 -271240 -62904 -90197 -446327 28113 -174460 -280895 -186139 -296296
8540b96296L97412k53836J90037l23096o2919j125043J704734M21682J7305o9040
$$ -296296 101116 -152720 37317 -285779 -348698 -1473741 230993 652675 669980 600940
8530F00940M288n89542N7211l16338L12697K8361L45443l6595r9140n01549J50092
$$ 600940 605228 15686 72897 -243441 69256 97617 443060 406465 307325 -194224 -44132
8519d4132k79418N36077o0245j30603o1496K76264m83655K53063j59084K66992
$$ -44132 -323550 212527 152282 21679 -39817 236447 -247208 5855 -153229 113763
8509A13763k90009O4657K31595m01061o18L59595m13234J84158L3547j39324r1266
$$ 113763 -176246 -111589 120006 -281055 -281673 77922 -335312 -151154 -117607 -256931 -348197
8498c48197K91185l03301m7932K33383J88811j4913k35643J70317O3362n44162
$$ -348197 -57012 -360313 -408245 -174862 13949 -964 -236607 -66290 -2928 -547090
8488e47090M41189r4099N07554k39910k30551N90659n32580N06203k86378O3418
$$ -547090 -105901 -200000 307554 67644 -162907 427752 -104828 401375 114997 178415
8478A78415J18577K33303k51191J97460n36393J62603j31741J35608o708j27784
$$ 178415 296992 530295 279104 476564 -59829 102774 -28967 106641 99933 -27851
8468b7851K88497K34867k57756K02981J51407n40416J2949o3245L58159l62560
$$ -27851 260646 495513 237757 440738 592145 51729 64678 1433 359592 -2968
8458b968J51492j56910P558j24297J48595m05592M37577m49464J66356J83995
$$ -2968 148524 -8386 -828 -125125 23470 -382122 55455 -394009 -227653 -43658
8448d3658m14653K87480n5190O5239n16855P49281k78258p3J31663r8579k70352
$$ -43658 -458311 -170831 -226021 -160782 -677637 71644 -206614 -206687 -75024 -173603 -443955
8437d43955l3298K48475L8555M1695O6517J61042j41230J80481J78441l56555
$$ -443955 -477253 -228778 -190223 -148528 -82011 79031 -62199 118282 296723 -59832
8427e9832K7628Q249K22980k05465L25205k79375n422N4890q634L8064K26542
$$ -59832 -32204 -23955 199025 -6440 318765 39390 33968 88858 80224 118288 344830
8416C44830k6804l17664k39077K83931J04024P2268J46397j2118m7539r4967o8307
$$ 344830 318026 362 -238715 45216 149240 221508 367905 355787 308248 213281 144974
8405A44974j36743K89930k01317M6610j99234M22753o52275M71383k97083K3372
$$ 144974 8231 298161 96844 143454 -55780 366973 -285302 186081 -111002 -87630
8395h7630k47927K73100M28069l62643M2284k13584J8901L53901j56844o2689
$$ -87630 -335557 -62457 365612 2969 45253 -168331 -149430 204471 47627 -15062
8385a5062o3323j89965M72198n88194R6637N82072l81828Q8246j20434K37582
$$ -15062 -78385 -268350 203848 -384346 -287709 294363 -87465 781 -119653 117929
8375A17929j11103j25823K60296J64165j55806Q0405k20178q1302P3792J05870
$$ 117929 6826 -118997 141299 305464 149658 230063 9885 -71417 2375 108245
8365A08245k48862M79230m68619L04339R1829n49837L92730K12421m33785k7173
$$ 108245 -140617 338613 -130006 174333 266162 -283675 109055 321476 -112309 -139482
8355a39482N06495l57796j33083j03831J41077M10780m25958L28022l26127m058
$$ -139482 367013 9217 -123866 -227697 -86620 324160 -101798 226224 -99903 -103961
8345a03961k36453K85437J17454K60589j95526j18243k70941k70267J42499N12280
$$ -103961 -340414 -54977 62477 323066 127540 9297 -261644 -531911 -389412 122868
8335A22868l70821J01300m2679n0729J48936K03322k13148q8476J67053j12550
$$ 122868 -247953 -146653 -189332 -240061 -91125 112197 -100951 -189427 -22374 -134924
8325a34924P3303K36198r2129o2733j97394J11182k3276J6037j31770Q9356L70629
$$ -134924 -61621 174577 82448 19715 -177679 -66497 -89773 -73736 -205506 -116150 254479
8314B54479R3122m59789j59801K1420K48268k7007J17038N7369j85059r855J62782
$$ 254479 347601 -112188 -271989 -250569 -2301 -29308 87730 145099 -39960 -49815 112967
8303A12967Q4046j97039K86339j20813r4063k78934k6803J75807l2773K02360
$$ 112967 197013 -26 286313 165500 71437 -207497 -234300 -58493 -91266 111094
8293A11094o3949J31019k37607R9571k38570m583j6057K32848j00138O33118o74905
$$ 111094 47145 178164 -59443 40128 -198442 -203025 -219082 13766 -86372 546746 -128159
8282a28159K05755R8811j81354O5927k15635J0593k58734M35959R4763l04130
$$ -128159 77596 176407 -4947 60980 -154655 -144062 -402796 33163 127926 -176204
8272a76204j6650N27076q9521j38847P3224m53347M45115N1325k05738P8528k62740
$$ -176204 -192854 334222 244701 105854 179078 -274269 170846 222171 16433 94961 -167779
8261a67779N35846n17762L6562o529M90470l04535l18055K01220M72941n81921
$$ -167779 368067 -149695 -113133 -119662 370808 66273 -251782 -50562 422379 -159542
8251a59542M0011J75564N5384M12975l87022j75522j41847O58430m87242O2066
$$ -159542 -119531 56033 111417 524392 137370 -38152 -179999 478431 -8811 53255
8241E3255J07658R2442k74082K21292l80426J2662J69638r5590M75895j59642
$$ 53255 160913 253355 -20727 200565 -179861 -167199 2439 -93151 382744 223102
8231B23102O8541l5577j81714r3621P9522l38281M99069l69034L48109m84264
$$ 223102 291643 256066 74352 -19269 60253 -278028 221041 -147993 200116 -284148
8221b84148L78104N4282J47462n73031P93940l74419m22755M65928r9881O2913
$$ -284148 93956 148238 295700 -277331 516609 142190 -280565 185363 85482 148395
8211A48395k41967m9954k65921M44848R011P3120n6795P8705r6520j41991j56149
$$ 148395 -93572 -143526 -409447 35401 44412 117532 60737 139442 42922 -99069 -255218
8200b55218J16664J81099R4100l00473P85031m9768j70098o051J070498j286034
$$ -255218 -138554 42545 136645 -163828 621203 571435 401337 395286 1465784 179750
8190A79750m26295N29338j16315p1834p6064K69j56181M85334n40262K70722k3163
$$ 179750 -246545 282793 166478 94644 18580 18849 -137332 348002 -192260 78462 55299
8179E5299K28581l30344k88545M97141J1394j58859p2297j65144L29139M1178
$$ 55299 283880 -46464 -335009 162132 173526 14667 -57630 -222774 106365 147543
8169A47543M2542j67662J11792M207j52394j78062J53471j20129p2453K18588
$$ 147543 190085 22423 134215 138422 -13972 -192034 -38563 -158692 -231145 -12557
8159a2557K05029l25054M78295j02327O1740k84018M5901K9617k14139N02934
$$ -12557 192472 -132582 345713 243386 305126 21108 67009 96626 -117513 385421
8149C85421r1379k72645J1306p6683j65396O9290J39156j90436J1263J54266K44936
$$ 385421 294042 21397 32703 -43980 -209376 -140086 -930 -191366 -180103 -25837 219099
8138B19099l88488J27940j28625R211Q8030K0325K25174k73956K02083k84003
$$ 219099 -169389 -41449 -170074 -160863 -72833 -52508 172666 -101290 100793 -183210
8128a83210J97707l3056R3159n12976J42022J56725j38853M26103m34698K56460
$$ -183210 14497 -18559 74600 -438376 -296354 -139629 -278482 147621 -287077 -30617
8118c0617K21504m26903R7141K79369r3941K66126n10781p6036P4918J63443J91981
$$ -30617 190887 -236016 -138875 140494 46553 312679 -198102 -274138 -199220 -35777 156204
8107A56204k301m46537O59942o94807L08632k41132j76K50262k84252J46483J46740
$$ 156204 153903 -292634 367308 -327499 -18867 -259999 -260175 -9913 -294165 -147682 -942
8096i42k28588J22797m2597K2840J02382J3941J02094P7129l91848K51616l8791
$$ -942 -229530 -106733 -149330 -126490 -24108 -10167 91927 169056 -222792 28824 -9967
8085i967J86175n9001l38638N70334k02375j70314J51198m74932L56572R1935
$$ -9967 176208 117207 -221431 348903 146528 -23786 127412 -347520 9052 100987
8075A00987j37226o0001J58586l46663L9165L09003j70156L38479j59101j26691
$$ 100987 -36239 -96240 62346 -284317 -245152 63851 -106305 232174 73073 -53618
8065e3618K58016n75093L21853J42k2973j36772M85684m13763P3040k82690L03715
$$ -53618 204398 -370695 -48842 -48700 -71673 -208445 277239 -136524 -63484 -346174 -42459
8054d2459P84372p61095r5639j96193M21254j64320n7415K01181k29537j7899
$$ -42459 741913 -19182 -114821 -311014 110240 -54080 -111495 89686 -139851 -157750
8044a57750L5559L48362l78397J51045p7656j51791J05423L5101M18869j42088
$$ -157750 -122191 226171 -152226 -1181 -78837 -230628 -125205 -90104 328765 186677
8034A86677j35921j21756L19099k67966j3303j08126k23022L7575j65637M70201
$$ 186677 50756 -71000 248099 -19867 -33170 -141296 -364318 -326743 -492380 -22179
8024b2179q3201j82535j29002M51195M7125j48337O7309R2140k61930J31416K19274
$$ -22179 -105380 -287915 -416917 34278 81403 -66934 375 92515 -169415 -37999 181275
8013A81275j96447l5805m9197o0279J49884j36286k64328O77514m63136J60240
$$ 181275 -15172 -50977 -100174 -160453 -10569 -146855 -411183 266331 -196805 -36565
8003c6565l60042K88739p4343R7230J26750l20844J46015k6827M02418L163m10596
$$ -36565 -396607 -107868 -182211 -84981 41769 -279075 -133060 -159887 242531 245694 -164902
7992a64902J36456L33168n07642L00130j55685J86410j19174m331P6244k28194
$$ -164902 -28446 304722 -202920 97210 -58475 127935 8761 4430 80674 -147520
7982a47520K81424j56522L57667l98619N41998l98035o036l86169K68800J7081
$$ -147520 133904 -22618 335049 -63570 478428 80393 74357 -311812 -43012 -25931
7972b5931j66584P12995l77502j41233l72095K64888q3407l02999M44689k24651
$$ -25931 -192515 520480 142978 1745 -370350 -105462 -188869 -491868 -47179 -271830
7962b71830L62973M6072q4969j26028k28397L40645J10428l81118L81013q1559
$$ -271830 91143 137215 52246 -73782 -302179 38466 148894 -232224 148789 67230
7952F7230k77345J74374L12970n87321Q99103n72882k38678k18299N17547K5827
$$ 67230 -210115 -35741 277229 -310092 589011 16129 -222549 -440848 76699 102526
7942A02526l22418k4390M88185q0613n07210L40387k91419L00218p2231M0886
$$ 102526 -219892 -244282 243903 163290 -343920 -3533 -294952 5266 -66965 -26079
7932b6079k2851p7600K93785n19953L39275q5491K50337k02848j40988n0922K8355
$$ -26079 -48930 -126530 167255 -352698 -13423 -98914 151423 -51425 -192413 -243335 -214980
7921b14980K71271j21096l4459l144k17420L03787l09059J15330K04859J49151
$$ -214980 56291 -64805 -99264 -102408 -319828 -16041 -325100 -209770 -4911 144240
7911A44240l70752K83976O2528j51912l5269J32994r0443k21201K42735k01283
$$ 144240 -226512 57464 119992 -31920 -67189 65805 -24638 -245839 -3104 -204387
7901b04387K74384J16122k82547j00360L2162J10397K78802j6438l37056J36157
$$ -204387 69997 186119 -96428 -196788 -164626 -54229 224573 208135 -128921 7236
7891G236N0774j3713q9850j85725K70520o1351K29985m23988J40248q1180L6018
$$ 7236 58010 44297 -45553 -231278 39242 -22109 207876 -216112 -75864 -157044 -121026
7880a21026Q5928l0245j60241R1067l1873J4372K67662k30012J54838k83806k06375
$$ -121026 -35098 -65343 -225584 -134517 -166390 -152018 115644 -114368 40470 -243336 -449711
7869d49711K19603J02549j27366j96744N4420P7333R5648o9737L42960n92176
$$ -449711 -230108 -127559 -254925 -451669 -397249 -319916 -224268 -294005 48955 -543221
7859e43221L68008j10073M04264l7478l20986j47661n2674j018008N6474J556452
$$ -543221 -175213 -285286 118978 81500 -239486 -387147 -439821 -1457829 -1401355 155097
7849A55097J436386j414685M71047n47163K10498j40903J10801j77815K0291l9558
$$ 155097 1591483 176798 647845 100682 311180 170277 281078 103263 123554 83996
7839H3996m81077K25952L04340k46271N2409L04943k54233j67478J78852L4940
$$ 83996 -397081 -171129 133211 -113060 -60651 244292 -9941 -177419 1433 36373
7829C6373m5177N3369m40526K25806J24524j50715L63389J56112j98572o2987
$$ 36373 -8804 44565 -395961 -170155 -45631 -196346 167043 323155 124583 61596
7819F1596j6218J9652J31863o00429M80938k08683O3434K39592k26212k38325
$$ 61596 45378 65030 196893 -403536 77402 -131281 -67847 171745 -54467 -292792
7809b92792L0798J76819K31679l16149K89620j37476k99249L11689J13272K24780
$$ -292792 -261994 -85175 146504 -169645 119975 -17501 -316750 -5061 108211 332991
7799C32991l20457l40878L86794K23910k49163o64M0182K91197o73483J40650
$$ 332991 12534 -328344 58450 282360 33197 32533 72715 363912 -309571 -168921
7789a68921J2657L7399L3192L06579K32711o35029K14269k48017K97502R3596
$$ -168921 -156264 -118865 -85673 220906 453617 -181412 32857 -215160 82342 175938
7779A75938m91346L05686j25895J28454m00709P50047l90728M1167q1057J15307
$$ 175938 -315408 -9722 -135617 -7163 -407872 342175 -48553 -7386 -88443 26864
7769B6864j41159M484J15890K18816k49773Q1062k07222J5257J19959k24559M24465
$$ 26864 -114295 -109811 6079 224895 -24878 56184 -151038 -135781 -15822 -240381 184084
7758A84084M0161l54849J84121j19522M5802m95805J22415K82747J27906N1916
$$ 184084 224245 -130604 53517 -66005 -20203 -516008 -393593 -110846 17060 68976
7748F8976j6292L19428k38244m91421L53935J18521r117k72921j315K29935j08053
$$ 68976 52684 372112 133868 -357553 -3618 114903 105786 -167135 -168450 61485 -46568
7737d6568j21849L13167J05640o44791M11836L2100o4655l16477K48671Q6702
$$ -46568 -168417 144750 250390 -394401 17435 49535 -15120 -331597 -82926 3776
7727C776j51847L15212k94131j34958J70528K23897j06088l6682l23748L43810
$$ 3776 -148071 167141 -126990 -261948 -91420 132477 26389 -10293 -334041 9769
7717I769j89592L20731k64705J88017K67383j46775k67448J628r0947L09132k9620
$$ 9769 -179823 140908 -123797 64220 331603 184828 -82620 -80992 -171939 137193 107573
7706A07573q2556l11702J66296K82365n9083q5486k35923N19953l13020l6985
$$ 107573 25017 -286685 -120389 161976 102893 17407 -218516 301437 -11583 -48568
7696d8568j9912j64894m2558P71905o63657J99120o5198q0459n4547J39409k35106
$$ -48568 -68480 -233374 -275932 495973 -167684 31436 -33762 -114221 -168768 -29359 -264465
7685b64465O80716m26695j26742p6718K0756L47989j8088k43933J1826j46159
$$ -264465 416251 -10444 -137186 -213904 -193148 154841 136753 -107180 -95354 -241513
7675b41513M4277J08007k52666M57582l92283L36663j33324l02350R0764L65823
$$ -241513 -197236 -89229 -341895 115687 -276596 60067 -73257 -375607 -284843 80980
7665H0980l48003K16503j21273p1484J69633P7525j58119K73849l45574M51587
$$ 80980 -267023 -50520 -171793 -243277 -73644 3881 -154238 119611 -225963 225624
7655B25624j41311o2234o6970L6655j03692J51547N4608k98637j75332K88599
$$ 225624 84313 22079 -44891 -8236 -111928 39619 94227 -204410 -379742 -91143
7645i1143L1931K61908l09512N1733k09304J32228m1660k61485p809O01911l87510
$$ -91143 -59212 202696 -106816 -55083 -264387 -132159 -173819 -435304 -443113 158798 -228712
7634b28712L33154n15274J60777N03465n48860K05081K33399k43717k40563q8527
$$ -228712 104442 -410832 -250055 253410 -295450 -90369 143030 -100687 -341250 -429777
7624d29777J96958J84355K7290N7192k77923R1646O8739M47l31584L43859L4993
$$ -429777 -232819 -48464 -21174 36018 -241905 -150259 -81520 -81073 -412657 -68798 -33805
7613c3805J55731l92885K74194Q6262P7725l91759N56292k67394l90325J44509
$$ -33805 121926 -270959 3235 89497 167222 -224537 331755 64361 -325964 -181455
7603a81455o7780q9338K56665l52429q4787J601351j119438J20373q5387n4681
$$ -181455 -249235 -338573 -81908 -434337 -519124 1082227 -37211 83162 -2225 -56906
7593e6906J44318m44524J55501K05466K07565o07073p1094N59253J93397m48525
$$ -56906 87412 -357112 -201611 3855 211420 -395653 -466747 92506 285903 -162622
7583a62622o5682J60820j9597j55266J39523j91133K48424j0869R1561l09318
$$ -162622 -228304 -67484 -87081 -242347 -102824 -293957 -45533 -56402 35159 -274159
7573b74159L00048k13104J80095K23725m68133k02076K21264J51185M83271l11579
$$ -274159 25889 -187215 -7120 216605 -251528 -453604 -232340 -81155 402116 90537
7563I0537m74250N12178L01044K90354o16011k60413k88366O18989l00204k61346
$$ 90537 -383713 128465 429509 719863 103852 -156561 -444927 174062 -126142 -387488
7553c87488N77268l10564l80407M4677N22916j8909l44700K40132O4216j34972
$$ -387488 189780 -120784 -501191 -456514 66402 47493 -297207 -57075 7141 -127831
7543a27831P7067k91590M77628j71250n3822R8998J9168J17311l70190K4968M85153
$$ -127831 -50764 -342354 135274 -35976 -89798 9200 28368 145679 -224511 -199543 285610
7532B85610m00029j45880K8653R3188k6179L16942n65709j20075K54360K49557
$$ 285610 -114419 -260299 -231646 -138458 -164637 152305 -413404 -533479 -279119 -29562
7522b9562k6815j42556J99384l20041L41015j50007M7461l54569M85102J70091
$$ -29562 -56377 -198933 451 -319590 21425 -128582 -81121 -435690 49412 219503
7512B19503l74690K18244l6235r7422k60952J14774M60439l39052p9227O51852
$$ 219503 -155187 63057 26822 -70600 -331552 -216778 243661 -95391 -174618 477234
7502D77234n09772k27225J57943O6964k17307K10263R5476j5195O929o9662l90568
$$ 477234 -32538 -259763 -101820 -34856 -252163 -41900 53576 38381 45310 -24352 -414920
7491d14920L25079J08379J24411k84595k73516M00698J23302O0537n13195J21864
$$ -414920 -89841 18538 142949 -141646 -415162 -14464 108838 169375 -343820 -221956
7481b21956M28459m10127K30921m4067J1675m05393K03019J10232J77569j89431
$$ -221956 206503 -203624 27297 -16770 -5095 -410488 -207469 -97237 80332 -109099
7471a09099P2939q1256k70931M28747Q7547j82000l82522N87734p78882Q87162
$$ -109099 -36160 -117416 -388347 40400 127947 -54053 -436575 151159 -627723 259439
7461B59439l95653K31713j1174l2057o6114J6861M43453l57149k23503R0067M32474
$$ 259439 -136214 95499 84325 52268 -13846 3015 446468 89319 -134184 -44117 388357
7450C88357n49362J84358p4899J8396j34140l2196L44863o6820k82163j4935J92716
$$ 388357 -161005 23353 -51546 -33150 -167290 -199486 145377 78557 -203606 -218541 -25825
7439b5825l63491M93464k72169Q9730r0122M1326o4291L04332j06672Q641m1636
$$ -25825 -389316 104148 -168021 -78291 -168413 -127087 -191378 112954 6282 14923 -26713
7428b6713n4364J96198J34223k34176J6198k54286Q7925L72850l52269O9958o0730
$$ -26713 -81077 115121 249344 15168 31366 -222920 -134995 237855 -114414 -44456 -105186
7417a05186N111M00456r5846m48285r4834J59667J75822J78878j54654j30842
$$ -105186 -100075 300381 204535 -243750 -338584 -178917 -3095 175783 21129 -109713
7407a09713K4283J72446J21974n81156K04162K91169m35298K85542l83270O13352
$$ -109713 -85430 87016 208990 -372166 -168004 123165 -312133 -26591 -409861 203491
7397B03491n68488L59486j21954O3209j97474P5972K7963L14440k83563q9130
$$ 203491 -364997 -5511 -127465 -64256 -261730 -185758 -157795 156645 -126918 -216048
7387b16048J35813K26520k1392L1654l17890N661L36357j71435N78457k97375
$$ -216048 -80235 146285 124893 156547 -161343 -155682 180675 9240 587697 290322
7377B90322k04713k65342J40840J25049K63420n93335N2025J51288R3060Q510
$$ 290322 85609 -179733 -38893 86156 349576 -243759 -191734 -40446 52614 61124
7367F1124l23864L59418J84695m37579k3142R0559k49428M81356j32176k1358
$$ 61124 -262740 96678 281373 -156206 -179348 -88789 -338217 143139 10963 -10395
7357a0395k8282M8408j25499o5401K10883J65848m73476K16476r3853R0630K2687
$$ -10395 -38677 9731 -115768 -181169 29714 195562 -277914 -61438 -155291 -64661 -41974
7346d1974l29654K45474K11438j80180k03789K97689O7476N1034m31183L59740
$$ -41974 -371628 -126154 85284 -94896 -298685 -996 66480 117514 -313669 46071
7336D6071j26663K06773K21171n19850O4081K00649l65877N49012m63997J64957
$$ 46071 -80592 126181 347352 -172498 -108417 92232 -273645 275367 -188630 -23673
7326b3673j55861J5205K97038j90952j11762q7594J53093J22676J39823p1904
$$ -23673 -179534 -164329 132709 -58243 -170005 -257599 -104506 18170 157993 86089
7316H6089K33887l22536k81905P1421J81244j01815j06963j29959J6803M31013
$$ 86089 319976 -2560 -284465 -213044 -31800 -133615 -240578 -370537 -353734 77279
7306G7279n6576n68257L57063q0544M00486k17097J09121k35823k26402J53901
$$ 77279 20703 -547554 -190491 -271035 129451 -87646 21475 -214348 -440750 -286849
7296b86849L43679J86489J4098l52412k83203M71457m1202k65200R065J43698
$$ -286849 56830 243319 257417 -94995 -378198 93259 52057 -213143 -204078 -60380
7286f0380l2288J40603j54493P0093J3681j72043R5979J55508J53585o70817L37027
$$ -60380 -92668 47935 -106558 -36465 -22784 -194827 -98848 56660 210245 -460572 -123545
7275a23545j39146K36544L23958k14420k61441n7281j65978L27040o2312J07850
$$ -123545 -262691 -26147 297811 83391 -178050 -235331 -401309 -74269 -136581 -28731
7265b8731j919m2730l8100o8530j1987J53960n31181M08256L3715j09547K33434
$$ -28731 -30650 -73380 -111480 -180010 -191997 -38037 -569218 -160962 -127247 -236794 -3360
7254c360J4041q160Q4681J42746l28929l25058M20942L1709J42434n57490J8490
$$ -3360 10681 2521 87202 229948 -98981 -424039 -3097 28612 171046 -386444 -367954
7243c67954N20481j49133j88277O7534K63638m14531J36190K60035J60485o16703
$$ -367954 152527 3394 -184883 -117349 146289 -268242 -132052 127983 288468 -328235
7233c28235O68508k85984l16454K54332J39581m07515O83962q00253L37618l3223
$$ -328235 340273 54289 -262165 -7833 131748 -275767 408195 -392058 -54440 -87663
7223h7663K44666j45380K09197L4103l17792j52103M02037n95200L28553O5057
$$ -87663 157003 11623 220820 254923 -62869 -214972 187065 -408135 -79582 -14525
7213a4525l25900N4855j19467M18635J24117j694k21179P8183k3053k2572P6760
$$ -14525 -340425 -285570 -405037 13598 137715 136021 -85158 -6975 -30028 -52600 24160
7202B4160k87904L42683m74302N52257k43776l7363L71858j49728m10644L50596
$$ 24160 -263744 78939 -395363 156894 -86882 -124245 247613 97885 -312759 37837
7192C7837J66875p44997K30678n8855k28060L61695P2429l9000j00085M74380
$$ 37837 204712 -540285 -309607 -368462 -596522 -234827 -162398 -201398 -301483 172897
7182A72897k19251k14759l9154J16539J19467J90033j11677j73718J86730j30644
$$ 172897 -46354 -261113 -300267 -183728 -64261 125772 14095 -159623 27107 -103537
7172a03537M72405j14431q01976K84114N2952n1215K11159J58001k6070N615l38970
$$ -103537 368868 254437 -547539 -263425 -210473 -261688 -50529 107472 81402 87017 -251953
7161b51953o8290M32115k27534K65538k00136K13169l44682K68839n82077J81702
$$ -251953 -320243 111872 -115662 149876 -50260 162909 -181773 87066 -495011 -313309
7151c13309O47733l26371J19126n28701M39409J19464J3647L4593n46334J92086
$$ -313309 334424 8053 127179 -401522 37887 157351 170998 205591 -340743 -148657
7141a48657k48021M03413m52392L22175k49300M18768n33956P22572j44354J23593
$$ -148657 -396678 6735 -445657 -123482 -372782 45986 -487970 234602 90248 213841
7131B13841k49094M08251j57329n19759O53374o65755O00005n00243J96377r6702
$$ 213841 -35253 372998 215669 -304090 349284 -316471 283534 -216709 -20332 -117034
7121a17034J25238L87953o44584J73026l2377J01830J68983l06628J85989m41160
$$ -117034 8204 396157 -248427 -75401 -107778 -5948 163035 -143593 42396 -398764
7111c98764L06347J42884L8394o7108j30056J40327m16048K67958P7098j4101
$$ -398764 -92417 50467 88861 21753 -108303 32024 -384024 -116066 -38968 -53069
7101e3069l6401j43523r3770L62528m9879K59859k45927m7928J86584m60861M19375
$$ -53069 -89470 -232993 -326763 35765 -14114 245745 -182 -48110 138474 -322387 96988
7090I6988J24888J647l89811L51965m06644P8103K97745j82786O4827J3434M4462
$$ 96988 221876 223523 -166288 185677 -220967 -142864 154881 -27905 36922 50356 94818
7079I4818j20275j15780M31233l65275j00689L4942m0432k83534O38339J2655
$$ 94818 -25457 -141237 289996 -75279 -175968 -141026 -181458 -464992 173347 186002
7069A86002j85338l42941M91045l17644L18121l46121K47842j17656j18878L34106
$$ 186002 664 -342277 148768 -168876 149245 -196876 50966 -66690 -185568 148538
7059A48538l73476k81386K82734o4312L0422m5827K30639K08307J45652k20191
$$ 148538 -224938 -506324 -223590 -287902 -257480 -303307 -72668 135639 281291 61100
7049F1100L81581l57595k63439Q6646j6226j09321K1715K69218m7831r7842j50626
$$ 61100 442681 85086 -178353 -91707 -107933 -217254 -195539 73679 25848 -71994 -222620
7038b22620J51615J07561m74060L89950k76100M17210m2607k24400L81563k40723
$$ -222620 -71005 36556 -437504 -47554 -323654 93556 50949 -173451 208112 -32611
7028c2611L8702J93296l58100J11004j78124O0352q5506K51215j67488J07184
$$ -32611 6091 199387 -158713 -47709 -225833 -165481 -250987 228 -167260 -60076
7018f0076l24223L78900J88619n00940N01889j15107j77042J4233J42950J2598
$$ -60076 -384299 -5399 183220 -317720 184169 69062 -107980 -93747 49203 61801
7008F1801m1407L49933j89013l25750K58395l04336j33912R006j48699O48844
$$ 61801 20394 370327 181314 -144436 113959 -190377 -324289 -315283 -463982 184862
6998A84862k40270M45108o86765K70257p9172k15790K87943N8095J79015m20408
$$ 184862 -55408 389700 -297065 -26808 -105980 -321770 -33827 24268 203283 -217125
6988b17125M58697n39771K18921K77120k39367j8926l86695L58286L9946L795
$$ -217125 241572 -298199 -79278 197842 -41525 -60451 -447146 -88860 -48914 -45119
6978d5119J17980k97301O6107M4095l00126N72777K13633m04003j45467K03972
$$ -45119 72861 -224440 -158333 -114238 -414364 158413 372046 -31957 -177424 26548
6968B6548j60225n2907m7077P755R7429J31012j8344j4720j24974J76796n0771
$$ 26548 -133677 -186584 -233661 -225906 -128477 2535 -15809 -30529 -155503 21293 -29478
6957b9478L10798l94841k20873J49889J41552j57725J39143J23089q4486N2012
$$ -29478 281320 -113521 -334394 -184505 -42953 -200678 -61535 61554 -22932 29080
6947B9080p530j00782k47828L40832K10479o40981K69150J36067J58200m98897
$$ 29080 21550 -79232 -327060 13772 224251 -416730 -147580 -11513 146687 -352210
6937c52210L85760Q6987j26043o8353K02892j10738k66660J22777j35589M4492
$$ -352210 33550 120537 -5506 -73859 129033 18295 -248365 -125588 -261177 -216685
6927b16685O31171k52715k11317Q5235k282j19347O1151l04405L20579J13336
$$ -216685 414486 161771 -49546 35689 33407 -85940 -24789 -329194 -8615 104721
6917A04721L3242j54852N6938J03600k49233j28518L85899l53553j28064M36796
$$ 104721 137963 -16889 40049 143649 -105584 -234102 151797 -201756 -329820 106976
6907A06976K6851k96677j01354K67274j64010J66250k35621J415r2093l5549J22353
$$ 106976 133827 -162850 -264204 3070 -160940 5310 -230311 -228896 -320989 -356538 -234185
6896b34185j39907L37356P0918l50602K70757K78556o36006P7968N61738j51090
$$ -234185 -374092 -36736 34182 -316420 -45663 232893 -403113 -325145 236593 85503
6886H5503K2854j09303K6276L21368j74912j03529J53994m34876L43470j23639
$$ 85503 108357 -946 25330 346698 171786 68257 222251 -212625 130845 7206
6876G206J66559m36162L31720j49000L24127l52455k2610j70641n1489N40091
$$ 7206 173765 -262397 69323 -79677 244450 -108005 -130615 -301256 -352745 187346
6866A87346j04324j61622j11111j02893K30417N948m1927l21622L92709l81818
$$ 187346 83022 -78600 -189711 -292604 -62187 -56239 -98166 -419788 -27079 -408897
6856d08897J21420j18684J81331o1300K54084k4475K24596o47061L33251k8215
$$ -408897 -287477 -406161 -224830 -286130 -32046 -56521 168075 -478986 -145735 -173950
6846a73950M10047m28026L25120J61319q92702P44506l11972J53155R2095j91082
$$ -173950 236097 -191929 133191 294510 -598192 146314 -165658 -12503 79592 -111490
6836a11490j06081m2394L27974J01120l16674J79713k04244J22241K13742j32092
$$ -111490 -217571 -259965 68009 169129 -147545 32168 -172076 -49835 163907 31815
6826C1815k6455n0846K4485n8085l28615M43065j74039K45514P1357m04630J86507
$$ 31815 5360 -45486 -21001 -79086 -407701 35364 -138675 106839 178196 -226434 -39927
6815c9927j12408n6545J28366Q1424k81689J92928q5094M20329o07822J95164
$$ -39927 -152335 -208880 -80514 910 -280779 -87851 -172945 247384 -360438 -165274
6805a65274J47197M256j06967o2887K06214m24653M53569M169r9066r0034L69969
$$ -165274 -18077 -13821 -120788 -183675 22539 -402114 51455 55624 -43442 -133476 236493
6794B36493l61607J15076k00164J28718K02900m60438L26898j07636J99857J76772
$$ 236493 -125114 -10038 -210202 -81484 121416 -339022 -12124 -119760 80097 256869
6784B56869n21248K19095j77048J94959m12183J50727L01617K11516m06028m0153
$$ 256869 -264379 -45284 -222332 -27373 -439556 -288829 12788 224304 -181724 -221877
6774b21877N09276m46793O9758k91634L41976J86894m14761n95N91531l01107
$$ -221877 287399 -159394 -89636 -381270 -39294 147600 -267161 -267756 323775 22668
6764B2668Q4855l38408p9340J85947J55125m86917O13222j4137l72029J91230
$$ 22668 107523 -230885 -310225 -124278 30847 -456070 157152 143015 -229014 -37784
6754c7784K39784m39060K28147l11958N368O46984k01931n21681K56965K27530
$$ -37784 202000 -237060 -8913 -320871 -315503 331481 129550 -392131 -135166 92364
6744I2364k20125K64563m18374K20361O87279r30228L74740k25547L9768l34950
$$ 92364 -127761 136802 -281572 -61211 626068 -304160 70580 -154967 -115199 -450149
6734d50149N82166k1945n05246J24969L30344J23059l38697K46683k07804L0678
$$ -450149 132017 110072 -395174 -270205 60139 183198 -155499 91184 -116620 -85942
6724h5942K84483j60813j92133L0282J92543J3408k02302l1443K2867l5885J49067
$$ -85942 198541 37728 -154405 -124123 68420 81828 -120474 -151917 -129050 -164935 -15868
6713a5868N8992j43632k09574K98454J38038q2239n13530J89914P9063L22636
$$ -15868 43124 -100508 -310082 -11628 126410 44171 -469359 -279445 -200382 122254
6703A22254j59189Q1329j2956r9877r6564q2638R9204m83178M82962K23168j81841
$$ 122254 -36935 44394 31438 -68439 -165003 -247641 -148437 -631615 -148653 74515 -107326
6692a07326L7301j81421J49410J50475j89997q8294l4541M34875R1011l41530
$$ -107326 -70025 -251446 -102036 48439 -141558 -229852 -264393 170482 261493 -80037
6682h0037L29004j78304j10815j47777J99950m87654J29559K46693l61912M7761
$$ -80037 248967 70663 -40152 -187929 12021 -475633 -346074 -99381 -461293 -413532
6672d13532J9601M98754l0529M1346l84813K02835K43809j13827m2310p8191l83297
$$ -413532 -393931 104823 74294 115640 -269173 -66338 177471 63644 21334 -56857 -440154
6661d40154K62535K34821k19934K42294m39870L78114J59164n19302J04929K99590
$$ -440154 -177619 57202 -162732 79562 -360308 17806 176970 -342332 -237403 62187
6651F2187j0931K3569n00935K99941k86434K07761M43227m76472l9911p8237K2911
$$ 62187 51256 74825 -426110 -126169 -412603 -204842 238385 -238087 -277998 -356235 -333324
6640c33324Q40424n55171O407j90429P5604J11269J87092n83497L72553K19305
$$ -333324 507100 -48071 -41664 -232093 -156489 -45220 141872 -441625 -69072 150233
6630A50233m9456K20384m15459r5989q6024j71439K74958K08785j30565R199k34637
$$ 150233 100777 321161 -94298 -190287 -276311 -447750 -172792 35993 -94572 -85373 -320010
6619c20010L03295o7223M06445k79864k02271J19046J2340l9868Q2549j57213
$$ -320010 -16715 -83938 322507 42643 -159628 -40582 -28242 -68110 14439 -142774
6609a42774p8668J74693k72483J35851p9743J19298p6666m92123N79310P4186
$$ -142774 -221442 -46749 -319232 -183381 -263124 -143826 -220492 -712615 -133305 -59119
6599e9119L5509J49896m76678J48715M81568m15829j12256j08273O6042L27308
$$ -59119 -23610 126286 -350392 -201677 279891 -135938 -248194 -356467 -290425 36883
6589C6883K73367m82213L4665l36240K33911L892N37931m07840L11312j51587
$$ 36883 310250 -171963 -137298 -473538 -239627 -235735 302196 -105644 205668 54081
6579E4081k28605L66666j96910j73392L37675m11156Q8596l96432M32592J3050
$$ 54081 -174524 192142 -4768 -178160 159515 -251641 -163045 -559477 -126885 -113835
$$ [...]
##END NTUPLES=NMR SPECTRUM
##END=
