##TITLE=abcd
##JCAMPDX= 6.0         $$ Bruker NMR JCAMP-DX V2.0
##DATA TYPE= NMR SPECTRUM
##DATA CLASS= NTUPLES
##ORIGIN= UXNMR, Bruker Analytische Messtechnik GmbH
##OWNER= root
$$ XWIN-NMR		Version 3.5
$$ Thu Nov 13 18:58:54 2025 Russian Standard Time (UT+4h)  servis@DPX200
##.OBSERVE FREQUENCY= 200.131235884673
##.OBSERVE NUCLEUS= ^1H
##.ACQUISITION MODE= SIMULTANEOUS
##.ACQUISITION SCHEME= undefined
##.AVERAGES= 32
##.DIGITISER RES= 18
##SPECTROMETER/DATA SYSTEM= spect
##.PULSE SEQUENCE= zg
##.SOLVENT NAME= CDCl3
##.SHIFT REFERENCE= (INTERNAL, CDCl3, 0, 16.4885)
##AUDIT TRAIL= $$ (NUMBER, WHEN, WHO, WHERE, WHAT)
$$ ##TITLE= Audit trail, XWIN-NMR		Version 3.5
$$ ##JCAMPDX= 5.01
$$ ##ORIGIN= Bruker BioSpin GmbH
$$ ##OWNER= servis
$$ F:\spectra/data/av/nmr/H1/1/pdata/1/auditp.txt
$$ ##AUDIT TRAIL=  $$ (NUMBER, WHEN, WHO, WHERE, WHAT)
(   1,<2025-11-13 18:58:13.10 +0400>,<servis>,<DPX200>,
      <created by zg, POWCHK disabled, PULCHK disabled
       configuration hash MD5:
       00 E9 B6 7A A2 85 ED C7 34 08 36 98 17 FE 4E 26
       data hash MD5: 32K
       A2 D7 2C BB 47 29 E6 52 45 DA EB AC CD CF 3B A2>)
(   2,<2025-11-13 18:58:14.62 +0400>,<servis>,<DPX200>,
      <Start of raw data processing
       efp BC_mod = 2 LB = 0.05 FT_mod = 6 PKNL = 1 PHC0 = -177.562 PHC1 = 1.301565 SI = 16K 
       data hash MD5: 16K
       B8 27 07 1D 00 48 FE 30 03 D6 5D F1 F7 A9 FA 53>)
(   3,<2025-11-13 18:58:31.54 +0400>,<servis>,<DPX200>,
      <pk PHC0 = -1.6 PHC1 = 0 
       data hash MD5: 16K
       AC 02 0C 1C C9 8D DC 46 36 94 E9 8E 23 01 BF 2E>)
$$ ##END=
$$ 
$$ hash MD5
$$ 3B E9 64 76 C5 74 17 58 AA D1 5F 5E 81 EF 56 E9
##$RELAX= 
##$RELAX= 
##$RELAX= 
##$RELAX= 
##$RELAX= 
##$RELAX= 
##$RELAX= 
##$RELAX= 
$$ Bruker specific parameters
$$ --------------------------
##$DU= <F:\spectra>
##$EXPNO= 1
##$NAME= <H1>
##$PROCNO= 1
##$TYPE= <nmr>
##$USER= <av>
##$AMP= (0..31)
100 100 100 100 100 100 100 100 100 100 100 100 100 100 100 100 100 100 
100 100 100 100 100 100 100 100 100 100 100 100 100 100 
##$AQSEQ= 0
##$AQ_mod= 1
##$AUNM= <au_zg>
##$AUTOPOS= <>
##$BF1= 200.13
##$BF2= 200.13
##$BF3= 200.13
##$BF4= 200.13
##$BF5= 500.13
##$BF6= 500.13
##$BF7= 500.13
##$BF8= 500.13
##$BYTORDA= 1
##$CFDGTYP= 0
##$CFRGTYP= 5
##$CHEMSTR= <none>
##$CNST= (0..31)
1 1 145 1 1 1 1 1 1 1 1 1 1 1 1 1 1 1 1 1 1 1 1 1 1 1 1 1 1 1 1 1 
##$CPDPRG= <>
##$CPDPRG1= <>
##$CPDPRG2= <>
##$CPDPRG3= <>
##$CPDPRG4= <mlev>
##$CPDPRG5= <mlev>
##$CPDPRG6= <mlev>
##$CPDPRG7= <mlev>
##$CPDPRG8= <mlev>
##$CPDPRGB= <>
##$CPDPRGT= <>
##$D= (0..31)
0 2 0 0 0 0 0 0 0 0.06 0 0 0 0 0 0 0.0002 0 0 0 0 0 0 0 0 0 0 0 0 0 0 
0 
##$DATE= 1763045892
##$DBL= (0..7)
120 120 120 120 120 120 120 120 
##$DBP= (0..7)
150 150 150 150 150 150 150 150 
##$DBP07= 0
##$DBPNAM0= <>
##$DBPNAM1= <>
##$DBPNAM2= <>
##$DBPNAM3= <>
##$DBPNAM4= <>
##$DBPNAM5= <>
##$DBPNAM6= <>
##$DBPNAM7= <>
##$DBPOAL= (0..7)
0.5 0.5 0.5 0.5 0.5 0.5 0.5 0.5 
##$DBPOFFS= (0..7)
0 0 0 0 0 0 0 0 
##$DE= 6
##$DECBNUC= <off>
##$DECIM= 32
$$ [...]
##$SUBNAM4= <"">
##$SUBNAM5= <"">
##$SUBNAM6= <"">
##$SUBNAM7= <"">
##$SUBNAM8= <"">
##$SUBNAM9= <"">
##$SW= 20.6817932712277
##$SWIBOX= (0..15)
0 0 3 0 0 0 0 0 0 0 0 0 0 0 0 0 
##$SW_h= 4139.07284768212
##$TD= 32768
##$TD0= 1
##$TE= 0
##$TE2= 300
##$TE3= 300
##$TEG= 300
##$TL= (0..7)
0 120 120 120 120 120 120 120 
##$TP= (0..7)
150 150 150 150 150 150 150 150 
##$TP07= 0
##$TPNAME0= <>
##$TPNAME1= <>
##$TPNAME2= <>
##$TPNAME3= <>
##$TPNAME4= <>
##$TPNAME5= <>
##$TPNAME6= <>
##$TPNAME7= <>
##$TPOAL= (0..7)
0.5 0.5 0.5 0.5 0.5 0.5 0.5 0.5 
##$TPOFFS= (0..7)
0 0 0 0 0 0 0 0 
##$TUNHIN= 0
##$TUNHOUT= 0
##$TUNXOUT= 0
##$USERA1= <user>
##$USERA2= <user>
##$USERA3= <user>
##$USERA4= <user>
##$USERA5= <user>
##$V9= 5
##$VALIST= <valist>
##$VCLIST= <CCCCCCCCCCCCCCC>
##$VD= 0
##$VDLIST= <DDDDDDDDDDDDDDD>
##$VPLIST= <PPPPPPPPPPPPPPP>
##$VTLIST= <TTTTTTTTTTTTTTT>
##$WBST= 1024
##$WBSW= 30
##$XGAIN= (0..3)
0 0 0 0 
##$XL= 0
##$YL= 0
##$YMAX_a= 262526
##$YMIN_a= -267928
##$ZGOPTNS= <>
##$ZL1= 120
##$ZL2= 120
##$ZL3= 120
##$ZL4= 120
##$ABSF1= 0
##$ABSF2= 0
##$ABSG= 0
##$ABSL= 0
##$ALPHA= 0
##$AQORDER= 0
##$ASSFAC= 0
##$ASSFACI= 0
##$ASSFACX= 0
##$ASSWID= 0
##$AUNMP= <proc_1d>
##$AZFE= 0.1
##$AZFW= 0.1
##$BCFW= 0
##$BC_mod= 2
##$BYTORDP= 0
##$COROFFS= 0
##$CY= 18.4799938201904
##$DATMOD= 1
##$DC= 0
##$DFILT= <>
##$DTYPP= 0
##$F1P= 9.9274215381318
##$F2P= -0.165520771350173
##$FCOR= 1
##$FTSIZE= 16384
##$FT_mod= 6
##$GAMMA= 0
##$GB= 0
##$INTBC= 1
##$INTSCL= 4.127829e-11
##$ISEN= 128
##$LB= 0.05
##$LEV0= 0
##$LPBIN= 0
##$MAXI= 10000
##$MC2= 0
##$MEAN= 0
##$ME_mod= 0
##$MI= 50
##$NCOEF= 0
##$NC_proc= -4
##$NLEV= 6
##$NOISF1= 3.799351
##$NOISF2= 2.8
##$NSP= 0
##$NTH_PI= 0
##$NZP= 0
##$OFFSET= 16.48848
##$PC= 4
##$PHC0= -179.162
##$PHC1= 1.301565
##$PH_mod= 1
##$PKNL= yes
##$PPARMOD= 0
##$PSCAL= 4
##$PSIGN= 0
##$REVERSE= no
##$SF= 200.130005582386
##$SI= 16384
##$SIGF1= 3
##$SIGF2= 2
##$SINO= 400
##$SIOLD= 16384
##$SREGLST= <1H.CDCl3>
##$SSB= 0
##$STSI= 16384
##$STSR= 0
##$SW_p= 4139.07284768211
##$SYMM= 0
##$S_DEV= 0
##$TDeff= 32768
##$TDoff= 0
##$TI= <>
##$TILT= no
##$TM1= 0
##$TM2= 0
##$TOPLEV= 0
##$USERP1= <user>
##$USERP2= <user>
##$USERP3= <user>
##$USERP4= <user>
##$USERP5= <user>
##$WDW= 1
##$XDIM= 16384
##$YMAX_p= 375576228
##$YMIN_p= -275840
$$ End of Bruker specific parameters
$$ ---------------------------------
##NTUPLES= NMR SPECTRUM
##VAR_NAME=  FREQUENCY,     SPECTRUM/REAL,   SPECTRUM/IMAG
##SYMBOL=    X,             R,               I
##VAR_TYPE=  INDEPENDENT,   DEPENDENT,       DEPENDENT
##VAR_FORM=  AFFN,          ASDF,            ASDF
##VAR_DIM=   16384,         16384,           16384
##UNITS=     HZ,            ARBITRARY UNITS, ARBITRARY UNITS
##FACTOR=    0.252644378177508, 1,           1
##FIRST=     3299.83951724647, 0,            0
##LAST=      -839.233330435636, 0,           0
##MIN=       -839.233330435636, -275840,     0
##MAX=       3299.83951724647, 375576228,    0
$$ Real data points
##PAGE= N=1
##DATA TABLE= (X++(R..R)), XYDATA
$$ [...]
10738e7608R82k86J686n117P857o293N135n723O22j039N243q057P460k93l663
10723e9094M84L287j596j950L519n991Q533j478o159J4296j1587q654R728N457
10709e1205j985j420L552k377K899j9249J3320J607p191R31Q999N734p348n126
10695e8859J866q631O990j187j53n115P089Q036k500K644n296J514M005j3421
10681f3018R26k216j43M879n518J1967n068k778R193J612m804j338k252M771j606
10666e5393j330j65k805q763Q693p45O290j0504M173L108M381j742q0r05j953
10651e7740L61j639M094m534L241L715k073J005m227l21m65k281J918l519O2J0490
10635e1913P62r385M088j902K774K215l786n445k035R229L89j675J30J409m503
$$ plain form
10738 -57608 -56626 -56912 -55226 -60343 -52486 -58779 -53644 -59367 -58745 -59784 -54541 -62598 -55138 -55431 -59094
10723 -59094 -58610 -55323 -56919 -58869 -55350 -61341 -52808 -54286 -60445 -46149 -57736 -66390 -56662 -51205
10709 -51205 -53190 -54610 -51058 -53435 -50536 -69785 -56465 -54858 -62049 -61118 -52119 -46385 -53733 -58859
10695 -58859 -56993 -65624 -58634 -59821 -59974 -65089 -58000 -49964 -52464 -49820 -55116 -53602 -49597 -63018
10681 -63018 -62092 -64308 -64451 -59572 -65090 -53123 -58191 -60969 -51776 -50164 -54968 -56306 -58558 -53787 -55393
10666 -55393 -56723 -56888 -59693 -68456 -59763 -60508 -54218 -64722 -60549 -57441 -53060 -54802 -54882 -55787 -57740
10651 -57740 -57379 -59018 -54924 -59458 -56217 -52502 -54575 -53570 -57797 -58118 -58583 -60864 -58946 -62465 -62403 -51913
10635 -51913 -51151 -60536 -56448 -58350 -55576 -53361 -57147 -62592 -64627 -55398 -55009 -56684 -56554 -55145 -59648
10620e9648o264J0840K277J9l898j517n393Q489P310j0469j99J761J399o700P525
10605e4468r656L054P757O69j0215Q189q56k236M35L078n7p995j27M486J947j833
10589e7828m050N842o324Q302K735l622m557m709M204k779Q254K822l272l343
10575e8325m489M597l638J4692j0309j691M813n082P307o297n511Q199m178K333
10561e7579N762o19j2995O857K699n890J1900l306M200p321p388K436Q786j035
10547e3493m347J669o099K141O423k857j302K476o827M28J904n20m19n252P045
10532e9030k018K973K95r21l386J0930p806j058J226J151j034Q46j1132P413M395
10517e7156j269L350J081j047L792m859O430q551R329j385j932o933p104L814
$$ plain form
10620 -59648 -65912 -55072 -52795 -52776 -56674 -58191 -63584 -55095 -47785 -58254 -58453 -56692 -55293 -61993 -54468
10605 -54468 -64124 -61070 -53313 -52644 -62859 -54670 -55526 -57762 -57327 -54249 -54306 -62301 -62428 -57942 -55995 -57828
10589 -57828 -61878 -56036 -62360 -54058 -51323 -54945 -59502 -64211 -60007 -62786 -54532 -51710 -54982 -58325
10575 -58325 -62814 -58217 -61855 -47163 -57472 -59163 -54350 -59432 -52125 -58422 -63933 -55734 -59912 -57579
10561 -57579 -51817 -52436 -65431 -58574 -55875 -61765 -49865 -53171 -48971 -56292 -63680 -61244 -52458 -53493
10547 -53493 -57840 -56171 -62270 -60129 -53706 -56563 -57865 -55389 -62216 -61788 -59884 -60404 -60823 -66075 -59030
10532 -59030 -61048 -58075 -57780 -58701 -62087 -51157 -58963 -60021 -58795 -57644 -58678 -57832 -68964 -61551 -57156
10517 -57156 -58425 -55075 -53994 -55041 -51249 -56108 -49678 -58229 -48900 -50285 -52217 -59150 -66254 -62440
10503f2440l414R603j2213O994P328K497l482k505l283K432L191o4l50K770q639
10488f1575L607L311r400Q040M986r080L865n015M799n183J669k30K514R903n949
10473e3738j2135Q496n70K567j636M76L628J234q622o183R549r75P358m194j2713
10458f7458N351R921n155P4N865q605l485R780M239p66p477o112Q194j0907N640
10443f0901o16P318k775q212Q575m02p35k227L23N17Q627n431j775Q95K434p554
10427f1939J1913j3133J2325j4564M168K664M518n028L54L287L561p591j961J131
10413f0295j784P402K455m682J768K050m841k757J1813q903L142m049m563R025
10399e4219m279J693p195P418l019J028N60k131k231K519N544P26Q28j0617N904
$$ plain form
10503 -62440 -65854 -56251 -68464 -61470 -54142 -51645 -55127 -57632 -60915 -58483 -55292 -55356 -55706 -52936 -61575
10488 -61575 -57968 -54657 -64057 -56017 -51031 -60111 -56246 -61261 -56462 -61645 -59976 -60206 -57692 -47789 -53738
10473 -53738 -65873 -57377 -57947 -55380 -57016 -56540 -52912 -51678 -60300 -66483 -56934 -57909 -50551 -54745 -67458
10458 -67458 -62107 -52186 -57341 -57267 -51402 -60007 -63492 -53712 -49473 -50239 -57716 -63828 -55634 -66541 -60901
10443 -60901 -61517 -54199 -56974 -65186 -56611 -57013 -57748 -59975 -59652 -59135 -50508 -55939 -57714 -56819 -54385 -61939
10427 -61939 -50026 -63159 -50834 -65398 -61230 -58566 -54048 -59076 -58722 -55435 -51874 -59465 -61426 -60295
10413 -60295 -62079 -54677 -52222 -56904 -55136 -53086 -57927 -60684 -48871 -57774 -54632 -58681 -63244 -54219
10399 -54219 -58498 -56805 -64000 -56582 -59601 -58573 -58013 -60144 -62375 -59856 -54312 -53586 -52758 -63375 -57471
10384e7471p51r14K528K890l961n297O035m031L76K225m267O465K930j1443l908
10369f8594J1774P719n072n937O683n543n5P348J712j482p295m86J3626j99j2073
10354e7874j086k602k496Q791k23n209J0716p760n899j575L889J6536r542j0343
10340f4677L007P513m497O453r366M456L62m577r63K852M892R85n687J1375j0065
10325e7937J864J090n640m978Q371l745L311l327J160L638P924j1197o078P149
10311e8395m25K14j653P206j336k973m147J794M205n633J3799p749K038k446L072
10296e2429J705o190j533p22m048Q357j887J674Q68l477M850n512O191q801N268
10281e5686l912P087q965l137J0442j971r639O672K402N59n078l874M170O847
$$ plain form
10384 -57471 -58222 -59136 -56608 -53718 -57679 -62976 -56941 -60972 -60596 -58371 -62638 -56173 -53243 -64686 -68594
10369 -68594 -56820 -49101 -54173 -60110 -53427 -58970 -59025 -51677 -49965 -51447 -58742 -59228 -45602 -45801 -57874
10354 -57874 -58960 -61562 -64058 -55267 -55490 -60699 -49983 -57743 -63642 -65217 -61328 -44792 -54334 -64677
10340 -64677 -61670 -54157 -58654 -52201 -61567 -57111 -56749 -61326 -62289 -59437 -54545 -53560 -59247 -47872 -57937
10325 -57937 -56073 -54983 -60623 -65601 -57230 -60975 -57664 -60991 -59831 -56193 -48269 -59466 -65544 -58395
10311 -58395 -58820 -58606 -60259 -53053 -54389 -57362 -61509 -59715 -55510 -61143 -47344 -55093 -53055 -55501 -52429
10296 -52429 -50724 -56914 -58447 -59169 -63217 -54860 -56747 -55073 -54205 -57682 -52832 -58344 -52153 -60954 -55686
10281 -55686 -59598 -52511 -61476 -64613 -54171 -56142 -65781 -59109 -56707 -56148 -61226 -65100 -60930 -54083
10267e4083j970p579L534k265N006N71n681J9582j4464k599P108q059P619m980
10253e8260L122l42j676O993o432k088P049l345J986j0435K980M630l023l225
10239f2066J177L523M398m341M966k439p189P507j0680O753o315O728p256R599
10225e5635J56r81N684j2776J0670q42k435L946m430O66r436J2745j0100M205
10211e8563p99L670m24J940P267j4099R27k930N160m792O363m82k717l267N983
10196e6763K071j231j782k54M852j1327Q101N709j3397R042p917M541J0665n991
10182e3681j884m020J330j920o4q36R459j0494L113K472l598J880L461k808P471
10167e0119n954l119O760K141n926l844R621p427k292j015n38L883j81p546N804
$$ plain form
10267 -54083 -56053 -63632 -60098 -62363 -57357 -56786 -62467 -42885 -57349 -59948 -52840 -60899 -53280 -58260
10253 -58260 -55138 -55480 -57156 -50163 -56595 -58683 -51634 -54979 -52993 -63428 -60448 -55818 -58841 -62066
10239 -62066 -60889 -57366 -52968 -57309 -52343 -54782 -61971 -54464 -65144 -58391 -64706 -57978 -65234 -55635
10225 -55635 -55479 -56460 -50776 -63552 -52882 -53724 -56159 -52213 -56643 -55977 -65413 -52668 -62768 -58563
10211 -58563 -59362 -55692 -56116 -54176 -46909 -61008 -60081 -63011 -57851 -62643 -56280 -56762 -59479 -62746 -56763
10196 -56763 -54692 -55923 -57705 -57959 -53107 -64434 -56333 -50624 -64021 -54979 -62896 -58355 -47690 -53681
10182 -53681 -55565 -59585 -58255 -60175 -60239 -61075 -51616 -62110 -58997 -56525 -60123 -58243 -54782 -57590 -50119
10167 -50119 -56073 -59192 -52432 -50291 -56217 -60061 -50440 -57867 -60159 -61174 -61712 -57829 -58010 -65556 -59752
10152e9752Q200j6296Q071O52K714J327p016R080o603Q487n403j016L355K237
10138e1963L806o099n001l88Q563o487J714p392J424j447r005K1576k378m872
10124e7949k536K730J212m216J976l409N616q629Q188J760o19m430L388o094N509
10109e7503m098j982O433m223R832q28p373K373L85j1973J8574n131k175m829
10095f2518M871o492o78k736Q825k265J0606j4031Q132n93m643J990J483L509
10081e4540j461p10n53m315P047m322K393l462J266j030K439M85K597L527m344
10066e4983N775K24n460l814o133Q148L03L084j3581K234M888j17k787K896p380
10051f6703O945O54m668j863J1080j0308P936M599O03j193l246K416K07k487J993
$$ plain form
10152 -59752 -51552 -67848 -59777 -59125 -56411 -55084 -62100 -53020 -59623 -51136 -56539 -57555 -54200 -51963
10138 -51963 -48157 -54256 -59257 -59645 -51082 -57569 -55855 -63247 -61823 -63270 -72275 -50699 -53077 -57949
10124 -57949 -60485 -57755 -56543 -60759 -58783 -62192 -56576 -65205 -57017 -55257 -55876 -60306 -56918 -63012 -57503
10109 -57503 -61601 -63583 -57150 -61373 -51541 -52369 -59742 -57369 -56984 -68957 -50383 -55514 -57689 -62518
10095 -62518 -57647 -64139 -64817 -67553 -58728 -60993 -50387 -64418 -56286 -56879 -61522 -59532 -58049 -54540
10081 -54540 -56001 -56711 -57264 -61579 -54532 -58854 -56461 -59923 -58657 -59687 -57248 -56763 -54166 -50639 -54983
10066 -54983 -49208 -48984 -54444 -58258 -64391 -56243 -55940 -52856 -66437 -64203 -59315 -59432 -62219 -59323 -66703
10051 -66703 -59758 -59104 -63772 -65635 -54555 -64863 -56927 -52328 -51725 -52918 -56164 -53748 -53541 -56028 -54035
10036e4035j048q160K198N666m717m461J1012L082r338Q202l004l558J649q731
10022f5243Q836l771J286J0048j069r278k167O195P932j5630J124J2525r14j2679
10008f2805M77O659N807l073l528Q14m382l893J762J086J2171j5589J0265j2408
9994f6637J0484j232j582O301l544J397O49k981j434j448L495q27m458k738Q289
9979e6266j342O567j1738o08l773j290J6707K387k891o632R197m089k774M177
9965e2368l778L90k644k219P420k571o417n898J1573l330l605L275K321l573R381
9950e2043M087j1603M387m107K183n099N476j0864J3841o355M493j974Kn920N044
9935e8452o935p438J0386J975o382M886M041O480p00l682J057p994N984P492o729
$$ plain form
10036 -54035 -55083 -63243 -61045 -55379 -60096 -64557 -53545 -50463 -59801 -51599 -54603 -58161 -56512 -65243
10022 -65243 -56407 -60178 -58892 -48844 -49913 -59191 -61358 -55163 -47231 -62861 -61737 -49212 -50126 -62805
10008 -62805 -62328 -55669 -49862 -52935 -56463 -55649 -60031 -63924 -62162 -61076 -48905 -64494 -54229 -66637
9994 -66637 -56153 -57385 -58967 -52666 -56210 -54813 -54164 -57145 -58579 -60027 -56532 -57359 -61817 -64555 -56266
9979 -56266 -57608 -51041 -62779 -63387 -67160 -68450 -51743 -49356 -52247 -58879 -49682 -53771 -56545 -52368
9965 -52368 -56146 -55756 -58400 -60619 -53199 -55770 -62187 -68085 -56512 -59842 -63447 -60172 -57851 -61424 -52043
9950 -52043 -47956 -59559 -55172 -59279 -57096 -62195 -56719 -67583 -53742 -60097 -55604 -57578 -57576 -63496 -58452
9935 -58452 -65387 -72825 -62439 -60464 -66846 -61960 -57919 -51439 -52139 -55821 -54764 -62758 -56774 -49282 -56011
9920e6011Ol619J910L163o822O796q074J5193j1260L473L070r026K59J008M441
9905e5493k296n68K084l324P212p107l168K24J684N823j302o663K118Q486q160
9890f0450R405k478L769j1168Q230n041k746R07m52N933m214M031r306O322L827
9875e3431J153j355q122R212L101o034p858Q573m121m915R695l386L982l698o008
9860f3212K907m756N862n630P63N925m383M141n439M422o987R945n159M785m87
9845e7303k717O7N789M339p229n628M754K930l42j0258K444Q220J523n674O628
9830e2457p769J1334j3662K756l74K43K350O33m980N438k113N756M89o208n614
9815f4178r68O231O868n660l210O81l46l559N893P32l542L438L008k543J119j5
$$ plain form
9920 -56011 -56005 -59624 -57714 -54551 -61373 -54577 -62651 -47458 -58718 -55245 -52175 -61201 -60942 -59934 -55493
9905 -55493 -57789 -58357 -56273 -59597 -52385 -59492 -62660 -62436 -60752 -54929 -56231 -62894 -60776 -52290 -60450
9890 -60450 -51045 -53523 -49754 -60922 -52692 -57733 -60479 -59572 -60024 -54091 -58305 -54274 -63580 -57258 -53431
9875 -53431 -52278 -53633 -61755 -52543 -49442 -55476 -63334 -54761 -58882 -63797 -54102 -57488 -53506 -57204 -63212
9860 -63212 -60305 -65061 -59199 -64829 -64066 -58141 -62524 -58383 -63822 -59400 -66387 -56442 -61601 -56816 -57303
9845 -57303 -60020 -59953 -54164 -49825 -57054 -62682 -57928 -54998 -55340 -65598 -63154 -54934 -53411 -59085 -52457
9830 -52457 -60226 -48892 -62554 -59798 -60172 -59929 -57579 -56946 -61926 -56488 -58601 -52845 -52356 -58564 -64178
9815 -64178 -65146 -58915 -52047 -57707 -60917 -60236 -60582 -64141 -58248 -57516 -61058 -57620 -54612 -57155 -56036 -56051
9799e6051k486K168J462K890q566M73J005L37N98m179M342m64J779J924l818n628
9783f4214M797m826K821j196L840k493L40N887p292J476J1457j3542P605p67K011
9768e4096q901N358N725j128p52K404j0135O343O555n232k763q86J680k340q99
9753e9067J22n082R478p790j795N739J2178j9308Q570m557M214J021n058J0812
9739e0523n491n28N229p77N713j4636n61J411L816n36P86k345k625J0624o806
9724e7249j859J016j7399K5525j6388J4897P56j1045P561o109m239P401M031o176
9710e9277M10K502j171N856q656j197O714L13p741O240l604k55n126M033M575
9695e6384Q46n365n883K088L768M653o57J101j807K515p256Q043K96j35q206o372
$$ plain form
9799 -56051 -58537 -56369 -54907 -52017 -60583 -60110 -59105 -58768 -58170 -62349 -58007 -58471 -56692 -54768 -58586 -64214
9783 -64214 -59417 -64243 -61422 -62618 -58778 -61271 -60931 -55044 -62336 -60860 -49403 -62945 -55340 -56107 -54096
9768 -54096 -62997 -57639 -51914 -53042 -53794 -51390 -61525 -55182 -48627 -53859 -56622 -57508 -55828 -58168 -59067
9753 -59067 -58945 -64027 -54549 -62339 -64134 -58395 -46217 -65525 -56955 -61512 -57298 -56277 -61335 -50523
9739 -50523 -56014 -56542 -51313 -52090 -46377 -61013 -61574 -60163 -56347 -56883 -56097 -58442 -61067 -50443 -57249
9724 -57249 -59108 -58092 -75491 -49966 -66354 -51457 -50701 -61746 -54185 -60294 -64533 -57132 -53101 -59277
9710 -59277 -58867 -56365 -57536 -51680 -60336 -61533 -54819 -54506 -62247 -56007 -59611 -59866 -64992 -60959 -56384
9695 -56384 -55538 -60903 -66786 -64698 -60930 -56277 -56934 -55833 -57640 -55125 -62381 -54338 -54042 -54177 -62383 -68755
9679f8755P852R9Q247n885l625Q465l877j528p32p924R726P19p026R443l505n37
9663e8843l795R661k811r142J759K484p807P292P033R49j527J508j0951J2670
9649e1520l805n239J240q40N243l610p970J4080l658k896M555m985J523l111Q108
9634e2885l678K350J769k27l517q440O605P634J359r588k288O069N729j0688N720
9619e4076j6432P959L706k699j654l764J4216q706k971J1706n668L452l983j01
9605e9015q108Q992q70M448k023L02j788j736P064q492n849N687J0233l786q578
9590f3519P703o040l275N892J869Q934j4398J1809n067O618r305k055K292o108
9576f4650M343m504R750n531O64k04Q249q736M028j262m260J1151Q6o415l056
$$ plain form
9679 -68755 -60903 -60804 -52557 -58442 -62067 -53602 -57479 -59007 -59739 -67663 -57937 -57218 -64244 -54801 -58306 -58843
9663 -58843 -62638 -52977 -55788 -64930 -63171 -60687 -68494 -61202 -54169 -53220 -54747 -53239 -64190 -51520
9649 -51520 -55325 -60564 -59324 -60164 -54921 -58531 -66501 -52421 -56079 -58975 -54420 -59405 -57882 -60993 -52885
9634 -52885 -56563 -54213 -52444 -52671 -56188 -64628 -58023 -50389 -49030 -58618 -60906 -54837 -49108 -59796 -54076
9619 -54076 -70508 -62549 -58843 -61542 -63196 -66960 -52744 -61450 -64421 -52715 -58383 -54931 -58914 -59015
9605 -59015 -67123 -58131 -59001 -54553 -56576 -56274 -58062 -59798 -52734 -61226 -67075 -61388 -51155 -54941 -63519
9590 -63519 -55816 -61856 -65131 -59239 -57370 -48436 -62834 -51025 -56092 -49474 -58779 -60834 -58542 -64650
9576 -64650 -60307 -64811 -55061 -60592 -59928 -60132 -51883 -60619 -56591 -57853 -62113 -50962 -50876 -57291 -60347
9561f0347l004N286L654r463J4751o685o240P694m211K730q679R726n553M822
9547e5519j1558J3238p646Q6L346L636m936J248o82J0O12j174l41n242J1537P14
9531e2671j3692L694J2199m037k599k888j261j608P669J010o685R411j0558K254
9517e9762K753n364O511L55O24J520j2647Q673k577n696j030M273J0097j1736
9503f4006P723j433p401R161n232P352m242l515k280O664k646M525j5262K647
9489f7945Q433N702m107J689K861l270m306P947j0617R102K783R803k2831P503
9475e7253k269P573q675N754j2201M457k88J1538j3462P832L814k44L198q354
9461e8580k016k770j979Q286l139l795q574K208J3222q798O496L544q475J1525
$$ plain form
9561 -60347 -63351 -58065 -54411 -63874 -49123 -55808 -62048 -54354 -58565 -55835 -64514 -54788 -60341 -55519
9547 -55519 -67077 -53839 -61485 -61399 -58053 -54417 -59353 -58105 -58787 -58777 -58165 -59339 -59680 -64922 -53385 -52671
9531 -52671 -66363 -62669 -50470 -54507 -57106 -59994 -61255 -62863 -55194 -54184 -60869 -51458 -62016 -59762
9517 -59762 -57009 -62373 -55862 -55507 -54883 -53363 -66010 -57337 -59914 -65610 -66640 -62367 -52270 -64006
9503 -64006 -56283 -57716 -65117 -55956 -61188 -53836 -58078 -61593 -63873 -57209 -59855 -55330 -70592 -67945
9489 -67945 -59512 -53810 -57917 -56228 -53367 -56637 -60943 -52996 -63613 -54511 -51728 -41925 -64756 -57253
9475 -57253 -59522 -51949 -60624 -54870 -67071 -62614 -62902 -51364 -64826 -56994 -53180 -53424 -50226 -58580
9461 -58580 -60596 -63366 -65345 -57059 -60198 -63993 -72567 -70359 -57137 -65935 -59439 -55895 -64370 -52845
9447e2845r418Q10Q970j3268K82K966J212J2252j1398l183N878p623R317o960
9433f3008L274P266m493M910j0474J7832j3090Q986l160r005K163J825l265R344
9419e0895m287M197m324k230p921Q683k148r98M891L998m560r45O010j6556K618
9404f4467J1338m20l072p353K655L958j784O350p534l159O326L347J470m236J731
9389e4850l648L076n277J613L089j587o478J1949o761j077P339L217j3373o1n84
9374f3413O68J2900q490O62J226n389K997O776p094K71Q268q166j998K70m365
9359f4877P315k565K124N12l851M476r72L823q456MP932j1735N09R286n118N270
9343e6323n907j825j222o85n149J2577K759j981j0889R929n299j43J0976j0204
$$ plain form
9447 -52845 -62263 -61453 -52483 -65751 -65469 -62503 -61291 -49039 -60437 -63620 -57742 -65365 -56048 -63008
9433 -63008 -59734 -52468 -56961 -52051 -62525 -44693 -57783 -48797 -51957 -60962 -58799 -56974 -60239 -50895
9419 -50895 -55182 -50985 -55309 -57539 -65460 -56777 -58925 -59923 -55032 -51034 -55594 -56539 -50529 -67085 -64467
9404 -64467 -53129 -53549 -56621 -63974 -61319 -57361 -59145 -52795 -60329 -63488 -57162 -53815 -52345 -56581 -54850
9389 -54850 -58498 -55422 -60699 -59086 -55997 -57584 -64062 -52113 -58874 -59951 -52612 -49395 -62768 -62829 -63413
9374 -63413 -62745 -49845 -58335 -57673 -56447 -61836 -58839 -52063 -59157 -58886 -50618 -58784 -60782 -60512 -64877
9359 -64877 -57562 -60127 -58003 -57491 -61342 -56866 -57838 -54015 -62471 -62467 -54535 -66270 -65761 -56475 -61593 -56323
9343 -56323 -62230 -64055 -65277 -65962 -71111 -58534 -55775 -57756 -68645 -58716 -64015 -64158 -53182 -63386
9329f3386K973L311j869J247m686l443m351J815J5606p513l435M107M283M407
9315e0934k1150R727J421J755j258M534n84l026l453o17n077R658k096l082P983
9300e6199L970j245O29k403k822J171o956O374J741o68R32o461M157P0K002L243
9284e2465o322n782P062o300J1565j8572Q460J0691p361o55p454R398m310J619
9270f0426m250J578L887o866J4350r090K193J20K391m187J908p522J159P003o130
9255f3882N119J248q474J1966p989M596J0535j0239k591l168K627O989N05j2369
9241f5127Q4J410M276R37m294J0186r202l387Q506l073j0419K2091j4319m545
9227f6876O055k457l93J4901p059L372K334j6890J5224k797j0626P838m666k109
$$ plain form
9329 -63386 -60413 -57102 -58971 -57724 -62410 -65853 -70204 -68389 -52783 -60296 -63731 -59624 -55341 -50934
9315 -50934 -72084 -62357 -60936 -59181 -60439 -55905 -56489 -59515 -62968 -63585 -68662 -59004 -61100 -64182 -56199
9300 -56199 -52229 -53474 -52845 -55248 -58070 -56899 -63855 -57481 -55740 -56408 -55476 -61937 -57780 -57710 -55708 -52465
9284 -52465 -58787 -64569 -57507 -63807 -52242 -70814 -62354 -51663 -59024 -59679 -67133 -57735 -62045 -60426
9270 -60426 -64676 -63098 -59211 -66077 -51727 -60817 -58624 -58504 -56113 -60300 -58392 -65914 -64755 -57752 -63882
9255 -63882 -58763 -57515 -65989 -54023 -62012 -57416 -46881 -57120 -59711 -62879 -60252 -53263 -52758 -65127
9241 -65127 -65043 -63633 -59357 -58420 -62714 -52528 -61730 -65117 -56611 -59684 -70103 -48012 -62331 -66876
9227 -66876 -60821 -63278 -63671 -48770 -55829 -52457 -50123 -67013 -51789 -54586 -65212 -57374 -62040 -64149
9213f4149M83L486J362l432K988P271K332m636K186n773l611p12K898K963o586
9198f2930J4121n706q712M291o889J1590o297L702M239p104L042R700p989l49
9184e5291K615R844K4106q0805L3232J015m671Q002j1761J1905k552Q905p028
9171f2484Q639j1597P282p347M168M722M829j869R65J595o125l012Q54J609M088
9156e3683n246q531O627j058J2485j2538J647j109k960m371M132J320K460j46
9142f0971M039M146k910p316Q26n872J0478n443P23P111l922j701J134m89j294
9127f1461O934L24j255k078j448k179O198j1497P493K370q290L738J237o029R40
9112f5003J0931p476Q485J360o739O331p837M617l274m17k00N410k476l297n12
$$ plain form
9213 -64149 -63666 -60180 -58818 -62250 -59262 -51991 -49659 -54295 -52109 -57882 -61493 -62205 -59307 -56344 -62930
9198 -62930 -48809 -54515 -63227 -58936 -65825 -54235 -60532 -56830 -52591 -59695 -56653 -46953 -54942 -55291
9184 -55291 -52676 -42832 -18726 -99531 -66299 -65284 -69955 -61953 -73714 -61809 -64361 -55456 -62484
9171 -62484 -53845 -65442 -58160 -65507 -61339 -56617 -51788 -53657 -52692 -51097 -57222 -60234 -59380 -57771 -53683
9156 -53683 -58929 -67460 -60833 -61891 -49406 -61944 -60297 -61406 -64366 -68737 -64605 -63285 -60825 -60971
9142 -60971 -56932 -52786 -55696 -63012 -62186 -68058 -57580 -63023 -62300 -55189 -59111 -60812 -59678 -60167 -61461
9127 -61461 -54527 -54203 -55458 -57536 -58984 -61163 -54965 -66462 -58969 -56599 -64889 -61151 -59914 -65943 -65003
9112 -65003 -54072 -61548 -53063 -51703 -58442 -52111 -59948 -55331 -58605 -59022 -59222 -53812 -56288 -59585 -60097
9097f0097J261n064Q538j0421Q147k898L201l292P427j962L242r036K124k032
9083f0862K921L223n015J064k304Q002k119Q16N40r644J1118j3843P493N72R51
9068e7087k133M611m868l454k551J3533j2972J5982j0014j0420Q655r02J432R77
9054e9211O071l635L001j84m827k775J781K315M160r236J582O408n580J490N625
9039e3015m855J954k857n354P308J569k549k754P653q303l011Q859N81J188n037
9024e8623Q51P800m724L201j814P110q904k964M489M590m580l613l297N670K662
9009e2146l297n285J882J0812r583m093N246Q557n737p73j064o15o77L332J905
8994e1536m991K183J012j0515J3192n970j650j659O934P81j2510J3440L23k505
$$ plain form
9097 -60097 -58836 -63900 -55362 -65783 -57636 -60534 -57333 -60625 -53198 -55160 -51918 -60954 -58830 -60862
9083 -60862 -57941 -54718 -59733 -58669 -60973 -52971 -55090 -54274 -53734 -63378 -52260 -66103 -58610 -58038 -57087
9068 -57087 -59220 -54609 -59477 -62931 -65482 -51949 -64921 -48939 -58953 -69373 -60718 -61620 -60188 -59211
9054 -59211 -53140 -56775 -53774 -53958 -58785 -61560 -59779 -57464 -53304 -62540 -60958 -54550 -60130 -58640 -53015
9039 -53015 -57870 -55916 -58773 -64127 -56819 -55250 -57799 -60553 -52900 -61203 -64214 -55355 -54774 -53586 -58623
9024 -58623 -57772 -49972 -54696 -51495 -53309 -46199 -55103 -58067 -53578 -48988 -53568 -57181 -60478 -54808 -52146
9009 -52146 -55443 -60728 -58846 -48034 -57617 -61710 -56464 -47907 -53644 -54417 -55481 -56096 -56773 -53441 -51536
8994 -51536 -56527 -54344 -53332 -63847 -50655 -56625 -58275 -59934 -53000 -52219 -64729 -51289 -50966 -53471
8980e3471L176n083m985M264K420L40l831N268r771L986O197j593K108o049J550
8965e5474o14J239m844P836m177J842L150l400m059J1577k432r857M986l233L434
8950e4026o655K238K277m693J0089p36j842Q57n161j509K372M65J1453q612p006
8935f0489o84j786P086J734j364J615l971l629K093M356Q9r7p605j19J0127l149
8919e5793L679j924l063M865q106J3290j3624J0420o386Q410j3333K046O693q12
8905e3638Q72r953J4240r117N388j237n029l815J1814r696N335l978J091n135
8891f2858N686l75L501o046P103o773P333j849K922r031O682m57J235k680J452
8876e4155K400J315l086n369M028M8o134o75N968J426o998O648O108m345n939
$$ plain form
8980 -53471 -50295 -55378 -60363 -56099 -53679 -53339 -57170 -51902 -61673 -57687 -51490 -53083 -50975 -57024 -55474
8965 -55474 -56088 -54849 -59693 -51857 -56034 -54192 -51042 -54442 -58501 -46924 -49356 -59213 -54227 -57460 -54026
8950 -54026 -60681 -58443 -56166 -60859 -50770 -51506 -53348 -52491 -57652 -59161 -56789 -56324 -44871 -53483 -60489
8935 -60489 -61173 -62959 -55873 -54139 -55503 -53888 -57859 -61488 -59395 -55039 -54950 -55047 -62652 -62771 -52644 -55793
8919 -55793 -52114 -54038 -57101 -52236 -60342 -47052 -60676 -50256 -56642 -48232 -61565 -59519 -52826 -53638
8905 -53638 -52766 -62719 -48479 -57596 -52208 -53445 -58474 -62289 -50475 -60171 -54836 -58814 -57723 -62858
8891 -62858 -57172 -57547 -54046 -60092 -52989 -59762 -52429 -54278 -51356 -60387 -53705 -54162 -52927 -55607 -54155
8876 -54155 -51755 -50440 -53526 -58895 -54867 -54819 -60953 -61628 -55660 -54234 -61232 -54584 -48476 -52821 -58760
8861e8760L335n77k507P685p209m210J0216p814L189m72j02n643J0723J029p454
8846e8571K808j670J032L820m366n280R898j923J1197p955M090m561N146j823
8832d8158j2940O089j0657J6639k914j027J291k087k291K82L881l900n028Q125
8818e2695j217n318P756l711n49r907J4287J2352j3578j5214J1947K891N658l282
8804e0580M57k00N141j1697L263L8M070N587k812l727J3074r348j961L238L23
8789d5134j202P282n21J02328j56782K1312O494J5990n957L525o577M898p847
8776f2191K029J1087j6551J6452j0252j180O684n568O760l814M309l76k804L483
8762e1932j647k85j5197J3741L303R06o746O365j536J443l744p371R846m376j774
$$ plain form
8861 -58760 -55425 -56002 -58509 -50824 -58033 -62243 -52027 -59841 -56652 -57124 -57226 -62869 -52146 -51117 -58571
8846 -58571 -55763 -57433 -56401 -52581 -56947 -62227 -52329 -54252 -43055 -51010 -46920 -51481 -46335 -48158
8832 -48158 -61098 -55009 -65666 -49027 -51941 -52968 -51677 -53764 -56055 -55773 -51892 -55792 -60820 -52695
8818 -52695 -53912 -59230 -51474 -55185 -55734 -65641 -51354 -39002 -52580 -67794 -55847 -52956 -47298 -50580
8804 -50580 -50123 -50323 -45182 -56879 -53616 -53578 -49508 -43921 -46733 -50460 -37386 -46734 -48695 -45457 -45134
8789 -45134 -46336 -39054 -39575 62753 -94029 -72717 -66223 -50233 -56190 -52665 -59242 -54344 -62191
8776 -62191 -60162 -49075 -65626 -49174 -59426 -60606 -53922 -59490 -52730 -56544 -52235 -52611 -55415 -51932
8762 -51932 -53579 -53864 -69061 -55320 -52017 -51111 -57857 -51492 -53028 -51585 -55329 -62700 -52854 -57230 -59004
8747e9004O367M181j0811J6484p982q216M26J0049L776j0534P545N14k192l58
8733d9755K08j431o4J599l510P288q121K571m579L634j695m835J082K656M010
8718e0942K882o606J366P117n371n089j1161J6970j684K406k426R098q158M561
8704d7037n654j080Q189l197L351k752J809k156n009j844l237J265M741m53L355
8689d9709J33j502J1894k2057J1448J03J893M975j1241P803m106j189M269j040
8675d8326m411o103R141K188O325j7614R059j051j688P114r404O577J949m628
8661e0872O655r964L813L637p948J940J1224j1556k984J920k66N14J1631r251
8647e1507M507m304J971O959J346o450k525K479P227p198J248k592L551o937n378
$$ plain form
8747 -59004 -52637 -48456 -59267 -42783 -50765 -58981 -58555 -48506 -44730 -55264 -47719 -47205 -49397 -49755
8733 -49755 -49547 -50978 -51042 -49443 -52953 -45665 -53786 -51215 -55794 -52160 -53855 -58690 -57608 -54952 -50942
8718 -50942 -48060 -54666 -53300 -46183 -51554 -56643 -67804 -50834 -52518 -50112 -52538 -43440 -51598 -47037
8704 -47037 -52691 -53771 -45582 -48779 -45428 -48180 -46371 -48527 -53536 -55380 -58617 -57352 -52611 -53064 -49709
8689 -49709 -49576 -51078 -39184 -61241 -49793 -49690 -47797 -42822 -54063 -46260 -50366 -51555 -47286 -48326
8675 -48326 -52737 -58840 -49699 -47511 -41186 -58800 -49741 -50792 -52480 -45366 -54770 -48193 -46244 -50872
8661 -50872 -44217 -54181 -50368 -46731 -54679 -52739 -41515 -53071 -56055 -54135 -54401 -53887 -42256 -51507
8647 -51507 -47000 -51304 -49333 -42374 -41028 -47478 -50003 -47524 -40297 -47495 -46247 -48839 -45288 -52225 -57603
8632e7603K765R494M517m634R81N08l269j3371R061N703m967K213n585M76L361
8617e0350m117Q969r714J0590r45l026L588p441K361N386k537l527j5R731j3886
8602e4933J3091r600M592L267j1732J3631o324o620O580p668J873R795o728O068
8588d4708k635k068J0126r090p293P257j7610J3629O037j2870J8025j0747K374
8575d9573j068N258p321J3902j6760P436q6p871M598N205P04j934q298L727L66
8560e1715L066O583o986o417J2322P31q725N04J1380o369O055p874o392O894P249
8545c9694j900j516m402M783M5R71O64n275R825O421N8957O518r8142L052M830
8530e4863M994l194J1176j2893J0173l425k059N565j3655J5360k181j3097O158
$$ plain form
8632 -57603 -54838 -45344 -40827 -45461 -44480 -43972 -47241 -60612 -51551 -45848 -50815 -48602 -54187 -53711 -50350
8617 -50350 -54467 -45498 -55212 -44622 -45567 -48593 -45005 -52446 -50085 -44699 -47236 -50763 -50778 -41047 -54933
8602 -54933 -41842 -51442 -46850 -43583 -55315 -41684 -48008 -54628 -48048 -55716 -53843 -44048 -50776 -44708
8588 -44708 -47343 -49411 -39285 -48375 -55668 -48411 -66021 -52392 -46355 -59225 -41200 -51947 -49573
8575 -49573 -50641 -45383 -52704 -38802 -55562 -48126 -48212 -56083 -51485 -46280 -45576 -47510 -55808 -52081 -51715
8560 -51715 -48649 -42066 -49052 -55469 -43147 -42416 -51141 -50637 -39257 -45626 -39571 -47445 -53837 -46943 -39694
8545 -39694 -41594 -43110 -47512 -42729 -42684 -41713 -41049 -46324 -36499 -30078 28879 35397 -62745 -59693 -54863
8530 -54863 -49869 -53063 -41887 -54780 -44607 -48032 -50091 -44526 -58181 -42821 -45002 -58099 -51941
8517e1941L03oq513M840M441P218m002j934L567l841o18k049P244o022k762J2548
8501d1527j2149R066K537n450O699Q386k0007k077J2997j0867M419K214l992Q570
8487d1181j3103J6284r580M574o980M983N204j844m527K562M507j1032K650p079
8473e4562N924l19R956n832k370m945N384J527m699p08J2904q578K092o691J0382
8458d0535p709j3287K0024Q03l069r089J1343j0382M911L370o839O587o975N51
8444e0296J4574j4449N996j0672P960j708L656L839j4202M649N557j256N541j6100
8430e6911J6140p931J100P561L462j2566M600l417O636j0174J5687q004J5652
8417b8165k4728K2623j3820M523m716N824p723r328P537P117q278J1914j171q019
$$ plain form
8517 -51941 -51638 -51644 -60157 -55317 -50876 -43658 -47660 -49594 -46027 -49868 -50486 -52535 -45291 -51313 -54075 -41527
8501 -41527 -53676 -44610 -42073 -47523 -40824 -32438 -52445 -54522 -41525 -52392 -47973 -45759 -49751 -41181
8487 -41181 -54284 -38000 -47580 -43006 -49986 -45003 -39799 -41643 -46170 -43608 -39101 -50133 -47483 -54562
8473 -54562 -48638 -48957 -39001 -44833 -47203 -52148 -46764 -45237 -49936 -50644 -37740 -46318 -44226 -50917 -40535
8458 -40535 -48244 -61531 -41507 -40704 -43773 -52862 -41519 -51901 -46990 -43620 -50459 -43872 -50847 -50296
8444 -50296 -35722 -50171 -44175 -54847 -46887 -48595 -44939 -41100 -55302 -50653 -45096 -46352 -40811 -56911
8430 -56911 -40771 -48702 -47602 -40041 -36579 -49145 -44545 -47962 -41326 -51500 -35813 -43817 -28165
8417 -28165 -52893 -30270 -44090 -39567 -44283 -38459 -46182 -55510 -47973 -40856 -49134 -37220 -38391 -46410
8403d6410n641O536j641J5594j1800p133J1315m104J82R655r833j3580Q712Q701
8389c9447q340j453l374P325j323R685j4920P034q06J0325r7j5860N59l579O875
8374d7396J885k347N112l821R1O342n818L390O437j2895o29Q302J088M292n141
8359d1108l357J1092r482q92K52l595O388P33l177Q828k49j2212l857N905j006
8344d5737n105O247l30L467J8049k1220R548j644k300p046M722p871J3268j8820
8330e4772J4434L05p686Q183m04r823L869P071L679l336M04j0717P988j1072N893
8315d5984Q636J966L33j810q768L354M39J151n547r85Q024k129p65j0494J8705
8300c3874k0259J6361P756l0941J9136r705p246K2823j4415J0539l209L184K638
$$ plain form
8403 -46410 -52051 -45515 -47156 -31562 -43362 -50495 -39180 -43284 -43102 -33447 -43280 -56860 -48148 -39447
8389 -39447 -47787 -49240 -52614 -45289 -46612 -36927 -51847 -44813 -45619 -35294 -35391 -51251 -50692 -54271 -47396
8374 -47396 -45511 -47858 -42746 -46567 -46476 -40134 -45952 -42562 -36125 -49020 -49649 -41347 -40259 -35967 -41108
8359 -41108 -44465 -33373 -42855 -43747 -43495 -47090 -40702 -39969 -43146 -34318 -34567 -46779 -50636 -44731 -45737
8344 -45737 -50842 -44595 -44925 -41458 -23409 -44629 -35081 -36725 -39025 -46071 -41349 -49220 -35952 -54772
8330 -54772 -40338 -40033 -47719 -39536 -39940 -49763 -45894 -38823 -35144 -38480 -38076 -48793 -40805 -51877 -45984
8315 -45984 -37348 -35382 -35049 -36859 -45627 -42273 -41834 -40683 -46230 -47215 -39191 -41320 -42085 -52579 -33874
8300 -33874 -54133 -37772 -30016 -60957 -41821 -51526 -58772 -35949 -50364 -39825 -43034 -39850 -37212
8287c7212j2492J3625j1622Q391j938N062J708J369j6441M50K465l189N746M712
8273c9366j895J374n4M222o075K0800j5319j3573Q850J9219j1239p775J1506j7474
8259d6799P145l522J2150j4368P08P672o014O702p703n276J1333M667n056M188
8245c4173j3858o459K6693j6340L148P79q832N805k16m0L160o885N625l263J1610
8230c3246L263N285j9479R596n622K7613l4367N376n29L4j531Q242o312J938K420
8215c7319r75J1677N136j2185J1816k1125J0025j2871l15p985K2521M888M419
8202b2293m44J312j4640J2152J4587m2061l6614O049p845K14518m00561J37517
8190a38323M984J41435l2575l108l775p61M04r099P507N553k452J772o481Q899
$$ plain form
8287 -37212 -49704 -36079 -47701 -39310 -41248 -36186 -34478 -33109 -49550 -49100 -46635 -49824 -44078 -39366
8273 -39366 -41261 -39887 -39941 -35719 -41794 -20994 -36313 -49886 -41036 -21817 -33056 -40831 -29325 -46799
8259 -46799 -39654 -43176 -31026 -45394 -44686 -37014 -43028 -36326 -44029 -49305 -37972 -33305 -38361 -34173
8245 -34173 -48031 -54490 -27797 -44137 -40989 -40210 -49042 -43237 -43453 -43493 -40333 -47218 -41593 -44856 -33246
8230 -33246 -29983 -24698 -44177 -34581 -40203 -12590 -46957 -41581 -42110 -42076 -43607 -35365 -41677 -39739 -37319
8215 -37319 -38294 -26617 -21481 -33666 -21850 -42975 -32950 -45821 -46136 -54121 -31600 -26712 -22293
8202 -22293 -22737 -21425 -36065 -23913 -9326 -51387 -88001 -81952 -89797 124721 -275840 -138323
8190 -138323 -133339 8096 -24479 -27587 -31362 -32123 -31719 -40818 -33311 -27758 -30210 -28438 -34919 -26020
8176b6020j7799J5442q730j0815n84N935J1347k757m05j0850J5828j7871J7923
8163b9356j5839L234J0342n226j4595Q700M281n50l46j6866J4405J0194k4176
8150e5798J6972j1961J069o134K5811J339p274j5052L632J4922J4539j9773r905
8137d7613J2585L50j2206J0537J936j0317P966j469j0496J4739j300n432k362
8124d3082R626j5590O261L765Q168K848o875J647k972l323L217j5969O821N154
8110d0304J1374j9532M430N178r652j328J2038m650L064q291P852P920j8677J2498
8096c8080m922o72J3357r583Q48K431j930l769J2154j1370J0222q488K695j692
8082c8799J90J1180r628n175j0682J2566Q950r651P776j5543q88J1430L244O298
$$ plain form
8176 -26020 -43819 -28377 -37107 -47922 -48506 -42571 -31224 -33981 -34386 -45236 -29408 -47279 -29356
8163 -29356 -45195 -41961 -31619 -36845 -51440 -42740 -38459 -39009 -39355 -56221 -41816 -31622 -55798
8150 -55798 -38826 -50787 -49718 -55852 -30041 -28702 -35976 -51028 -47396 -32474 -17935 -37708 -47613
8137 -47613 -35028 -34678 -46884 -36347 -34411 -44728 -36762 -38231 -48727 -33988 -35288 -40720 -43082
8124 -43082 -33456 -49046 -42785 -39020 -30852 -28004 -34879 -33232 -36204 -39527 -36310 -52279 -45458 -40304
8110 -40304 -28930 -48462 -44032 -38854 -48506 -49834 -37796 -42446 -39382 -47673 -39821 -31901 -50578 -38080
8096 -38080 -43002 -43674 -30317 -39900 -39052 -36621 -38551 -42320 -30166 -41536 -31314 -39802 -37107 -38799
8082 -38799 -38609 -27429 -37057 -42232 -52914 -40348 -31398 -41049 -33273 -48816 -49704 -38274 -35030 -28732
8068b8732k0669K036J3096n732k00P030k007m255Q876P680j3526O724l667J4044
8054a9302m626p837K665j001m476J0586j0357N547j1222P921N110j9533R736N441
8040c1348J756q877L685L113m501K236J5034j0557j2437L136R678J624q617l289
8026c9364j12N77O896N897j5287J3361q314R554j359p643j815J234J396m368L846
8011c5501n006l259m952J2947q141J2322j432n496p61L471M958j0048P205O964
7997b6729j5901P753M546j4804J2196p093k062J1049k372p649Q865l375O453r714
7983c8837j292J0815j168J116j47k517n01j756l181j567j07J4310o149q399l256
7968d2636J5072j2207Q326L789j6226R164j078n7j920O478k416n112j804N966
$$ plain form
8068 -28732 -49401 -47365 -34269 -40001 -40201 -33171 -35178 -39433 -30557 -22877 -36403 -29679 -33346 -19302
8054 -19302 -23928 -31765 -29100 -30101 -34577 -23991 -34348 -28801 -40023 -32102 -26992 -46525 -36789 -31348
8040 -31348 -29592 -38469 -34784 -31671 -36172 -33936 -18902 -29459 -41896 -38760 -29082 -27458 -36075 -39364
8026 -39364 -39476 -38899 -32003 -26106 -41393 -28032 -36346 -26792 -28151 -35794 -37609 -36375 -34979 -39347 -35501
8011 -35501 -40507 -43766 -48718 -35771 -43912 -31590 -33022 -38518 -39279 -35808 -30850 -40898 -33693 -26729
7997 -26729 -42630 -34877 -30331 -45135 -32939 -40032 -42094 -31045 -33417 -41066 -32201 -35576 -29123 -38837
7983 -38837 -40129 -29314 -30482 -29366 -29513 -32030 -32531 -34287 -37468 -39035 -39142 -24832 -30981 -39380 -42636
7968 -42636 -27564 -39771 -31445 -27656 -43882 -34718 -35796 -35853 -37773 -31295 -33711 -38823 -40627 -34661
7954c4661j0142J1043o644N479M717k0930J1224N240m317o307J1164K931j79n326
7940c6708j3432J4670Q366n534j477l761Q839K704j3670N491o428N001r823J0420
7926c5342p448J3824p286P744k756l890p46L001n827m233J1795j0017J1748n727
7912c5160j28j791j336J2851j7982Q268n952N302O880m22q754M839r371N438j524
7897c8842M892n298K172j379P00J27Q29K856j1332J920l993J6037p886L465l680
7882c9412m841J0541j4983J1085J692p231L147M185n405L021q679R634j3407Q035
7868d2618Q636j977q264L693k329P602n176j537M308k317N088L515n715L048J036
7853c3007k966M360K080O8718l8222m3081R959l553j4508P940N342N39O735J225
$$ plain form
7954 -34661 -44803 -33760 -40404 -34925 -30208 -51138 -39914 -34674 -38991 -45298 -34134 -31203 -31382 -36708
7940 -36708 -50140 -35470 -27104 -32638 -34115 -37876 -29037 -26333 -40003 -34512 -40940 -35939 -45762 -35342
7926 -35342 -42790 -28966 -36252 -28508 -31264 -35154 -35900 -32899 -38726 -42959 -31164 -41181 -29433 -35160
7912 -35160 -35288 -37079 -38415 -25564 -43546 -35278 -41230 -35928 -29048 -29470 -38224 -33385 -42756 -37318 -38842
7897 -38842 -33950 -39248 -37076 -38455 -37755 -37628 -36799 -33943 -45275 -43355 -47348 -31311 -39197 -35732 -39412
7882 -39412 -44253 -33712 -48695 -37610 -35918 -43149 -40002 -35817 -41222 -38201 -46880 -37246 -50653 -42618
7868 -42618 -33982 -35959 -44223 -40530 -42859 -35257 -40433 -41970 -37662 -39979 -34891 -31376 -37091 -34043 -33007
7853 -33007 -35973 -31613 -29533 39185 963 -42118 -32159 -35712 -50220 -42280 -36938 -36399 -29664 -28439
7839b8439m06n544O43M006n143k443n119k881M183J892m634R618r615O837m756
7824d1801J5793j6784J5286j1487O865j6545J1689j57J2349p693O63k545r604
7811d3971k056J4552m704K642n574J808M420o210J801N124O37q028o18J412n139
7796d3904J1560P49m951Q222m411k125n13r4K462j2015J2660L105l881L172j2391
7781d2355J616Q953r008n29N852r270j670M954M218N103O041j3229O526o569N671
7766c3696L338p240j905Q783l907n679L943N927L043j1737O746J172j6183J8444
7752b8951p01j707L706j0081O577q634J0866P7K591q793Q977j2888L051k713J0639
7737b7984r409M570n314O189j0322Q883J026j1036J6084k122o946K313J1925K74
$$ plain form
7839 -28439 -28845 -34389 -33746 -29740 -34883 -37326 -42445 -45326 -41143 -39251 -43885 -34267 -43882 -37045 -41801
7824 -41801 -26008 -42792 -27506 -38993 -32128 -48673 -36984 -37141 -24792 -32485 -31822 -34367 -43971
7811 -43971 -46027 -31475 -36179 -33537 -39111 -37303 -32883 -39093 -37292 -32168 -31531 -39559 -40177 -38765 -43904
7796 -43904 -32344 -31595 -36546 -28324 -32735 -34860 -35373 -35467 -33005 -45020 -32360 -29255 -33136 -29964 -42355
7781 -42355 -40739 -31786 -40794 -41323 -35471 -44741 -46411 -41457 -37239 -32136 -26095 -39324 -32798 -39367 -33696
7766 -33696 -30358 -37598 -39503 -30720 -34627 -40306 -36363 -30436 -27393 -39130 -32384 -31212 -47395 -28951
7752 -28951 -29652 -31359 -27653 -37734 -31157 -39791 -28925 -28848 -26257 -35050 -26073 -38961 -35910 -38623 -27984
7737 -27984 -37393 -32823 -38137 -31948 -42270 -33387 -32361 -43397 -27313 -29435 -36381 -34068 -22143 -21869
7723b1869j4375L290o411R291j1988L427J969O601j111k152j873k975P07J459
7709c6010j529P313m188j726j916O762l1R32n759J97O017q276J202O25J2055r577
7693c3909l57J19K515r423N962m369n825J0345J2076j2229O126j2825J1213k71
7679c0852j6377J912P283J0853j4901J1281k815q365P382k936M492o200J2111
7666b7132o759K914m425J758l334m292J1188n233J540K405m044o489N434j187
7652c7656J91R448k0605K3621j2428O973q14o923J268M219K911O811j1127K472
7638c1639o893L794J079O075r229k917K133O717j421q318J640O597j354J128m701
7623c7309k024j249J4218m005q800n72L435J2234m889o003k416O69R652m488L591
$$ plain form
7723 -21869 -36244 -32954 -39365 -30074 -42062 -38635 -36666 -30065 -31176 -33328 -35201 -38176 -37469 -36010
7709 -36010 -37539 -30226 -34414 -36140 -38056 -31294 -31325 -30393 -36152 -35955 -29938 -38214 -37012 -36387 -24332 -33909
7693 -33909 -34266 -34147 -31632 -41055 -35093 -39462 -45287 -34942 -22866 -35095 -28969 -41794 -30581 -30852
7679 -30852 -47229 -45317 -38034 -27181 -42082 -30801 -33616 -41981 -34599 -37535 -33043 -39243 -27132
7666 -27132 -33891 -30977 -35402 -33644 -36978 -41270 -30082 -35315 -33775 -31370 -35414 -41903 -36469 -37656
7652 -37656 -37465 -28017 -48622 -25001 -37429 -30456 -31270 -38193 -36925 -32706 -29795 -22984 -34111 -31639
7638 -31639 -38532 -34738 -33659 -27584 -36813 -39730 -37597 -30880 -32301 -40619 -38979 -32382 -33736 -32608 -37309
7623 -37309 -39333 -40582 -26364 -30369 -39169 -39741 -36306 -24072 -28961 -34964 -37380 -36711 -27059 -31547 -27956
7608b7956o272L526p372P045l893l471J0745q143l22k334M227m355P889m051Q535
7593b6202M35L387p328j839j080m805K071J0787j2585M588N342o092o669J3127
7579b6863o073J765J822k086P374P99j741m851J256N676M366j028q618O56L760
7564b3786J31K718l174J1856j6126N53O944p803Q135o56j459k925P093j350M314
7549a5535K10r15m513J0178j0164j454J0754j032q141M614J4625j1215N854L106
7535c628q607M610O164q374J4524m179O02R27j127K840N54m283P984M471r679
7520B799P548R587q443k311N668Q291j864J0074r623L866O461j560P371J5579
7506E3443l940J390l678J3526m680J2882R058K7619J0891K9901M5735M6009M4733
$$ plain form
7608 -27956 -34228 -30702 -38074 -31029 -34922 -38393 -27648 -35791 -36113 -38447 -34220 -38575 -30686 -34737 -26202
7593 -26202 -25767 -22380 -29708 -31547 -32627 -37432 -35361 -24574 -37159 -32571 -27229 -33321 -39990 -26863
7579 -26863 -32936 -31171 -29349 -31435 -24061 -23262 -25003 -29854 -28598 -22922 -18556 -19584 -28202 -27546 -23786
7564 -23786 -23655 -20937 -24111 -12255 -28381 -27828 -20884 -28687 -20552 -21208 -22667 -25592 -18499 -19849 -15535
7549 -15535 -15325 -16240 -20753 -10575 -20739 -22193 -11439 -12471 -20612 -15998 -1373 -12588 -6734 -3628
7535 -3628 -12235 -7625 -1461 -9835 4689 510 1112 2039 912 3752 4306 23 8007 12478 2799
7520 2799 10347 19934 11491 9180 14848 23139 21275 31349 21726 25592 32053 30493 37864 53443
7506 53443 49503 50893 47215 60741 56061 68943 78001 105620 116511 146412 192147 238156 282889
7493B82889M8767P0608J14461J52897J38633J66134K13641J78530J42683J27255
7483A636498J07913J16024P0919M9972L3655L0905l993n5562j04583j34374j77402
7472A569972k53819k19692j49676j51129j12761j01857q9647p6973o0843o5305
7462B88270n4208o0650l6771j8124k7710j1016j9326j862j7215j273l785j1097
7450B5233q879R466L256j2229j2184k003R406J857q861k859J3930j2219j2091
7437h177J3286j1489j277O339m651M85n03n510R74L747l607n467L771M860j3748
7422b0967M341O778O258k987k481N911j4581K498M527M897j3024Q628L045k09
7408g366n5L438o855J974O668j2500P024O78r474J2030p531O585P126j2887R288
$$ plain form
7493 282889 331656 402264 516725 669622 808255 974389 1188030 1366560 1509243 1636498
7483 1636498 1744411 1860435 1931354 1981326 2014981 2045886 2041893 1986331 1881748 1747374 1569972
7472 1569972 1316153 1096461 946785 795656 682895 581038 491391 414418 353575 288270
7462 288270 234062 173412 136641 118517 90807 79791 60465 58603 41388 40115 36330 25233
7450 25233 16354 25820 29076 16847 4663 2660 12066 13923 5062 2203 16133 3914 -8177
7437 -8177 5109 -6380 -7657 -1318 -5969 -5484 -5987 -11497 -10523 -6776 -10383 -15850 -12079 -7219 -20967
7422 -20967 -16626 -9848 -3590 -6577 -9058 -3147 -17728 -15230 -10703 -5806 -18830 -10202 -7157 -7366
7408 -7366 -7421 -3983 -10838 -8864 -2196 -14696 -7672 -6994 -16468 -4438 -11969 -5384 1742 -11145 -1857
7393a857j6337J1196m345N61J1205l930N220n639o908P771l097N611p40K753K722
7378D186m32k460k045N442n226P341m771N741N861o855J451J1088o406L139l815
7363A2239O967n688L046n11M197j59J363l574p014P350Q099l580P45n713k915
7348A4852J1636J861J443o404J1746P788n594m513K865J0760p461J5546q839J4208
7334E9894q810N967j1034P866O786j776m107q72R040K37O9N570j376J918J1717
7319H1089l766q730J6398o627M481J671n473J3880r24p52J291J0848m725M935
7305A03596O208L453Q135J1162J0236k779l362J1996j346J9042j2484P90J6011
7292A70658l389K395Q074k188J5691P541m123P437J1721m845J3772j160J1694
$$ plain form
7393 -1857 -18194 -6998 -11343 -10782 423 -3507 1713 -3926 -10834 -3063 -6160 -549 -1289 1464 4186
7378 4186 3754 1294 -751 4691 -535 6806 2035 7776 13637 6782 8233 19321 12915 16054 12239
7363 12239 19206 13518 16564 16053 20250 20091 21454 17880 10866 18216 26315 22735 23480 17767 14852
7348 14852 26488 28349 29792 23388 35134 42922 37328 32815 35680 46440 38979 54525 45686 59894
7334 59894 51084 57051 46017 53883 60669 58893 54786 53914 62954 63191 63260 68830 67454 69372 81089
7319 81089 77323 68593 84991 78364 82845 84516 79043 92923 91999 91247 92538 103386 98661 103596
7305 103596 109804 113257 121392 132554 142790 140011 136649 148645 147299 166341 153857 154647 170658
7292 170658 167269 169664 177738 175550 191241 198782 194659 202096 213817 208972 222744 221584 233278
7279B33278k839L440K521J0554o51N757n137J8519L190p7J2724Q438K600J9918
7265C12235R011J2819J296K9166J1735J4596J8295J2626L4594J4465N0811K1465
7253E43114L8017K9067J8452K6603J0875J5570R62R021k916K112j8631k529k5251
7240F44466k7061l2986l5704k6160k5652j8891j834j4115k416J2210O457j502
7228D76812J0907J4908J1911Q891K2569P885k824J8631J9560j185k88J3201n060
7215E95918J4677n85J3106J4315J1277J6600J5341J9980K6689J6208K3242L0194
7203G96962K1517r950L8259K7185K2459K5209L3050J7946K4367J1913L2466L0301
7191A071684K1405L3731J3537K7061L4046L3601K9171K1524K9980L3658K5737
$$ plain form
7279 233278 230439 233879 236400 246954 246303 252060 246923 265442 268632 268555 281279 289717 292317 312235
7265 312235 321246 334065 335361 364527 376262 390858 409153 421779 456373 470838 521649 543114
7253 543114 581131 610198 628650 655253 666128 681698 682660 691681 688765 690877 672246 669717 644466
7240 644466 617405 584419 548715 522555 496903 478012 476178 462063 459647 471857 478314 476812
7228 476812 487719 502627 514538 523429 545998 553883 551059 569690 589250 588065 587777 600978 595918
7215 595918 610595 610010 623116 637431 648708 665308 680649 700629 727318 743526 766768 796962
7203 796962 818479 808529 846788 873973 896432 921641 954691 972637 997004 1008917 1041383 1071684
7191 1071684 1093089 1126820 1140357 1167418 1201464 1235065 1264236 1285760 1315740 1349398 1375135
7180A375135K2474K3854K1913L0598K3870J9985K2207L2639K4988L8692K3730
7169A660085M1895M3511L9208M4016M9171M6822N1260N2996M9895N1959N6433
7158B187251N5082O1253O6288N3630O8079O2764P0859P4981O7285P2933P3109
7147B913514Q9022Q5164R1948P7977Q8535R4327Q5970Q1255R9546R1246J00754
7136C899258R6446J10155J02261J07883J17741J23055J34459J43222J47085J45873
7126E127438J35843J49096J54902J60625J77878J63828J76507J76562J80469J78832
7116F781980J97630J95606K12106K37885K54267K56647K62449K85195K95547L06423
7106I285735L34110L48280L58053L89964L99590M07530M31618M24372M66617N03002
$$ plain form
7180 1375135 1397609 1421463 1443376 1473974 1497844 1517829 1540036 1572675 1597663 1636355 1660085
7169 1660085 1701980 1745491 1784699 1828715 1877886 1924708 1975968 2028964 2078859 2130818 2187251
7158 2187251 2242333 2303586 2369874 2423504 2491583 2554347 2625206 2700187 2767472 2840405 2913514
7147 2913514 3002536 3087700 3179648 3257625 3346160 3440487 3526457 3607712 3707258 3798504 3899258
7136 3899258 3995704 4105859 4208120 4316003 4433744 4556799 4691258 4834480 4981565 5127438
7126 5127438 5263281 5412377 5567279 5727904 5905782 6069610 6246117 6422679 6603148 6781980
7116 6781980 6979610 7175216 7387322 7625207 7879474 8136121 8398570 8683765 8979312 9285735
7106 9285735 9619845 9968125 10326178 10716142 11115732 11523262 11954880 12379252 12845869 13348871
7096A3348871N40813N94192O57701P11034P90822R06978J053706J328765J833585
7087B1766467K507084L430774N171861O983788P274274Q542421R343069J0779773
7079G5799511K1343750K8345227K5142281L1148188L7249506L2625077K5438349
7072B77091889K3411052J9472467K0327241J6244183Q274277O382698L899863
7065C75103670M72558r744147j8732110k4941577l4011888m4479429l8980277
7058B04686800k9544918k5924156k1188231j7767736j5275595j3273684j1563187
7051G0149293j0505503r686910r731878o640412m724104l647162k829523k228378
7043B0155423j799475j479076j247926j042565r20189p82626p12049o65836n69904
$$ plain form
7096 13348871 13889684 14483876 15141577 15852611 16643433 17550411 18604117 19932882 21766467
7087 21766467 24273551 27704325 32876186 39859974 47134248 55676669 65019738 75799511
7079 75799511 97143261 125488488 150630769 181778957 219028463 251653540 277091889
7072 277091889 300502941 319975408 340302649 356546832 364821109 371203807 375103670
7065 375103670 375576228 365832081 347099971 322158394 288146506 243667077 204686800
7058 204686800 175141882 149217726 128029495 110261759 94986164 81712480 70149293
7051 70149293 59643790 49956880 40225002 33584590 28860486 25213324 22383801 20155423
7043 20155423 18355948 16876872 15628946 14586381 13666192 12883566 12171517 11505681 10935777
7034A0935777n34385m94017m70843m41912l93449l78431l62950l35503l08521
7025G215766l19215k83361k69316k53872k35309k22622k27484k17581k24179k17231
7015D745596j91601j79483j72604j39312j36368j23698j21306j20671j16844j14326
7005C329383q9527r7718q1456q5119o6680q2442n9755n8764n2152o6092n2944
6994B536734n4281n7224n5326n6818m8849o6046m8576n5562m9826m3306n1249
6983A949671n3380m5703l7962k5957k3587l4543k1715l6537n377l5057k4077k1751
6971A584025k9329k2806l4665r778l5376l2313k6355l6849k9915l7815l0979k6331
6959A231514k2067l3432j6900k4251l8583j695l3980j8187k5079j0935k0350j9810
$$ plain form
7034 10935777 10401392 9907375 9436532 8994620 8601171 8222740 7859790 7524287 7215766
7025 7215766 6896551 6613190 6343874 6090002 5854693 5632071 5404587 5187006 4962827 4745596
7015 4745596 4553995 4374512 4201908 4062596 3926228 3802530 3681224 3560553 3443709 3329383
7005 3329383 3239856 3142138 3060682 2975563 2908883 2826441 2766686 2707922 2655770 2589678 2536734
6994 2536734 2482453 2425229 2369903 2313085 2264236 2198190 2149614 2094052 2044226 2000920 1949671
6983 1949671 1896291 1850588 1812626 1786669 1763082 1728539 1706824 1670287 1664910 1629853 1605776 1584025
6971 1584025 1554696 1531890 1497225 1487447 1452071 1419758 1393403 1356554 1326639 1288824 1257845 1231514
6959 1231514 1209447 1176015 1159115 1134864 1096281 1094586 1060606 1042419 1017340 1006405 986055 966245
6947I66245k6075r476j4222k0791p123o301j1100r111j2678j0537m195o068m72
6934H28096j3767j2270M832o522k1392r524l515j9147J748j3081j7475l912o768
6921G07303j8675j1993l324j6871k8021j936r508o821j3815j4061j1086m639k780
6908E63773o217j7522N065r594j2314j0456n393k6763k1677k7281l2782m0738
6896C58101l2551l4164l6708l0503m6697k6948k8822k8608k8093k0783j3099O10
6884C1735P694Q449L0249J5109J2705K3899J0147J6463N606J0253R714K023J3359
6871A97405O400K010k019K080l86o395J80J2937j3319k368n478M42p717L536j998
6856A85310j3223M056q88o307q62R03l249K570j1294k788r271P078Mj7233q658
$$ plain form
6947 966245 940170 930694 916472 895681 888558 882257 871157 862046 849368 838831 834636 828568 828096
6934 828096 814329 802059 806891 800369 778977 769453 765938 746791 748539 735458 717983 714071 707303
6921 707303 688628 676635 673311 656440 628419 626483 616975 610154 596339 582278 571192 566553 563773
6908 563773 557556 540034 545099 535505 523191 512735 507342 480579 458902 431621 398839 358101
6896 358101 325550 291386 254678 224175 177478 150530 121708 93100 65007 44224 31125 31735
6884 31735 39429 47878 78127 93236 105941 129840 139987 156450 162056 172309 182023 184046 197405
6871 197405 203805 205815 203796 205876 205490 199095 199275 212212 198893 196525 191047 191489 183772 187308 185310
6856 185310 172087 176143 175255 168948 168086 168989 165740 168310 157016 154228 144957 152035 152039 134806 126148
6841A26148J19r221M052L398o950Q29J155j0776J41M83L47m21n18n014l816J948
6825A01904M082m211M785p225L366k009p90q06J322m704L795n113J426J185k355
6810I4652j0700N94j253J7271k6747o192R378m693q538k215N804J830n192n705
6796E8294K036K432j457r53K198J590J882j3276J3206K854j0058p858J6890J474
6782F9254o742j74J571l740M010k305j6727J5219r101m834O029J573r308n30K399
6767D6594K280o961l46J796o848M85R977N79j269p312J685K900o293M530j125
6752D0672n150N387k290M763q551R114k580J739q991N306m606k690O829J156j46
6737C9962l574L388M704j663K440l922m573M28L763j1266J8331p915j0659Q692
$$ plain form
6841 126148 126267 117046 121098 124496 117546 118375 119530 108754 108895 109378 109725 109304 108786 103772 99956 101904
6825 101904 105986 101775 106560 99335 102701 100692 99902 99096 100418 95714 99509 94396 95822 97007 94652
6810 94652 83952 84546 83293 100564 73817 67625 77003 72310 63772 61557 67361 69191 63999 58294
6796 58294 60330 62762 61305 60352 62550 64140 66022 52746 65952 68806 58748 50890 67780 69254
6782 69254 62512 62338 63909 60169 64179 61874 45147 60366 51265 46431 52460 54033 44725 44195 46594
6767 46594 48874 41913 41567 43363 36515 37000 46977 47556 46287 38975 40660 43560 37267 41797 40672
6752 40672 35522 40909 38619 43382 34831 43945 41365 43104 34113 39419 34813 32123 38952 40108 39962
6737 39962 36388 39776 44480 42817 45257 41335 36762 37190 40953 29687 48018 40103 29444 38136
6723C8136J238M059k234O886r026r76N947n941N36P617k842k318K346j729L659
6708D5358Q560j5932J1225N93j032J132K223K062L816J314l563k649k115J712
6694E2704M553O600O658p581R76J5542n160M539Q300l241o069J0858J227J080
6680I0986J4611l240K666j693K709R029Q70R286Q903O937R042L7948L0113L8568
6666B56735M1280N1904N9452J02061J56572J44809J60267K07925J75315J36539
6656A492859J26503J13236J01394J06917M1768L9899J9668J3294m6652r9224j26043
6645A783619j66342k45919k16139j62193j56287j09825r8404q9664o9919p7442
6635C91485n7725n0410n8484l7747k7963k3505j5361j8985k842j5676K372j5281
$$ plain form
6723 38136 39374 43433 41199 48085 39059 38083 44030 38089 38625 46242 43400 41082 43428 41699 45358
6708 45358 53918 37986 49211 49804 48772 49904 52127 54189 58005 59319 55756 53107 50992 52704
6694 52704 57257 63857 70515 62934 63910 79452 74292 78831 87131 83890 77821 88679 89906 90986
6680 90986 105597 102357 105023 103330 106039 115068 115938 125224 134127 141064 150106 188054 218167 256735
6666 256735 298015 349919 409371 511432 668004 812813 973080 1181005 1356320 1492859
6656 1492859 1619362 1732598 1833992 1940909 1982677 2022576 2042244 2055538 2008886 1909662 1783619
6645 1783619 1617277 1371358 1155219 993026 836739 726914 628510 538846 468927 391485
6635 391485 333760 283350 224866 187119 159156 135651 120290 101305 98463 82787 85159 69878
6623F9878q455Q611r692n740m402K979n737j168J942j3781L508k28j0864P998
6609C4849n526l192J484R38p347M654j279k791J302q949N617j1561J0817j2152
6595F864M738k998M980j0368k799J0299L916q986O925k189k756L53m30p741O586
6580F394m677M706K464j3377Q932k48j61r172m469l686J0631R090p552m226l448
6565h799j981J2836n452N381r341O19n897k8Q504Q960j1505Q96J250o510J0473
6550e94N779r783J166qJ031O820p109n629K793k036q78N060o78j153k759k985
6534a0963J0501q263m072J0359q491j000M400J948J180j0102R123q830l81K234
6520a2357M755m628j608J278j153m1o779J3942o324Q91J676m28l968K698M804
$$ plain form
6623 69878 61423 70034 60342 54602 50200 53179 47442 46274 48216 34435 37943 37715 26851 34849
6609 34849 29323 26131 27615 28553 21206 25860 24581 21790 23092 14143 19760 8199 19016 6864
6595 6864 11602 8604 13584 3216 417 10716 14632 5646 12571 10382 7626 7979 7549 -192 6394
6580 6394 1717 6423 8887 -4490 4442 4194 4033 -5139 -9608 -13294 -2663 6427 -1125 -5351 -8799
6565 -8799 -10780 2056 -3396 1985 -7356 -6737 -12634 -12662 -4158 4802 -6703 -5807 -4557 -11067 -594
6550 -594 5185 -4598 -3432 -3440 -2409 4411 -2698 -8327 -5534 -7570 -8448 -3388 -4066 -5219 -7978 -10963
6534 -10963 -462 -8725 -12797 -2438 -10929 -11929 -7529 -5581 -4401 -14503 -5380 -14210 -14591 -12357
6520 -12357 -7602 -12230 -13838 -12560 -13713 -13754 -20533 -6591 -12915 -12024 -10348 -10776 -14744 -12046 -7242
6505g242J133J738j0252R398j1644P007l043M531n243K40P64K307o676j533J570
6490a6945Q945o253o330P877K699Q80j5366N186k318l319J2203j219M34o441J4703
6475e264j2197L489n19j254p32j50m575J415L682K190K912o559m60K693k011p329
6459b4669J0496J903j3619M018R049k823j910q324Q413J928J835o655J053M68
6445a8837j657K118l568J2392l088r654J769P88j808P80M037o200J325P481r032
6430b3154L048n253P631l890J871J071O211J471j3089P872n398K564L107o21r197
6415b5756o571K301R613J0065n729j35p679J4475j6082P898k046K051o177J0112
6401a3660r506l153M759l425j827L805L344o35k715M741j837l176J079J165J359
$$ plain form
6505 -7242 -6109 -4371 -14623 -5225 -16869 -9862 -12905 -8374 -13617 -13377 -12613 -10306 -16982 -18515 -16945
6490 -16945 -8000 -14253 -20583 -12706 -10007 -9127 -24493 -19307 -21625 -24944 -12741 -13960 -13526 -19967 -5264
6475 -5264 -17461 -13972 -14491 -15745 -16477 -16627 -21202 -19787 -16105 -13915 -11003 -17562 -18022 -15329 -17340 -24669
6459 -24669 -14173 -12270 -25889 -21871 -12822 -15645 -17555 -25879 -17466 -15538 -13703 -20358 -19305 -18837
6445 -18837 -20494 -18376 -21944 -9552 -12640 -22294 -20525 -19737 -21545 -20765 -16728 -22928 -21603 -14122 -23154
6430 -23154 -20106 -25359 -17728 -21618 -19747 -18676 -12465 -10994 -24083 -16211 -21609 -19045 -15938 -16559 -25756
6415 -25756 -32327 -30026 -20413 -10348 -16077 -16212 -23891 -9416 -25498 -17600 -19646 -17595 -23772 -13660
6401 -13660 -23166 -26319 -21560 -24985 -26812 -23007 -19663 -20298 -23013 -18272 -20109 -23285 -22206 -21041 -19682
6386a9682l706L694l550M555j0220K61Q870O698j1361k046M618k69P627p509l983
6371b6003Q391n292N477J713j1917M547k683j1507J4949M750R61m226O038o870
6357b1672l85r256R569L537p042P365p089q299Q623n314R124j109l946J111N622
6342a9161O054j9751K943L898o549J5328k998o664L041l172M887M517L10j1993
6328b9310N823j4001P372P364m752K161O063n932J05M281p36p968K690m76j881
6313b9197k251N545q0K695j986N362k435J30q030O139j277m289J626N651p049
6298b9446J1487r505O563p497N810m420k198L561K485p305l068M144K001m990
6284c2378O162n548N181M206j779J738k871M281Q61j964l49J578m403M412j945
$$ plain form
6386 -19682 -23388 -19694 -23244 -18689 -28909 -28648 -19778 -13080 -24441 -26487 -21869 -22138 -14511 -22020 -26003
6371 -26003 -17612 -22904 -17427 -15714 -27631 -23084 -25767 -37274 -22325 -17575 -16614 -20840 -14802 -21672
6357 -21672 -22057 -31313 -21744 -18207 -25249 -17884 -24973 -33272 -24649 -29963 -20839 -21948 -25894 -24783 -19161
6342 -19161 -13107 -32858 -29915 -26017 -32566 -17238 -20236 -26900 -23859 -27031 -22144 -17627 -17317 -29310
6328 -29310 -23487 -37488 -30116 -22752 -27504 -25343 -19280 -25212 -25107 -20826 -21562 -29530 -26840 -27316 -29197
6313 -29197 -31448 -25903 -25983 -23288 -25274 -19912 -22347 -22217 -30247 -24108 -25385 -29674 -28048 -22397 -29446
6298 -29446 -17959 -27464 -20901 -28398 -22588 -27008 -29206 -25645 -23160 -30465 -33533 -29389 -27388 -32378
6284 -32378 -26216 -31764 -26583 -22377 -24156 -22418 -25289 -21008 -20147 -22111 -22460 -20882 -25285 -20873 -22818
6269b2818L068J244n814r948R618L213n09j411k278M711m384K531J399m411R705
6254a6084j2376N233k857J430j814p639N646R048p972M058r430M917L888J786
6240b2166n98L524o711j865k838O180M794m419k14J439m651Q584n941K066o410
6225b9226k053R685j380R74j2100l20J2109j4409R710K689K539l234p565j538
6211c4119O793K160n319j095R800j1475Q550l885L889M284j0532k4Q614j2201
6197c4560O620k44L026j695q98J030j226k110K341N9J441N263j0238N720o766
6182c2237P303l337Q09p182Q435Q00q293p772O865J6588p130j336o130J1054m874
6167b6437k076m977R962r699O424j4348J0245Q820j1802K418j612j986N809J043
$$ plain form
6269 -22818 -19750 -18506 -24320 -34268 -24650 -21437 -21946 -23357 -25635 -20924 -25308 -22777 -21378 -25789 -16084
6254 -16084 -28460 -23227 -26084 -24654 -26468 -34107 -28461 -19413 -27385 -23327 -32757 -27840 -23952 -22166
6240 -22166 -22764 -19240 -25951 -27816 -30654 -24474 -19680 -24099 -24313 -22874 -27525 -18941 -24882 -22816 -29226
6225 -29226 -31279 -21594 -22974 -22000 -34100 -34420 -22311 -36720 -27010 -24321 -21782 -25016 -32581 -34119
6211 -34119 -27326 -25166 -30485 -31580 -21780 -33255 -24705 -28590 -24701 -20417 -30949 -30973 -22359 -34560
6197 -34560 -27940 -28184 -25158 -26853 -27751 -26721 -27947 -30057 -27716 -27657 -26216 -20953 -31191 -25471 -32237
6182 -32237 -24934 -28271 -27462 -34644 -26209 -25409 -33702 -41474 -34609 -18021 -25151 -26487 -32617 -21563 -26437
6167 -26437 -28513 -33490 -23528 -33227 -26803 -41151 -30906 -22086 -33888 -31470 -33082 -35068 -29259 -28216
6153b8216j236L50L7K798m372k01Q08m125N341J704k274l433O950j414L047M994
6137a9242o963J2222j4776J494N90l392R929j4262M066M131l589o145P096P130
6123b1711j0570N120m458N552m55J017q60l155L173J02l582p170N263K217q167
6108c7684K065P250J684n165n693J2201n558m240N773K209K861l03p40m790k880
6093c3010p990J1238j471N849p703o150M723L66N049n057J410K828j0340J262
6079c8996N364o499N172M506o854L845j48Q412l174m660M572o983L587q368R547
6064c0677l516J5739j6449J0527j957l296o04r721J0275L970k573p976J2995k598
6050b5861J817m46p521K084L037o96n65p86Q419j5949P955l372M554j420M412
$$ plain form
6153 -28216 -29452 -29102 -29065 -26267 -30639 -30840 -30032 -34157 -28816 -27112 -29386 -32819 -25869 -27283 -24236 -19242
6137 -19242 -26205 -13983 -28759 -27265 -26675 -30067 -20138 -34400 -30334 -26203 -29792 -35937 -28841 -21711
6123 -21711 -32281 -27161 -31619 -26067 -26522 -25505 -26365 -29520 -26347 -26245 -29827 -36997 -31734 -29517 -37684
6108 -37684 -35619 -28369 -26685 -31850 -37543 -25342 -30900 -35140 -29367 -27158 -24297 -24600 -25340 -30130 -33010
6093 -33010 -41000 -29762 -31233 -25384 -33087 -39237 -34514 -34148 -29099 -34156 -32746 -29918 -40258 -38996
6079 -38996 -33632 -40131 -34959 -30453 -37307 -33462 -33610 -25198 -28372 -33032 -28460 -35443 -31856 -40224 -30677
6064 -30677 -34193 -18454 -34903 -24376 -26333 -29629 -30233 -39954 -29679 -25709 -28282 -36258 -23263 -25861
6050 -25861 -24044 -24490 -32011 -29927 -26890 -27586 -28151 -28937 -20518 -36467 -28512 -31884 -27330 -28750 -24338
6035b4338K127o690J0426p756n304R300j714n310l202K285j155M738J478l542
6021b8657r26M731j473J074k855k12N812r630K771M55o521Q655l471M852l821
6006b9216K756m679L683n314L596K574k760M924m300q388J5312n454N0p620N551
5991b9285j87J701Q901j5269N449P749m307r146L357p60L808N0p436J0589q214
5976c3000M722j572R85J882L256p426J224l925M372j507N729m114m013Q752m533
5961b9168n72j191m323N811L797j0213J3838n721m043P048j5146M871J468l925
5947c7469P516l47N174j442k653l028K989J810j263L139m650m339j731J986J524
5932c2784N920j433P44l842j2152J0889J738O95l791j354M825k119J0331l276
$$ plain form
6035 -24338 -22211 -28901 -18475 -26231 -31535 -22235 -23949 -29259 -32461 -30176 -31331 -26593 -25115 -28657
6021 -28657 -29583 -24852 -26325 -25251 -28106 -28318 -22506 -32136 -29365 -28910 -35431 -26776 -30247 -25395 -29216
6006 -29216 -26460 -31139 -27456 -32770 -29174 -26600 -29360 -24436 -28736 -37124 -21812 -27266 -27216 -34836 -29285
5991 -29285 -29472 -27771 -18870 -34139 -28690 -20941 -25248 -34394 -31037 -31797 -27989 -27939 -35375 -24786 -33000
5976 -33000 -28278 -29850 -28865 -26983 -23727 -31153 -29929 -33854 -29482 -30989 -25260 -29374 -33387 -24635 -29168
5961 -29168 -29740 -30931 -35254 -29443 -25646 -35859 -22021 -27742 -31785 -24737 -39883 -35012 -33544 -37469
5947 -37469 -29953 -30300 -25126 -26568 -29221 -32249 -29260 -27450 -28713 -25574 -30224 -34563 -36294 -34308 -32784
5932 -32784 -26864 -28297 -27553 -31395 -43547 -32658 -30920 -30225 -34016 -35370 -30545 -32664 -22333 -25609
5918b5609L694m032j401N708o398k167K325n601N616j811l537L230L558n562p453
5903c9440J3100n840M507j547m450M971o805J4800o641n735M063m688M352j049
5889c0402j19j037l740l292J0799M010J431j0085M95o782J430J1395P068n939
5875b4768j3439J3786j0806J2235l32j970k318J862r609N931M062p717j625P105
5861b7603L427j184j5594J1973J067K336j830r676Q064m10p547R217j110N92j0120
5846c8398P803n913R437j043n224N214K297j6221J3808K880p939P158m993k632
5832c3766K493K160l583J888O308l312o437J918K574o91k440j660O894j1062n363
5817d4079O586L86J112K251M450J242l881k384k449K780l860P965m305m716L003
$$ plain form
5918 -25609 -21915 -25947 -27348 -21640 -28038 -30205 -27880 -33481 -27865 -29676 -33213 -29983 -26425 -31987 -39440
5903 -39440 -26340 -32180 -27673 -29220 -33670 -28699 -35504 -20704 -27345 -33080 -29017 -33705 -29353 -30402
5889 -30402 -30521 -31558 -35298 -38590 -27791 -23781 -22350 -32435 -31940 -38722 -37292 -25897 -18829 -24768
5875 -24768 -38207 -24421 -35227 -22992 -23324 -25294 -27612 -25750 -35359 -29428 -25366 -33083 -34708 -27603
5861 -27603 -24176 -25360 -40954 -28981 -27914 -25578 -27408 -37084 -29020 -29430 -36977 -27760 -28870 -28278 -38398
5846 -38398 -30595 -36508 -27071 -28114 -33338 -28124 -25827 -42048 -28240 -25360 -33299 -26141 -31134 -33766
5832 -33766 -31273 -29113 -32696 -30808 -24500 -27812 -34249 -32331 -29757 -30448 -32888 -34548 -27654 -38716 -44079
5817 -44079 -37493 -37107 -35995 -33744 -29294 -28052 -31933 -34317 -36766 -33986 -37846 -29881 -34186 -38902 -35899
5802c5899K641k459J29J188J0493J278j5927N875L915k24P06p168Q679p698j887
5787c6358P868P92l710n254J479N896o699K587J3762j4806M78J815L310K534m202
5772c0508j569n10L227P382n197n104j168P385o940K445q494J0836j1876N229
5758c4862k581K587l514K911q71j869J0340o698o00R283k163m867p878J0883m279
5743c4178N19J542m49K788k33j601q768K511L935M40L3L355m375M328R13J240
5727b8000k726m997k42K186M156j365q23M414j2214N040K381r951J0253n242K
5712c7128L089R31j191P228j336k839k437Q059m607m063J631J664n989J653L423
5697c1912j0799J0853o435O162L436r494K782l110J599j148Q570q112R620k587
$$ plain form
5802 -35899 -33258 -35717 -35588 -34400 -23907 -22629 -38556 -32681 -28766 -28990 -28284 -35452 -26773 -34471 -36358
5787 -36358 -28490 -27698 -31408 -36662 -35183 -29287 -35986 -33399 -19637 -34443 -33965 -32150 -28840 -26306 -30508
5772 -30508 -32077 -32587 -29360 -21978 -27175 -32279 -33447 -26062 -33002 -30557 -39051 -28215 -40091 -34862
5758 -34862 -37443 -34856 -38370 -35459 -36330 -38199 -27859 -34557 -35157 -25874 -28037 -32904 -40782 -29899 -34178
5743 -34178 -33659 -32117 -32566 -29778 -30011 -31612 -40380 -37869 -33934 -33494 -33461 -30106 -34481 -30153 -29240 -28000
5727 -28000 -30726 -35723 -35965 -33779 -29623 -30988 -31811 -27397 -39611 -34571 -32190 -42141 -31888 -37130 -37128
5712 -37128 -34039 -33108 -34299 -27071 -28407 -31246 -33683 -25624 -30231 -34294 -32663 -30999 -36988 -35335 -31912
5697 -31912 -42711 -31858 -38293 -32131 -28695 -38189 -35407 -38517 -36918 -38066 -29496 -37608 -27988 -30575
5683c0575l878k951O912j550N46j394q83M128k951l218n714P527M433j964p9j753
5667c3364k730R50k106J3984p234P50m829n56O28j894K015K09N205j573K32J630
5651b8683l347J249l758J815k473J730r482N909K285L554p950P732K20Q49l201
5636c3551K542K508p270M594n585k645L857P535q775M108M593k688l477L408J004
5621b9842j771P62P418j3552k264N692J1531n184k549j0876M280m868K017J1667
5607b7539n928J071j79j665j749N885o364l501P162l994J019n414P123M914l031
5592c2190n111R759j648l490K527l103R13p73L675M010j3430J890J29N306j485
5577c3021j841l966L159O972j241k575m440Q276r561R305n49K062o276L804q247
$$ plain form
5683 -30575 -34453 -37404 -30492 -32042 -31496 -32890 -33773 -29645 -32596 -35814 -41528 -34001 -29568 -31532 -31611 -33364
5667 -33364 -36094 -35144 -37250 -23266 -30500 -29750 -34579 -35135 -34507 -36401 -34386 -34177 -28972 -30545 -30313 -28683
5651 -28683 -32030 -30781 -34539 -32724 -35197 -33467 -42949 -37040 -34755 -31201 -39151 -31419 -31199 -30350 -33551
5636 -33551 -31009 -28501 -35771 -31177 -36762 -39407 -35550 -28015 -36790 -32682 -28089 -30777 -34254 -30846 -29842
5621 -29842 -31613 -30851 -23433 -36985 -39249 -33557 -22026 -27210 -29759 -40635 -36355 -41223 -39206 -27539
5607 -27539 -33467 -32396 -32575 -34240 -35989 -30104 -36468 -39969 -32807 -36801 -35782 -41196 -34073 -29159 -32190
5592 -32190 -37301 -27542 -29190 -32680 -30153 -33256 -32343 -33116 -29441 -25431 -38861 -36971 -36842 -31536 -33021
5577 -33021 -34862 -38828 -35669 -28697 -29938 -32513 -36953 -28677 -38238 -28933 -29482 -27420 -33696 -29892 -38139
5562c8139j091K612L64Q010j1870P447O59K485o663P9O185m286O705q932P239
5547b9196R43J59l980K220r631J0601k087M86l437K011l979Q24L664q355P581
5532c2176p831J1544l681M539J32Q9N428p678J935K931J398n615O327J795p738
5517b8601P200J0334m543j452o299O931m073r913L365m789L32N525o633M898k602
5502c0320l348L466j418K046J018O672j94l965o590O416n770o093P892q67N78
5487c0477o08m934L626K675j743k292q56Q540p87q904O720M166n030j317J024
5472c0197p260Q999K993j2080P510L531K517j1161M356n21k257K345L021q253
5458c6457O137j0981N62J2422j70p104M552l426O693Q413j6664O191K50k11j0747
$$ plain form
5562 -38139 -39230 -36618 -36254 -28244 -40114 -32667 -32008 -29523 -36186 -36107 -29922 -34208 -27503 -36435 -29196
5547 -29196 -28253 -28094 -32074 -29854 -39485 -28884 -30971 -30485 -33922 -31911 -35890 -35066 -31402 -39757 -32176
5532 -32176 -40007 -28463 -32144 -27605 -27473 -27384 -21956 -29634 -27699 -24768 -23370 -28985 -22658 -20863 -28601
5517 -28601 -21401 -11067 -15610 -17062 -23361 -16430 -20503 -30416 -27051 -31840 -31508 -25983 -32616 -27718 -30320
5502 -30320 -33668 -30202 -31620 -29574 -28556 -21884 -22078 -26043 -32633 -26217 -31987 -38080 -30188 -31055 -30477
5487 -30477 -31085 -36019 -32393 -29718 -31461 -33753 -34609 -26069 -26856 -35760 -29040 -24874 -29904 -31221 -30197
5472 -30197 -37457 -28458 -25465 -37545 -30035 -26504 -23987 -35148 -30792 -31313 -33570 -31225 -28204 -36457
5458 -36457 -30320 -41301 -40739 -28317 -28487 -35591 -31039 -34465 -27772 -19359 -36023 -29832 -29582 -29793 -40540
5443d0540R294p078P915m843J2076q922m988K474L780k548K416L082K466M347
5429b1069r164n173K713k415Q617k888l049R778r655n819J0725O820j0234Q694
5415b2119l438N057M282p655J444L771L669p635q95O554n439N43M626p116j645
5400b5996l610O117l938o89l286l06N208l685q913J3864k436q002R073o519M748
5385b8370k874O468j2120K984m864N746N070o820R883j0350N26J62k44L037o356
5370c8122N701J0693j7447M364L092M860o504M805j566o170Q892r106N802o309
5356c7015N020L161n884l814K146J182m86R659n370k402Q253j2686Q49N66J824
5341c4997L994l004J393k921K58p749L903j489J346k880m618P614J085M886j735
$$ plain form
5443 -40540 -31246 -38324 -30409 -35252 -23176 -32098 -37086 -34612 -30832 -33380 -30964 -27882 -25416 -21069
5429 -21069 -30233 -35406 -32693 -35108 -26491 -29379 -32428 -22650 -32305 -38124 -27399 -20579 -30813 -22119
5415 -22119 -25557 -20500 -16218 -23873 -22429 -18658 -14989 -22624 -23519 -16965 -22404 -21861 -17235 -24351 -25996
5400 -25996 -29606 -23489 -27427 -28116 -31402 -31708 -26500 -30185 -39098 -25234 -27670 -35672 -26599 -33118 -28370
5385 -28370 -31244 -24776 -36896 -33912 -38776 -33030 -27960 -34780 -24897 -35247 -34721 -34559 -34803 -31766 -38122
5370 -38122 -32421 -21728 -39175 -34811 -31719 -26859 -33363 -28558 -30124 -36294 -27402 -36508 -30706 -37015
5356 -37015 -31995 -28834 -34718 -38532 -36386 -35204 -35690 -26031 -31401 -33803 -25550 -38236 -37387 -36821 -34997
5341 -34997 -31003 -34007 -32614 -35535 -35277 -43026 -39123 -40612 -39266 -42146 -46764 -39150 -38065 -33179 -34914
5326c4914N100j3235J8014k392r798J342N495q835O690o75J405j662o927J1659
5312b8733j0128K289l694O771K58K882j579l235J398K870k288K060m243k748L928
5297c4192j046m207j376J1181j392j997m221J0961o417P691o161n107N026q20
5283c2077K711q546L355J690o616l40J666L996K954q675K465N973K156k51m514
5268c4053o525J4647l786n857O333n134L666J282L514j5383J5263m479L046n522
5254c2988L224r467J2952k174l861l037N04P375O55L301r979J869k252q057N103
5239c6832K130J783M351n781k047j358N374m091N142l456O148k812l692l09j005
5224c6455Q099p076j009L847l803N091j3389R268k105M920N180j0106p61Q388
$$ plain form
5326 -34914 -29814 -43049 -25035 -27427 -37225 -35883 -30388 -39223 -32533 -33208 -31803 -33465 -40392 -28733
5312 -28733 -38861 -36572 -40266 -33495 -33237 -30355 -31934 -35169 -33771 -30901 -33189 -31129 -35372 -38120 -34192
5297 -34192 -35238 -39445 -40821 -29640 -31032 -33029 -37250 -26289 -32706 -25015 -31176 -36283 -31257 -32077
5283 -32077 -29366 -37912 -34557 -32867 -39483 -39823 -38157 -34161 -31207 -39882 -37417 -31444 -29288 -29539 -34053
5268 -34053 -40578 -25931 -29717 -35574 -29241 -34375 -30709 -29427 -25913 -41296 -26033 -30512 -27466 -32988
5254 -32988 -29764 -39231 -26279 -28453 -32314 -35351 -34847 -27472 -26817 -23516 -33495 -31626 -33878 -41935 -36832
5239 -36832 -34702 -32919 -28568 -34349 -36396 -37754 -32380 -36471 -31329 -34785 -28637 -31449 -35141 -35450 -36455
5224 -36455 -28356 -35432 -36441 -32594 -36397 -31306 -44695 -35427 -37532 -32612 -27432 -37538 -38299 -29911
5210b9911J44q13L086q35r898K343O659l657m615O20j108J0942n950N293p333
5195c5033R494q428L009l935J09k431K306O295k786m938o68r09N784Q58n13n583
5179c7369K852n464K771m961P023K921p456M297K939o648L391J545O14L554l801
5164c3792L094N27j1113K981N719o074P713k035N18r176r79O811j621k067O388
5149c3106J967k321m000J066L279M433j3639J886N51J0685q627m802P968N873
5135b8787j1654J4450j5827P774n903K493O86o97Q601j0400Q435n283m679Q968
5121c1823J062j0032M160n797J2837r881l18J092J2063j1765l76N431N848r457
5107c6956L092o879N115m977J3480j0005N66N609J870m210k171m53O336R1j3041
$$ plain form
5210 -29911 -29767 -30580 -27494 -28329 -38227 -35884 -29225 -32882 -37497 -36877 -37985 -27043 -32993 -27700 -35033
5195 -35033 -25539 -33967 -30958 -34893 -34784 -37215 -34909 -28614 -31400 -36338 -37006 -37915 -32131 -31273 -31786 -37369
5179 -37369 -34517 -39981 -37210 -42171 -35148 -32227 -39683 -35386 -32447 -39095 -35704 -34159 -33545 -29991 -33792
5164 -33792 -30698 -30171 -41284 -38303 -32584 -38658 -30945 -32980 -32462 -41638 -42617 -35806 -37427 -39494 -33106
5149 -33106 -31139 -33460 -37460 -36394 -33115 -28682 -42321 -40435 -39884 -29199 -37826 -42628 -34660 -28787
5135 -28787 -40441 -25991 -41818 -34044 -39947 -37454 -36768 -37465 -28864 -39264 -30829 -36112 -40791 -31823
5121 -31823 -30761 -40793 -36633 -42430 -29593 -39474 -39792 -38700 -26637 -38402 -38778 -33347 -27499 -36956
5107 -36956 -33864 -40743 -35628 -40605 -27125 -37130 -36564 -30955 -29085 -33295 -35466 -35919 -29583 -29492 -42533
5092d2533O733J741O128p660J458O286q444j142j686J2968k410o913P975j0623
5078c8122K816R54K714o208O569j73j438K311L884o60r117J350O490Q47p199j582
5062c6564m882J2747q041Q561n903m956L178l397J5271j3631j566o9L696L654
5048c1902K796p846j713L969Q64j512n798P178k675O168k015j346j865J558O675
5033b7464n850L226q693O381o466M847o321l630Q38P739j2948R962L978q619K011
5018d1009J190M425k376M012k14r691J4090j4259O610R313m205l108P50K240j2797
5003d5029J0455p308J4356o966K98n227k847M667J356k436Q0M646L9J355j998
4988c4559j285M215l240L757k513K551k280o625k606O353P200r375P807K568n013
$$ plain form
5092 -42533 -35800 -34059 -27931 -35591 -34133 -27847 -36291 -37433 -39119 -26151 -28561 -35474 -27499 -38122
5078 -38122 -35306 -34352 -31638 -37846 -31277 -31450 -32888 -30577 -26693 -27353 -36470 -35120 -28630 -27783 -34982 -36564
5062 -36564 -41446 -28699 -36740 -28179 -34082 -39038 -35860 -39257 -23986 -37617 -39183 -39252 -35556 -31902
5048 -31902 -29106 -36952 -38665 -34696 -33832 -35344 -41142 -33964 -36639 -30471 -32486 -33832 -35697 -34139 -27464
5033 -27464 -33314 -30088 -38781 -32400 -38866 -34019 -40340 -43970 -43132 -35393 -48341 -38379 -34401 -43020 -41009
5018 -41009 -39819 -35394 -37770 -33758 -33972 -43663 -29573 -43832 -37222 -27909 -32114 -35222 -34472 -32232 -45029
5003 -45029 -34574 -41882 -27526 -34492 -34194 -39421 -42268 -37601 -36245 -38681 -38601 -33955 -33916 -32561 -34559
4988 -34559 -35844 -31629 -34869 -31112 -33625 -31074 -33354 -39979 -42585 -36232 -29032 -38407 -30600 -28032 -33045
4973c3045R201k3944K0285n960L781p840N267o569Q129p919M504o936K915O73
4959c7458l504M813j242J08P303k100n822N080K355q789N053L694J120j192n722
4944c6303n33P175q162J0073j0832K65o765M562Q534n268N354n306M285O032k668
4929b9557q340J1929q944m063N652J3378o492n677L945r074M532k345j812L936
4915c2932M067R16p96l968L261k289n825p97j822Q721k757k568K111m061N873
4900c2866q537M302N43m261P737O304m388O440q175l15O019M20j0215N910Q608
4885b2474j0020p789K561J326l61J4j284Q008k594q296Q712l638j0346J3888q88
4870c3181N863r393P704j0761O009k028k162n805L095J431N798O17j211M505p034
$$ plain form
4973 -33045 -23844 -47788 -27503 -33463 -29682 -37522 -32255 -38824 -30695 -38614 -34110 -41046 -38131 -37458
4959 -37458 -40962 -36149 -37391 -37283 -29980 -32080 -37902 -32822 -30467 -39256 -34203 -30509 -29389 -30581 -36303
4944 -36303 -36836 -29661 -37823 -27750 -38582 -38317 -45082 -40520 -31986 -37254 -31900 -37206 -32921 -26889 -29557
4929 -29557 -37897 -25968 -34912 -38975 -33323 -19945 -26437 -32114 -28169 -37243 -32711 -35056 -36868 -32932
4915 -32932 -28865 -27949 -28745 -32713 -29452 -31741 -37566 -38363 -40185 -31464 -34221 -36789 -34678 -38739 -32866
4900 -32866 -41403 -37101 -36558 -40819 -33082 -26778 -31166 -24726 -32901 -33216 -27197 -26777 -36992 -31082 -22474
4885 -22474 -32494 -40283 -37722 -36396 -36757 -36743 -38027 -30019 -32613 -40909 -32197 -35835 -46181 -32293 -33181
4870 -33181 -27318 -36711 -29007 -39768 -33759 -35787 -37949 -43754 -40659 -39228 -33430 -32813 -34024 -29519 -36553
4855c6553l679J813M396L385l661O843m311L271n799k140J206N075o617q899P725
4840c7945J4451N14r067P667n541p852N42L931j989j871O865N167Qp459p51j446
4824c4776K862l90p639R074p30p423O755L54m629j025k68J1208r602j483j57L383
4808c4486m90J249m713L512J78L068n24p533N093m905R474j0551J0236k07L23
4793c0276n77N050j4627J3608m987L226n262l275L838K972q317r27N229l171R449
4778b8047j1344N284k150N739J788J70j3236R394o40l414J3807k1514k579J1570
4764c5172L538p063r51L665N63M16k128m65m602M084m312J2411n478K135K812
4749c0547o231j051L118m338q8R311k998o085K858j198N10n14j380L37j617K255
$$ plain form
4855 -36553 -40232 -38419 -34023 -30638 -34299 -27456 -31767 -28496 -34295 -36435 -35229 -30154 -36771 -45670 -37945
4840 -37945 -23494 -22980 -32047 -24380 -29921 -37773 -37231 -33300 -35289 -37160 -30295 -25128 -25120 -32579 -33330 -34776
4824 -34776 -31914 -32304 -39943 -30869 -31599 -39022 -32267 -31913 -36542 -37567 -37835 -26627 -36229 -37712 -37869 -34486
4808 -34486 -34976 -33727 -38440 -34928 -34750 -31682 -32206 -39739 -34646 -39551 -30077 -40628 -30392 -30599 -30276
4793 -30276 -30853 -25803 -40430 -26822 -31809 -28583 -33845 -37120 -33282 -30310 -38627 -39554 -34325 -37496 -28047
4778 -28047 -39391 -34107 -36257 -30518 -28730 -28560 -41796 -32402 -33042 -36456 -22649 -44163 -46742 -35172
4764 -35172 -31634 -38697 -39648 -35983 -35420 -35004 -37132 -37597 -42199 -38115 -42427 -30016 -35494 -33359 -30547
4749 -30547 -36778 -37829 -34711 -39049 -39137 -29826 -32824 -38909 -36051 -37249 -36739 -37253 -38633 -38296 -39913 -37658
4733c7658l99K306k910j306m578J1384j200J37M201q473L458n51L320K575n847
4718c5541O87n505j472O550K097q248K650K216j544q16o81K188M127l243O242
4703c0293m310J369L693j4002J349O408l768P319p361J1624q210m95K565l26J614
4688c2824L825j772q554l050r48J2056J807n095n617k905L099K151L110l563M044
4673c4236N974j0893J1083L745m543o053M170r238J588M075p400Q853L963l603
4659c2515m404j823L250K758Q57J711l578o879R670M18j727j056l611R596k135
4644b9468n384k81O296p143q74M166P887j2057P918r629N462J38J981O685j0680
4629c4983Q52j670L240L2NO406j1249O263m546O305M283M3k947L435n427m547
$$ plain form
4733 -37658 -38057 -35751 -38661 -39967 -44545 -33161 -34361 -34224 -30023 -38496 -35038 -35589 -32269 -29694 -35541
4718 -35541 -34854 -40359 -41831 -35281 -33184 -41432 -38782 -36566 -38110 -38926 -39607 -37419 -33292 -36535 -30293
4703 -30293 -34603 -33234 -29541 -43543 -42194 -35786 -39554 -32235 -39596 -27972 -36182 -36677 -34112 -34438 -32824
4688 -32824 -28999 -30771 -39325 -42375 -43323 -31267 -29460 -34555 -40172 -43077 -39978 -37827 -34717 -38280 -34236
4673 -34236 -28262 -39155 -28072 -24327 -28870 -34923 -30753 -39991 -38403 -34328 -41728 -32875 -28912 -32515
4659 -32515 -36919 -38742 -35492 -32734 -31877 -30166 -33744 -40623 -30953 -30535 -32262 -33318 -36929 -27333 -29468
4644 -29468 -34852 -35133 -28837 -35980 -36854 -32688 -24801 -36858 -28940 -38569 -33107 -32969 -30988 -24303 -34983
4629 -34983 -34131 -35801 -32561 -32529 -32524 -26118 -37367 -31104 -35650 -29345 -25062 -25019 -27966 -24531 -29958 -34505
4613c4505R835o618o627J4215m468j798j1j39q343J250j247K011M117j996M254
4598c0070q092J2835m591m563q627O96N156N572N041j24l482r341Q571k413l945
4583c7377R279q636M549j441j2683J0774m197M426k74O213R533n582j491r562
4569c6469J0469q138M54L651K210k354n372J030l823j885J1987n789k559P301
4555b9287q182L273M757n490k259o654O143R470r047k876M713O295o956M416k404
4540c4088K207n012L427l245j34O630j181l694L104K74O575j6552N393L658l166
4525c5804o47k359L931N805p124M856L221j4381P384n68r97k793J86R488j363
4510c1165o395K936n94q456O277J624J411K956m623o05P541j2545K691m582K250
$$ plain form
4613 -34505 -24670 -31288 -37915 -23700 -28168 -29966 -29977 -30116 -38459 -37209 -38456 -36445 -32328 -34324 -30070
4598 -30070 -38162 -25327 -29918 -34481 -43108 -42412 -37256 -31684 -26643 -26767 -30249 -39590 -31019 -33432 -37377
4583 -37377 -28098 -36734 -32185 -33626 -46309 -35535 -39732 -35306 -35580 -29367 -19834 -25416 -26907 -36469
4569 -36469 -26000 -34138 -33684 -30033 -27823 -30177 -35549 -34519 -38342 -40227 -28240 -34029 -36588 -29287
4555 -29287 -37469 -34196 -29439 -34929 -37188 -43842 -37699 -28229 -37276 -40152 -35439 -29144 -36100 -31684 -34088
4540 -34088 -31881 -36893 -33466 -36711 -36845 -30215 -31396 -35090 -31986 -31712 -25137 -41689 -36296 -32638 -35804
4525 -35804 -36451 -38810 -34879 -29074 -36198 -31342 -28121 -42502 -35118 -35686 -36683 -39476 -39290 -29802 -31165
4510 -31165 -37560 -34624 -35218 -43674 -37397 -35773 -34362 -31406 -36029 -36634 -29093 -41638 -38947 -43529 -41279
4495d1279j1483K0414n720P269q452L428K630k804k262k571P335q017P197K0k963
4480c7258l718k832L238k328J2649o417m469K439K44k810J5045k136l918M362
4466b7909j1502J0458n584Q30L22m949j987J2153o386j812J0904n904j931o92
4452c3989o72J0294n739k920r476Q572k895O309K531o266J077L517Q044j2588
4438c4201M521q830P501l529j057j526J6061j8831L581M125r365P534P610k808
4424b9214l703k867K306q1j713L901M678l467j1557J5846r767J337m239L304Q096
4409b7140o729l2J726m780J204K49l671M942o931L831N793o9J80k764J1230j1057
4393c4018J217l580R775p781k802N173M753k328q727j654J6247l980j118o303
$$ plain form
4495 -41279 -52762 -32348 -38068 -30799 -39251 -35823 -33193 -35997 -38259 -40830 -33495 -41512 -34315 -34295 -37258
4480 -37258 -40976 -43808 -40570 -42898 -30249 -36666 -41135 -38696 -38452 -41262 -26217 -28353 -32271 -27909
4466 -27909 -39411 -28953 -34537 -33707 -33385 -38334 -40321 -28168 -34554 -36366 -25462 -31366 -33297 -33989
4452 -33989 -34661 -24367 -30106 -33026 -42502 -33930 -36825 -30516 -27985 -34251 -33174 -29657 -21613 -34201
4438 -34201 -29680 -38510 -31009 -34538 -35595 -37121 -21060 -39891 -36310 -32185 -41550 -34016 -26406 -29214
4424 -29214 -32917 -35784 -33478 -33559 -35272 -31371 -26693 -30160 -41717 -25871 -35638 -34301 -38540 -35236 -27140
4409 -27140 -33869 -33901 -32175 -36955 -35751 -35502 -39173 -34231 -41162 -37331 -31538 -31607 -31427 -34191 -22961 -34018
4393 -34018 -32801 -36381 -26606 -34387 -37189 -32016 -27263 -29591 -38318 -39972 -23725 -27705 -28823 -35126
4379c5126K223p849L131k284O688N345p201O555p211Q733J227p331R15L036L853
4364b5296j2933R856N992r147m015M321J541L452o286N556J241k377l347M311
4350b7131N207p645l562P395k292j935j818J2912J79n065K669k839n867O685l137
4335b6244R283n416M463K900r309K625n851J2910J878j26L065M662k751n597R492
4320d016N943o116L824L642N988L716p52k826J0872n50N834P754K081q727p186
4305A9481J1711J1838o695r881Q732j035N937n904J0762K531K562L547J3048K798
4291F9432n029P784J5510l830J6840m142J5461M701O484l499K912Q005l184M401
4277A31846n003P735r978n135l498j669j386L005m462L170J1557k3445J0879j01
$$ plain form
4379 -35126 -32903 -40752 -37621 -39905 -33217 -27872 -35073 -28518 -35729 -26996 -25769 -33100 -32185 -29149 -25296
4364 -25296 -38229 -28373 -22381 -31528 -35543 -31222 -29681 -26229 -32515 -26959 -25718 -28095 -31442 -27131
4350 -27131 -21924 -29569 -33131 -25736 -28028 -29963 -31781 -18869 -18690 -23755 -21086 -23925 -29792 -23107 -26244
4335 -26244 -16961 -22377 -17914 -15014 -24323 -21698 -27549 -14639 -12761 -12887 -9822 -5160 -7911 -13508 -4016
4320 -4016 1927 -4189 -365 3277 9265 12981 12229 9403 20275 19725 25559 33313 35394 26667 19481
4305 19481 31192 43030 36335 26454 35186 34151 40088 34184 44946 47477 50039 53586 66634 69432
4291 69432 64403 72187 87697 83867 100707 96565 112026 116727 123211 119712 122624 130629 127445 131846
4277 131846 126843 134578 124600 119465 115967 114298 112912 115917 111455 114625 126182 102737 113616 113515
4263A13515p865R051K848P054M084m533Q714N588j679j608M638p962K799J0077
4249A44721j2000j8149R165j0878R42p622p11j0743o009N5p508p566j395o946
4235F5356M362p211p10p681j073M856m869M66n576l621P309p607j1594l89j197
4220C0821N489n662m286l170K444q569o040J97o080o206L491p516J1199j2247
4206f135K990n04j0876N140n440n742J2880o587k252L581p654J643l630l363p51
4191b6700J1280p964j354O675j0366O252j060o600Q929K750p763K190j461q614
4177c3806P445k643m287m80K51K723L059J242j577M010k899Q25J850K365n676
4162b7598o15j957o14j0769J3000R127j0887J416l145L974K97J045n102M705L465
$$ plain form
4263 113515 105650 114701 117549 124603 128687 124154 132868 138456 136777 135169 139807 131845 134644 144721
4249 144721 132721 114572 123737 112859 113801 106179 105468 94725 88716 88771 81263 73697 72302 65356
4235 65356 69718 62507 61797 54116 53043 57899 53030 53496 47920 44299 51608 44001 32407 32018 30821
4220 30821 36310 30648 26362 23192 25636 17067 11027 11224 5144 -1062 2429 -5087 6112 -6135
4206 -6135 -3145 -3649 -14525 -9385 -14825 -20567 -7687 -14274 -16526 -12945 -20599 -18956 -22586 -25949 -26700
4191 -26700 -15420 -23384 -24738 -18063 -28429 -22177 -23237 -29837 -20908 -18158 -25921 -23731 -25192 -33806
4177 -33806 -26361 -29004 -33291 -33771 -33520 -30797 -27738 -26496 -28073 -24063 -26962 -26137 -24287 -21922 -27598
4162 -27598 -28213 -30170 -30784 -41553 -28553 -19426 -30313 -28897 -32042 -28068 -27771 -26726 -31828 -27123 -23658
4147b3658n227M494j4505Q440j53l909M733q40k374Q638j0921N897k241J4206
4133a7420n847j3177J1208p766N323l421M871k214N391j1323N180j494N011q081
4119c3759L813L506j0886L844M635l855N447m273L134o686P539m727N710n2l848
4104c0458k006J3401p681j0178J1842j5794R508j202L227J983l58n906L431j353
4090c1544l286k159J7529j7243L605K920K691J507m119K256m25l960M861q581
4076c5948Q880q156N297r39l02O876j878o537M56L476l87j118p935N760j413o914
4060d0782J0174j136J826O03o151O05J2083j642j0778P707j1592M923K416L98
4046c1346J083n81K890j0948J3602q480l43N639j2758J6592j269o335J221M955
$$ plain form
4147 -23658 -28885 -24391 -38896 -30456 -30609 -34518 -29785 -30625 -32999 -24361 -35282 -29385 -31626 -17420
4133 -17420 -23267 -36444 -25236 -33002 -27679 -31100 -26229 -28443 -23052 -34375 -29195 -30689 -25678 -33759
4119 -33759 -29946 -26440 -37326 -33482 -28847 -32702 -27255 -31528 -28394 -35080 -27541 -32268 -26558 -26610 -30458
4104 -30458 -32464 -19063 -26744 -36922 -25080 -40874 -31366 -32568 -29341 -27358 -27716 -33622 -30191 -31544
4090 -31544 -34830 -36989 -19460 -36703 -33098 -30178 -27487 -25980 -30099 -27843 -28268 -32228 -27367 -35948
4076 -35948 -27068 -35224 -29927 -30866 -31168 -24292 -26170 -32707 -32251 -28775 -29162 -30280 -38215 -32455 -33868 -40782
4060 -40782 -30608 -31744 -29918 -29315 -35466 -34861 -22778 -24420 -35198 -27491 -39083 -34160 -31744 -31346
4046 -31346 -30263 -30844 -27954 -38902 -25300 -33780 -34123 -28484 -41242 -24650 -25919 -32254 -31033 -26078
4032b6078k717l997M932q436M604p774Q282k587N794Q45l00k186j165p008N957
4017c1834m585J1765j4814O366L320j095L97j769l872j15K304K283l445P995n097
4002c2196q36m725M917m170R960m480q994J870j888J1302m571O116M00m872M372
3987b7795N978n416j2346J1178o247m250J172M983p22k515N756J758j350N661
3973b4155j0442K614P799k907n347K664o74m81p370j639L863J1226r574L932K786
3958b7705J142k543k617Q833k2219J1228N655k876L681j0145P567j0034M230l288
3944c9091N280p682M870N446j5253Q783l992M022M829j896O965j465r035L385
3930c4834O409o848k987Q343j503j0410M703n261J1539k136k817R317q346j486
$$ plain form
4032 -26078 -28795 -32792 -27860 -36296 -31692 -39466 -31184 -33771 -27977 -27132 -27432 -29618 -30783 -37791 -31834
4017 -31834 -36419 -24654 -39468 -33102 -29782 -30877 -30480 -32249 -36121 -36236 -33932 -31649 -35094 -27099 -32196
4002 -32196 -33032 -37757 -32840 -37010 -27050 -31530 -40524 -38654 -40542 -29240 -33811 -27695 -27295 -32167 -27795
3987 -27795 -21817 -27233 -39579 -28401 -34648 -38898 -37726 -32743 -33465 -35980 -30224 -28466 -29816 -24155
3973 -24155 -34597 -31983 -24184 -27091 -32438 -29774 -30448 -30929 -38299 -39938 -36075 -24849 -34423 -30491 -27705
3958 -27705 -26563 -29106 -31723 -22890 -45109 -33881 -28226 -31102 -27421 -37566 -29999 -40033 -35803 -39091
3944 -39091 -33811 -41493 -36623 -31177 -46430 -37647 -41639 -37617 -32788 -34684 -27719 -29184 -38219 -34834
3930 -34834 -28425 -35273 -38260 -29917 -31420 -41830 -37127 -42388 -30849 -32985 -35802 -26485 -34831 -36317
3916c6317O779k792j041p008N216J554j745O647l857n681j598p674P576M784P21
3901c4436Q730k918k053k153m849L551n051R191l918O713n096m876j372K816N080
3886c0641n806K116m05k328M318j0165J3508n180J805m869N616l577M788p985
3872c8805J0762k46p879P277n699j952l365K231k282M298J677j799k969N687p061
3857d0125M43P226k269J245m092M182N136o376n246L961j065K432m347k742M932
3842c6705o328m19J3033o871k381M098r078J0349j672K197l180l938J0420r347
3828c9822R283m764m555L112O555n440n602m117J431J2260K26j937o492M773L048
3813c2041k40j493K362n693n514L414J564j242J725J668J216n743q73M138O04
$$ plain form
3916 -36317 -29538 -32330 -33371 -40379 -35163 -33609 -35354 -28707 -32564 -38245 -39843 -47517 -39941 -35157 -34436
3901 -34436 -25706 -28624 -30677 -32830 -37679 -34128 -39179 -29988 -33906 -27193 -32289 -37165 -38537 -35721 -30641
3886 -30641 -36447 -34331 -34736 -37064 -32746 -42911 -29403 -34583 -32778 -37647 -32031 -35608 -30820 -38805
3872 -38805 -28043 -28289 -36168 -28891 -34590 -36542 -39907 -37676 -39958 -35660 -33983 -35782 -38751 -33064 -40125
3857 -40125 -39682 -32456 -34725 -33480 -37572 -33390 -28254 -34630 -39876 -35915 -36980 -34548 -38895 -41637 -36705
3842 -36705 -43033 -43452 -30419 -37290 -39671 -35573 -44651 -34302 -35974 -33777 -36957 -40895 -30475 -39822
3828 -39822 -30539 -35303 -39858 -36746 -30191 -35631 -41233 -45350 -43919 -31659 -31433 -33370 -39862 -35089 -32041
3813 -32041 -32281 -33774 -31412 -37105 -42619 -39205 -37641 -38883 -37158 -35490 -34274 -40017 -40890 -36752 -36148
3798c6148L13M908m401K07N087q540k041n069R441P622m32r162q4k991J2215M26
3782b8649p070l540l870J0318k380j077L932p337J188J160Q884j3110M782J567
3768c5202j288j477o449N484J256m987R354J660J156j255r160J7112j1863j2885
3754d8544Q959J2174m216j2991Q740K71L377n066l014Q747q97k454L085n88k486
3739c4903j164K542L429J023o577q280J7677q419l754k481l94J3919n697m997
3725c8076O210l355O520j5243J0819n53l257k901L812k990O394o17n666L78o17
3710c9142P498p851j275R063l482J122P804p955q386N487J849l446N657q39j697
3695c5593N163p931K686K187m442r6O047m72p383K369Jp697R534P09K102k664
$$ plain form
3798 -36148 -35835 -30927 -35328 -35121 -30034 -38574 -40615 -45684 -36243 -28621 -29053 -38215 -38299 -41290 -29075 -28649
3782 -28649 -35719 -39259 -43129 -32811 -35191 -36268 -32336 -39673 -38485 -37325 -28441 -41551 -36769 -35202
3768 -35202 -36490 -37967 -44416 -38932 -37676 -42663 -33309 -31649 -30493 -31748 -40908 -23796 -35659 -48544
3754 -48544 -39585 -27411 -31627 -44618 -35878 -35607 -32230 -37296 -40310 -31563 -32460 -34914 -31829 -32417 -34903
3739 -34903 -36067 -33525 -30096 -29073 -35650 -43930 -26253 -34672 -38426 -40907 -41301 -27382 -33079 -38076
3725 -38076 -31866 -35221 -28701 -43944 -33125 -33678 -36935 -39836 -36024 -39014 -32620 -33237 -38903 -38525 -39142
3710 -39142 -31644 -39495 -40770 -31707 -35189 -34067 -26263 -34218 -42604 -37117 -35268 -38714 -33057 -33896 -35593
3695 -35593 -30430 -38361 -35675 -33488 -37930 -38026 -31979 -32451 -39834 -37465 -37464 -45161 -35627 -34918 -32816 -35480
3679c5480j588j215M678k386M508p495M376o102M468k825M679n887N449o091L507
3664c7404l672j453m677N309Q176p906m526M899M134M708l5j0527k545P562j10
3649c8067R91M255M614o203l046Q203n614P412k0996J865J4179l414l223J440
3635c7604n083k326Q172J642l049k536J0147l341p45r062K010J1006k213L400
3621b9582l128n885J025N846p74l972n432L457R23l859Q109J63k279K380p487
3606d0495k143R944m313j2800P286L258l087M449M098o304Q230k847j523R01j749
3591c7095k202N717n507M605L076l331l026J954R95q638O879P668j3802P508m069
3576c9268l454R640r232J0076p075N541j3626J7686m883m409n131J4425j6483
$$ plain form
3679 -35480 -37068 -38283 -33605 -35991 -31483 -38978 -34602 -40704 -36236 -39061 -34382 -40269 -34820 -40911 -37404
3664 -37404 -41076 -42529 -47206 -41897 -33721 -41627 -46153 -41254 -37120 -32412 -32447 -42974 -45519 -37957 -38067
3649 -38067 -37076 -32821 -28207 -34410 -37456 -29253 -34867 -27455 -48451 -46586 -32407 -35821 -39044 -37604
3635 -37604 -42687 -45013 -36841 -35199 -38248 -40784 -30637 -33978 -34723 -43785 -41775 -30769 -32982 -29582
3621 -29582 -32710 -38595 -37570 -31724 -32498 -36470 -41902 -38445 -37522 -41381 -33272 -33109 -35388 -33008 -40495
3606 -40495 -42638 -32694 -37007 -49807 -42521 -39263 -42350 -37901 -33803 -40107 -31877 -34724 -36247 -35346 -37095
3591 -37095 -39297 -33580 -39087 -34482 -31406 -34737 -37763 -35809 -34814 -43452 -36573 -28905 -42707 -35199 -39268
3576 -39268 -42722 -33082 -42314 -32238 -39313 -33772 -47398 -29712 -34595 -39004 -44135 -29710 -46193
3563d6193J4455m460k690K542M976l589j73j0381R494l633L817M790q452N071
3549c4426K782j3055O793L962m642p773J1266l493N636o248N322n966P886j2112
3535d4068N006P247q236Q559l529l562J745j693M470J833N402p298j167k204r571
3520d7066Q805m325R277K86m176k845k282N701k434J09J257K630K645k388l994
3505c8800J4Q578l812k249l317P527N23r688M529J379k792k322N14k376j453M242
3489c9503M195n557L972M135k156J480n056J062l260k999O359P936j4171m112
3475d7675O261j465O690l790O109n241K346n148J975o43M369j863N316o406Q63
3460c8302l860R043o009R093q068M1P04j482L178n40L550j2112J1350o983L583
$$ plain form
3563 -46193 -31738 -36198 -38888 -36346 -31370 -34959 -35132 -45513 -36019 -39652 -35835 -31045 -39497 -34426
3549 -34426 -31644 -44699 -37906 -33944 -38586 -46359 -35093 -38586 -32950 -39198 -33876 -39842 -31956 -44068
3535 -44068 -39062 -31815 -40051 -31492 -35021 -38583 -36838 -38531 -34061 -32228 -26826 -34124 -35291 -37495 -47066
3520 -47066 -38261 -42586 -33309 -33023 -37199 -40044 -42326 -36625 -39059 -38950 -37693 -35063 -32418 -34806 -38800
3505 -38800 -38786 -30208 -34020 -36269 -39586 -32059 -31536 -41224 -36695 -35316 -38108 -40430 -39916 -42292 -43745 -39503
3489 -39503 -35308 -40865 -36893 -32758 -34914 -33434 -38490 -37428 -40688 -43687 -37328 -29392 -43563 -47675
3475 -47675 -41414 -42879 -36189 -39979 -33870 -39111 -36765 -41913 -39938 -40581 -36212 -38075 -32759 -39165 -38302
3460 -38302 -42162 -33119 -39128 -30035 -38103 -38062 -37358 -38840 -35662 -36202 -32652 -44764 -33414 -40397 -36814
3445c6814K622q986N861N834j2243L876P48Q327j0342l464J820J3253j1357M96
3431d0369M684j1143N780O12J1324n279l968m076O928L51o642J855J100R942n252
3416c4153R1n424K885L7R388j3002K687j960M744J918K605r870L076k167M060
3401c5085m918J2596m551o486k418R632Q55j095l321o739K996J175j2072J2296
3387c7135L232o130J638P030n201L045P07M26l042k428l009N753K817o296P747
3372c0846j4361J2916l459l186N916r969P276o020P544n155J306O849j1601N538
3358c7252J665o91M95M675M31k7j0298P576J374l273o82l178R021o185m287O523
3342c4113n423N122j0294J6180j0789R73N605p107K901q256M932L255J680q260
$$ plain form
3445 -36814 -34192 -43178 -37317 -31483 -43726 -39850 -39102 -30775 -41117 -44581 -42761 -29508 -40865 -40369
3431 -40369 -35685 -46828 -41048 -40436 -29112 -34391 -38359 -42435 -35507 -35156 -41798 -39943 -38843 -28901 -34153
3416 -34153 -34062 -39486 -36601 -36564 -27176 -40178 -37491 -39451 -34707 -32789 -30184 -40054 -36978 -39145 -35085
3401 -35085 -40003 -27407 -31958 -38444 -40862 -31230 -30375 -31470 -34791 -41530 -38534 -37359 -49431 -37135
3387 -37135 -33903 -40033 -38395 -31365 -36566 -33521 -32814 -32388 -35430 -37858 -40867 -35114 -32297 -38593 -30846
3372 -30846 -45207 -32291 -35750 -38936 -33020 -42989 -35713 -41733 -34189 -39344 -38038 -31189 -42790 -37252
3358 -37252 -35587 -36278 -35783 -31108 -30677 -30704 -41002 -33426 -32052 -35325 -36007 -39185 -30164 -36349 -40636 -34113
3342 -34113 -39536 -34414 -44708 -28528 -39317 -38344 -32739 -39846 -36945 -45201 -40269 -37014 -35334 -43594
3328d3594J5383l978m292q46k003R272j5505J0519j0990J1740m151j872o416Q649
3314c8084l94k15K387k966M364m411J825k483j233K254J1408j348l890m748K599
$$ plain form
3328 -43594 -28211 -32189 -36481 -37327 -39330 -30058 -45563 -35044 -46034 -34294 -38445 -40317 -46733 -38084
3314 -38084 -38478 -38693 -36306 -39272 -34908 -39319 -37494 -39977 -41210 -38956 -27548 -28896 -32786 -37534 -34935
$$ [...]
##END NTUPLES=NMR SPECTRUM
##END=
