##TITLE=abcd
##JCAMPDX= 6.0         $$ Bruker NMR JCAMP-DX V2.0
##DATA TYPE= NMR SPECTRUM
##DATA CLASS= NTUPLES
##ORIGIN= UXNMR, Bruker Analytische Messtechnik GmbH
##OWNER= root
$$ XWIN-NMR		Version 3.5
$$ Mon Nov 17 13:26:30 2025 Russian Standard Time (UT+4h)  servis@DPX200
##.OBSERVE FREQUENCY= 200.131235884673
##.OBSERVE NUCLEUS= ^1H
##.ACQUISITION MODE= SIMULTANEOUS
##.ACQUISITION SCHEME= undefined
##.AVERAGES= 32
##.DIGITISER RES= 18
##SPECTROMETER/DATA SYSTEM= spect
##.PULSE SEQUENCE= zg
##.SOLVENT NAME= Acetone
##.SHIFT REFERENCE= (INTERNAL, Acetone, 0, 16.4885)
##AUDIT TRAIL= $$ (NUMBER, WHEN, WHO, WHERE, WHAT)
$$ ##TITLE= Audit trail, XWIN-NMR		Version 3.5
$$ ##JCAMPDX= 5.01
$$ ##ORIGIN= Bruker BioSpin GmbH
$$ ##OWNER= servis
$$ F:\spectra/data/av/nmr/H1/1/pdata/1/auditp.txt
$$ ##AUDIT TRAIL=  $$ (NUMBER, WHEN, WHO, WHERE, WHAT)
(   1,<2025-11-17 13:19:56.17 +0400>,<servis>,<DPX200>,
      <created by zg, POWCHK disabled, PULCHK disabled
       configuration hash MD5:
       00 E9 B6 7A A2 85 ED C7 34 08 36 98 17 FE 4E 26
       data hash MD5: 32K
       D3 29 B3 19 1F 06 01 85 7F 34 63 41 3C 25 9C 45>)
(   2,<2025-11-17 13:25:04.03 +0400>,<servis>,<DPX200>,
      <Start of raw data processing
       efp BC_mod = 2 LB = 0.05 FT_mod = 6 PKNL = 1 PHC0 = -254.562 PHC1 = 1.301565 SI = 16K 
       data hash MD5: 16K
       FD 8E C1 20 4C 2E 35 A2 C2 82 DC C9 32 0C 5A D2>)
$$ ##END=
$$ 
$$ hash MD5
$$ 89 F2 48 ED 3F 37 14 84 97 FC 75 67 6F 12 45 98
##$RELAX= 
##$RELAX= 
##$RELAX= 
##$RELAX= 
##$RELAX= 
##$RELAX= 
##$RELAX= 
##$RELAX= 
$$ Bruker specific parameters
$$ --------------------------
##$DU= <F:\spectra>
##$EXPNO= 1
##$NAME= <H1>
##$PROCNO= 1
##$TYPE= <nmr>
##$USER= <av>
##$AMP= (0..31)
100 100 100 100 100 100 100 100 100 100 100 100 100 100 100 100 100 100 
100 100 100 100 100 100 100 100 100 100 100 100 100 100 
##$AQSEQ= 0
##$AQ_mod= 1
##$AUNM= <au_zg>
##$AUTOPOS= <>
##$BF1= 200.13
##$BF2= 200.13
##$BF3= 200.13
##$BF4= 200.13
##$BF5= 500.13
##$BF6= 500.13
##$BF7= 500.13
##$BF8= 500.13
##$BYTORDA= 1
##$CFDGTYP= 0
##$CFRGTYP= 5
##$CHEMSTR= <none>
##$CNST= (0..31)
1 1 145 1 1 1 1 1 1 1 1 1 1 1 1 1 1 1 1 1 1 1 1 1 1 1 1 1 1 1 1 1 
##$CPDPRG= <>
##$CPDPRG1= <>
##$CPDPRG2= <>
##$CPDPRG3= <>
##$CPDPRG4= <mlev>
##$CPDPRG5= <mlev>
##$CPDPRG6= <mlev>
##$CPDPRG7= <mlev>
##$CPDPRG8= <mlev>
##$CPDPRGB= <>
##$CPDPRGT= <>
##$D= (0..31)
0 2 0 0 0 0 0 0 0 0.06 0 0 0 0 0 0 0.0002 0 0 0 0 0 0 0 0 0 0 0 0 0 0 
0 
##$DATE= 1763371195
##$DBL= (0..7)
120 120 120 120 120 120 120 120 
##$DBP= (0..7)
150 150 150 150 150 150 150 150 
##$DBP07= 0
##$DBPNAM0= <>
##$DBPNAM1= <>
##$DBPNAM2= <>
##$DBPNAM3= <>
##$DBPNAM4= <>
##$DBPNAM5= <>
##$DBPNAM6= <>
##$DBPNAM7= <>
##$DBPOAL= (0..7)
0.5 0.5 0.5 0.5 0.5 0.5 0.5 0.5 
##$DBPOFFS= (0..7)
0 0 0 0 0 0 0 0 
##$DE= 6
##$DECBNUC= <off>
##$DECIM= 32
##$DECNUC= <off>
##$DECSTAT= 4
##$DIGMOD= 1
##$DIGTYP= 9
##$DL= (0..7)
0 120 120 120 120 120 120 120 
##$DP= (0..7)
150 150 150 150 150 150 150 150 
##$DP07= 0
$$ [...]
##$SUBNAM4= <"">
##$SUBNAM5= <"">
##$SUBNAM6= <"">
##$SUBNAM7= <"">
##$SUBNAM8= <"">
##$SUBNAM9= <"">
##$SW= 20.6817932712277
##$SWIBOX= (0..15)
0 0 3 0 0 0 0 0 0 0 0 0 0 0 0 0 
##$SW_h= 4139.07284768212
##$TD= 32768
##$TD0= 1
##$TE= 0
##$TE2= 300
##$TE3= 300
##$TEG= 300
##$TL= (0..7)
0 120 120 120 120 120 120 120 
##$TP= (0..7)
150 150 150 150 150 150 150 150 
##$TP07= 0
##$TPNAME0= <>
##$TPNAME1= <>
##$TPNAME2= <>
##$TPNAME3= <>
##$TPNAME4= <>
##$TPNAME5= <>
##$TPNAME6= <>
##$TPNAME7= <>
##$TPOAL= (0..7)
0.5 0.5 0.5 0.5 0.5 0.5 0.5 0.5 
##$TPOFFS= (0..7)
0 0 0 0 0 0 0 0 
##$TUNHIN= 0
##$TUNHOUT= 0
##$TUNXOUT= 0
##$USERA1= <user>
##$USERA2= <user>
##$USERA3= <user>
##$USERA4= <user>
##$USERA5= <user>
##$V9= 5
##$VALIST= <valist>
##$VCLIST= <CCCCCCCCCCCCCCC>
##$VD= 0
##$VDLIST= <DDDDDDDDDDDDDDD>
##$VPLIST= <PPPPPPPPPPPPPPP>
##$VTLIST= <TTTTTTTTTTTTTTT>
##$WBST= 1024
##$WBSW= 30
##$XGAIN= (0..3)
0 0 0 0 
##$XL= 0
##$YL= 0
##$YMAX_a= 34271
##$YMIN_a= -36516
##$ZGOPTNS= <>
##$ZL1= 120
##$ZL2= 120
##$ZL3= 120
##$ZL4= 120
##$ABSF1= 0
##$ABSF2= 0
##$ABSG= 0
##$ABSL= 0
##$ALPHA= 0
##$AQORDER= 0
##$ASSFAC= 0
##$ASSFACI= 0
##$ASSFACX= 0
##$ASSWID= 0
##$AUNMP= <proc_1d>
##$AZFE= 0.1
##$AZFW= 0.1
##$BCFW= 0
##$BC_mod= 2
##$BYTORDP= 0
##$COROFFS= 0
##$CY= 18.4799938201904
##$DATMOD= 1
##$DC= 0
##$DFILT= <>
##$DTYPP= 0
##$F1P= 9.9274215381318
##$F2P= -0.165520771350173
##$FCOR= 1
##$FTSIZE= 16384
##$FT_mod= 6
##$GAMMA= 0
##$GB= 0
##$INTBC= 1
##$INTSCL= 4.127829e-11
##$ISEN= 128
##$LB= 0.05
##$LEV0= 0
##$LPBIN= 0
##$MAXI= 10000
##$MC2= 0
##$MEAN= 0
##$ME_mod= 0
##$MI= 50
##$NCOEF= 0
##$NC_proc= -8
##$NLEV= 6
##$NOISF1= 3.799351
##$NOISF2= 2.8
##$NSP= 0
##$NTH_PI= 0
##$NZP= 0
##$OFFSET= 16.48848
##$PC= 4
##$PHC0= -254.562
##$PHC1= 1.301565
##$PH_mod= 1
##$PKNL= yes
##$PPARMOD= 0
##$PSCAL= 4
##$PSIGN= 0
##$REVERSE= no
##$SF= 200.130005582386
##$SI= 16384
##$SIGF1= 3
##$SIGF2= 2
##$SINO= 400
##$SIOLD= 16384
##$SREGLST= <1H.CDCl3>
##$SSB= 0
##$STSI= 16384
##$STSR= 0
##$SW_p= 4139.07284768211
##$SYMM= 0
##$S_DEV= 0
##$TDeff= 32768
##$TDoff= 0
##$TI= <>
##$TILT= no
##$TM1= 0
##$TM2= 0
##$TOPLEV= 0
##$USERP1= <user>
##$USERP2= <user>
##$USERP3= <user>
##$USERP4= <user>
##$USERP5= <user>
##$WDW= 1
##$XDIM= 16384
##$YMAX_p= 470334517
##$YMIN_p= -5571533
$$ End of Bruker specific parameters
$$ ---------------------------------
##NTUPLES= NMR SPECTRUM
##VAR_NAME=  FREQUENCY,     SPECTRUM/REAL,   SPECTRUM/IMAG
##SYMBOL=    X,             R,               I
##VAR_TYPE=  INDEPENDENT,   DEPENDENT,       DEPENDENT
##VAR_FORM=  AFFN,          ASDF,            ASDF
##VAR_DIM=   16384,         16384,           16384
##UNITS=     HZ,            ARBITRARY UNITS, ARBITRARY UNITS
##FACTOR=    0.252644378177508, 1,           1
##FIRST=     3299.83951724647, 0,            0
##LAST=      -839.233330435636, 0,           0
##MIN=       -839.233330435636, -5571533,    0
##MAX=       3299.83951724647, 470334517,    0
$$ Real data points
##PAGE= N=1
##DATA TABLE= (X++(R..R)), XYDATA
$$ [...]
$$ plain form
7960 162298 529288 582925 -371215 551942 -114400 189919 433096 5873 -731841 204427
7950 204427 473487 -645926 -34966 -69839 137325 183326 493336 418257 -123611 481584
7940 481584 61094 121214 -295348 -236226 174265 62295 288028 237576 475046 109904
7930 109904 369572 -407513 -247962 487586 306151 -9314 205602 72457 248880 511423
7920 511423 278437 67857 687291 -114411 37916 518535 226333 776057 266673 205614
7910 205614 420197 498931 295134 -447993 935070 766265 30335 301968 328754 -73253
7900 -73253 -20338 -17332 227014 691008 168059 -147347 34152 130844 -368804 -189990 324537
7889 324537 311212 874658 217424 -192990 414219 545895 987482 16438 710584 -764143
$$ packed form
7960A62298L66990N3637r54140R23157o66342L04319K43177m27223p37714R36268
7950B04427K69060j119413O10960l4873K07164M6001L10010p5079n41868O05195
7940D81584m20490O0120m16562N9122M10491j11970K25733n0452K37470l65142
7930A09904K59668p77085J59551P35548j81435l15465K14916j33145J76423K62543
7920E11423k32986k10580O19434q01702J52327M80619k92202N49724n09384o1059
7910B05614K14583P8734k03797p43127J383063j68805p35930K71633K6786m02007
7900g3253N2915L006K44346M63994n22949l15406J81499R6692m99648J78814N14527
7889C24537j3325N63446o57234m10414O07209J31676M41587r71044O94146j474727
$$ plain form
7879 -764143 -68168 -20276 -268675 27329 41871 606397 -243735 741264 1005673 144926
7869 144926 165122 462292 -104507 -257483 -49434 378700 485018 442114 240552 -421106
7859 -421106 772886 493565 1336396 1258360 -1820964 -5571533 729164 -14598 480842
7850 480842 -366096 355525 -62487 466036 -65272 723192 -31935 -53559 786167 58792
7840 58792 -541573 576704 -96657 -265041 702471 440271 153579 320692 446467 442346
7830 442346 735630 -219367 -72951 -707548 495443 -305345 -736138 918928 -45907
7821 -45907 334003 171745 -660824 1506276 -460231 5199 -567831 -365846 -147140 -112060
7811 -112060 -99244 -48621 393332 -727520 -178548 -198616 219132 463951 -226712 -457095
$$ packed form
7879g64143O95975M7892k48399K96004J4542N64526q50132R84999K64409q60747
7869A44926K0196K97170n66799j52976K08049M28134J06318m2904k01562o61658
7859d21106J193992k79321Q42831p8036l079324l750569O300697p43762M95440
7850D80842q46938P21621m18012N28523n31308P88464p55127k1624Q39726p27375
7840E8792o00365J118277o73361j68384R67512k62200k86692J67113J25775m121
7830D42346K93284r54997J46416o34597J202991q00788m30793J655066r64835
7821d5907L79910j62258q32569K167100j966507M65430n73030K01985K18706L5080
7811a12060J2816N0623M41953j120852N48972k0068M17748K44819o90663k30383
$$ plain form
7801 -457095 306913 73036 115862 510719 655658 317776 220430 67167 123004 232216
7791 232216 183702 -348551 157920 356171 -52383 547541 127389 -242262 -39305 245651
7781 245651 -198960 439273 -336302 722013 288315 732384 667055 624084 180230 -281769
7771 -281769 35655 803865 75013 94330 682849 531228 -456742 -285625 -495618 40195
7761 40195 132361 295547 318644 -598177 496198 178184 -344207 802575 269907 -39421
7751 -39421 95826 429724 796670 -441645 -109460 -269814 304867 -283082 252292 375797
7741 375797 -141564 227162 -225576 44773 60802 447819 789175 543822 148704 302328
7731 302328 553117 -40471 -461254 -294479 804895 -101409 392173 -378294 -28497 -319973
$$ packed form
7801d57095P64008k33877M2826L94857J44939l37882r7346j53263N5837J09212
7791B32216m8514n32253N06471J98251m08554N99924m20152l69651K02957K84956
7781B45651m44611O38233p75575J058315m33698M44069o5329m2971m43854m61999
7771b81769L17424P68210p28852J9317N88519j51621r87970J71117k09993N35813
7761D0195R2166J63186K3097r16821J094375l18014n22391J146782n32668l09328
7751c9421J35247L33898L66946j238315L32185j60354N74681n87949N35374J23505
7741C75797n17361L68726m52738K70349J6029L87017L41356k45353l95118J53624
7731C02328K50789n93588m20783J66775J099374r06304M93582p70467L49797k91476
$$ plain form
7721 -319973 185310 338235 282748 73158 555948 -138052 -215391 279942 95356 201204
7711 201204 -419865 268284 -384064 -35076 -521426 -206258 661313 200309 -267363 913085
7701 913085 999769 -214859 -121041 726840 -130953 217085 246006 -321457 -132170 78384
7691 78384 444186 -235493 -749135 -504677 344172 614348 244136 -467662 117785 -54992
7681 -54992 -271916 187764 -174908 -394104 677978 367656 66231 139776 -182102 368125
7671 368125 -774051 207335 -39032 198768 -129514 421806 -31390 -295126 -279121 102674
7661 102674 374617 641631 -41499 -631498 -363435 -167007 151520 288531 201848 119387
7651 119387 235830 -478970 -279802 496024 160104 23551 129766 307478 432000 1131203
$$ packed form
7721c19973N05283J52925n5487k09590M82790o94000p7339M95333j84586J05848
7711B01204o21069O88149o52348L48988m86350L15168Q67571m61004m67672J180448
7701I13085Q6684j214628R3818Q47881q57793L48038K8921n67463J89287K10554
7691G8384L65802o79679n13642K44458Q48849K70176l70212p11798N85447j72777
7681e4992k16924M59680l62672k19196J072082l10322l01425P3545l21878N50227
7671C68125j142176R81386k46367K37800l28282N51320m53196k63736J6005L81795
7661A02674K71943K67014o83130n89999K68063J96428L18527J37011q6683q2461
7651A19387J16443p14800J99168P75826l35920j36553J06215J77712J24522O99203
$$ plain form
7641 1131203 -94869 116481 272275 -147662 330937 232656 19394 -424103 58838 484938
7631 484938 336239 -289782 91596 -178261 248375 173028 420736 -312839 -587239 123178
7621 123178 647098 710065 775907 436077 222213 -37263 763260 -14524 671215 795035
7611 795035 37018 161058 295071 588514 -767026 246115 195692 120801 -125103 409958
7601 409958 -167764 47825 244305 -391039 169293 -103536 -509105 -308943 -342905 1074810
7591 1074810 -173975 912478 92899 -165338 -354142 423995 375737 -97655 471657
7582 471657 257807 430469 -403701 230579 -590593 625971 127865 1673 -561333 264041
7572 264041 507528 -95337 76652 839247 -426915 -289769 385413 -195960 42946 -295993
$$ packed form
7641A131203j226072K11350J55794m19937M78599r8281k13262m43497M82941M26100
7631D84938j48699o26021L81378k69857M26636p5347K47708p33575k74400P10417
7621A23178N23920O2967O5842l39830k13864k59476Q00523p77784O85739J23820
7611G95035p58017J24040J34013K93443j355540J013141n0423p4891k45904N35061
7601D09958n77722K15589J96480o35344N60332k72829m05569K00162l3962J417715
7591A074810j248785J086453q19579k58237j88804P78137m8258m73392N69312
7582D71657k13850J72662q34170O34280q21172J216564m98106j26192n63006Q25374
7572B64041K43487o02865J71989P62595j266162J37146O75182n81373K38906l38939
$$ plain form
7562 -295993 328691 221773 603524 -213571 143908 -5805 246088 445104 340267 215811
7552 215811 84338 -100590 839682 456461 177498 -166866 -157114 -597026 -72395 366761
7542 366761 -221266 434890 175592 -477005 73547 65734 832715 -122141 59422 307305
7532 307305 225740 442459 421970 660579 827930 253413 289852 1101402 -426974 -272161
7522 -272161 10405 -507146 970225 -255889 379576 73071 176242 174122 -219816 553242
7512 553242 -83530 449805 -153547 -86904 143691 -87934 174464 -541287 275282 540223
7502 540223 -705626 -358028 -568821 147133 120163 -70141 378687 243096 359510 348789
7492 348789 847835 139909 -273550 -879033 -42410 178943 616656 522977 24601 -172079
$$ packed form
7562b95993O24684j06918L81751q17095L57479j49713K51893J99016j04837j24456
7552B15811j31473j84928R40272l83221k78963l44364R752m39912N24631M39156
7542C66761n88027O56156k59298o52597N50552p813P66981r54856J81563K47883
7532C07305q1565K16719k0489K38609J67351n74517L6439Q11550j528376J54813
7522b72161K82566n17551J477371j226114O35465l06505J03171k120l93938P73058
7512E53242o36772N33335o03352O6643K30595k31625K62398p15751Q16569K64941
7502E40223j245849L47598k10793P15954k6970j90304M48828j35591J16414j0721
7492C48789M99046p07926m13459o05483Q36623K21353M37713r3679m98376j96680
$$ plain form
7482 -172079 398030 -274622 560522 434481 -486362 -319408 148089 999955 -10877 -115321
7472 -115321 -66987 212799 54953 107981 58163 136392 122067 157589 43391 -47372 -56016
7461 -56016 238868 253439 -121335 -205577 123995 -43041 44505 -236736 522351 337667
7451 337667 952 326650 345035 706499 221436 492294 306972 771568 63744 723693
7441 723693 -480352 385663 73638 10324 567413 -127758 45039 -164306 -453222 172322
7431 172322 217378 -511392 -38006 528986 30824 -206243 872888 628937 -183323 1075072
7421 1075072 -85465 407551 -108171 789656 -290369 -324559 -51066 278108 82714
7412 82714 795523 438186 134321 146873 495590 -83344 279226 505989 -256557 275549
$$ packed form
7482a72079N70109o72652Q35144j26041r20843J66954M67497Q51866j010832j04444
7472a15321M8334K79786j57846N3028m9818P8229j4325L5522j14198r0763q644
7461e6016K94884J4571l74774q4242L29572j67036Q7546k81241P59087j84684
7451C37667l36715L25698J8385L61464m85063K70858j85322M64596p07824O59949
7441G23693j204045Q66015l12025o3314N57089o95171J72797k09345k88916O25544
7431A72322M5056p28770M73386N66992m98162k37067J079131k43951q12260J258395
7421A075072j160537M93016n15722Q97827j080025l4190K73493L29174j95394
7412H2714P12809l57337l03865J2552L48717n78934L62570K26763p62546N32106
$$ plain form
7402 275549 329939 -50673 -98953 -490608 426726 -314584 -151544 -120340 154676 760290
7392 760290 6843 253819 -281356 -313032 187832 18594 329605 -2257 409362 666366
7382 666366 119555 -410796 -319506 669221 732826 -525806 429797 -477347 301017 304617
7372 304617 -304553 388192 558133 479800 272125 -352527 1137597 -274700 279069 418912
7362 418912 -156046 13907 -72502 -8318 168284 454781 28733 144008 -190959 1198279
7352 1198279 -45756 -132985 280545 -292242 274504 -418924 85928 350153 111262 522530
7342 522530 205697 -42690 451153 130417 -9741 -105797 -124702 66817 -260243 98809
7332 98809 136783 375516 66591 236196 601765 -225915 -66837 -9979 70532 -142435
$$ packed form
7402B75549N4390l80612m8280l91655R17334p41310J63040L1204K75016O05614
7392G60290p53447K46976n35175l1676N00864j69238L11011l31862M11619K57004
7382F66366n46811n30351R1290R88727O3605j258632R55603r07144P78364L600
7372C04617o09170O92745J69941p8333k07675o24652J490124j412297N53769J39843
7362D18912n74958J69953q6409O4184J76602K86497m26048J15275l34967J389238
7352A198279j244035q7229M13530n72787N66746o93428N04852K64225k38891M11268
7342E22530l16833k48387M93843l20736j40158r6056j8905J91519l27060L59052
7332I8809L7974K38733l08925J69605L65569q27680J59078N6858Q0511k12967
$$ plain form
7322 -142435 -113327 -385553 -20666 108262 -240519 92095 -25930 383047 168505 -180706
7312 -180706 637925 141941 -390930 253862 -274716 -371072 382820 504121 580931 -128784
7302 -128784 667711 187339 830903 -93367 948243 196068 213874 354487 458328 319583
7292 319583 895014 251938 198437 -240322 -387460 -98639 -168625 -542075 805430 5031
7282 5031 333852 394041 -310657 42375 -11969 107343 552912 312702 241801 54917 46738
7271 46738 -378331 -295196 284942 585681 959687 -476535 -337057 -262829 -50912 377025
7261 377025 -133253 536486 182978 522648 23223 -42464 -386191 -196924 -328378 211968
7251 211968 -259165 1107705 -180401 403200 220183 484606 147904 -360692 431766
$$ packed form
7322a42435K9108k72226L64887J28928l48781L32614j18025M08977k14542l49211
7312a80706Q18631m95984n32871O44792n28578r6356P53892J21301P6810p09715
7302a28784P96495m80372O43564r24270J041610p52175J7806J40613J03841j38745
7292C19583N75431o43076n3501m38759j47138K88821o9986l73450J347505q00399
7282E031L28821O0189p04698L53032n4344J19312M45569k40210p0901j86884q179
7271D6738m25069Q3135N80138L00739L74006j436222J39478P4228K11917M27937
7261C77025n10278O69739l53508L39670m99425o5687l43727J89267j31454N40346
7251B11968m71133J366870j288106N83601j83017K64423l36702n08596P92458
$$ plain form
7242 431766 30606 92968 -803705 -282211 160310 294399 -165350 287837 359573 1098799
7232 1098799 -3243 462926 653757 -612634 191727 181249 -160988 350484 64049
7223 64049 50896 112489 1177337 -539975 209235 -169939 130783 1045820 38188 53894
7213 53894 264076 -297615 -235398 -759707 495038 466265 -190783 -33977 180897 746881
7203 746881 -250408 1019003 351267 155472 162296 -618013 254914 -121632 -924064 206788
7193 206788 249495 -128747 501817 -198679 -651775 917480 -316285 290201 -35583 122746
7183 122746 -76683 -7898 -231519 -464075 218545 -560986 -92588 -251256 166068 -1622
7173 -1622 789361 78266 944313 849630 8519 29881 -285249 674470 356803 173302
$$ packed form
7242D31766m01160O2362q96673N21494M42521J34089m59749M53187P1736P39226
7232A098799j102042M66169J90831j266391Q04361j0478l42237N11472k86435
7223F4049j3153O1593J064848j717312P49210l79174L00722R15037j007632J5706
7213E3894K10182n61691O2217n24309J254745k8773o57048J56806K14874N65984
7203G46881r97289J269411o67736j95795O824p80309Q72927l76546q02432J130852
7193B06788M2707l78242O30564p00496m53096J569255j233765O06486l25784J58329
7183A22746j99429O8785k23621k32556O82620p79531M68398j58668M17324j67690
7173a622P90983p11095Q66047r4683q41111K1362l15130R59719l17667j83501
$$ plain form
7163 173302 323149 432222 717703 620795 116696 -232546 -223090 220291 -269625 185006
7153 185006 -358027 177914 386822 207764 270623 -9255 554147 404409 1018691 84639
7143 84639 -184448 688940 -18057 -95122 101244 1170770 -134891 441486 -165646 -281955
7133 -281955 675699 850930 38814 -268111 754936 831878 17705 -121506 228781 -238726
7123 -238726 451906 552080 -369273 73727 -370363 142140 852180 190250 -87705 -168184
7113 -168184 -195766 314340 820283 -57683 845273 -382145 388673 -368856 -183236 -119468
7103 -119468 -853698 -374426 -310656 -551575 -337704 51396 285954 693807 -332034 -200984
7093 -200984 458193 221505 352711 366458 864580 458055 214737 311908 309185 -103310
$$ packed form
7163A73302J49847J09073K85481r6908n04099l49242R456M43381m89916M54631
7153A85006n43033N35941K08908j79058O2859k79878N63402j49738O14282r34052
7143H4639k69087Q73388p06997p7065J96366J069526j305661N76377o07132j16309
7133b81955R57654J75231q12116l06925J023047P6942q14173j39211L50287m67507
7123b38726O90632J00174r21353M43000m44090N12503P10040o61930k77955q0479
7113a68184k7582N10106N05943q77966R02956j227418P70818p57529J85620O3768
7103a19468p34230M79272O3770k40919K13871L89100K34558M07853j025841J31050
7093b00984O59177k36688J31206J3747M98122m06525k43318R7171k723m12495
$$ plain form
7083 -103310 676114 -231229 -291308 -138761 13964 457126 75703 -4264 -144127 -283958
7073 -283958 823948 -92055 621798 -473534 -812093 -314815 -297539 148251 167809 265963
7063 265963 -144742 -669829 700164 1852 -319534 511969 87437 -377905 407971 -129230
7053 -129230 426660 -385626 -588043 663201 512311 386308 -514120 6469 -57512 1440455
7043 1440455 157447 310865 261820 -155053 -149654 -183955 424141 -126804 1033409 616670
7033 616670 381212 -283870 -128394 474271 -25151 12484 368832 -102694 256720 86127
7023 86127 -430367 338363 449240 45906 215504 -92019 -120197 -524430 687454 -239130
7013 -239130 -2894 -553600 -189232 533456 518645 306090 84207 100225 -259826 -280928
$$ packed form
7083a03310P79424r07343o0079J52547J52725M43162l81423p9967j39863j39831
7073b83958J107906r16003P13853j095332l38559M97278J7276M45790J9558R8154
7063B65963m10705n25087J369993o98312l21386Q31503m24532m65342P85876n37201
7053a29230N55890q12286k02417J251244j50890j26003r00428N20589o3981J497967
7043A440455j283008J53418m9045m16873N399l4301O08096n50945J160213m16739
7033F16670k35458o65082J55476O02665m99422L7635L56348m71526L59414j70593
7023H6127n16494P68730J10877m03334J69598l07523k8178m04233J211884r26584
7013b39130K36236n50706L64368P22688j4811k12555k21883J6018l60051k1102
$$ plain form
7003 -280928 487247 1031803 -41790 375752 -110626 -473046 362723 677410 418157 295322
6993 295322 -322824 -7381 -114337 167590 756097 758570 76613 -143819 118250 1003385
6983 1003385 358326 -33720 -465187 -85510 -487180 107119 -338443 309575 34899 -204710
6973 -204710 151464 -117560 78465 -116218 -708857 354426 472842 666268 328204 460899
6963 460899 -284220 37274 981461 -50947 133533 232463 -550755 -617647 -64263 528562
6953 528562 134771 300513 349729 -21095 580595 -146047 -354042 10352 477188 -165620
6943 -165620 842954 382595 752213 673475 -521389 353122 524919 12795 507703 -298820
6933 -298820 111861 -426026 -600202 167222 255704 165699 323137 799391 165265 -550373
$$ packed form
7003b80928P68175N44556j073593M17542m86378l62420Q35769L14687k59253j22835
6993B95322o18146L15443j06956K81927N88507K473o81957k20432K62069Q85135
6983A003385o45059l92046m31467L79677m01670N94299m45562O48018k74676k39609
6973b04710L56174k69024J96025j94683n92639J063283J18416J93426l38064J32695
6963D60899p45119L21494R44187j032408J84480R8930p83218o6892N53384N92825
6953E28562l93791J65742M9216l70824O01690p26642k07995L64394M66836o42808
6943a65620J008574m60359L69618p8738j194864Q74511J71797n12124M94908q06523
6933b98820M10681n37887j74176P67424Q8482r0005J57438M76254o34126p15638
$$ plain form
6923 -550373 322459 457657 220347 306005 63985 78319 -182603 -115099 817931 58644
6913 58644 352841 -608162 788733 278081 -7053 533185 433399 -158363 -129706 313647
6903 313647 -437460 -83220 261536 -375856 323359 -9926 306454 236297 -321038 708106
6893 708106 -673166 117602 -427036 340623 252318 659213 -282686 422792 997276 -352400
6883 -352400 -30750 76272 -225364 -28225 -237425 -72211 -135757 -402406 -236957 186878
6873 186878 -169775 -360176 -12721 781813 -76561 -58572 -189697 90511 -90846 378458
6863 378458 497865 364806 534513 323367 311527 669452 364713 -368400 247242 -185353
6853 -185353 -707175 -275503 208436 295702 -316259 777176 143627 803635 -274137 456856
$$ packed form
6923e50373Q72832J35198k37310Q5658k42020J4334k60922O7504R33030p59287
6913E8644K94197r61003J396895n10652k85134N40238r9786n91762K8657M43353
6903C13647p51107L54240L44756o37392O99215l33285L16380p0157n57335J029144
6893G08106j381272P90768n44638P67659q8305M06895r41899P05478N74484j349676
6883c52400L21650J07022l01636J97139k09200J65214o3546k66649J65449M23835
6873A86878l56653j90401L47455P94534q58374J7989j31125K80208j81357M69304
6863C78458J19407j33059J69707k11146j1840L57925l04739p33113O15642m32595
6853a85353n21822M31672M83939Q7266o11961J093435o33549O60008j077772P30993
$$ plain form
6843 456856 1016714 -86727 354920 -198683 -444291 2692 193247 180076 273297 233707
6833 233707 -477942 -365747 203065 847678 139909 786 -86978 221079 469323 -270372
6823 -270372 645592 -416938 192573 -34504 372994 264619 373293 616122 362127 -521135
6813 -521135 160811 -42846 136945 -468600 638973 461292 571497 -379347 670199
6804 670199 478899 8113 332799 -84504 -964930 479282 -375252 -311337 -103047 169951
6794 169951 330167 -452538 476727 815069 245168 208993 -142100 35471 645643 329563
6784 329563 27387 348904 -111054 657085 -173589 -236831 -156270 -499868 -432193 73587
6774 73587 -234099 503747 -2294 586062 287385 718556 -37906 633071 495313 -374200
$$ packed form
6843D56856N59858j103441M41647n53603k45608M46983J90555j3171R3221l9590
6833B33707p11649J12195N68812O44613p07769j39123q7764L08057K48244p39695
6823b70372R15964j062530O09511k27077M07498j08375J08674K42829k53995q83262
6813e21135O81946k03657J79791o05545J107573j77681J10205r50844J049546
6804F70199j91300m70786L24686m17303q80426J444212q54534O3915K08290K72998
6794A69951J60216p82705R29265L38342n69901l6175l51093J77571O10172l16080
6784C29563l02176L21517m59958P68139q30674o3242Q0561l43598O7675N05780
6774G3587l07686P37846n06041N88356k98677M31171p56462O70977j37758q69513
$$ plain form
6764 -374200 -287087 -632719 8689 -244292 169673 127754 425026 146239 813375 104843
6754 104843 -41764 533077 19297 -487800 -615613 99530 211079 -94803 965252 451071
6744 451071 -324147 -687222 62522 205112 637495 195049 -209593 989131 676667 855488
6734 855488 53701 -21380 -63707 -15499 157394 167308 -96485 -439156 219563 428705 165143
6723 165143 237925 87421 -219376 -277111 -141518 64736 -111701 -227783 -555195 -462150
6713 -462150 746923 405660 493761 -742581 21952 -293083 284934 -56666 124980 574091
6703 574091 -125526 801808 391148 415372 111999 425567 -141761 -152323 176318 265142
6693 265142 330800 -554306 296530 328804 33656 99178 66753 1062137 402254 -15239
$$ packed form
6764c74200Q7113l45632O41408k52981M13965m1919K97272k78787O67136p08532
6754A04843j46607N74841n13780n07097j27813P15143J11549l05882J060055n14181
6744D51071p75218l63075P49744J42590M32383m42446m04642J198724l12464J78821
6734H55488q01787p5081m2327M8208J72893R914k63793l42671O58719K09142k63562
6723A65143P2782j50504l06797n7735J35593K06254j76437j16082l27412R3045
6713d62150J209073l41263Q8101j236342P64533l15035N78017l41600J81646M49111
6703E74091o99617R27334m10660K4224l03373L13568n67328j0562L28641Q8824
6693B65142O5658q85106Q50836L2274k95148O5522l2425R95384o59883m17493
$$ plain form
6683 -15239 -116930 -537765 167429 96028 48844 553018 -514215 280617 569748 415900
6673 415900 -159360 150691 343515 209629 336854 475883 596681 -422408 235749 95350
6663 95350 254415 -239474 -73533 388501 145148 302036 467751 264143 197923 746985
6653 746985 -541408 -376694 -174490 -469830 245402 -75239 579568 -693973 -20415
6644 -20415 291954 -405338 -96272 -723373 123326 356946 642957 548316 -106601 633976
6634 633976 33683 109887 251061 -52322 -425751 -594981 -179421 499417 -70527 92980
6624 92980 67858 190975 -750072 27206 465382 -193435 35784 207466 525951 123252
6614 123252 302385 -326874 286061 -156008 267362 265749 732210 543549 -333409 208183
$$ packed form
6683a5239j01691m20835P05194p1401m7184N04174j067233P94832K89131j53848
6673D15900n75260L10051J92824j33886J27225J39029J20798j019089O58157j40399
6663I5350J59065m93889J65941M62034k43353J56888J65715k03608o6220N49062
6653G46985j288393J64714K02204k95340P15232l20641O54807j273541O73558
6644b0415L12369o97292L09066o27101Q46699K33620K86011r4641o54917P40577
6634F33976o00293P6204J41174l03383l73429j69230M15560O78838n69944J63507
6624I2980k5122J23117r41047P77278M38176o58817K29219J71682L18485m02699
6614A23252J79133o29259O12935m42069M23370j613M66461j88661q76958N41592
$$ plain form
6604 208183 373831 207291 -340325 -212724 674766 -174540 -102847 146460 369444 -232126
6594 -232126 149687 355185 64698 -425891 -654135 500896 -138401 -294758 154114 783368
6584 783368 -245551 501073 -170959 -496871 -319145 -569006 60617 291721 394580 304539
6574 304539 605259 -66981 324746 415957 576530 471008 -166697 -778733 -277826 503826
6564 503826 205955 -52834 -711473 200438 394694 112249 -122111 604531 -302560 -281624
6554 -281624 430335 165401 72616 -337878 -137674 237371 1244503 402830 -684246 -39056
6544 -39056 843518 535999 -956537 550723 613921 427696 712805 -270497 382205 464083
6534 464083 448261 23489 6302 387128 658559 -187169 -689113 853939 -390934 90297
$$ packed form
6604B08183J65648j66540n47616J27601Q87490q49306P1693K49307K22984o01570
6594b32126L81813K05498k90487m90589k28244J155031o39297j56357M48872O29254
6584G83368j028919P46624o72032l25912J77726k49861O29623K31104J02859r0041
6574C04539L00720o72240L91727R1211J60573j05522o37705o12036N00907P81652
6564E03826k97871k58789o58639R11911J94256k82445k34360P26642r07091K0936
6554b81624P11959k64934r2785m10494K00204L75045J007132q41673j087076O45190
6544c9056Q82574l07519j492536J507260O3198j86225K85109r83302O52702Q1878
6534D64083j5822m24772j7187L80826K71431q45728n01944J543052j244873M81231
$$ plain form
6524 90297 177013 -453512 -415344 11834 -36324 232475 -168618 318265 -365336 7919
6514 7919 344883 272948 192510 -122003 147059 -162114 137027 33508 643091 195416
6504 195416 157492 -208381 -636917 -864341 700339 -472619 -318098 -248982 269514 150226
6494 150226 227866 -178633 -273803 753185 51900 545249 -200466 683202 90681 -126309
6484 -126309 -151361 -190009 409931 708896 -172547 192265 125763 -476515 316428 -565705
6474 -565705 394007 90912 -588522 -91051 -163707 44450 289734 601288 -335482 149947
6464 149947 638958 -396216 126415 -334655 448709 690522 427876 272713 80244 -337167
6454 -337167 -636173 357222 966829 -208374 -545184 193912 -11208 1020191 55265
$$ packed form
6524I0297Q6716o30525L8168M27178m8158K68799m01093M86883o83601L73255
6514G919L36964p1935q0438l14513K69062l09173K99141j03519O09583m47675
6504A95416l7924l65873m28536k27424J564680j172958J54521O9116N18496j19288
6494A50226P7640m06499r5170J026988p01285M93349p45715Q83668n92521k16990
6484a26309k5052l8648N99940K98965q81443L64812o6502o02278P92943q82133
6474e65705R59712l03095o79434M97471p2656K08157K45284L11554r36770M85429
6464A49947M89011j035174N22631m61070P83364K41813k62646j55163j92469m17411
6454c37167k99006R93395O09607j175203l36810P39096k05120J031399r64926
$$ plain form
6445 55265 525229 -337026 359641 241183 -16813 40947 594177 973000 373949 675830
6435 675830 -78681 -510851 511915 149854 -317926 -235690 632533 485220 534040 221492
6425 221492 204251 288118 594963 264254 -370626 16501 -214968 193920 161989 -670019
6415 -670019 236337 128685 -170001 -661343 -2320 -160181 -706750 -213609 321919 403865
6405 403865 168750 923393 -437830 -177259 696377 -378739 -86101 44596 -528942
6396 -528942 235829 -318886 648668 -45496 451869 199494 -55668 545610 -586828 437433
6386 437433 493970 573694 237144 147040 117609 -499178 -417858 410049 779624 282605 144650
6375 144650 209569 500426 779550 -408516 61560 9713 616498 548376 -705579 536133
$$ packed form
6445E5265M69964q62255O96667j18458k57996N7760N53230L78823n99051L01881
6435F75830p54511m32170J022766l62061m67780Q2236Q68223j47313M8820l12548
6425B21492j7241Q3867L06845l30709o34880L87127k31469M08888l1931q32008
6415f70019R06356j07652k98686m91342O59023j57861n46569M93141N35528Q1946
6405D03865k35115P54643j361223K60571Q73636j075116K92638J30697n73538
6396e28942P64771n54715R67554o94164M97365k52375k55162O01278j132438J024261
6386D37433N6537P9724l36550r0104k9431o16787Q1320Q27907L69575m97019j37955
6375A44650O4919K90857K79124j188066M70076n1847O06785o8122j253955J241712
$$ plain form
6365 536133 -240884 -450985 -73428 -88008 67971 -362003 267067 265330 537674 670794
6355 670794 -552487 -1713 -109443 158358 -286491 470799 -166430 -244768 369526 -345122
6345 -345122 193926 99190 284930 366114 121804 -54675 27558 114911 137474 177097 -479770
6334 -479770 375662 130734 306921 -757793 279640 -333556 287312 -55233 28642 -56663
6324 -56663 224656 438137 98981 -109327 411810 -3234 -592917 -630879 513718 -155383
6314 -155383 -361759 -215050 6343 21596 144603 469226 574499 -386209 -780400 70025
6304 70025 256432 236686 -384524 724721 -856811 -272152 886742 754037 326301 254052
6294 254052 378402 -325646 714334 399910 371974 299096 40401 -226764 -206336 -143364
$$ packed form
6365E36133p77017k10101L77557j4580J55979m29974O29070j737K72344J33120
6355F70794j223281N50774j07730K67801m44849P57290o37229p8338O14294p14648
6345c45122N39048r4736J85740Q1184k44310j76479Q2233Q7353K2563L9623o56867
6334d79770Q55432k44928J76187j064714J037433o13196O20868l42545Q3875q5305
6324e6663K81319K13481l39156k08308N21137m15044n89683l7962J144597o69101
6314a55383k06376J46709K21393J5253J23007L24623J05273r60708l94191Q50425
6304G0025J86407j9746o21210J109245j581532N84659J158894j32705m27736p2249
6294B54052J24350p04048J039980l14424k7936p2878k58695k67165K0428O2972
$$ plain form
6284 -143364 534256 340656 199579 895894 1055682 218953 -70549 -447185 435119 444750
6274 444750 -441351 395470 302669 -82345 212366 181325 -11592 317429 82146 609846
6264 609846 8588 -23645 90913 596923 256630 83611 397051 316101 -35711 498528
6254 498528 657951 135452 30456 -431801 -391589 111327 -43467 230171 -23460 -320220
6244 -320220 -200758 553853 -265884 -104606 -219251 985989 -245317 140752 10939
6235 10939 755512 -134772 223815 148249 282006 497922 497703 684230 126209 195936 34063
6224 34063 -401989 4026 185627 234686 96499 -290867 437734 625331 172087 -181832
6214 -181832 75138 192759 639113 318323 418537 -26960 158324 502582 609426 408479
$$ packed form
6284a43364O77620j93600j41077O96315J59788q36729k89502l76636Q82304R631
6274D44750q86101Q36821r2801l85014K94711l1041j92917L29021k35283N27700
6264F09846o01258l2233J14558N06010l40293j73019L13440q0950l51812N34239
6254D98528J59423n22499j04996m62257M0212N02916j54794K73638k53631k96760
6244c20220J19462P54611q19737J61278j14645J205240j231306L86069j29813
6235A0939P44573q90284L58587p5566J33757K15916k19J86527n58021O9727j61873
6224C4063m36052M06015J81601M9059j38187l87366P28601J87597m53244l53919
6214a81832K56970J17621M46354l20790J00214m45497J85284L44258J06844k00947
$$ plain form
6204 408479 -110899 -151281 500874 -231375 182294 102397 690418 529240 79010 95322
6194 95322 -320508 704470 320151 604906 580196 -37206 8760 -396343 649382 -45641
6184 -45641 295200 -73476 -83880 -408511 460874 682937 160330 -381314 298073 -99763
6174 -99763 -70720 -484548 -949406 453360 525650 -278424 -60533 -358183 -14970 -138448
6164 -138448 369477 -382121 463126 66742 642329 336975 470796 85134 -642799 351819
6154 351819 526075 326193 -242965 51910 418363 162820 530735 -67073 884461 -268101
6144 -268101 361496 273220 240615 402182 131940 43528 -626537 857003 -16445 -266601
6134 -266601 173012 -339024 259328 108559 583968 -735456 -248279 -371174 -283664 524279
$$ packed form
6204D08479n19378m0382O52155p32249M13669p9897N88021j61178m50230J6312
6194I5322m15830J024978l84319K84755k4710o17402M5966m05103J045725o95023
6184d5641L40841l68676j0404l24631Q69385K22063n22607n41644O79387l97836
6174i9763K9043m13828m64858J402766P2290q04074K17891k97650L43213j23478
6164a38448N07925p51598Q45247l96384N75587l05354J33821l85662p27933R94618
6154C51819J74256j99882n69158K94875L66453k55543L67915n97808R51534j152562
6144b68101O29597q8276l2605J61567k70242q8412o70065J483540q73448k50156
6134b66601M39613n12036N98352j50769M75409j319424M87177j22895Q7510Q07943
$$ plain form
6124 524279 -3642 651197 -195973 143160 415017 407470 240656 185770 360560 302902
6114 302902 -208575 114778 397792 477352 -180201 -798114 309870 -35226 -200460 111803
6104 111803 86180 224472 378575 165472 -19112 213767 31701 745170 824431 565537
6094 565537 -256544 742955 841800 -104821 -302297 -211832 -286510 357073 -322439 -336043
6084 -336043 -297268 625211 236201 105321 787265 493878 -77872 437134 -139032 -405841
6074 -405841 -438351 81087 -220685 210859 80949 271075 141820 101129 -679686 -117250
6064 -117250 980062 130219 584317 -93561 536072 -219244 50320 101490 457179 984569
6054 984569 342394 -484499 -179469 -26184 -232518 -418660 934035 427293 -602946
$$ packed form
6124E24279n27921O54839q47170L39133K71857p547j66814n4886J74790n7658
6114C02902n11477L23353K83014P9560o57553o17913J107984l45096j65234L12263
6104A11803k5623J38292J54103k13103j84584K32879j82066P13469P9261k58894
6094E65537q22081R99499R8845r46621j97476R0465p4678O43583o79512j3604
6084c36043L8775R22479l89010j30880O81944k93387n71750N15006n76166k66809
6074d05841l2510N19438l01772M31544j29910J90126j29255m0691p80815N62436
6064a17250J097312q49843M54098o77878O29633p55316K69564N1170L55689N27390
6054I84569o42175q26893L05030J53285k06334j86142J352695n06742j030239
$$ plain form
6045 -602946 616372 380818 -615331 348447 -313807 232108 617 531372 437109 781281
6035 781281 -317496 321146 1324761 129412 195411 -768594 -173784 -146000 197596 355918
6025 355918 383793 -329667 276247 -607119 1122820 706106 287035 420088 -73347 368247
6015 368247 69491 394539 176373 491398 565173 308009 -10899 55267 273273 452094
6005 452094 99587 41874 452001 -234429 490625 588769 -595597 9786 -484198 312059
5995 312059 -432942 -762175 59752 -84788 -32413 -294017 -47548 191681 -99601 -712232
5985 -712232 -124859 142640 451124 -87207 74506 13782 464728 -45712 256135 532292
5975 532292 -498026 -63869 117545 248987 861195 67394 -60929 -76637 -303150 47073
$$ packed form
6045f02946J219318k35554r96149R63778o62254N45915k31491N30755r4263L44172
6035G81281j098777O38642J003615j195349O5999r64005N94810K7784L43596J58322
6025C55918K7875p13460O05914q83366J729939m16714m19071J33053m93435M41594
6015C68247k98756L25048k18166L15025P3775k57164l18908O6166K18006J78821
6005D52094l52507n7713M10127o86430P25054R8144j184366O05383m93984P96257
5995C12059p45001l29233Q21927j44540N2375k61604K46469K39229k91282o12631
5985g12232N87373K67499L08484n38331J61713o0724M50946n10440L01847K76157
5975E32292j030318M34157J81414J31442O12208p93801j28323j5708k26513L50223
$$ plain form
5965 47073 35388 680775 -74590 699160 14930 258446 -66250 -694119 657170 164224
5955 164224 525147 900987 51 46761 -19306 292296 -467852 284008 239267 389044
5945 389044 -217399 -147459 -90742 181380 -758059 160984 439065 681931 96860 451541
5935 451541 -398781 747208 241395 136534 765881 -38995 513681 258857 67564 666108
5925 666108 323158 405665 114564 548585 -261926 129467 164018 -271017 565595 371165
5915 371165 142039 29449 53089 367729 497398 364678 -250117 -499960 -65965 446356
5905 446356 185148 333772 110885 555170 -201787 -932209 -376765 -487783 -662396 893346
5895 893346 700319 596368 329032 381771 -106133 -178990 -96989 183725 432299 431029 268035
$$ packed form
5965D7073j1685O45387p55365P73750o84230K43516l24696o27869J351289m92946
5955A64224L60923L75840r00936M6710o6067L11602p60148P51860m4741J49777
5945C89044o06443O9940N6717K72122r39439R19043K78081K42866n85071L54681
5935D51541q50322J145989n05813j04861O29347q04876N52676k54824j91293N98544
5925F66108l42950Q2507k91101M34021q10511L91393L4551m35035Q36612j94430
5915C71165k29126j12590K3640L14640J29669j32720o14795k49843M33995N12321
5905D46356k61208J48624k22887M44285p56957p30422N55444j11018j74613J555742
5895H93346j93027j03951k67336N2739m87904p2857Q2001K80714K48574j270j62994
$$ plain form
5884 268035 -161441 169655 30834 -131625 474961 573593 -397083 389557 43709 258855
5874 258855 -121772 -524726 -205308 -536214 492599 151982 495698 279947 219242 -329409
5864 -329409 115957 -370118 548431 714325 534445 239613 8801 -266741 -786615 -219241
5854 -219241 -306896 -562850 -64035 -433208 254446 -226358 62341 655951 -34012 -178641
5844 -178641 283530 -270829 -229469 117352 193672 273623 -27778 -19011 -486844 -726882 164080
5833 164080 602193 33392 490670 -212244 -592856 63913 -697082 218086 -378364 -41326
5823 -41326 -212049 501291 186074 365710 -351560 271864 63621 -610704 496047 632631
5813 632631 114441 -468661 404515 -8164 102275 -224723 -264622 1338898 249191 -396377
$$ packed form
5884B68035m29476L31096j38821j62459O06586R8632r70676P86640l45848K15146
5874B58855l80627m02954L19418l30906J028813l40617L43716k15751o0705n48651
5864c29409M45366m86075R18549J65894j79880k94832k30812k75542n19874N67374
5854b19241q7655k55954M98815l69173O87654m80804K88699N93610o89963j44629
5844a78641M62171n54359M1360L46821P6320P9951l01401Q767m67833k40038Q90962
5833A64080M38113n68801M57278p02914l80612O56769p60995R15168n96450L37038
5823d1326j70723P13340l15217J79636p17270O23424k08243o74325J106751J36584
5813F32631n18190n83102Q73176m12679J10439l26998l9899J603520j089707o45568
$$ plain form
5803 -396377 133641 1047191 -249504 307982 395053 319561 47163 -76064 1023676 -14353
5793 -14353 -230959 852190 464207 398546 157471 -27102 289742 257421 657108 -269887
5783 -269887 227948 114417 14932 -669670 -261302 533613 -549167 -699250 74267 164522
5773 164522 81332 414201 474770 41031 -372780 368735 -191930 221501 102619 78137
5763 78137 -438398 -302890 564681 785626 -636812 491550 551623 -64278 374307 1552125
5753 1552125 289990 264021 518017 111504 151525 355419 427429 149866 455059 340130
5743 340130 -528232 824014 -317401 -242667 389433 98310 65366 158685 644266 475410
5733 475410 214604 -971990 -118855 -443343 727310 141239 96243 -403318 865716
$$ packed form
5803c96377N30018R13550j296695N57486Q7071p5492k72398j23227J099740j038029
5793a4353k16606J083149l87983o5661k41075j84573L16844l2321L99687r26995
5783b69887M97835j13531r9485o84602M08368P94915j082780j50083P73517R0255
5773A64522q3190L32869O0569m33739m13811P41515n60665M13431j18882k4482
5763G8137n16535J35508Q67571K20945j422438J128362O0073o15901M38585J177818
5753A552125j262135k5969K53996m06513M0021K03894P2010k77563L05193j14929
5743C40130q68362J352246j141415P4734O32100k91123l2944R3319M85581j68856
5733D75410k60806j186594Q53135l24488J170653n86071m4996m99561J269034
$$ plain form
5724 865716 535466 375035 97786 -53435 -141510 140595 416351 -193112 -94332 458117
5714 458117 264385 242813 287082 482929 155227 1034481 860363 674355 412077 162665
5704 162665 129444 -284358 495319 -1045272 -58854 -87376 -101233 288502 310640 706907
5694 706907 638829 255466 592235 95565 -343813 224512 90238 893586 -518350 564232
5684 564232 -68054 622645 372339 254460 129522 264610 281767 516915 -384405 -96265
5674 -96265 1299175 930207 202004 1088418 854208 576031 199860 734184 397523 98406
5664 98406 27480 881632 -59586 1066226 743846 783107 551363 612817 739902 889630
5654 889630 873609 618375 515731 1464564 894417 -59969 1154691 1267553 1252183 992478
$$ packed form
5724H65716l30250j60431k77249j51221q8075K82105K75756o09463R8780N52449
5714D58117j93732k1572M4269J95847l27702Q79254j74118j86008k62278k49412
5704A62665l3221m13802P79677j540591R86418k8522j3857L89735K2138L96267
5694G06907o8078l83363L36769m96670m39378N68325j34274Q03348j411936J082582
5684E64232o32286O90699k50306j17879j24938J35088J7157K35148r01320K88140
5674i6265J395440l68968p28203Q86414k34210k78177l76171N34324l36661k99117
5664I8406p0926Q54152r41218J125812l22380L9261k31744O1454J27085J49728
5654H89630j6021k55234j02644R48833n70147r54386J214660J12862j5370k59705
$$ plain form
5644 992478 1200492 831472 1526015 1763567 1282718 1256865 1713645 1940656 1445843 1436147
5634 1436147 1239672 1636957 1336904 2359902 1965826 2161210 1897561 2285332 2307888 2276960
5624 2276960 2509761 3359781 4147135 3159420 4409560 4868553 6069910 6632576 7942532
5615 7942532 7782811 9305586 10758316 11591693 13478251 15677657 17672578 19652734 22740153
5606 22740153 25456221 27348161 29070543 29147612 28440957 28005631 26300095 24553367 23797464
5597 23797464 22601349 21063291 20036474 17911405 17342717 14874289 13387918 11786782
5589 11786782 11082514 10636732 10489065 9319370 8310257 8354732 8481155 9313926 9406035
5580 9406035 10167701 10338948 10636559 10418059 11080088 11732092 9884767 10242255 9816123
$$ packed form
5644I92478K08014l69020O94543K37552m80849k5853M56780K27011m94813r696
5634A436147j96475L97285l00053J022998l94076J95384k63649L87771K2556l0928
5624B276960K32801Q50020P87354r87715J250140M58993J201357N62666J309956
5615G942532j59721J522775J452730Q33377J886558K199406J994921J980156L087419
5606B2740153K716068J891940J722382P7069p06655m35326j705536j746728p55903
5597B3797464j196115j538058j026817k125069n68688k468428j486371j601136
5589A1786782p04268m45782j47667j169695j009113M4475J26423Q32771R2109
5580I406035P61666J71247K97611k18500O62029O52004j847325L57488m26132
$$ plain form
5571 9816123 9870195 8382668 8383517 7273222 7423972 6770307 5964676 5057353 4564987 4198221
5561 4198221 3664882 4132182 3353193 2152205 1564736 1720893 1043293 1848021 1849809 1855512
5551 1855512 1811554 2010816 1670360 719219 1166357 1345829 1239066 1632705 1387535 447396
5541 447396 408868 1403031 843300 881894 985146 475713 2207999 1187645 989629 941653
5531 941653 759809 281047 693955 883732 462392 1203162 1118501 786672 837470 721905
5521 721905 356515 923950 326747 598584 902113 732596 173009 114047 868103 902850
5511 902850 558052 319091 1927393 -47940 245145 654433 1098428 304716 -618759
5502 -618759 386088 430970 1106709 1465302 822697 1442905 592443 217439 1071509 452028
$$ packed form
5571I816123N4072j487527Q49j110295J50750o53665q05631r07323m92366l66766
5561D198221n33339M67300p78989j200988n87469J56157o77600Q04728J788N703
5551A855512m3958J99262l40456r51141M47138J79472j06763L93639k45170r40139
5541D47396l8528R94163n59731L8594J03252n09433J732286j020354j98016m7976
5531I41653j81844m78762M12908J89777m21340P40770q4661l31829N0798j15565
5521G21905l65390N67435n97203K71837L03529j69517n59587n8962P54056L4747
5511I02850l44798k38961J608302j975333K93085M09288M43995p93712r23475
5502f18759J004847M4882O75739L58593o42605O20208q50462l75004Q54070o19481
$$ plain form
5492 452028 1223483 466349 1208341 120876 453780 -71517 318456 1182565 843504 385561
5482 385561 289084 349187 209318 524460 653934 680615 71312 424872 1237242 144059
5472 144059 461012 216212 499180 909109 183279 913062 697006 1265247 559410 1026995
5462 1026995 1247251 547011 612730 1280589 1814354 563440 1272519 717665 1085962 736143
5452 736143 846832 488717 524393 -44694 850375 409646 349785 -2233 1054503 389635
5442 389635 255883 1262844 895476 -455097 380847 154085 799937 1119342 218227
5433 218227 250070 319057 1185137 918019 -118783 728786 164146 -85403 186506 190993
5423 190993 806394 832430 542944 1480460 271489 1273461 1014511 760753 300240 734352
$$ packed form
5492D52028P71455p57134P41992j087465L32904n25297L89973Q64109l39061m57943
5482C85561r6477O0103j39869L15142J29474K6681o09303L53560Q12370j093183
5472A44059L16953k44800K82968M09929p25830P29783k16056N68241p05837M67585
5462A026995K20256p00240O5719O67859N33765j250914P09079n54854L68297l49819
5452G36143J10689l58115L5676n69087Q95069m40729n9861l52018J056736o64868
5442C89635j33752J006961l67368j350573Q35944k26762O45852L19405r01115
5433B18227L1843O8987Q66080k67118j036802Q47569n64640k49549K71909M487
5423A90993O15401K6036k89486R37516j208971J001972k58950k53758m60513M34112
$$ plain form
5413 734352 489225 889693 169588 935822 1400444 656085 216114 581359 673663 507102
5403 507102 1500235 445110 571704 415545 903433 120618 1023578 537337 616044 479480
5393 479480 991633 840604 1178312 591762 1067018 1290838 671379 1868232 761324
5384 761324 568895 602137 1377284 1288772 244275 939258 704178 885456 407880 928225
5374 928225 997931 561358 380527 485766 1045277 1268262 998797 443387 840892 572310
5364 572310 430691 1130529 1467846 1868962 721379 1597414 1249859 1233129 897525 598971
5354 598971 546715 930550 937638 1125534 -124585 859762 209954 782656 536774 1505038
5344 1505038 685701 633862 1121719 232097 226146 615554 -68936 655220 332661 1066962
$$ packed form
5413G34352k45127M00468p20105P66234M64622p44359m39971L65245R2304j66561
5403E07102R93133j055125J26594j56159M87888p82815R02960m86241P8707j36564
5393D79480N12153j51029L37708n86550M75256K23820o19459J196853j106908
5384G61324j92429L3242P75147q8512j044497O94983k35080J81278m77576N20345
5374I28225O9706m36573j80831J05239N59511K22985k69465n55410L97505k68582
5364E72310j41619O99838L37317M01116j147583Q76035l47555j6730l35604k98554
5354E98971n2256L83835P088J87896j250119R84347o49808N72702k45882R68264
5344A505038q19337n1839M87857q89622n951L89408o84490P24156l22559P34301
$$ plain form
5334 1066962 610776 -80359 641145 460761 1156164 486017 841715 275116 1157796 1045313
5324 1045313 735289 386243 147703 122028 234302 772172 1150129 599307 725589 626326
5314 626326 716143 1230823 230146 1079689 451058 614358 330969 270579 1107706 660063
5304 660063 1269924 509082 205463 267533 526622 594518 1035033 526347 1655042 593193
5294 593193 1015942 1121342 736107 581855 404457 387621 359156 807515 117579 956830
5284 956830 810006 1012911 273133 -89993 707088 694241 442560 798238 1161614 196061
5274 196061 1192415 -201959 738397 601877 705315 849071 877991 856266 1549580 1143930
5264 1143930 1231389 241601 968893 595192 515795 793614 668414 1261738 596922 -370952
$$ packed form
5334A066962m56186o91135P21504j80384O95403o70147L55698n66599Q82680j12483
5324A045313l10024l49046k38540k5675J12274N37870L77957n50822J26282r9263
5314F26326Q9817N14680j000677Q49543o28631J63300k83389o0390Q37127m47643
5304F60063O09861p60842l03619O2070K59089O7896M40515n08686J128695j061849
5294E93193M22749J05400l85235j54252j77398j6836k8465M48359o89936Q39251
5284I56830j46824K02905p39778l63126P97081j2847k51681L55678L63376r65553
5274A96061R96354j394374R40356j36520J03438J43756K8920k1725O93314m05650
5264A143930Q7459r89788P27292l73701p9397K77819j25200N93324o64816r67874
$$ plain form
5254 -370952 310706 731010 437251 1401296 1041850 1179137 410242 330601 -32477 -397320
5244 -397320 285138 71112 404990 738053 1143930 265461 533933 1001669 865225 883460
5234 883460 546187 447809 1057521 1033745 1179950 548611 1251263 1199493 510089 957225
5224 957225 674640 401795 494826 965693 790720 1389495 1015125 1375875 1788372 1619117
5214 1619117 1190063 1674953 2442639 1788137 2218334 1346826 2079170 2922032 2106074 2428587
5204 2428587 2661301 3172888 3509024 2205937 3133494 2943034 2955661 3221749 2526020 1921974
5194 1921974 2495223 2801188 2722262 2355796 3249858 2674710 2199656 2629681 2400288 1480650
5184 1480650 2045981 2842340 1872386 1761452 1571889 1873428 1144538 1812905 1442102 1104521
$$ packed form
5254c70952O81658M20304k93759R64045l59446J37287p68895p9641l63078l64843
5244c97320O82458k14026L33878L33063M05877q78469K68472M67736j36444J8235
5234H83460l37273r8378O09712k3776J46205o31339P02652n1770o89404M47136
5224I57225k82585k72845R3031M70867j74973N98775l74370L60750M12497j69255
5214A619117m29054M84890P67686o54502M30197q71508P32344Q42862q15958L22513
5204B428587K32714N11587L36136j303087R27557j90460J2627K66088o95729o04046
5194A921974N73249L05965p8926l66466Q94062n75148m75054M30025k29393r19638
5184A480650N65331P96359r69954j10934j89563L01539p28890O68367l70803l37581
$$ plain form
5174 1104521 1172945 1189623 789210 1166880 1025972 979851 747993 889914 1157293 762690
5164 762690 1210153 323303 494623 1017987 1089205 331417 892292 1032362 777968 1276428
5154 1276428 815291 1139917 472094 321290 975255 1559254 1806669 301069 1098238
5145 1098238 389504 263571 619034 1164668 1176688 -9729 414480 1605879 1308205
5136 1308205 881370 289861 991072 684720 656650 1392181 1332750 872130 567048 1382837
5126 1382837 824686 811873 1036518 969947 556638 195858 1107467 1360243 1008195 1415527
5116 1415527 302138 1177582 924792 2127329 1221368 1090436 2123866 1901530 2001017
5107 2001017 1389458 1298243 1653874 2073217 1692483 1890774 2156079 1181579 1716851 2151316
$$ packed form
5174A104521O8424J6678m00413L77670j40908m6121k31858J41921K67379l94603
5164G62690M47463q86850J71320N23364P1218p57788N60875J40070k54394M98460
5154A276428m61137L24626o67823j50804O53965N83999K47415j505600P97169
5145A098238p08734j25933L55463N45634J2020j186417M24209J191399k97674
5136A308205m26835n91509P01211l06352k8070P35531n9431m60620l05082Q15789
5126A382837n58151j2813K24645o6571m13309l60780R11609K52776l52048M07332
5116A415527j113389Q75444k52790J202537r05961j30932J033430k22336R9487
5107B001017o11559r1215L55631M19343l80734J98291K65305r74500N35272M34465
$$ plain form
5097 2151316 2060176 2012138 1700444 2492983 2456976 2936453 2376067 1897406 1733149 2418531
5087 2418531 1323340 1741735 2841068 2270420 2692547 2654357 3335238 2334514 3427514
5078 3427514 2904822 3469268 2678447 2098742 2515078 3359414 3681456 3087498 3580847 3606086
5068 3606086 2890784 3239522 4224422 4174781 4477449 4840893 3696849 4282464 4249672 5083514
5058 5083514 5447479 5048954 5106086 4946183 5353603 5207995 5094351 5610492 5382996 5413374
5048 5413374 5995754 5778111 6662246 6494080 6687103 6963149 7390551 7323388 7391550 7595888
5038 7595888 7544340 8042311 8202515 8572166 8001033 8522440 9078615 9231525 9878036 9414497
5028 9414497 9487795 9594121 10800667 10853455 10068896 11640332 11693206 12055078 12501659 12408233
$$ packed form
5097B151316r1140m8038l11694P92539l6007M79477n60386m78661j64257O85382
5087B418531j095191M18395J099333n70648M22127l8190O80881j000724J093000
5078C427514n22692N64446p90821n79705M16336Q44336L22042n93958M93349K5239
5068C606086p15302L48738R84900m9641L02668L63444j144044N85615l2792Q33842
5058E083514L63965l98525N7132j59903M07420j45608j13644N16141k27496L0378
5048E413374N82380k17643Q84135j68166J93023K76046M27402o7163O8162K04338
5038G595888n1548M97971J60204L69651n71133N21407N56175J52910O46511m63539
5028I414497P3298J06326J206546N2788p84559J571436N2874L61872M46581r3426
$$ plain form
5018 12408233 13136641 13213494 13806941 14345595 14569767 14271741 14878946 14963366 15447921 15822902
5008 15822902 15949501 17358217 17799177 18170244 18880348 19590262 19978669 21384109 21939602
4999 21939602 22354013 22792552 24412890 24609570 26537727 26935152 27692429 29507908 31758198
4990 31758198 32190816 33736616 36249201 38897019 42306522 45638156 49550220 53763463
4982 53763463 57786677 62307368 67456213 74055070 82085400 92215099 102945427 113720907
4974 113720907 126888107 140633411 155920288 173911438 190137930 206682218 223030432
4967 223030432 237249719 253251199 270046269 289586677 311964590 335261137 353906521
4960 353906521 369376550 381841260 391996507 401912946 411576751 425768455 444760601
$$ packed form
5018A2408233P28408P6853N93447N38654K24172k98026O07205Q4420M84555L74981
5008A5822902J26599J408716M40960L71067P10104P09914L88407J405440N55493
4999B1939602M14411M38539J620338J96680J928157L97425P57277J815479K250290
4990C1758198M32618J545800K512585K647818L409503L331634L912064M213243
4982E3763463M023214M520691N148845O598857Q030330J0129699J0730328J0775480
4974A13720907J3167200J3745304J5286877J7991150J6226492J6544288J6348214
4967B23030432J4219287J6001480J6795070J9540408K2377913K3296547J8645384
4960C53906521J5470029J2464710J0155247R916439R663805J4191704J8992146
$$ plain form
4953 444760601 461857755 469757253 470334517 466652421 459681745 448589478 437014092 430299860
4945 430299860 428176949 423440701 413011598 398240061 380178430 359199328 336633628
4938 336633628 313421789 296705223 282583145 267934993 251934969 232163145 213669229
4931 213669229 193129895 172737933 154189254 137609548 123975818 111434933 100069825
4924 100069825 90593958 79515023 69597006 60047301 53569311 47731726 42867090 38335540
4916 38335540 34626896 32068849 28914511 27289251 26025465 24276004 23116092 22448370
4908 22448370 20866502 20697055 19737498 19065388 18028370 18121246 17824126 16189584 17422435
4899 17422435 16263756 14761399 15588915 15008722 14985395 14381947 13759380 13320696 13589563
$$ packed form
4953D44760601J7097154P899498N77264l682096o970676j1092267j1575386o714232
4945D30299860k122911m736248j0429103j4771537j8061631k0979102k2565700
4938C36633628k3211839j6716566j4122078j4648152j6000024j9771824j8493916
4931B13669229k0539334k0391962j8548679j6579706j3633730j2540885j1365108
4924A00069825r475867j1078935r918017r549705o477990n837585m864636m531550
4916C8335540l708644k558047l154338j625260j263786j749461j159912o67722
4908B2448370j581868j69447r59557o72110j037018R2876k97120j634542J232851
4899A7422435j158679j502357Q27516n80193k3327o03448o22567m38684K68867
$$ plain form
4890 13589563 12363178 12975470 12336096 11324536 10518791 11696357 11401367 11597323 10195419
4881 10195419 9974089 9882086 9407263 9867415 9482282 9910572 9524176 9657286 9447383 8420979
4871 8420979 8146093 8177951 8456859 7528017 8505849 7507661 7795989 7364182 6959583 7111921
4861 7111921 6956585 8195122 6287744 6136360 6143769 6504135 5699289 6165038 6352076 6270612
4851 6270612 5575092 5891314 5954325 6021446 5659482 5602423 5095521 5237716 4744089 4328325
4841 4328325 4636603 4139895 4872868 5371783 5330750 4428413 3738424 4477076 4150731 3809286
4831 3809286 4125600 3801270 3682804 4758111 3910359 3255040 4527226 4535068 3515002
4822 3515002 4385012 4038334 3246023 3802628 4416751 3781613 3428143 3352336 3139629 2823422
$$ packed form
4890A3589563j226385O12292o39374j011560q05745J177566k94990J95956j401904
4881A0195419k21330r2003m74823M60152l85133M28290l86396J33110k09903j026404
4871H420979k74886L1858K78908r28842R77832r98188K88328m31807m04599J52338
4861G111921j55336J238537j907378j51384P409L60366q04846M65749J87038q1464
4851F270612o95520L16222O3011O7121l61964n7059n06902J42195m93627m15764
4841D328325L08278m96708P32973M98915m1033r02337o89989P38652l26345l41445
4831C809286L16314l24330j18466J075307q47752o55319J272186P842j020066
4822C515002Q70010l46678p92311N56605O14123o35138l53470p5807k12707l16207
$$ plain form
4812 2823422 3764761 3879222 3240643 3590938 3296385 3911532 3582637 3271187 2711923 3122056
4802 3122056 2887607 2545790 2232297 3361310 2829624 3064481 1789385 3254964 2666857
4793 2666857 2374691 2362707 1742276 2318629 2527524 2810818 2272839 2611766 2338511 2862158
4783 2862158 2324868 2812642 2756824 3134143 2066392 2468801 2854571 2496116 2372279 2852583
4773 2852583 1663578 2624008 2537668 2446298 3371072 2307851 2523211 2857325 2166531 2991158
4763 2991158 2411048 2657113 1926906 2435257 2058782 2671137 2045341 2101565 1523529 2174276
4753 2174276 1921925 2426227 2406765 1587921 2470352 1331691 1928309 2352435 2628116 1823578
4743 1823578 2291077 2146342 1607145 1798810 1631450 2039436 1968697 2327951 2880643 2071335
$$ packed form
4812B823422R41339J14461o38579L50295k94553O15147l28895l11450n59264M10133
4802C122056k34449l41817l13493J129013n31686K34857j275096J465579n88107
4793B666857k92166j1984o20431N76353K08895K83294n37979L38927k73255N23647
4783B862158n37290M87774n5818L77319j067751M02409L85770l58455j23837M80304
4773B852583j189005R60430q6340r1370R24774j063221K15360L34114o90794Q24627
4763B991158n80110K46065p30207N08351l76475O12355o25796N6224n78036O50747
4753B174276k52351N04302j9462q18844Q82431j138661N96618M24126K75681q04538
4743A823578M67499j44735n39197J91665j67360M07986p0739L59254N52692q09308
$$ plain form
4733 2071335 1459189 2090609 1950941 1962349 2687754 2160153 2466975 2058923 3142869 2408761
4723 2408761 2975384 2775101 3042465 1881081 1993056 2936872 3083287 3761178 3204867
4714 3204867 2973280 3304611 3704986 3817425 4283629 3882511 3346112 4382302 4061903
4705 4061903 4223493 4093786 3490172 3764945 4166879 4091312 4325072 3315204 3643645 4382269
4695 4382269 4560108 4788472 3777462 3727418 3521629 3923417 3658268 4093455 3182904 3355886
4685 3355886 3245387 3555087 2918355 2831300 3600197 2961594 2617792 2099424 2314811 2966336
4675 2966336 2471657 3191321 2099988 1984617 2110334 1758280 1724149 1686695 1475152 1416063
4665 1416063 2028334 792652 1534450 2111155 2193694 2065896 1120912 1239537 540770 1767966
$$ packed form
4733B071335o12146O31420j39668J1408P25405n27601L06822m08052J083946p34108
4723B408761N66623k00283K67364j161384J11975R43816J46415O77891n56311
4714C204867k31587L31331M00375J12439M66204m01118n36399J036190l20399
4705D061903J61590j29707o03614K74773M01934p5567K33760j009868L28441P38624
4695D382269J77839K28364j011010n0044k05789M01788k65149M35187r10551J72982
4685C355886j10499L09700o36732q7055P68897o38603l43802n18368K15387O51525
4675B966336m94679P19664j091333j15371J25717l52054l4131l7454k11543n9089
4665A416063O12271j235682P41798N76705Q2539j27798r44984J18625o98767J227196
$$ plain form
4655 1767966 1586447 1174045 1122670 2167752 1310716 1482873 728800 2052754 706055
4646 706055 2006449 1948974 1454798 1864305 1231037 1116929 1332793 1468773 1357409 582155
4636 582155 1275346 1555019 1824721 1024832 919803 1683528 1097172 1449203 1194866 1869890
4626 1869890 2296265 1733093 1570648 1539588 1032066 1891766 1375461 1474989 1970681 1244767
4616 1244767 1078311 1731936 933532 1547348 889702 1157094 975791 813844 1107846 1714823
4606 1714823 1342296 1221493 1331119 1617601 1929737 1598549 1408408 1359006 1398983 822597
4596 822597 1361520 181067 2079977 2016653 1232949 400463 940278 535225 1546272
4587 1546272 1508760 1016614 1215699 1429264 1311787 831660 1329064 852607 1255518 943934
$$ packed form
4655A767966j81519m12402n1375J045082q57036J72157p54073J323954j346699
4646G06055J300394n7475m94176M09507o33268j14108K15864J35980j11364p75254
4636E82155O93191K79673K69702p99889j05029P63725n86356L52031k54337O75024
4626A869890M26375n63172j62445l1060n07522Q59700n16305R9528M95692p25914
4616A244767j66456O53625p98404O13816o57646K67392j81303j61947K94002O06977
4606A714823l72527j20803J09626K86482L12136l31188j90141m9402L9977n76386
4596H22597N38923j180453J898910o3324p83704q32486N39815m05053J011047
4587A546272l7512m92146J99085K13565j17477m80127M97404m76457M02911l11584
$$ plain form
4577 943934 1253057 1141101 692051 1011220 1157140 1139958 808013 1490847 1236375 1611208
4567 1611208 1104092 1625245 626636 1608141 1218936 233490 1239006 1238678 664614 2011275
4557 2011275 743660 1002543 882126 455673 1521953 1243816 629281 1430093 1080794
4548 1080794 1141915 914870 371213 2627675 1233662 924375 1341074 1093902 1211074
4539 1211074 1123815 959792 1759344 2125134 1131485 1402573 823443 1559405 1366729 787213
4529 787213 1456812 1738328 482040 1312244 680536 1062792 584332 1202779 1330558 1817716
4519 1817716 971369 1006438 723261 1025377 1071983 369172 365758 1068355 880988 1336099
4509 1336099 1099249 1444588 1261301 1602561 493938 1195417 1350251 556722 1213246
$$ packed form
4577I43934L09123j11956m49050L19169J45920j7182l31945O82834k54472L74833
4567A611208n07116N21153r98609R81505l89205r85446J005516l28n74064J346661
4557B011275j267615K58883j20417m26453J066280k78137o14535Q00812l49299
4548A080794O1121k27045n43657K256462j394013l09287M16699k47172J17172
4539A211074q7259j64023P99552L65790r93649K71088n79130P35962j92676n79516
4529G87213O69599K81516j256288Q30204o31708L82256m78460O18447J27779M87158
4519A817716q46347L5069k83177L02116M6606p02811l414P02597j87367M55111
4509A336099k36850L45339j83287L41260j108623P01479J54834p93529O56524
$$ plain form
4500 1213246 1214866 -311307 1551741 1324385 1404852 1221307 815965 594247 244272 1354645
4490 1354645 1370823 730865 303737 1377907 768285 1483359 1035838 366400 943344 538527
4480 538527 784660 690090 522939 1392784 337910 1023582 1352733 1013811 644245 778800
4470 778800 1126822 1368760 466281 1809140 1114725 1206783 645963 1268997 1218041 824400
4460 824400 1235235 1299321 616659 550578 538333 751405 766560 571487 1038345 1092653 689139
4449 689139 998458 594227 1908055 1020232 1212328 1771545 1478318 1364356 1586084 1003992
4439 1003992 1112343 1130187 1080921 780164 1280329 1185451 1455692 716886 1101453 1571555
4429 1571555 1203701 965758 1297754 609726 567856 1355945 946617 712404 786049 627912
$$ packed form
4500A213246J620j526173J863048k27356Q0467j83545m05342k21718l49975J110373
4490A354645J6178o39958m27128J074170o09622P15074m47521o69438N76944m04817
4480E38527K46133r4570j67151Q69845j054874O85672L29151l38922l69566J34555
4470G78800L48022K41938r02479J342859o94415R2058n60820O23034n0956l93641
4460H24400M10835O4086o82662o6081j2245K13072J5155j95073M66858N4308m03514
4449F89139L09319m04231J313828q87823J92096N59217k93227j13962K21728n82092
4439A003992J08351J7844m9266l00757N00165r4878K70241p38806L84567M70102
4429A571555l67854k37943L31996o88028m1870P88089m09328k34213P3645j58137
$$ plain form
4419 627912 1412122 972340 519951 1518132 1540843 871363 1080464 333695 1159137 268605
4409 268605 763064 572090 1122924 789861 996799 1544775 1027040 1243350 1088437 878658
4399 878658 1092319 780590 802506 790304 1140794 1159104 1451342 84272 548451 821802
4389 821802 2090202 1698182 111331 705241 939859 1021614 796844 1221049 841042 894080
4379 894080 1258775 1096964 930986 1373176 403644 939490 1150834 1753423 889736 1135162
4369 1135162 1624069 1210629 882591 1107399 1774898 1470666 1501201 1411251 874533 777815
4359 777815 598126 1774940 1437044 890801 1976367 1108937 1732972 1348197 1874225
4350 1874225 1282458 82095 1663177 1208996 1815879 889372 1600220 1005085 2022363
$$ packed form
4419F27912P84210m39782m52389R98181K2711o69480K09101p46769Q25442q90532
4409B68605M94459j90974N50834l33063K06938N47976n17735K16310j54913k09779
4399H78658K13661l11729K1916j2202L50490J8310K92238j367070M64179K73351
4389H21802J268400l92020j586851N93910K34618Q1755k24770M24205l80007N3038
4379H94080L64695j61811j65978M42190r69532N35846K11344O02589q63687K45426
4369A135162M88907m13440l28038K24808O67499l04232L0535q9950n36718r6718
4359G77815j79689J176814l37896n46243J085566q67430O24035l84775N26028
4350A874225n91767j200363J581082m54181O06883r26507P10848n95135J017278
$$ plain form
4341 2022363 1673879 1470477 1251379 2170817 1831589 1277010 803190 1882623 659069
4332 659069 1362366 312050 402120 360814 1329394 1170420 514509 1129856 451775 132089
4322 132089 438855 367664 786828 784664 1800806 839663 1230552 955698 1708001 886729
4312 886729 742857 1464957 1160482 892628 1045331 650233 437753 1097327 1192650 1245386
4302 1245386 696756 1351837 505109 778414 849170 875322 681372 419341 561397 447316
4292 447316 1168424 1417597 1146249 1155143 601761 344920 453929 487635 -247010 263478
4282 263478 1095205 934599 887806 323673 565289 1162306 1370744 778408 1313572 1112767
4272 1112767 912216 1719688 317531 1101705 1185887 747937 267563 860509 298448 798827
$$ packed form
4341B022363l48484k03402k19098R19438l39228n54579m73820J079433j223554
4332F59069P03297j050316R0070m1306R68580j58974o55911O15347o78081l19686
4322A32089L06766p1191M19164k164J016142r61143L90889k74854P52303q21272
4312H86729j43872P22100l04475k67854J52703l95098k12480O59574R5323N2736
4302A245386n48630O55081q46728K73305P0756K6152j93950k62031J42056j14081
4292D47316P21108K49173k71348Q894n53382k56841J09009L3706p34645N10488
4282B63478Q31727j60606m6793n64133K41616N97017K08438n92336N35164k00805
4272A112767k00551Q07472j402157P84174Q4182m37950m80374N92946n62061N00379
$$ plain form
4262 798827 715837 364604 1252386 1127388 1007964 1428222 1854769 1352821 668491 612609
4252 612609 1132614 490788 499943 990153 971679 1093006 947308 633924 786924 482605
4242 482605 1010417 1327090 250381 1341527 1042616 1460719 1009516 842466 19466
4233 19466 28695 1436668 643029 1387512 1155544 605092 672461 957831 163715 598621
4223 598621 1146466 205017 820703 571970 1026200 616925 1254682 734292 731088 648102
4213 648102 1385128 951500 557150 1036355 357448 648040 783234 824609 955306 1412675
4203 1412675 1010227 459104 921611 480718 1125131 902890 572745 853788 576194 682289
4193 682289 681196 730563 167929 882841 144937 1403258 828393 1303312 535458 859429
$$ packed form
4262G98827q2990l51233Q87782j24998j19424M20258M26547n01948o84330n5882
4252F12609N20005o41826R155M90210j8474J21327j45698l13384J53000l04319
4242D82605N27812L16673j076709J091146k98911M18103m51203j67050q23000
4233A9466R229J407973p93639P44483k31968n50452O7369K85370p94116M34906
4223E98621N47845r41449O15686k48733M54230m09275O37757n20390l204q2986
4213F48102P37026m33628l94350M79205o78907K90592J35194M1375J30697M57369
4203A412675m02448n51123M62507m40893O44413k22241l30145K81043k77594J06095
4193F82289j093M9367n62634P14912p37904J258321n74865M74919p67854L23971
$$ plain form
4183 859429 328356 335707 642838 731749 920978 890708 933309 909457 842912 1261646 965601
4172 965601 583120 557982 150287 842506 952216 -90100 476666 1057943 951522 85932
4162 85932 457642 632993 1050254 1424366 396438 1384633 768379 1362996 560024 996524
4152 996524 1326102 241990 529487 801907 1289138 1301586 1022983 1080065 575783 906302
4142 906302 977375 850448 823985 1462548 218899 1313328 530243 880786 664874 300901
4132 300901 810430 1684687 627382 784342 1109424 145293 831069 790465 1077664 408762
4122 408762 695714 769051 490670 745704 325327 1028458 967628 1170907 1042833 580070
4112 580070 679082 609076 963545 1039407 486709 1037300 866058 -8512 1166630 1190640
$$ packed form
4183H59429n31073P351L07131Q8911J89229l0270M2601k3852o6545M18734k96045
4172I65601l82481k5138m07695O92219J09710j042316N66766N81277j06421q65590
4162H5932L71710J75351M17261L74112j027928R88195o16254N94617q02972M36500
4152I96524L29578j084112K87497K72420M87231J2448k78603N7082n04282L30519
4142I06302P1073j26927k6463O38563j243649J094429p83085L50543k15912l63973
4132C00901N09529Q74257j057305J56960L25082r64131O85776m0604K87199o68902
4122D08762K86952P3337k78381K55034m20377P03131o0830K03279j28074m62763
4112E80070R9012p0006L54469P5862n52698N50591j71242q74570J175142K4010
$$ plain form
4102 1190640 839121 890105 1373835 1169919 103758 22863 1801500 682576 1056305
4093 1056305 390043 853608 1213517 986433 1033049 728385 930817 638324 1549394 292411
4083 292411 891226 1280044 282408 958635 1094318 658362 94294 -65232 902223 1337580
4073 1337580 1068572 1357905 247640 607901 869867 976440 739255 905522 1275982
4064 1275982 586775 876370 596795 138386 461994 1161034 1358153 1093554 1049344 670476
4054 670476 464899 570368 1872526 920524 984451 505012 525727 355652 381375 639677
4044 639677 1111899 1422018 639116 824010 1478770 1051348 535728 1105870 510509 1733213
4034 1733213 960095 2146573 564374 1658038 877996 835771 1027036 921801 1218799
$$ packed form
4102A190640l51519N0984M83730k03916j066161q0895J778637j118924L73729
4093A056305o66262M63565L59909k27084M6616l04664K02432k92493R11070j256983
4083B92411N98815L88818r97636O76227J35683m35956n64068j59526R67455M35357
4073A337580k69008K89333j110265L60261K61966J06573k37185J66267L70460
4064A275982o89207K89595k79575m58409L23608O99040J97119k64599m4210l78868
4054F70476k05577J05469J302158r52002O3927m79439K0715j70075K5723K58302
4044F39677M72222L10119p82902J84894O54760m27422n15620N70142n95361J222704
4034A733213p73118J186478j582199J093664p80042m2225J91265j05235K96998
$$ plain form
4025 1218799 1053158 969635 605189 603054 773181 139046 883187 656341 1480828 830821
4015 830821 1045514 918420 566974 878047 1455602 473483 927989 503688 624743 634177
4005 634177 947025 2170202 1404664 1243156 279375 983609 665280 865367 531105 939676
3995 939676 1177440 755502 464055 823723 470587 1321643 1495084 1452870 1250481 722060
3985 722060 593245 263681 624709 621053 1137866 861824 1449106 609557 1081549 1282113
3975 1282113 731036 802112 1056751 226348 1590550 942933 1209270 867231 470047 758588
3965 758588 831062 680177 965659 315524 835354 372507 1181843 932354 713965 1561379
3955 1561379 1180870 1168968 514318 468470 183069 404708 1332805 824682 1274735 831748
$$ packed form
4025A218799j65641q3523l64446k135J70127o34135P44141k26846Q24487o50007
4015H30821K14693j27094l51446L11073N77555r82119M54506m24301J21055R434
4005F34177L12848J223177p65538j61508r63781P04234l18329K00087l34262M08571
3995I39676K37764m21938k91447L59668l53136Q51056J73441m2214k02389n28421
3985G22060j28815l29564L61028l656N16813k76042N87282q39549M71992K00564
3975A282113n51077P1076K54639q30403J364202o47617K66337l42039l97184K88541
3965G58588P2474j50885K85482o50135N19830m62847Q09336k49489k18389Q47414
3955A561379l80509j1902o54650m5848k85401K21639R28097n08123M50053m42987
$$ plain form
3945 831748 736465 278843 1238508 -170621 633828 573408 772330 863693 1301192 340278
3935 340278 1212327 1234714 372576 1309518 627042 518973 1079915 1133851 1089203 -4123
3925 -4123 717469 1246653 251104 407928 1011061 637431 592519 -136771 -1515 853298
3915 853298 475053 720246 1705087 674355 1058849 189617 1292128 603609 868121
3906 868121 366504 992984 956319 159680 1363594 714409 618036 836769 414297 -369
3896 -369 170654 608784 1067603 470262 1399594 880595 -280278 727184 601961 705255
3886 705255 333911 78778 310661 767783 560012 682430 183910 1665575 809656 673484
3876 673484 898567 1526148 1411537 683203 151222 59703 878368 -62511 1214769 781583
$$ packed form
3945H31748r5283m57622R59665j409129Q04449o0420J98922R1363M37499r60914
3935C40278Q72049K2387q62138R36942o82476j08069N60942N3936m4648j093326
3925d123P21592N29184r95549J56824O03133l73630m4912p29290J35256Q54813
3915H53298l78245K45193R84841j030732L84494q69232J102511o88519K64512
3906H68121n01617O26480l6665p96639J203914o49185r6373K18733m22472m14666
3896c69J71023M38130M58819n97341R29332n18999j160873J007462j25223J03294
3886G05255l71344k55133K31883M57122k07771J22418m98520J481665q55919j36172
3876F73484K25083O27581j14611p28334n31981r1519Q18665r40879J277280m33186
$$ plain form
3866 781583 984224 -468806 1577994 725315 1239784 248705 1164591 830266 1151577
3857 1151577 455840 511335 1493116 1147414 432302 121225 1006714 787052 5179 1026593
3847 1026593 87337 605022 758850 942143 802263 836430 872395 277777 508332 1322099
3837 1322099 245956 774693 498273 437933 426874 -158989 492964 1077439 451262 944371
3827 944371 639749 941392 1512596 387218 456056 751034 -132644 703387 698850 1287661
3817 1287661 668782 455207 1025504 618770 328817 313317 932822 751626 936390 466325
3807 466325 662674 324763 453983 835899 564184 810462 1024151 425161 883744 355333
3797 355333 403430 669896 601758 1180159 463132 254338 448689 1170543 728976 574306
$$ packed form
3866G81583K02641j453030K046800q52679N14469r91079R15886l34325L21311
3857A151577o95737N5495R81781l45702p15112l11077Q85489k19662p81873J021414
3847A026593r39256N17685J53828J83293j39880L4167L5965n94618K30555Q13767
3837A322099j076143N28737k76420o0340j1059n85863O51953N84475o26177M93109
3827I44371l04622L01643N71204j125378O8838K94978q83678Q36031m537N88811
3817A287661o18879k13575N70297m06734k89953j5500O19505j81196J84764m70065
3807D66325J96349l37911J29220L81916k71715K46278K13689n98990M58583n28411
3797C55333M8097K66466o8138N78401p17027k08794J94351P21854m41567j54670
$$ plain form
3787 574306 -209028 562534 290474 805779 997750 360763 912919 378090 885533 608445
3777 608445 572039 155459 241849 483623 164593 595551 833371 893399 327408 628968
3767 628968 679541 301615 927719 992713 677863 308355 731457 905064 361489 1050821
3757 1050821 1052258 322998 525878 618513 755276 409887 906379 870438 901218 452707
3747 452707 176870 240876 696384 785755 800621 202483 643383 483945 790646 495808
3737 495808 646795 762939 40150 431982 872288 560811 640586 689261 865400 669774
3727 669774 903573 971588 799413 975213 1537619 847476 486684 22764 1231632 1073020
3717 1073020 1564967 361969 711231 94283 905794 401873 1061263 785191 666761
$$ packed form
3787E74306p83334P71562k72060N15305J91971o36987N52156n34829N07443k77088
3777F08445l6406m16580Q6390K41774l19030M30958K37820O0028n65991L01560
3767F28968N0573l77926O26104O4994l14850l69508M23102J73607n43575O89332
3757A050821J437p29260K02880R2635J36763l45389M96492l5941L0780m48511
3747D52707k75837O4006M55508Q9371J4866n98138M40900j59438L06701k94838
3737D95808J50987J16144p22789L91832M40306l11477P9775M8675J76139j95626
3727F69774K33799O8015j72175J75800N62406o90143l60792m63920J208868j58612
3717A073020M91947j202998L49262o16948Q11511n03921O59390k76072j18430
$$ plain form
3708 666761 674909 274050 376298 643928 710637 943989 38079 880030 -48485 513127
3698 513127 693303 91641 -34798 570445 278554 810800 -276323 -107174 745946 1105681
3688 1105681 1611213 490435 230061 659822 803154 951820 771235 937009 36657
3679 36657 689000 314433 173703 237196 606072 806575 892413 711383 607662 946552
3669 946552 367894 594664 758819 300239 213935 155094 581351 1046595 399946 887108
3659 887108 518792 714717 262640 366357 894358 803792 380493 664725 616079 340597
3649 340597 1172397 1419717 770694 889603 166245 -373755 1283266 757206 461937 700321
3639 700321 1080344 -29771 703269 908000 1120514 562196 818870 890226 271872 578210
$$ packed form
3708F66761Q148m00859J02248K67630O6709K33352r05910Q41951r28515N61612
3698E13127J80176o01662j26439O05243k91891N32246j087123J69149Q53120L59735
3688A105681N05532j120778k60374M29761J43332J48666j80585J65774r00352
3679C6657O52343l74567j40730O3493L68876K00503Q5838j81030j03721L38890
3669I46552n78658K26770J64155m58580q6304n8841M26257M65244o46649M87162
3659H87108l68316J95925m52077J03717N28001r0566m23299K84232m8646k75482
3649C40597Q31800K47320o49023J18909p23358n40000J657021n26060k95269K38384
3639G00321L80023j110115P33040K04731K12514n58318K56674P1356o18354L06338
$$ plain form
3629 578210 -139792 679352 604713 396635 802640 202186 712094 365664 474246 1027853
3619 1027853 334889 153882 486582 -70843 96839 710354 779764 377588 1344196 674326
3609 674326 321051 414627 559054 904124 227272 531310 1002934 104360 699886 640645
3599 640645 177795 872439 -120760 533311 544064 568902 334712 415444 637183 760332
3589 760332 551753 443303 891893 808362 672024 307139 557850 456913 237800 1035070
3579 1035070 917057 749924 740039 850559 341893 703359 172062 1255362 513379 405983
3569 405983 -181568 -268500 1612618 581168 477801 1206448 297068 917688 444807 554952
3559 554952 1028366 844367 570178 763626 1044298 638212 452961 137829 1024103 210314
$$ packed form
3629E78210p18002Q19144p4639k08078M06005o00454N09908l46430J08582N53607
3619A027853o92964j81007L32700n57425J67682O13515O9410m02176R66608o69870
3609F74326l53275R3576J44427L45070o76852L04038M71624q98574N95526n9241
3599F40645m62850O94644r93199O54071J0753K4838k34190Q0732K21739J23149
3589G60332k08579j08450M48590q3531j36338l64885K50711j00937k19113P97270
3579A035070j18013j67133r885J10520n08666L61466n31297J083300p41983j07396
3569D05983n87551q6932J881118j031450j03367P28647r09380O20620m72881J10145
3559E54952M73414j83999k74189J93448K80672m06086j85251l15132Q86274q13789
$$ plain form
3549 210314 465626 497440 554907 587389 533634 -270208 416274 718366 654517 1218835 1069467
3538 1069467 805922 558336 496864 799361 985894 -48071 281810 882542 530628 -273866
3528 -273866 131856 1316736 1039720 634327 738497 1035233 462139 895894 406273 267982
3518 267982 638402 370940 173247 688622 529897 127145 557861 517114 383321 631927
3508 631927 -244783 935434 131225 471028 604420 329488 902763 -282216 -15843
3499 -15843 644470 -155123 257997 786096 735064 -111753 -504100 276446 699117 1471618
3489 1471618 262445 462881 877927 283319 442882 827632 56890 375945 568480
3480 568480 996315 373006 591630 -45340 1673432 570324 474041 382078 1200488 658389
$$ packed form
3549B10314K55312L1814N7467L2482n3755q03842O86482L02092o3849N64318j49368
3538A069467k63545k47586o1472L02497J86533j033965L29881O00732l51914q04494
3528b73866M05722J184880k77016m05393J04170K96736n73094M33755m89621j38291
3518B67982L70420k67462j97693N15375j58725m02752M30716m0747j33793K48606
3508F31927q76710J180217q04209L39803J33392k74932N73275j184979K66373
3499a5843O60313p99593M13120N28099n1032q46817l92347P80546M22671P72501
3489A471618j209173K00436M15046n94608J59563L84750p70742L19055J92535
3480E68480M27835o23309K18624o36970J718772j103108r6283r1963Q18410n42099
$$ plain form
3470 658389 760545 477497 438275 600534 901532 1212204 580337 -271959 687825 738646
3460 738646 768694 536615 51373 -312442 287426 2011233 1800099 319256 98770 434332
3450 434332 771506 894741 657828 592142 912457 407860 623788 659999 699164 839538
3440 839538 410748 815987 -176124 581892 -12495 405534 1310720 440948 965754 748293
3430 748293 573518 858546 136504 730650 1115825 -459940 1176070 1464720 943103
3421 943103 886958 552178 1004502 162410 499039 962894 298097 1024663 1526345 487405
3411 487405 785599 709563 372777 1091171 1340476 132568 865261 901716 524171 1081380
3401 1081380 857598 690675 1091351 813532 637403 1271595 1087459 1041720 583425 355348
$$ packed form
3470F58389J02156k83048l9222J62259L00998L10672o31867q52296R59784N0821
3460G38646L0048k32079m85242l63815N99868J723807k11134j480843k20486L35562
3450D34332L37174J23235k36913o5686L20315n04597K15928L6211L9165J40374
3440H39538m28790M05239r92111P58016n94387M18029R05186q69772N24806k17461
3430G48293j74775K85028p22042N94146L85175j575765J636010K88650n21617
3421I43103n6145l34780M52324q42092L36629M63855o64797P26566N01682j038940
3411D87405K98194p6036l36786P18394K49305j207908P32693L6455l77545N57209
3401A081380k23782j66923M00676k77819j76129O34192j84136m5739m58295k28077
$$ plain form
3391 355348 982980 913848 847476 491372 1754103 1344475 1182112 521681 1045534 1744816
3381 1744816 1553569 1129485 1210634 1020496 607520 731266 514925 671251 559505 494941
3371 494941 1021425 984662 1242642 743048 1099034 781503 1445650 1788200 1994714 1756733
3361 1756733 1325694 1570400 945797 1167548 1679669 1145129 1167427 1788321 1998024 1741511
3351 1741511 2179954 2235606 2534110 2689627 2654406 2652096 2881520 2993396 2477245 3137584
3341 3137584 3534060 3600885 4408899 5466142 7275559 7076943 8744981 9702530 9847275
3332 9847275 11572617 12261032 14415125 15864403 17825936 19442596 21922972 25483729
3324 25483729 27956855 29611388 31034239 31271861 31349641 30000814 27918514 26953581 25186659
$$ packed form
3391C55348O27632o9132o6372l56104J262731m09628j62363o60431N23853O99282
3381A744816j91247m24084Q1149j90138m12976J23746k16341J56326j11746o4564
3371D94941N26484l6763K57980m99594L55986l17531O64147L42550K06514k37981
3361A756733m31039K44706o24603K21751N12121n34540K2298O20894K09703k56513
3351A741511M38443N5652K98504J55517l5221k310K29424J11876n16151O60339
3341C137584L96476O6825Q08014J057243J809417j98616J668038R57549J44745
3332I847275J725342O88415K154093J449278J961533J616660K480376L560757
3324B5483729K473126J654533J422851K37622P7780j348827k082300r64933j766922
$$ plain form
3315 25186659 23366996 21995948 20511779 19006056 17921358 15259497 12113898 11217332
3307 11217332 8819725 8438528 6456716 5997091 4833528 3871488 3147882 2641662 1940378
3298 1940378 2295496 2929161 2372045 2399740 1433489 1765757 1780796 1079776 1861373 1093954
3288 1093954 1538416 929363 1253212 1380637 1911308 341377 673484 1322439 1307121 1374054
3278 1374054 943026 1553737 1142008 1264779 1155956 1127100 1257867 1101305 1221664 1551088
3268 1551088 1362057 519950 1116955 250879 885700 876969 1304894 1363060 952317 1198748
3258 1198748 659853 970072 702604 856701 1306420 706595 787043 1029231 563169 1092339
3248 1092339 960387 483250 162310 1068352 1012918 534301 375310 573988 241724 314337
$$ packed form
3315B5186659j819663j371048j484169j505723j084698k661861l145599q96566
3307A1217332k397607l81197j981812m59625j163563r62040p23606n06220p01284
3298A940378L55118O33665n57116K7695r66251L32268J5039p01020P81597p67419
3288A093954M44462o09053L23849J27425N30671j569931L32107O48955j5318O6933
3278A374054m31028O10711m11729J22771j08823k8856J30767j56562J20359L29424
3268A551088j89031q42107N97005q66076O34821q731M27925N8166m10743K46431
3258A198748n38895L10219k67468J54097M49719n99825Q0448K42188m66062N29170
3248A092339j31952m77137l20940R06042n5434m78617j58991J98678l32264P2613
$$ plain form
3238 314337 671630 462663 893650 490916 621017 293442 409870 752987 484525 394890
3228 394890 208702 606153 999667 1292791 474726 5265 452804 462998 929762 -218687
3218 -218687 859369 846909 124100 -193211 295975 982355 879210 1059095 -198867 466232
3208 466232 645929 314170 3450 21322 917199 885490 446073 326075 583138 -648627
3198 -648627 771403 309505 780116 1014764 884261 288072 397995 850279 92579 831883
3188 831883 22937 110176 91053 61407 -161579 1114988 415044 458277 -76822 477245
3178 477245 524409 658627 1118789 406839 561466 679712 947420 -480166 380657 1544207
3168 1544207 230753 -63104 671318 329514 -13346 494689 236564 755378 538201
$$ packed form
3238C14337L57293k08967M30987m02734J30101l27575J16428L43117k68462q9635
3228C94890j86188L97451L93514K93124q18065m69461M47539J0194M66764j148449
3218b18687J078056j2460p22809l17311M89186O86380j03145J79885j257962O65099
3208D66232J79697l31759l10720J7872Q95877l1709m39417j19998K57063j231765
3198f48627J420030m61898M70611K34648j30503n96189J09923M52284p57700P39304
3188H31883q08946Q7239j9123k9646k22986J276567o99944M3233n35099N54067
3178D77245M7164J34218M60162p11950J54627J18246K67708j427586Q60823J163550
3168A544207j313454k93857P34422l41804l42860N08035k58125N18814k17177
$$ plain form
3159 538201 1052966 371865 247276 32403 659835 645542 398734 1077146 433424 492945
3149 492945 956836 547628 631475 510938 368953 361549 90802 935611 320835 1332615
3139 1332615 840665 238063 574065 648993 407172 -522390 479679 590279 406825 88591
3129 88591 658735 478084 502672 952996 554422 614310 296867 308009 457017 159171
3119 159171 499116 189288 517236 -648199 211034 -231786 1032497 -276856 486667
3110 486667 575705 -258660 541521 794063 518456 206859 149220 264287 334697 467859
3100 467859 663954 1052027 -27015 870708 1182699 862308 200325 -11562 98997 223588
3090 223588 381185 -43766 753874 541088 513344 438389 745360 395963 718045 546084
$$ packed form
3159E38201N14765o81101j24589k14873O27432j4293k46808O78412o43722N9521
3149D92945M63891m09208Q3847j20537j41985p404k70747Q44809o14776J011780
3139A332615m91950o02602L36002P4928k41821r29562J002069J10600j83454l18234
3129H8591N70144j80651K4588M50324l98574N9888l17443J1142J49008k97846
3119A59171L39945l09828L27948j165435Q59233m42820J264283j309353P63523
3110D86667Q9038q34365Q00181K52542k75607l11597n7639J15067P0410J33162
3100D67859J96095L88073j079042Q97723L11991l20391o61983k11887J10559J24591
3090B23588J57597m24951P97640k12786k7744p4955L06971l49397L22082j71961
$$ plain form
3080 546084 463393 809189 567550 1036075 164231 77839 762350 225399 1058545 704892
3070 704892 4629 466354 130805 516191 1531742 999781 453804 1095729 27548
3061 27548 510068 85128 898165 533475 649489 316312 504546 217660 154350 229772
3051 229772 348923 627162 -223197 -348509 1027572 -71350 495937 712045 1105069
3042 1105069 895438 511527 634697 410660 730589 1096073 -298027 472326 103204
3033 103204 577328 346876 -72697 -53624 991400 -228226 664975 -41915 834151 151408
3023 151408 486440 524454 9831 985323 402726 -99255 369788 367049 427034 102867
3013 102867 145273 104254 579115 16431 374455 238888 -347081 -101673 613960 491495
$$ packed form
3080E46084q2691L45796k41639M68525q71844q6392O84511n36951Q33146l53653
3070G04892p00263M61725l35549L85386J015551n31961n45977O41925j068181
3061B7548M82520m24940Q13037l64690J16014l33177J88234k86886o3310P5422
3051B29772J19151K78239q50359j25312J376081j098922N67287K16108L93024
3042A105069k09631l83911J23170k24037L19929L65484j394100P70353l69122
3033A03204M74124k30452m19573J9073J045024j219626Q93201p06890Q76066o82743
3023A51408L35032L8014n14623R75492n82597n01981M69043k739N9985l24167
3013A02867M2406m1019M74861n62684L58024j35567n85969K45408P15633j22465
$$ plain form
3003 491495 898731 853836 328411 702778 1571807 -38059 1156021 735568 -123206 341361
2993 341361 368994 631805 1028216 304044 447486 -71630 142049 -75760 467160 492572
2983 492572 554479 251118 265070 199319 255360 619266 687816 533661 386299 684817 434439
2972 434439 896623 -492720 1016436 844391 163666 52817 1212300 -47608 658871
2963 658871 134454 489215 990971 431710 -63889 423427 422339 454256 514333 -267071
2953 -267071 -291093 -455501 606128 263548 366887 -28868 658604 -72372 513349 165096
2943 165096 395295 920321 241036 367209 113829 607381 33861 513134 604887 420567
2933 420567 491595 66961 654157 483900 -73278 374274 95211 1029805 266143 115964
$$ packed form
3003D91495M07236m4895n25425L74367Q69029j609866J194080m20453q58774M64567
2993C41361K7633K62811L96411p24172J43442n19116K13679k17809N42920K5412
2983D92572O1907l03361J3952o5751N6041L63906O8550j54155j47362K98518k50378
2972D34439M62184j389343J509156j72045o80725j10849J159483j259908P06479
2963F58871n24417L54761N01756n59261m95599M87316j088L1917O0077p81404
2953b67071k4022j64408J061629l42580J03339l95755O87472p30976N85721l48253
2943A65096K30199N25026o79285J26173k53380M93552n73520M79273R1753j84320
2933D20567P1028m24634N87196j70257n57178M47552k79063R34594p63662j50179
$$ plain form
2923 115964 369206 -51877 622996 -21705 331751 435593 91701 359345 111914 142758
2913 142758 389967 798067 456765 224337 421703 405693 14221 -360774 384586 284864
2903 284864 757360 336952 700153 106405 393315 504822 717897 1096502 1155795 292385
2893 292385 762754 325842 1114 165711 684181 528943 832626 -247566 -5162 570360
2883 570360 100315 565632 323326 -232818 63751 248382 105566 919459 553497 787925
2873 787925 227706 48823 303011 129575 -810231 -534360 674255 619572 145129 685962
2863 685962 -19531 578280 489719 618901 419761 355745 990888 420482 32995 155655
2853 155655 421521 -102591 532160 472282 797791 532804 415271 717678 556502 203141
$$ packed form
2923A15964K53242m21083O74873o44701L53456J03842l43892K67644k47431L0844
2913A42758K47209M08100l41302k32428J97366j6010l91472l74995P45360r9722
2903B84864M72496m20408L63201n93748K86910J11507K13075L78605N9293q63410
2893B92385M70369m36912l24728J64597N18470j55238L03683j080192K42404N75522
2883E70360m70045M65317k42306n56144K96569J84631j42816Q13893l65962K34428
2873G87925n60219j78883K54188j73436r39806K75871J208615n4683m74443N40833
2863F85962p05493N97811q8561J29182j99140o4016O35143n70406l87487J22660
2853A55655K65866n24112O34751n9878L25509k64987j17533L02407j61176l53361
$$ plain form
2843 203141 773288 251827 433038 512610 48947 103768 118044 257850 566013 128558
2833 128558 -208219 1818559 517857 -16651 198493 644153 -207269 904794 679790
2824 679790 497380 184568 1203713 383072 133013 805805 420612 217727 560548 612904
2814 612904 741707 488070 356561 521219 487980 176043 90323 92822 -71041 -82546 -251051
2803 -251051 943214 1178733 57320 247598 714551 642190 130974 814492 581574 1064667
2793 1064667 586645 713468 -322010 451607 604169 829375 206627 289449 793854 520940
2783 520940 362589 1068859 650904 52993 207278 350567 494380 408743 465570 128209
2773 128209 -229090 337650 -59866 -30691 102290 342977 59706 -206516 156475 976183
$$ packed form
2843B03141N70147n21461J81211P9572m63663N4821J4276J39806L08163m37455
2833A28558l36777K026778j300702n34508K15144M45660q51422J112063k25004
2824F79790j82410l12812J019145q20641k50059O72792l85193k02885L42821N2356
2814F12904J28803k53637j31509J64658l3239l11937q5720K499j63863j1505j68505
2803b51051J194265K35519j121413J90278M66953p2361n11216O83518k32918M83093
2793A064667m78022J26823j035478P73617J52562K25206o22748Q2822N04405k72914
2783E20940j58351P06270m17955n97911J54285J43289J43813q5637N6827l37361
2773A28209l57299N66740l97516K9175J32981K40687k83271k66222L62991Q19708
$$ plain form
2763 976183 584707 -385622 241264 468931 -28773 490901 522646 761094 677370 323320
2753 323320 799234 51478 335952 1353555 30686 11449 479633 52611 233424 650870
2743 650870 -376123 469081 46823 202341 712193 919783 80002 -144627 70568 604767
2733 604767 1200204 514052 807156 50776 237667 630433 208685 593186 126326 442648
2723 442648 515896 626461 572484 52461 506605 -201318 252034 301911 318175 590579
2713 590579 174674 86339 781379 378202 144948 513230 272589 -693465 673941 391986
2703 391986 374341 665076 -72065 82107 379213 699100 246367 727101 -290054 305124
2693 305124 194941 244297 257375 -232114 62020 -114993 494414 455391 -569527 238990
$$ packed form
2763I76183l91476r70329O26886K27667m97704N19674L1745K38448q3724l54050
2753C23320M75914p47756K84474J017603j322869j9237M68184m27022J80813M17446
2743F50870j026993Q45204m22258J55518N09852K07590q39781k24629K15195N34199
2733F04767N95437o86152K93104p56380J86891L92766m21748L84501m66860L16322
2723D42648P3248J10565n3977n20023M54144p07923M53352M9877J6264K72404
2713E90579m15905q8335O95040m03177k33254L68282k40641r66054J367406k81955
2703C91986j7645K90735p37141J54172K97106L19887m52733M80734j017155N95178
2693C05124j10183M9356J3078m89489K94134j77013O09407l9023j024918Q08517
$$ plain form
2683 238990 525705 484927 -430320 339302 117326 442482 453390 621948 626908 429428
2673 429428 652567 -6944 892010 446665 108347 606410 652965 -242716 766133 651596
2663 651596 1106480 131230 -182316 753106 59153 -414437 501589 667997 307523 -28478
2653 -28478 551448 300616 262395 957840 319215 -197732 -154622 672397 410491 624098
2643 624098 425075 830158 323841 307548 712074 64460 608327 346832 881218 321255
2633 321255 125271 815730 296703 1019272 178303 -211788 67528 735168 189859 372485
2623 372485 63132 190267 104926 -181576 75757 652185 104378 -20889 265296 230253
2613 230253 -223760 167555 -285259 647894 666801 187 -204595 -154298 82145 837897
$$ packed form
2683B38990K86715m0778r15247P69622k21976L25156J0908J68558M960j97480
2673D29428K23139o59511Q98954m45345l38318M98063M6555q95681J008849j14537
2663F51596M54884r75250l13546R35422o93953m73590R16026J66408l60474l36001
2653b8478N79926k50832l8221O95445o38625n16947M3110Q27019k61906K13607
2643F24098j99023M05083n06317j6293M04526o47614N43867k61495N34386n59963
2633C21255j95984O90459n19027P22569q40969l90091K79316O67640n45309J82626
2623C72485l09353J27135q5341k86502K57333N76428n47807j25267K86185l5043
2613B30253m54013L91315m52814R33153J8907o66614k04782N0297K36443P55752
$$ plain form
2603 837897 696166 236871 -50448 949828 735448 771815 272333 302898 78586 318416
2593 318416 569575 71419 -1609 493925 559079 231235 713466 955029 434100 401579
2583 401579 325665 52991 18282 -507218 56678 655978 664137 851964 689729 855354
2573 855354 180422 -207734 587680 -227663 658107 140428 695910 191928 836089 394571
2563 394571 936080 177725 679970 774658 338991 585383 -2943 901981 758522 885936
2553 885936 -177195 906197 -46731 291826 638300 275997 402623 643938 1112890
2544 1112890 381209 -171817 -64799 975835 145581 763052 -335196 -150711 -75750
2535 -75750 307072 378205 305827 635041 644955 81551 720742 1228387 1098735 765389 -115701
$$ packed form
2603H37897j41731m59295k87319J000276k14380L6367m99482L0565k24312K39830
2593C18416K51159m98156p3028M95534O5154l27844M82231K41563n20929l2521
2583D01579p5914k72674l4709n25500N63896N99300Q159J87827j62235J65625
2573H55354o74932l88156P95414q15343Q85770n17679N55482n03982O44161m41518
2563C94571N41509p58355N02245R4688m35667K46392n88326R04924j43459J27414
2553H85936j063131J083392r52928L38557L46474l62303J26626K41315M68952
2544A112890p31681n53026J07018J040634q30254O17471j098248J84485P4961
2535g5750L82822P1133p2378L29214R914n63404O39191N07645j29652l33346q81090
$$ plain form
2524 -115701 387113 -53209 300624 228591 535162 -175135 357748 680752 322967 43522
2514 43522 891641 1293871 212567 530729 900995 806931 794022 409803 -180329 378005
2504 378005 543752 423503 -359416 -285182 115778 955873 334130 120598 -73484 1090426
2494 1090426 45190 260777 -75023 95881 -214049 154108 613945 55222 -80713
2485 -80713 259416 343183 730733 403304 87486 8564 269260 199377 175287 246701 -677236
2474 -677236 -358316 525870 976904 135080 -270827 -216183 236753 337732 1121198 693290
2464 693290 296631 -123226 -77271 -18977 -193522 396569 482464 1663677 375004 116153
2454 116153 728113 472034 33757 -448663 439603 32051 251821 528586 478978 293189
$$ packed form
2524a15701N02814m40322L53833p2033L06571p10297N32883L23004l57785k79445
2514D3522Q48119M02230j081304L18162L70266r4064j2909l84219n90132N58334
2504C78005J65747j20249p82919P4234M00960Q40095o21743k13532j94082J163910
2494A090426j045236K15587l35800J70904l09930L68157M59837n58723j35935
2485h0713L40129Q3767L87550l27429l15818p8922K60696o9883k4090P1414r23937
2474f77236L18920Q84186M51034q41824m05907N4644M52936J00979P83466m27908
2464F93290l96659m19857M5955N8294j74545N90091Q5895J181213j288673k58851
2454A16153O11960k56079m38277m82420Q88266m07552K19770K76765m9608j85789
$$ plain form
2444 293189 469659 -293020 522517 -285983 -222739 724402 570700 396737 49657 649822
2434 649822 478123 371882 200408 146647 -92873 -230058 183675 92775 538971 79730
2424 79730 -155743 670563 -17551 713306 -357521 520101 807831 340212 -175471 775446
2414 775446 183350 -129499 325896 275285 1005145 296781 355679 848963 174068 11701
2404 11701 630356 617879 312020 -109509 642596 677594 -257652 -264571 100092 346107 544329
2393 544329 797599 -17974 128725 34720 800970 257284 3927 515433 -61681 1100073
2383 1100073 254108 301909 235423 93915 -313817 149769 286936 461008 -385723 652270
2373 652270 623187 -82430 582781 333715 1644065 509257 417714 96188 411563 -42692
$$ packed form
2444B93189J76470p62679Q15537q08500O3244R47141j53702j73963l47080O00165
2434F49822j71699j06241j71474n3761k39520j37185M13733r0900M46196m59241
2424G9730k35473Q26306o88114P30857j070827Q77622K87730m67619n15683R50917
2414G75446n92096l12849M55395n0611P29860p08364N8898M93284o74895j62367
2404A1701O18655j2477l05859m21529P52105L4998r35246o919L64663K46015J98222
2393E44329K53270q15573J46699r4005P66250n43686k53357N11506n77114J161754
2383A100073q45965M7801o6486j41508m07732M63586J37167J74072q46731J037993
2373F52270k9083p05617O65211k49066J310350j134808r1543l21526L15375m54255
$$ plain form
2363 -42692 11170 147464 553067 534411 327360 47751 -471509 -10746 373590 804482
2353 804482 131117 195935 1186830 980194 -199328 823177 679894 -304854 7783 628491
2343 628491 -1162355 -692227 916948 219034 713421 -65302 108247 691985 -143256
2334 -143256 300055 551625 468723 944173 445207 867006 1013275 513683 1241711 -224939
2324 -224939 -273618 326846 170117 682635 -230969 701061 445739 -184942 242492 221859
2314 221859 105732 -182522 312085 552784 96618 -255770 248512 636444 -133572 531886
2304 531886 -197861 48542 743410 979600 427980 305843 985902 -381144 316980 228660
2294 228660 -582731 664141 -283698 120446 -147133 367095 -843486 366429 474985
$$ packed form
2363d2692N3862J36294M05603j8656k07051k79609n19260M60763L84336M30892
2353H04482o73365O4818R90895k06636j179522J022505j43283r84748L12637O20708
2343F28491j790846M70128J609175o97914M94387p78723J73549N83738q35241
2334a43256M43311K51570q2902M75450m98966M21799J46269m99592P28028j466650
2324b24939m8679O00464j56729N12518r13604R32030k55322o30681M27434k0633
2314B21859j16127k88254M94607K40699m56166l52388N04282L87932p70016O65458
2304E31886p29747K46403O94868K36190n51620j22137O80059j367046O98124q8320
2294B28660q11391J246872r47839M04144k67579N14228j210581J209915J08556
$$ plain form
2285 474985 -5989 -57962 73376 358973 502118 52014 -191285 257166 697424 478196
2275 478196 169311 236606 249795 213893 817676 631863 -86127 413386 -2241 -183653
2265 -183653 531115 1168648 717772 415127 239210 -276179 -26333 -241393 1733846 -535044
2255 -535044 287701 129831 35477 715426 506368 559430 353733 395286 -299272 121953
2245 121953 402059 687740 -545243 23939 713267 567109 -216310 455871 -212154 -310232
2235 -310232 342860 -331561 341198 1060554 758677 452045 -38175 326158 641748 57352
2225 57352 -96432 439229 476787 -450036 818788 41903 912918 606880 -34536 36384
2215 36384 618616 321249 501365 -576321 806179 569297 -49274 44484 688767 -3796
$$ packed form
2285D74985m80974n1973J31338K85597J43145m50104k43299M48451M40258k19228
2275D78196l08885O7295J3189l5902O03783j85813p17990M99513m15627j81412
2265a83653P14768O37533m50876l02645j75917n15389K49846k15060J975239k268890
2255e35044Q22745j57870r4354O79949k09058N3062k05697M1553o94558M21225
2245A21953K80106K85681j232983N69182O89328j46158p83419O72181o68025r8078
2235c10232O53092o74421O72759P19356l01877l06632m90220L64333L15590n84396
2225E7352j53784N35661L7558r26823J268824p76885Q71015l06038o41416P0920
2215C6384N82232k97367J80116j077686J382500k36882o18571R3758O44283o92563
$$ plain form
2205 -3796 564116 306871 -127591 748668 -45071 158159 -198594 436739 660253 870385
2195 870385 321531 414494 -250524 451505 160500 705418 701781 1026985 367743 656044
2185 656044 681725 317216 463277 -148389 966522 327580 71384 75669 436301 557011
2175 557011 43773 551895 831860 83213 -246910 253060 260127 33271 996186 -136356
2165 -136356 -138056 575664 438976 -289294 753785 432792 290272 693308 186891 679699
2155 679699 432292 -148522 713911 842514 253802 244282 164330 210700 826150 498420
2145 498420 89314 887126 497670 212173 954532 1108898 881545 939188 758668 886999
2135 886999 138710 113278 363688 389179 851472 801556 -90788 954225 309401 346957
$$ packed form
2205c796N67912k57245m34462Q76259p93739K03230l56753O35333K23514K10132
2195H70385n48854R2963o65018P02029k91005N44918l637L25204o59242K88301
2185F56044K5681l64509J46061o11666J114911o38942k56196M285L60632J20710
2175E57011n13238N08122K79965p48647l30123M99970P067k26856R62915j132542
2165a36356j700P13720j36688p28270J043079l20993j42520M03036n06417M92808
2155F79699k47407n80814Q62433J28603n88712r520p9952M6370O15450l27730
2145D98420m09106P97812l89456k85497P42359J54366k27353N7643j80520J28331
2135H86999p48289k5432K50410K5491M62293m9916q92344J045013o44824L7556
$$ plain form
2125 346957 -206794 181609 181176 1119492 -46381 388742 768350 711715 -262591 87761
2115 87761 399846 952963 612684 44355 171730 418047 705838 325555 1045116 924813
2105 924813 -18400 267131 67461 600886 606307 -580763 -723899 373317 709953 235545
2095 235545 447520 660286 699980 65173 379900 -18683 759285 560339 1043701 37598
2085 37598 -656470 -680539 482935 -435356 333195 355490 791899 1100799 1511167 69151
2075 69151 642352 -19729 652160 693865 580253 538197 142005 686602 721677 -37615
2065 -37615 511393 629609 222275 250676 -155902 679428 960583 832443 94179 609169
2055 609169 372381 417813 553321 822028 41728 216593 -371276 127479 673378 507532
$$ packed form
2125C46957n53751L88403m33R38316j165873M35123L79608n6635r74306L50352
2115H7761L12085N53117l40279n68329J27375K46317K87791l80283P19561j20303
2105I24813r43213K85531j99670N33425N421j187070j43136J097216L36636m74408
2095B35545K11975K12766L9694o34807L14727l98583P77968j98946M83362j006103
2085C7598o94068k4069J163474r18291P68551K2295M36409L08900M10368j442016
2075F9151N73201o62081O71889M1705j13612m2056l96192N44597L5075p59292
2065c7615N49008J18216m07334K8401m06578Q35330K81155j28140p38264N14990
2055F09169k36788M5432J35508K68707p80300J74865n87869M98755N45899j65846
$$ plain form
2045 507532 -40143 515040 -5124 147659 342806 430996 79474 348345 -144237 398177
2035 398177 442002 693907 462845 176954 830967 696623 -43243 567631 412474 768316
2025 768316 729650 -93180 101049 -577435 605310 955515 -442926 1559940 212267
2016 212267 139691 159377 683883 235048 379458 367723 507001 -626966 -426675 569536
2006 569536 475400 561169 444411 435416 283160 701767 539706 186298 260504 204971 452317
1995 452317 -47843 1289600 261016 -348048 400437 140253 -68955 -288958 1204807
1986 1204807 573855 1405330 153055 -1147644 15377 -114628 -24721 -15708 798515 659111
1976 659111 127629 665678 459934 444233 351993 954403 826909 1014554 1109631 -18968
$$ packed form
2045E07532n47675N55183n20164J52783J95147Q8190l51522K68871m92582N42414
2035C98177M3825K51905k31062k85891O54013j34344p39866O10874j55157L55842
2025G68316l8666q22830J94229o78484J182745L50205j398441K002866j347673
2016B12267p2576J9686N24506m48835J44410j1735J39278j133967K00291R96211
2006E69536r4136Q5769j16758q995j52256M18607j62061l53408P4206n5533K47346
1995D52317n00160J337443j028584o09064P48485k60184k09208k20003J493765
1986A204807o30952Q31475j252275j300699J163021j30005Q9907R013Q14223j39404
1976F59111n31482N38049k05744j5701r2240O02410j27494J87645R5077j128599
$$ plain form
1966 -18968 449660 287374 -111989 380667 158860 347657 680078 -24820 264318 221578
$$ packed form
1966a8968M68628j62286l99363M92656k21807J88797L32421p04898K89138m2740
$$ [...]
##END NTUPLES=NMR SPECTRUM
##END=
