##TITLE=abcd
##JCAMPDX= 6.0         $$ Bruker NMR JCAMP-DX V2.0
##DATA TYPE= NMR SPECTRUM
##DATA CLASS= NTUPLES
##ORIGIN= UXNMR, Bruker Analytische Messtechnik GmbH
##OWNER= root
$$ XWIN-NMR		Version 3.5
$$ Sat Dec 13 08:59:50 2025 Russian Standard Time (UT+4h)  servis@DPX200
##.OBSERVE FREQUENCY= 200.131235884673
##.OBSERVE NUCLEUS= ^1H
##.ACQUISITION MODE= SIMULTANEOUS
##.ACQUISITION SCHEME= undefined
##.AVERAGES= 24
##.DIGITISER RES= 18
##SPECTROMETER/DATA SYSTEM= spect
##.PULSE SEQUENCE= zg
##.SOLVENT NAME= DMSO
##.SHIFT REFERENCE= (INTERNAL, DMSO, 0, 16.4885)
##AUDIT TRAIL= $$ (NUMBER, WHEN, WHO, WHERE, WHAT)
$$ ##TITLE= Audit trail, XWIN-NMR		Version 3.5
$$ ##JCAMPDX= 5.01
$$ ##ORIGIN= Bruker BioSpin GmbH
$$ ##OWNER= servis
$$ F:\spectra/data/av/nmr/H1/1/pdata/1/auditp.txt
$$ ##AUDIT TRAIL=  $$ (NUMBER, WHEN, WHO, WHERE, WHAT)
(   1,<2025-12-13 08:58:45.62 +0400>,<servis>,<DPX200>,
      <created by zg, POWCHK disabled, PULCHK disabled
       terminated by command 'halt'
       configuration hash MD5:
       00 E9 B6 7A A2 85 ED C7 34 08 36 98 17 FE 4E 26
       data hash MD5: 32K
       AF 8A 25 30 5F 76 B1 01 15 F4 36 BA 09 15 2F 0E>)
(   2,<2025-12-13 08:58:47.54 +0400>,<servis>,<DPX200>,
      <Start of raw data processing
       efp BC_mod = 2 LB = 0.05 FT_mod = 6 PKNL = 1 PHC0 = -263.2463 PHC1 = 6.301564 SI = 16K 
       data hash MD5: 16K
       25 C2 08 05 62 69 24 70 22 9F 6D C8 42 ED D5 0C>)
$$ ##END=
$$ 
$$ hash MD5
$$ B2 A8 01 56 B4 5E 2E 34 B3 A2 08 66 BF 33 A8 64
##$RELAX= 
##$RELAX= 
##$RELAX= 
##$RELAX= 
##$RELAX= 
##$RELAX= 
##$RELAX= 
##$RELAX= 
$$ Bruker specific parameters
$$ --------------------------
##$DU= <F:\spectra>
##$EXPNO= 1
##$NAME= <H1>
##$PROCNO= 1
##$TYPE= <nmr>
##$USER= <av>
##$AMP= (0..31)
100 100 100 100 100 100 100 100 100 100 100 100 100 100 100 100 100 100 
100 100 100 100 100 100 100 100 100 100 100 100 100 100 
##$AQSEQ= 0
##$AQ_mod= 1
##$AUNM= <au_zg>
##$AUTOPOS= <>
##$BF1= 200.13
##$BF2= 200.13
##$BF3= 200.13
##$BF4= 200.13
##$BF5= 500.13
##$BF6= 500.13
##$BF7= 500.13
##$BF8= 500.13
##$BYTORDA= 1
##$CFDGTYP= 0
##$CFRGTYP= 5
##$CHEMSTR= <none>
##$CNST= (0..31)
1 1 145 1 1 1 1 1 1 1 1 1 1 1 1 1 1 1 1 1 1 1 1 1 1 1 1 1 1 1 1 1 
##$CPDPRG= <>
##$CPDPRG1= <>
##$CPDPRG2= <>
##$CPDPRG3= <>
##$CPDPRG4= <mlev>
##$CPDPRG5= <mlev>
##$CPDPRG6= <mlev>
##$CPDPRG7= <mlev>
##$CPDPRG8= <mlev>
##$CPDPRGB= <>
##$CPDPRGT= <>
##$D= (0..31)
0 2 0 0 0 0 0 0 0 0.06 0 0 0 0 0 0 0.0002 0 0 0 0 0 0 0 0 0 0 0 0 0 0 
0 
##$DATE= 1765601925
##$DBL= (0..7)
120 120 120 120 120 120 120 120 
##$DBP= (0..7)
150 150 150 150 150 150 150 150 
##$DBP07= 0
##$DBPNAM0= <>
##$DBPNAM1= <>
##$DBPNAM2= <>
##$DBPNAM3= <>
##$DBPNAM4= <>
##$DBPNAM5= <>
##$DBPNAM6= <>
##$DBPNAM7= <>
##$DBPOAL= (0..7)
0.5 0.5 0.5 0.5 0.5 0.5 0.5 0.5 
##$DBPOFFS= (0..7)
0 0 0 0 0 0 0 0 
##$DE= 6
##$DECBNUC= <off>
##$DECIM= 32
##$DECNUC= <off>
##$DECSTAT= 4
##$DIGMOD= 1
##$DIGTYP= 9
##$DL= (0..7)
0 120 120 120 120 120 120 120 
##$DP= (0..7)
$$ [...]
##$SUBNAM4= <"">
##$SUBNAM5= <"">
##$SUBNAM6= <"">
##$SUBNAM7= <"">
##$SUBNAM8= <"">
##$SUBNAM9= <"">
##$SW= 20.6817932712277
##$SWIBOX= (0..15)
0 0 3 0 0 0 0 0 0 0 0 0 0 0 0 0 
##$SW_h= 4139.07284768212
##$TD= 32768
##$TD0= 1
##$TE= 0
##$TE2= 300
##$TE3= 300
##$TEG= 300
##$TL= (0..7)
0 120 120 120 120 120 120 120 
##$TP= (0..7)
150 150 150 150 150 150 150 150 
##$TP07= 0
##$TPNAME0= <>
##$TPNAME1= <>
##$TPNAME2= <>
##$TPNAME3= <>
##$TPNAME4= <>
##$TPNAME5= <>
##$TPNAME6= <>
##$TPNAME7= <>
##$TPOAL= (0..7)
0.5 0.5 0.5 0.5 0.5 0.5 0.5 0.5 
##$TPOFFS= (0..7)
0 0 0 0 0 0 0 0 
##$TUNHIN= 0
##$TUNHOUT= 0
##$TUNXOUT= 0
##$USERA1= <user>
##$USERA2= <user>
##$USERA3= <user>
##$USERA4= <user>
##$USERA5= <user>
##$V9= 5
##$VALIST= <valist>
##$VCLIST= <CCCCCCCCCCCCCCC>
##$VD= 0
##$VDLIST= <DDDDDDDDDDDDDDD>
##$VPLIST= <PPPPPPPPPPPPPPP>
##$VTLIST= <TTTTTTTTTTTTTTT>
##$WBST= 1024
##$WBSW= 30
##$XGAIN= (0..3)
0 0 0 0 
##$XL= 0
##$YL= 0
##$YMAX_a= 581969
##$YMIN_a= -364499
##$ZGOPTNS= <>
##$ZL1= 120
##$ZL2= 120
##$ZL3= 120
##$ZL4= 120
##$ABSF1= 0
##$ABSF2= 0
##$ABSG= 0
##$ABSL= 0
##$ALPHA= 0
##$AQORDER= 0
##$ASSFAC= 0
##$ASSFACI= 0
##$ASSFACX= 0
##$ASSWID= 0
##$AUNMP= <proc_1d>
##$AZFE= 0.1
##$AZFW= 0.1
##$BCFW= 0
##$BC_mod= 2
##$BYTORDP= 0
##$COROFFS= 0
##$CY= 18.4799938201904
##$DATMOD= 1
##$DC= 0
##$DFILT= <>
##$DTYPP= 0
##$F1P= 9.9274215381318
##$F2P= -0.165520771350173
##$FCOR= 1
##$FTSIZE= 16384
##$FT_mod= 6
##$GAMMA= 0
##$GB= 0
##$INTBC= 1
##$INTSCL= 4.127829e-11
##$ISEN= 128
##$LB= 0.05
##$LEV0= 0
##$LPBIN= 0
##$MAXI= 10000
##$MC2= 0
##$MEAN= 0
##$ME_mod= 0
##$MI= 50
##$NCOEF= 0
##$NC_proc= -5
##$NLEV= 6
##$NOISF1= 3.799351
##$NOISF2= 2.8
##$NSP= 0
##$NTH_PI= 0
##$NZP= 0
##$OFFSET= 16.48848
##$PC= 4
##$PHC0= -263.2463
##$PHC1= 6.301564
##$PH_mod= 1
##$PKNL= yes
##$PPARMOD= 0
##$PSCAL= 4
##$PSIGN= 0
##$REVERSE= no
##$SF= 200.130005582386
##$SI= 16384
##$SIGF1= 3
##$SIGF2= 2
##$SINO= 400
##$SIOLD= 16384
##$SREGLST= <1H.CDCl3>
##$SSB= 0
##$STSI= 16384
##$STSR= 0
##$SW_p= 4139.07284768211
##$SYMM= 0
##$S_DEV= 0
##$TDeff= 32768
##$TDoff= 0
##$TI= <>
##$TILT= no
##$TM1= 0
##$TM2= 0
##$TOPLEV= 0
##$USERP1= <user>
##$USERP2= <user>
##$USERP3= <user>
##$USERP4= <user>
##$USERP5= <user>
##$WDW= 1
##$XDIM= 16384
##$YMAX_p= 468513578
##$YMIN_p= -588073
$$ End of Bruker specific parameters
$$ ---------------------------------
##NTUPLES= NMR SPECTRUM
##VAR_NAME=  FREQUENCY,     SPECTRUM/REAL,   SPECTRUM/IMAG
##SYMBOL=    X,             R,               I
##VAR_TYPE=  INDEPENDENT,   DEPENDENT,       DEPENDENT
##VAR_FORM=  AFFN,          ASDF,            ASDF
##VAR_DIM=   16384,         16384,           16384
##UNITS=     HZ,            ARBITRARY UNITS, ARBITRARY UNITS
##FACTOR=    0.252644378177508, 1,           1
##FIRST=     3299.83951724647, 0,            0
##LAST=      -839.233330435636, 0,           0
##MIN=       -839.233330435636, -588073,     0
##MAX=       3299.83951724647, 468513578,    0
$$ Real data points
##PAGE= N=1
##DATA TABLE= (X++(R..R)), XYDATA
$$ [...]
11524 -123315 -231600 -117873 -223506 -262799 -208407 -261123 -147527 -116406 -218518 -248383
11514 -248383 -85083 -195867 -215481 -131201 -104656 -163399 -82620 -70494 -268426 -142928 -44968
11503 -44968 -302724 -113446 -218560 -256831 -96844 -140310 -177103 -262583 -234356 -140024 -86533
11492 -86533 -166168 -262847 -120869 -172423 -92667 -208540 -251773 -120448 -70220 -124797 -192921
11481 -192921 -173661 -144352 -101382 -192013 -125543 -236381 -188021 -64366 -214434 -202168 -234207
11470 -234207 -195647 -140035 -199557 -197872 -104309 -149456 -32621 -228695 -130784 -95851 -113445
11459 -113445 -130252 -97155 -262849 -205164 -116016 -224683 -101443 -286023 -146501 -160470
11449 -160470 -107306 -83074 -277485 -165137 -137003 -208217 -266238 -133522 -141749 -103775 -108829
11438 -108829 -195012 -124764 -65497 -303210 -79075 -159602 -200430 -204728 -166304 -230185 -96894
11427 -96894 -266913 -262658 -158769 -246975 -54130 -158737 -124719 -186539 -168236 -302521 -137447
11416 -137447 -191732 -201669 -237050 -101998 -217328 -87512 -136907 -114648 -238956 -87261 -91163
11405 -91163 -237183 -115393 -167168 -48302 -140329 -154304 -128716 -64347 -216617 -223239 -87298
11394 -87298 -159410 -111065 -161644 -248119 -68797 -60862 -205731 -132788 -214793 -135736 -159602
11383 -159602 -78651 -172879 -129989 -189488 31843 -268717 -93876 -198479 -129065 -86294 -250702
11372 -250702 -242034 -117665 -206308 -144053 -164973 -243308 -216698 -109956 -149459 -197477 -218708
11361 -218708 -226412 -122265 -95751 -275555 -134500 -245442 -83577 -207230 -238551 -198966
11351 -198966 -57539 -183036 -169312 -92027 -278829 -150417 -186529 -43605 -338706 -189232
11341 -189232 -89006 -181426 -192526 -152518 -213388 -181663 -238949 -244067 -127485 -194690 -130685
11330 -130685 -108107 -84632 -172827 -91690 -201685 -233813 -72093 -92758 -141575 -66082 -249421
11319 -249421 11958 -134207 -272890 -209836 -182757 -244135 -68921 -215962 -236373 -169717
11309 -169717 -131428 -129432 -207538 -227852 -194635 -91003 -180011 -182446 -144918 -192888 -138169 -59618
11297 -59618 -228891 -208120 -93392 -110304 -97840 -147845 -207344 -143802 -63089 -86814 -150596
11286 -150596 -92900 -147793 -222832 -42772 -192460 -146084 -108692 -93801 -108324 -188899 -127107
11275 -127107 -155761 -116933 -205102 -138476 -196797 -102217 -106259 -140037 -149505 -95321 -161771 -120716
11263 -120716 -95666 -133971 -122666 -13222 -121734 17134 16754 8157 3166 34408 49497 -101438
11251 -101438 -111253 16625 -107843 -48833 -94549 -132682 -145775 -119106 -123641 -110533 -258002
11240 -258002 -195290 -178234 -220008 -138683 -126551 -149873 -178686 -171092 -90036 -178083 -126519 -17376
11228 -17376 -171766 -136787 -158282 -124070 -106776 -317073 -107934 -170389 -193542 -191793 -133148
11217 -133148 -221368 -136124 -147366 -173638 -100494 -86273 -214038 -145415 -140222 -201469 -173224
11206 -173224 -198108 -77614 -117712 -45194 -138118 -83843 -106500 -174270 -87598 -114989 -246443
11195 -246443 -165226 -177170 -183311 -124739 -279628 -176334 -87456 -166116 -295346 -87292 -70805
11184 -70805 -176684 -182229 -116990 -118206 -85105 -200665 -69736 -286767 -150262 -154509 -33785
11173 -33785 -272610 -121855 -135739 -46822 -176872 -7258 -248555 -118037 -59883 -167115
11163 -167115 -184353 -127340 -178531 -56059 -87076 -170395 -142093 -91213 -204623 -153572 -152970
11152 -152970 -251703 -97823 -222879 -137392 -148485 -107372 -168464 -109882 -165663 -105493 -52944
11141 -52944 -96039 -178744 -82983 -144273 -96722 -144483 -47955 -162423 -145139 -111357 -192037
11130 -192037 -224936 -136436 -159121 -196499 -71393 -163857 -184507 -134246 -98515 -104989 -180844
11119 -180844 -159939 -46727 -58425 -48618 -32765 -171627 -125035 -108591 -34867 -120013 -110637
11108 -110637 -199198 -33034 3938 -108387 -161526 -48586 -54708 1767 -69052 -175377 -92657
11097 -92657 -33921 49094 -184804 -39971 -139594 -7776 -63850 -34213 -139897 -5255 27355
11086 27355 -119575 -85385 -153847 -30324 -42698 -73127 -139445 -245421 -98718 -85744 -115752
11075 -115752 -149637 -120172 -169138 -54012 -132952 -174739 -108121 -56096 -113132 -113357 -192901 -13174
11063 -13174 -120889 -48707 -202604 -108155 -144950 -18849 -108379 -186607 -155313 -100458 -32046
11052 -32046 -81321 -109691 -71967 -136842 -48549 -126068 -127341 -80087 -114398 -104305 -119902 15501
11040 15501 -160394 -72985 -48848 -106796 -43434 -70864 -102498 -80294 -79446 -48887 -116068 -36654
11028 -36654 -84591 -72394 1822 38187 -159006 -71393 -120580 -17139 -141803 -103429 -109664
11017 -109664 -498 -82112 -48521 -92491 -156889 -87303 -28151 -90519 -139526 -55584 -50741
11006 -50741 -55344 -126980 -86421 -107427 -90492 -144967 -65836 -168017 -61198 -9533 -23178
10995 -23178 -69331 15606 -52190 43419 -67570 -89429 -98790 -13682 -56278 -27549 39255 -60380
10983 -60380 23032 5912 -43477 -82206 85350 -31982 -66934 -34364 -32865 -62453 -54520 -48359
10971 -48359 -131221 -49998 -19492 -47050 -64902 -105449 -8579 62408 -35333 5792 -49315 -63586
10959 -63586 9102 -6978 8378 -59765 -26163 -77193 75066 -72681 13428 -103895 11281
10948 11281 -50001 -45422 56308 31860 -17668 87952 10774 -22683 109548 -39652 -22348
10937 -22348 77821 42231 -75115 31958 -62114 -15504 41775 -43139 75449 27635 7481
10926 7481 19387 -44094 -89404 24702 -85046 133507 -32877 -36163 -61233 69291 23675
10915 23675 -74909 -42192 -78163 103264 -379 24262 -149752 64932 40279 54810 49571
10904 49571 26060 -9882 44855 -241 -64832 22898 -19139 42144 35679 25141 93840 -9431
10892 -9431 -26103 83664 5915 -47001 86737 81617 -566 96890 39513 79293 73294 19107
10880 19107 62341 58814 107013 161737 74068 99076 18387 138869 149591 87305 74001 113529
10868 113529 42498 49025 70606 123077 151172 144808 45187 130820 107176 56090 223867 203316
10856 203316 93806 45375 106765 193988 148596 75961 209077 99596 95338 252203 161560
10845 161560 60172 134478 143473 208322 84355 119949 252341 97022 152594 107518 194366
10834 194366 82998 223037 114621 177423 175134 268447 277113 157883 80399 220733 185518
10823 185518 158392 170739 180712 179348 172619 222737 234458 253293 154940 315731 170676 181417
10811 181417 145633 296065 127495 196553 232713 247347 290230 187132 272260 263541 254408
10800 254408 188102 345582 257932 248023 307764 203995 324710 303049 304721 254449 219839
10789 219839 314498 229626 301238 360281 252543 364022 327842 206803 349062 305243 368042
10778 368042 465436 390352 312834 523518 370147 396609 353408 489765 438055 534651 399297
10767 399297 461055 434238 423627 517729 491163 408549 479839 573790 514182 623807 505809
10756 505809 667255 663174 708897 590473 654448 683064 658587 617015 710598 698989 765180
10745 765180 856806 771948 843658 901524 875993 872158 905840 892168 1059910 983976 1048308
10734 1048308 1104301 1184549 1125781 1306665 1273243 1219973 1406685 1420493 1470491 1557652 1415582
10723 1415582 1582864 1580867 1558806 1710181 1830484 1689611 1823899 1901904 2026722 1929992
10713 1929992 2087592 2198809 2115621 2204554 2304272 2308030 2368811 2463473 2514391 2606028 2554583
10702 2554583 2567542 2817362 2707006 2807597 2899465 2899246 2978766 3152934 2938827 3136880
10692 3136880 3154471 3174473 3297274 3179770 3315289 3439040 3427309 3325537 3598077 3463390
10682 3463390 3521779 3557380 3672264 3522373 3691392 3720708 3735042 3811059 3806236 3804468 3895628
10671 3895628 3928866 3960036 4123351 3971413 4007875 4171776 4226046 4103597 4087523 4114747
10661 4114747 4118958 4198891 4276833 4248617 4239736 4146539 4272075 4297695 4205901 4358138 4409951
10650 4409951 4358337 4319727 4251855 4351517 4259014 4179790 4166313 4144932 4135927 4198807 4025169
10639 4025169 4158720 3987666 3962841 4017146 3870919 3976897 3896014 3802508 3783853 3681203
10629 3681203 3569288 3730641 3572215 3568329 3551942 3328734 3376833 3506981 3361894 3299057
10619 3299057 3339132 3241900 3189245 3173935 3105507 3079635 2948743 2938371 2967667 2838568 2830785
10608 2830785 2756196 2652339 2506409 2462826 2597369 2459391 2193546 2375979 2065009 2106297
10598 2106297 2119909 2100005 1930130 1985131 1848922 1845475 1646887 1743194 1594631 1679473 1451721
10587 1451721 1517059 1487962 1343109 1285415 1296520 1000775 1210809 1159059 1072749 981501 939258
10576 939258 932014 968236 874149 933328 841027 783284 834404 846448 769437 628892 774937
10565 774937 803985 633864 555516 673345 530629 617521 467418 376358 580251 587371 496569
10554 496569 429464 482276 465805 504570 441808 363215 489123 374705 345938 531918 282068
10543 282068 388504 370983 245510 455947 346160 400157 395909 459758 375338 386816 218732
10532 218732 257047 225790 380281 262140 328334 266413 294819 332794 272196 98641 291194
10521 291194 339346 272848 187135 112901 230691 261553 294408 107455 163929 200110 253071
10510 253071 265881 140883 168615 194237 281079 190270 297250 27440 233654 235449 128359
10499 128359 131923 202852 139548 192916 117201 105304 41360 261096 290499 158198 153740
10488 153740 79276 124992 296381 213856 126555 139051 86357 222072 103305 208584 110832
10477 110832 156273 185042 160492 206237 149924 242869 270400 202267 261471 114017 113569 260940
10465 260940 226111 148053 151638 219997 203705 193628 226968 135044 282843 185189 261321
10454 261321 160032 182868 97305 272469 245084 196216 193072 327110 253094 291865 188328
10443 188328 254883 311154 304112 160394 220796 220493 239939 319767 231228 259291 315108 259783
10431 259783 274278 264778 199351 292951 367635 351950 385941 282502 297267 484664 358357
10420 358357 249806 289413 450297 286536 415681 459657 355934 420844 389203 465947
10410 465947 444864 394615 559769 489710 389543 343601 552985 441819 513815 481209 516649
10399 516649 445538 599963 574520 609247 539757 584207 730436 844352 619614 682718 762248
10388 762248 761337 707133 782533 755672 744519 905640 984573 951857 854317 996042 960680
10377 960680 1068033 1002891 1096787 1040147 1048658 1227454 1094678 1120181 1176988 1178636 1247872
10366 1247872 1315593 1318844 1376528 1342365 1418599 1563132 1479592 1598896 1659120 1716986 1649906
10355 1649906 1743604 1812298 1882709 1865718 1861493 1915473 1991577 2030550 1975783 2041537 2117389
10344 2117389 2210928 2105714 2301141 2417154 2250424 2380233 2367690 2429426 2277914 2447414
10334 2447414 2568412 2525055 2464384 2750302 2598427 2696610 2718685 2788331 2766918 2805201 2900099
10323 2900099 2965121 2951834 3028570 3037007 3060013 3217732 3249000 3209308 3267348 3331664 3431312
10312 3431312 3360650 3339992 3478533 3606785 3484551 3574787 3748465 3634872 3641911 3794015
10302 3794015 3710538 3704135 3619823 3864689 3669031 3723892 3732003 3801655 3689354 3744655 3804883
10291 3804883 3698255 3788120 3629606 3721280 3598904 3664285 3647356 3781433 3623148 3620413
10281 3620413 3668810 3718974 3623978 3629042 3630175 3634238 3655624 3637834 3663846 3607617 3613550 3530195
10269 3530195 3627878 3563503 3633414 3579234 3602997 3531552 3573669 3510774 3556387 3543410 3475137
10258 3475137 3392938 3415746 3353221 3284869 3274156 3241699 3219935 3130083 3027204 2946597 3087823
10247 3087823 2833308 2779817 2858344 2761652 2755870 2667865 2637971 2523195 2506385 2594909 2399276
10236 2399276 2398264 2271018 2254235 2263692 2252388 2100918 2181146 2126043 2017022 2055656 2042830
10225 2042830 1978500 1931386 2025669 1870390 1814309 1781335 1713588 1640418 1693794 1505723 1593162
10214 1593162 1562395 1540415 1499498 1412157 1432401 1350883 1244641 1313920 1379466 1184402 1115523
10203 1115523 1202160 1153353 1065525 975782 991979 964726 977982 902520 842348 854848 745052
10192 745052 792460 778966 726779 705272 643905 673868 607850 613282 720734 520411 526831
10181 526831 488028 546446 557490 544001 571775 499722 463717 498618 433019 377872 415982
10170 415982 322399 453409 314900 272087 327470 265124 299625 302525 160121 322105 293994
10159 293994 290358 331528 141058 275011 322792 198738 217726 234170 232820 304576 260632
10148 260632 251858 209943 188186 204888 270757 99617 146168 165004 173434 182477 159441 84218
10136 84218 238348 183152 -27958 164604 99585 19145 158486 92682 147527 64851 202963
10125 202963 104669 42622 114682 96223 88364 95559 49276 5913 135242 101976 -667
10114 -667 21305 92855 54811 -7897 234 91883 27464 -40945 -15167 133794 61777 111819
10102 111819 111078 -38120 1851 -3140 33515 -5877 -17298 145716 99319 40330 -98538
10091 -98538 78236 45540 -53960 6816 61973 -50976 -40532 67773 7776 -26418 -71811
10080 -71811 88351 -68177 -5144 -42619 -18073 2392 -8331 21091 -43868 -8508 -33279
10069 -33279 -68065 -89401 48673 -78632 -68107 -19302 -80547 -52027 31594 -118104 -25868
10058 -25868 -65791 -94725 24137 -115939 -12502 885 30755 -110560 19451 -110572
10048 -110572 -62002 -73514 -22483 14642 -66218 6650 -70265 -79749 7750 18660 -196050
10037 -196050 -29834 -12185 -17527 61663 -41110 -85873 -48772 -73024 -4561 -111988 -147250
10026 -147250 76058 -8941 -171002 -86654 -27408 35514 56876 42757 -116466 42003 -7242
10015 -7242 143476 -92604 -75024 -32944 43494 -62449 -101366 -142999 -38711 -41209 -28102
10004 -28102 -53763 -164961 -34443 -21204 -34669 -25580 -41320 -107594 -11427 -50622 -91230
9993 -91230 -15303 50255 11643 -28689 -157913 -37316 -48394 -100432 -110760 -36103 -163217
9982 -163217 -16663 -67397 -91653 -102819 22238 2989 54612 -57501 -69760 -63369 -71576
9971 -71576 38612 -163204 -74163 -159380 -59315 -34296 -64145 -149533 -20667 -157847 -80008
9960 -80008 -30964 -92027 -13911 -89056 -39483 -130561 -252777 -69716 -32050 -186229 -5513
9949 -5513 -100186 -126639 -26858 45790 -49998 23465 108235 16842 90206 107678 84573 188357
9937 188357 265455 405834 400405 375991 240340 190827 163637 -12189 62577 44460 81389
9926 81389 -69322 186 -63441 -74489 66426 -17200 -56971 -107646 -56722 52056 -183477
9915 -183477 -188740 -50918 -73126 -95516 -144160 -26199 -127957 -11278 -87263 -64065 -210002
9904 -210002 16484 -27924 -48978 -45117 -57644 -38144 -45443 -139822 -32853 -75162 -99347 -25224
9892 -25224 -45810 -42178 -73097 -26007 -201183 13532 -9006 -69498 -82486 -62891 -55898 -31873
9880 -31873 -65637 -28369 27308 -154257 4108 -127632 -117978 -62882 -21236 -66697 -30603
9869 -30603 -83834 -35231 -117454 -12303 -96095 84355 31060 -48880 -143157 -9848 -9624 -55540
9857 -55540 44583 12437 27906 -57417 2190 14426 -31641 -66430 103087 121165 -32883
9846 -32883 -68833 140674 2972 44492 -48436 94841 64834 38208 51271 -18360 -38420
9835 -38420 202878 -7265 50767 69631 125455 87332 64957 63347 -11247 65804 48855 140867
9823 140867 6451 58862 92141 -26588 12655 84123 30560 26397 56086 91165 70499
9812 70499 75167 203529 172883 65454 17536 76054 95726 89496 126235 3173 172343
9801 172343 175523 66312 203547 36372 62711 124896 -20697 47796 74229 70345 33506
9790 33506 187191 186664 99398 129474 211059 238935 334331 490523 506542 777208 833908 1050309
9778 1050309 1017784 807497 581061 508649 388685 257216 161563 155579 169973 56891 58655
9767 58655 59162 102084 -58387 66107 117958 -89559 -32599 -91422 -46928 -65998 -53649 -119652
9755 -119652 4502 -81805 36458 52549 -83297 -60144 103447 79327 35044 -8984 -77388
9744 -77388 -75104 32806 29575 -118726 -31150 -7812 -65976 -56631 -42396 -31822 6803 -44239
9732 -44239 -20904 -131538 -67327 -118922 79193 -200623 -169000 -97221 44865 -179220 -80215
9721 -80215 -283620 -132714 -31211 -99249 -116153 -56384 -91230 -124421 -31045 -98743 -18412
9710 -18412 -143089 -42333 -205911 -63736 -97509 -49028 -81632 -110847 -204138 -35185 -91949
9699 -91949 -56990 3557 -104337 -55746 -70358 -34491 -114849 -157256 -126497 -160191 -59861
9688 -59861 -39936 -60789 50465 -41001 -102364 -26815 -113866 64838 -42501 -103179 -64216
9677 -64216 -52544 -56130 28686 -125800 -45326 -53536 -98133 -46527 -39673 -36504 -138067 5260
9665 5260 51045 -130358 44290 -93422 -66959 -36027 -38269 -24412 -47194 -60021 61195
9654 61195 64200 -68936 -22694 10030 111298 -117749 92793 11162 -91198 120473 20579
9643 20579 -15391 -63518 -3209 110560 -50501 -97482 76571 53962 59043 -46156 101211
9632 101211 50355 59589 229885 127774 71515 158752 170977 217928 324931 186027 328267
9621 328267 381817 427392 500150 563859 601147 734690 824104 815179 683903 648864 601806
9610 601806 644739 477686 409159 296846 494544 168641 315733 70559 309972 5784
9600 5784 272268 71877 105332 65771 151678 -1326 13811 35366 40977 -376 -114244
9589 -114244 128585 41983 90782 -2227 133671 -125240 91232 4102 68101 -1801 29128
9578 29128 134994 205319 -928 165442 9740 163438 166032 144401 52070 40830 201102
9567 201102 96202 -4682 -124110 43200 12261 -18566 -59990 -30529 -54932 19441 60943
9556 60943 -25809 17757 -117874 83975 -86404 -94428 -12505 -10841 -168482 66716 -147920
9545 -147920 -15842 20403 40939 -17759 59752 -100293 -479 36485 -94696 -21615 -129477
9534 -129477 35856 -58380 -78489 -74389 -36639 -152425 -9749 -76238 -58475 -150780 -23253
9523 -23253 114530 1376 27354 35192 -4743 -85746 18199 -62216 -24844 -85944 -66555
9512 -66555 84333 -57576 -79576 -112451 7682 -143132 -53225 -87374 110302 -149253 -26107
9501 -26107 -70615 -58024 -40973 29140 26391 -150944 17157 -28748 45333 -169612 32606
9490 32606 -86698 -5558 -1123 -1942 64695 -48714 104863 7158 16423 -102746 121777 34625
9478 34625 32686 34635 25121 2216 87288 22944 28924 61684 34112 139113 81731 11711
9466 11711 39129 64804 133889 31809 99106 68411 180773 88160 159442 96796 53229
9455 53229 167479 155367 170086 73891 38939 156694 64311 1181 171115 -1954 93248
9444 93248 224587 122499 132936 132418 150676 84440 203958 66508 76267 135093 -8972
9433 -8972 282482 188884 196953 50624 182804 241065 194915 138145 273412 245692 161464
9422 161464 114844 204285 217330 312431 251633 203637 198793 143233 331997 208329 208525 215381
9410 215381 247844 310471 285067 183189 212747 342707 156040 185657 243839 206671 262925
9399 262925 109403 240755 225353 271427 191791 374935 163269 333868 309534 264184 403104
9388 403104 204649 303591 406933 241968 180894 326089 298949 416374 317992 450155
9378 450155 249850 446561 487093 469533 333072 424188 300971 326989 415233 281660 264844
9367 264844 365508 224919 330352 451136 306481 321227 410949 310099 401179 477331
9357 477331 401781 527513 317674 465432 560595 516174 507268 624274 585853 565367 590571
9346 590571 547701 618695 508098 579899 548645 456649 550510 526404 482121 543292 514056
9335 514056 538740 393515 460579 514990 517777 465020 535862 532448 457316 660890 548451
9324 548451 711876 520435 761823 693007 774567 571183 865162 720980 823772 950024
9314 950024 806017 622129 942318 865886 827746 826127 846763 948079 839832 870399 812255
9303 812255 849417 836652 937616 923235 792080 940607 938467 940528 973245 1054766 986417
9292 986417 1063093 965574 1042498 1118884 1289224 1221351 1307564 1286805 1380148 1361792 1495392
9281 1495392 1456831 1559679 1677544 1638374 1782337 1854847 1900296 2091644 2143026 2240357 2431060
9270 2431060 2500620 2696696 2896004 3234433 3329304 3690338 3833076 4366822 4603848 5142936
9260 5142936 5513271 6198602 6868038 7539774 8252780 9085641 9760425 10502533 10975829 11168179
9250 11168179 11143787 10950474 10484592 9813502 9054593 8159662 7444748 6927678 6322756 5806148
9240 5806148 5438569 5204026 5025471 4778876 4685622 4851722 4901851 5143711 5185033 5441588
9230 5441588 5525730 6061472 6537356 6987027 7597565 8143266 8968194 9780821 10558865 11331951
9220 11331951 12177019 12579044 12995575 13001838 12601808 11880917 11016424 10097420 8839193 7999934
9210 7999934 7074145 6239884 5547438 4948259 4397145 3909668 3488102 3305160 3006404 2671894
9200 2671894 2690990 2516079 2260470 2197239 2119029 1911204 1919070 1794863 1702602 1624642 1620555
9189 1620555 1521088 1442664 1472543 1412144 1404805 1404002 1334971 1297575 1300676 1239059 1317067 1309541
9177 1309541 1216729 1175914 1135024 1127123 1125335 1044445 1018400 1109103 1013021 881785 994604
9166 994604 920843 984984 897683 751731 883090 840720 758608 904265 834560 737145 836413
9155 836413 819130 777134 627678 728473 722996 724603 711666 772577 759852 823812 834571 863948
9143 863948 801833 675529 823067 742015 682705 684497 657858 783774 709164 707996 636794
9132 636794 730949 764837 729005 668557 720751 780228 812225 683251 647318 664489 794560
9121 794560 755330 795979 773439 733211 850770 862805 904640 711586 885294 912617 828075
9110 828075 812699 895024 883569 863303 898234 865614 861426 922754 883485 974995 962432 1027558
9098 1027558 1066044 1078203 1104842 1083586 975477 1209690 1181191 1216205 1184310 1236707 1321570
9087 1321570 1457187 1362357 1330366 1424520 1555266 1482480 1661448 1640093 1649056 1814180 1824475
9076 1824475 1814666 1785605 1907788 1971561 2178524 2087909 2261815 2511490 2682106 2736916 3058149
9065 3058149 3345974 3673676 4149630 4651296 5086830 5456950 5758948 5968969 5907953 5725189
9055 5725189 5495540 5358804 5258749 5325402 5456229 5748629 6041385 6536674 7125264 7941820
9045 7941820 8600769 9708547 10822989 12278914 13742832 15398008 17143574 19022077
9037 19022077 20587446 22059312 23374372 24249758 25037807 25189152 25183520 24789400 24152773
9028 24152773 23209973 21858979 20077009 18030229 15954537 13916667 11937808 10222756
9020 10222756 8858508 7799146 7173702 6296804 5983840 5586533 5478525 5222331 5122702
9011 5122702 5222708 5304537 5418910 5716454 5956375 6036962 6548488 6661865 6871420 6930098
9001 6930098 6979711 6875775 6763540 6360902 6186126 5810627 5435705 4788437 4302537 3909647
8991 3909647 3517708 3092263 2784419 2515114 2249862 2238542 2056556 1881878 1648103 1656966
8981 1656966 1594052 1525859 1516493 1459994 1376449 1390278 1351481 1248286 1238155 1212844 1177944
8970 1177944 1251500 1097423 1070258 1175708 1070073 1099930 1086941 1083578 924301 960042 1050669
8959 1050669 1059326 903562 991708 1009268 959466 992060 1039741 973560 934791 1078241 1059841
8948 1059841 856676 1072100 968833 1030913 907034 972355 1005309 925884 986400 1090782
8938 1090782 894041 1112326 953461 1059282 967550 927372 1038404 1060008 1086413 1074147
8928 1074147 1121723 1056013 1102220 1067447 981486 1170463 1124898 1048997 1073138 1113801 1225267
8917 1225267 1182475 1153166 1115894 1099480 1202831 1290813 1181932 1209780 1402767 1249286 1481927
8906 1481927 1368986 1458539 1509758 1654514 1672022 1707644 1594401 1861990 1900708 1879356 1951130
8895 1951130 1946146 2154367 2342274 2260540 2303368 2542278 2493731 2810870 2969878 3075512
8885 3075512 3277869 3711919 3798704 4145815 4628838 5043569 5568599 6224460 7035782 7831514
8875 7831514 8847851 9962383 10829614 11720481 12324577 12714267 12945344 12727928 12714638
8866 12714638 12606218 11969491 11458241 10580376 9728000 8765443 7919926 7030056 6526345
8857 6526345 6063462 5712524 5363487 5157774 4975551 5039318 4898001 4966031 5138988 5292626
8847 5292626 5563650 5951752 6409088 6800873 7601111 8248797 8932587 9615826 10314789 10755428
8837 10755428 11107337 11251234 11155944 11065066 10796585 10427464 9860334 8969430 8272059 7451747
8827 7451747 6543216 5746394 5206267 4592878 4382124 4103822 3839148 3849667 3762065 3819000
8817 3819000 3944943 4144883 4204309 4473243 4615675 4457575 4515408 4387853 4125430 4193015
8807 4193015 3956237 3766342 3388284 3054844 2777393 2424637 2146530 2021705 1738145 1713723
8797 1713723 1689830 1575850 1462444 1361989 1576163 1461688 1306564 1562766 1503699 1594882
8787 1594882 1748838 2023605 1840665 2162452 2593735 2666175 2721890 2754968 2888355 2932856
8777 2932856 2872115 2800552 2721020 2575261 2568366 2246840 1828115 1590126 1343435 1288887 1073417
8766 1073417 720813 820755 788942 754155 684319 590632 515123 639885 529311 559914 323452
8755 323452 457076 463292 538245 373446 230170 375416 437700 386625 369053 215538 334163
8744 334163 401509 399288 415843 288416 320843 477550 284660 366634 224751 261477 273961
8733 273961 289923 175639 308531 142161 318552 242183 179731 211787 219343 264841 235193
8722 235193 144518 197188 221258 178154 186086 163480 214595 -14150 83864 148894 -33777
8711 -33777 74073 120557 28247 78795 50455 194776 34290 22088 70117 53092 79506
8700 79506 67720 -22750 98229 -116173 86115 78612 29243 -54712 158332 -29939 54807
8689 54807 5959 61755 9452 108052 71581 28429 -12699 -69565 52231 69563 -183961
8678 -183961 -5184 -28606 -58871 49224 -96833 -21100 -40585 -67539 -49088 -153474 -81009
8667 -81009 -16221 -11662 -27315 -35275 -55198 -818 -53299 117803 -87326 -128689 22079 41158
8655 41158 2094 -155694 -118488 -81503 -33381 -85228 43574 -215430 -101291 -99801 33105
8644 33105 -194245 -179487 -60390 -132248 620 -31799 -98058 -6514 -112608 -152840 8460
8633 8460 -129097 -170791 -40000 -25774 -121295 -175047 4707 -33899 -88162 -104377 -148479
8622 -148479 -172348 -39571 -147753 -50227 -249887 -19620 -122066 -84461 -230623 -54960
8612 -54960 -137870 -112957 -184261 -50848 -92487 -89750 -55645 -156576 -98016 -196878 -52058
8601 -52058 -166555 -153104 -124240 13700 -220265 -27774 -277768 -22364 -212381 -91159
8591 -91159 -188864 -82793 -172946 -11933 -70374 -185983 -108604 -127486 20307 -194966 -1422
8580 -1422 -226876 -52556 -116702 10184 -31910 -23704 -175471 -28964 -121359 -7685 -187719
8569 -187719 -108040 -3279 -43637 -30571 -162922 -61675 -70968 -83954 -104277 67421 -124912
8558 -124912 -102112 -48534 -63404 -84690 -17286 -74104 -138646 -68351 -184350 -52566 -110633
8547 -110633 -85074 -111368 -58088 -119154 -107947 -146729 -129997 -65399 -99136 -99523 -160053 -141507
8535 -141507 -103827 -219269 -275760 447317 38548 47804 23841 -61567 -77577 -42826 -112
8524 -112 85053 -162712 3435 -49092 19115 -56988 -66915 -139272 -28498 38328 -113290 -93396
8512 -93396 -113957 -133485 -12017 -80021 -32795 -172075 -17001 -46975 -31700 -203381 -65513
8501 -65513 -111544 -118375 -156536 -106664 -134471 -44930 -167654 -56678 -249039 -70796 -55789
8490 -55789 -88360 -114152 -122652 -208597 -77431 -122355 -60875 -145142 -237359 -93887 -25517 -70510
8478 -70510 -165252 -105381 -103925 -141008 -125819 -136360 -180502 -173967 -83497 -58758 -100512 -90313
8466 -90313 -154621 -144282 8833 -194099 -95902 -127816 6556 -104131 -32397 -127467 -128239
8455 -128239 -123087 -73867 -91540 -194111 -110662 -143128 -127828 -77834 -138060 -62481 -22889 -121541
8443 -121541 -56351 -125285 -60443 -99201 -103334 -43834 -76298 -99193 -139276 -131502 -133611 -34355
8431 -34355 -82818 5178 -11306 -137324 -111802 -107241 -6682 -70830 -106449 -34028 -46297 -25272
8419 -25272 -63602 5396 -46127 -105149 -2755 5616 -71140 14289 -45094 -96812 -108699 -10885
8407 -10885 -28306 -215937 -50166 -31464 -13088 -20222 -51427 -24386 -24165 -90125 101440 -99793
8395 -99793 -35027 78009 -39352 -73314 -31884 -54359 -68022 -80800 4164 7044 -38378 -34576
8383 -34576 -49679 80269 -184391 4606 -74027 -35842 -108445 -1258 -130028 -18136 -58624
8372 -58624 -96419 -85452 -223137 4418 -209660 8981 -171183 -30668 -36112 -80524 -120353
8361 -120353 -4454 -187089 33258 -108260 -113883 -117060 -45400 -135201 -13883 -203627 -71878
8350 -71878 -31858 -101912 -92216 -205661 -8422 -122897 8229 -223752 -68605 -110068 -150767
8339 -150767 -156804 -36685 -213354 9502 -173499 -2628 -221062 -115571 -63463 -158860
8329 -158860 -112859 -80338 -111610 -98898 -127056 -160339 -11703 -161582 -16404 -78558 -81631
8318 -81631 -30926 -118926 -86845 -111428 42557 -168879 -56060 -130270 -43017 -73755 -82921
8307 -82921 -197626 -151259 -102058 -82787 48382 -88392 -76037 -72595 -12422 -63164 -122464
8296 -122464 -47928 -8540 -116656 -9733 -107548 -184656 57975 -94763 -44727 -123380 -161682
8285 -161682 -58024 -91613 -62601 -143688 -91935 -98057 47964 -73860 -207381 -240640 55706
8274 55706 -142963 85479 -94157 -115220 -115597 -65356 -97470 -121145 -114155 43990 963 -114888
8262 -114888 -40943 -168409 -42283 -128487 2068 -20841 -168076 9187 -101169 -167989
8252 -167989 -47221 -118630 -52566 39031 -86172 -91620 -103284 -49904 -123337 -60991 -18007
8241 -18007 -107901 -129835 45089 -81780 -83 -187264 12507 -6537 -78302 -733 -124610
8230 -124610 -118607 -24900 -42691 -155755 -29938 -61585 -47568 -64855 40165 -102350 33095
8219 33095 -93162 40636 -87457 -127237 -68926 15637 -45201 -80746 -4994 -45658 -61570
8208 -61570 -85641 -124387 -65783 -84009 -26501 -97897 47952 -59194 32040 -121901 -164360
8197 -164360 -28598 -67940 -105112 -121438 -239340 -588073 125956 -108170 78425 8069
8187 8069 -68265 10978 -14469 -99953 -7850 17827 49856 -65877 -46755 -25521 40515 25212
8175 25212 66683 12411 -52842 87340 -50101 -32825 -71347 -2943 28845 94672 -46942
8164 -46942 47224 -24428 -6865 104102 25506 -24133 -23986 49368 180502 49880 -115872
8153 -115872 -13211 106884 8967 80229 111781 70534 8161 25430 197986 -47402 -5413
8142 -5413 82369 81314 44638 -7671 81988 30331 49144 -31163 48157 40610 43773 133474 63506
8129 63506 -12992 -28604 -20164 42491 44469 -577 122862 73024 63533 78045 108570 110632
8117 110632 79141 100426 30884 130980 58080 176838 96524 113974 69807 71124 151279
8106 151279 24650 143652 73357 169935 187553 162827 65979 281318 113628 263890 241831
8095 241831 263618 139521 295639 289475 238454 149981 326675 186437 232749 205240 269204
8084 269204 328193 296719 328112 287018 256229 284838 438055 245795 341466 304548 455051
8073 455051 296182 330961 228545 330119 316199 444449 322973 425804 301565 488414
8063 488414 430749 479224 409596 449836 445907 614931 539600 516984 379706 593087 695565
8052 695565 650266 643893 607732 602493 772328 682400 652525 702056 612785 870925 801230 847556
8040 847556 905682 809542 885161 1142380 1017958 1058267 1157695 1216524 1194073 1141369 1294203
8029 1294203 1279558 1355109 1437166 1529593 1488335 1554144 1739121 1850434 1752575 1953458 2077468
8018 2077468 2199604 2295634 2166561 2490935 2620417 2534105 2849272 2738989 3002035 3111222
8008 3111222 3126942 3213662 3374781 3561429 3662267 3817749 3860602 4033433 3997775 4239562
7998 4239562 4276472 4313710 4507649 4470219 4663662 4735590 4715154 4768775 4827234 4897529 4981776
7987 4981776 4970377 5006647 5036190 5054865 4842018 4990635 4914164 4824094 5007160 4788615 4775031
7976 4775031 4806793 4647849 4593443 4638157 4504877 4580274 4434969 4406189 4253447 4250633 4137289
7965 4137289 4125567 4045295 4161872 4083611 4064361 3976680 3925932 3998407 3980056 3942460 3950447
7954 3950447 4062520 3921200 4097175 3934231 3945788 4080112 4124658 4075780 4148501 3999401
7944 3999401 4106101 4196861 4129718 4031243 4069087 4179923 4206813 4026473 4152587 4043466
7934 4043466 4125081 4046089 4105914 3840215 3928477 3891521 3910632 3733424 3653355 3810385 3663000
7923 3663000 3544252 3541143 3400528 3252903 3346743 3211672 3088591 2937942 2884347 2749164
7913 2749164 2661775 2508304 2517167 2477030 2333784 2169072 2143407 2075410 1943692 1876889 1882643
7902 1882643 1834463 1754447 1668470 1607038 1479892 1549478 1455089 1465165 1403361 1425037 1460963
7891 1460963 1463597 1439587 1488096 1620011 1903752 2074045 2198287 2492755 2325331 2138473
7881 2138473 1821665 1490341 1149474 1239926 939848 917460 831398 794482 821159 796949 772885
7870 772885 740101 624113 617341 789395 690633 585576 593931 801837 533069 575944 489987
7859 489987 640362 480351 547079 495645 461412 503669 512079 887127 359669 380069 342067
7848 342067 416410 297970 366085 401144 284401 264985 354929 177578 271064 279342 343644
7837 343644 279901 242745 247064 165665 171600 363648 310400 103980 224055 212255 232240
7826 232240 154476 248644 332147 224161 238368 247020 314426 157358 258123 309409 220399
7815 220399 129866 231815 219991 123189 130231 267507 239010 64231 29802 84030 195231
7804 195231 175172 119393 124205 112977 48537 187951 149937 -38106 21143 118575 216997
7793 216997 -12608 -62389 96899 -25876 32061 -21978 90974 -29642 42343 120804 -38271
7782 -38271 -55693 53011 80405 -39303 -17447 -40392 86011 58191 17486 92200 -24346
7771 -24346 33471 66422 1884 -67805 -8890 -6107 -27089 -26501 1156 53603 -25338 -33243 -1899
7758 -1899 -42897 -67432 -56176 -26842 24756 -151 -30538 -48463 -48535 -81366 -39093 6482 -64944
7745 -64944 16707 -56990 55117 61874 23952 74349 1672 -69824 33731 -99263 50752
7734 50752 -98610 -121329 -15361 74548 13811 -6435 -162388 34412 -73128 -109010 -143833
7723 -143833 26842 -80788 43678 30320 -55569 -72936 4104 63746 -41720 11385 -64454
7712 -64454 -65231 -173688 -80213 -112824 -14692 27246 -63135 -54663 -30523 -48432 -2223 49129
7700 49129 -95392 -77640 -73651 10996 -32298 -6537 -36149 49794 -154918 14194 -100743
7689 -100743 -71265 -49938 -70302 2255 -54898 -16903 -123245 12727 -50072 -39570 -121882
7678 -121882 117139 -125214 8921 -112014 22799 -144030 35328 -18202 -145155 78452
7668 78452 -88694 -132763 -72093 -57316 -56719 -57696 -139515 81391 -45506 -115640 31400 -123645
7656 -123645 -103573 -39986 -46704 -70583 -59030 -27710 -70874 -18056 -93315 -47885 -117823 -14451
7644 -14451 -80768 2286 -71147 63312 -67941 9720 -71155 6891 -168003 -48980 -55239
7633 -55239 -109755 -190194 60444 -103050 -122409 -28503 -164174 -87077 -43280 -60110 -6465
7622 -6465 -69934 -100903 11559 -65458 -81090 -84334 -19001 -83343 -107922 -63510 -87087 -168230
7610 -168230 -15094 -41597 -140282 -79693 -20964 22501 -177982 -138183 13327 34107 -185698
7599 -185698 -27904 -206480 -189151 -58381 -206523 -96119 -12642 90850 -67085 -64088
7589 -64088 -111204 -60250 -6087 -87899 -77708 -65762 -98793 -102041 -121477 -182198 -61537 -43018
7577 -43018 -105897 -152375 -39871 -116503 10853 -68508 -3560 -99647 -52829 -127287 -60186
7566 -60186 -150690 -46801 1377 -10100 -81285 -90126 -43411 -95884 -48068 -19647 -203463 -14802
7554 -14802 -41346 -113078 -16045 -88134 -88970 -58147 -4399 -144104 -84214 -3234 34404 -81534
7542 -81534 -86935 -76287 51052 -171470 21359 8611 -94299 19756 -18260 -95972 -50340
7531 -50340 52278 -3144 -102638 -20147 -61764 -61151 -78763 -34527 -1497 -50257 -48184 -97157
7519 -97157 -101340 -83417 -28151 -43512 -20577 -59587 -62723 -64071 46734 -69115 58031 14636
7507 14636 174 -64320 -4988 -85072 -145662 -105796 -70606 -109618 -35445 -43593 -26775 -112404
7495 -112404 -73415 -48168 -38077 73534 -4652 -72085 26795 -93929 98673 -124818 -30553
7484 -30553 -44816 -25987 -84965 18937 -170182 -36589 11518 -2139 -97582 -30836 -33474
7473 -33474 -78546 -2031 -131406 63511 -55959 -37349 30318 -30195 -98466 72566 -88226
7462 -88226 -3063 -40335 -100127 4359 -59522 -89359 -75685 -25198 2936 -93195 -90257 -34352
7450 -34352 -109891 -124035 9593 -91560 -75770 -181057 -44440 -66351 86985 -126260 -52278
7439 -52278 -27400 3282 27742 -65349 -105831 -21613 -11498 -74330 -7645 -109286 -21431 3765
7427 3765 -33279 -63298 -76296 -128149 178644 -86729 -159368 -115092 11049 12915 32680 19842
7415 19842 -61041 23304 -56324 29986 -75892 -130061 -34907 31155 -107625 -125859 -3224
7404 -3224 -5684 -118935 -70110 -95176 18186 -120336 -17097 -1269 39102 -113753 -37208
7393 -37208 70482 -75758 -50221 8760 -150816 -30290 28602 -19213 848 -134135 -4483
7382 -4483 24243 -47223 -96097 -59834 -34190 61740 -79010 -49121 -39790 7274 -65746 -5938
7370 -5938 -116730 -13420 -10556 -63173 95303 -4810 -175724 50795 81672 137716 -112002
7359 -112002 20372 -68925 -1642 -116067 -27915 55461 -50346 17951 32354 -75217 -64545
7348 -64545 -62827 75733 -32903 4850 -71901 69871 102476 -76858 -21149 -8082 -8352 -100249
7336 -100249 10977 5525 -85380 -57623 72888 251 75965 -37529 25653 -45969 -39318
7325 -39318 -517 -34471 -41552 81062 -11998 -87577 3492 144551 42308 92139 18768
7314 18768 -4294 -58173 118461 69401 78516 -145656 192124 126986 -21897 1724 48625
7303 48625 53369 121906 13686 -40968 108859 31613 9555 1100 55417 -36584 75298 128154
7291 128154 93893 172 46354 -65558 40372 -3358 2974 29466 -68309 42943 34210
7280 34210 50408 15804 36531 64263 6396 35451 -23634 -11372 115440 -132556 -51561
7269 -51561 3664 -40828 -77108 22545 -77995 -16259 -34877 16821 66055 -64562 19303
7258 19303 87897 -40216 20541 43491 -38254 -46350 -6169 26280 -31060 58901 19992 -5353
7246 -5353 -74442 21244 84368 11110 -19577 -11919 -29846 43218 50549 -6468 75993 17454
7234 17454 64712 48522 -12992 78480 -31508 -6851 -36476 -56483 -2251 78105 426 34970
7222 34970 -96747 -10662 19960 117287 -147322 -10118 35361 79818 -33981 83676 -130172
7211 -130172 90931 46474 27482 19401 6410 27877 16209 16736 -34513 -52246 47876 73911
7199 73911 60766 49262 29303 24698 99767 39426 73285 57459 -84443 31903 -5621 39717
7187 39717 26546 59090 57064 162986 -21434 -44862 15766 128959 22220 20751 136791
7176 136791 -31747 130097 -25564 -14389 26652 54012 128122 133222 60759 -64518 6591
7165 6591 104169 89245 9154 13036 123472 156255 64125 -27732 37298 -16202 70330 141484
7153 141484 70715 79066 38206 211266 124301 81774 28730 152573 115547 167752 -23046
7142 -23046 82559 -48591 111063 81083 3878 99906 198010 69104 100984 72227 27033
7131 27033 108964 85395 112369 39408 228297 92432 152542 133247 -30599 282080 191913
7120 191913 128863 77254 204473 63450 272668 42609 71070 206527 190864 133540 118710
7109 118710 168119 108024 277984 154208 52483 99161 194549 173909 200824 110759 188834
7098 188834 265233 188517 162736 160584 164249 224640 237853 189104 76645 278992 159586
7087 159586 239937 174003 201976 147699 330528 185876 259220 228322 330576 374304 249331
7076 249331 147223 285945 240519 194430 289996 281092 226289 357095 317236 313110 218214
7065 218214 313194 264116 267082 319772 276991 290119 375879 344430 316070 390564 309752 401753
7053 401753 327328 365941 339427 325324 347067 440434 455297 451139 420762 424693 449108 402838
7041 402838 370144 326011 460060 445807 445707 402450 492294 555746 487943 442819 537346 522846
7029 522846 525794 516806 526637 443053 506934 597856 618089 525780 597879 678345 549972 651789
7017 651789 572963 550671 763314 571692 700152 753235 741096 631145 793447 738996 779111
7006 779111 733598 842436 799802 768551 818110 982436 944735 792613 1053180 941467 1059048
6995 1059048 995335 987123 1007328 1183910 1081125 1145418 1097121 1269896 1228268 1205060 1269110
6984 1269110 1360316 1345607 1404895 1493608 1434513 1548766 1571057 1728894 1691535 1708987 1786347
6973 1786347 1810314 1958814 2005135 1973260 2079523 2294874 2284030 2376774 2474707 2468428 2512833
6962 2512833 2824374 2755388 2892637 2924980 3247314 3246371 3258093 3352773 3511686 3607784 3702534
6951 3702534 3865514 3881018 3983303 3969401 4070915 4221209 4211572 4296978 4445497 4548192
6941 4548192 4520140 4618382 4648894 4846622 4876369 4901646 4845222 4965537 5029130 5137594 5114345
6930 5114345 5023933 5073416 5085705 5145401 5151269 5049626 5009542 5100193 5145606 5099101 4904037
6919 4904037 5057090 5052170 5081252 5030427 5018130 4932311 5032093 5118817 5106904 5058016 5039413
6908 5039413 5136155 5374313 5173714 5318728 5441826 5573871 5654575 5657501 5816700 5852573
6898 5852573 6057909 6289182 6492811 6390343 6509242 6804616 6944630 7024565 7006799 7194380
6888 7194380 7372831 7256445 7460645 7524461 7535145 7593743 7695220 7624182 7706454 7709982 7690283
6877 7690283 7675142 7676800 7623781 7574369 7428666 7405083 7256093 6986165 7030959 6802298 6672130
6866 6672130 6523959 6178509 6137943 6033811 5796456 5714206 5534284 5269802 5176858 4983774
6856 4983774 4876462 4537947 4371731 4400888 4284320 4070531 3963516 3894474 3662738 3646332
6846 3646332 3466370 3397079 3259387 3298401 3288416 3040171 2891557 2947809 2997653 2790017 2815296
6835 2815296 2621810 2725756 2676962 2573483 2563293 2511819 2423102 2472624 2406014 2298379 2475885
6824 2475885 2287976 2444915 2354593 2220560 2252340 2317250 2231032 2222272 2110094 2114850 2295695
6813 2295695 2156803 2144914 1999662 2147392 2082851 2265689 2083304 2077060 2108070 2146643 2219155
6802 2219155 2227640 2074053 2106203 2278379 2131998 2237991 2225048 2223000 2178825 2138151 2313532
6791 2313532 2291200 2238441 2413864 2368265 2374648 2261279 2476141 2408552 2418476 2486562 2568445
6780 2568445 2539987 2583491 2595450 2665718 2747402 2806967 2826463 2778928 2917846 3008478 2926000
6769 2926000 3129452 3122815 3344969 3420856 3456345 3411256 3554408 3737755 3788520 3884144 4025007
6758 4025007 4009062 4249790 4432351 4416305 4563453 4728685 4953461 5166955 5297123 5472477
6748 5472477 5605093 5864124 5945964 6108651 6229809 6405629 6542104 6723434 6683202 6884120
6738 6884120 6843366 6995295 7138491 7091837 7087420 7133622 7152700 7228730 7204845 7148648 7219557
6727 7219557 7118721 7152332 7116652 7195261 7204754 7244742 7268321 7275786 7453080 7462493 7411160 7528547
6715 7528547 7509698 7723201 8003077 7948694 8291544 8482068 8636239 8784685 9140278 9344383
6705 9344383 9656558 9894058 10208859 10395299 10923803 11200411 11430976 11727462 11980000 12410484
6695 12410484 12763335 12968466 13173710 13477728 13764677 13992520 14066008 14307181 14382146 14463061
6685 14463061 14443802 14550291 14588563 14450437 14500731 14475915 14319258 14287646 14178625 14012024
6675 14012024 13774400 13742896 13613039 13306825 13075095 13021826 12798434 12660820 12428643 12277699
6665 12277699 12138809 11921650 11816164 11580187 11516529 11315399 11322304 11184017 10994657 10985554
6655 10985554 10824495 10912736 10769794 10738185 10677525 10792899 10655799 10684926 10641977 10728979
6645 10728979 10839207 10714787 10715117 10741910 10910791 10944031 11059341 11021073 11134514 11131355 11272942
6634 11272942 11281209 11441583 11414022 11450963 11650355 11553347 11546832 11755207 11723306 11741695 11841648
6623 11841648 11812562 11892840 11879327 11769593 11874181 11785856 11734328 11791758 11821158 11502436 11551154
6612 11551154 11461672 11348506 11301501 11228730 11086608 11026918 10788238 10825832 10692569 10590395
6602 10590395 10474458 10440387 10191885 10184251 10141152 10004328 9929549 9955014 9983255 9768687 9668586
6591 9668586 9783715 9715963 9560729 9590186 9611173 9632357 9517734 9502419 9607939 9462372
6581 9462372 9523134 9664951 9547004 9501981 9620999 9621788 9577390 9636897 9572465 9862460 9728280
6570 9728280 9944379 9920306 10103736 10002040 10382818 10372895 10488131 10535268 10523063 10686648
6560 10686648 10315552 10030500 9866373 9530755 9126532 8798196 8314723 8026679 7653365
6551 7653365 7213037 7056960 6674703 6384392 6255577 5975965 5771425 5606780 5706135 5568979
6541 5568979 5367344 5303965 5514850 5352297 5299081 5377047 5394002 5340189 5538966 5423908
6531 5423908 5406588 5618429 5427265 5544104 5464392 5376262 5316663 5375705 5158308 5179823 5099085
6520 5099085 4973113 5241685 5043563 5191874 5183842 5378461 5485321 5672954 5767219 5986738
6510 5986738 6189590 6234207 6222156 6170033 6129867 6065390 5792761 5585513 5142395 5037726
6500 5037726 4834698 4518540 4248778 4110915 3973623 3956619 3784214 3558780 3615581 3503209
6490 3503209 3548533 3507887 3459523 3397664 3609017 3476692 3613143 3573647 3552864 3759851 3800556
6479 3800556 3648034 3660999 3753067 3676296 3687755 3627840 3405683 3285346 3094742 3080769 2762423
6468 2762423 2750877 2542405 2530284 2429629 2307057 2214260 2133659 2103019 2028208 1945759 1857277
6457 1857277 1869211 1912972 1783342 1725136 1657489 1761939 1616572 1634606 1616179 1638065 1573256
6446 1573256 1421184 1549873 1421393 1394719 1434315 1484726 1376721 1479977 1468154 1468856 1353272
6435 1353272 1401922 1504503 1397586 1288586 1277081 1387592 1261352 1292766 1388621 1357618
6425 1357618 1172521 1322359 1296490 1220700 1252277 1262833 1274195 1176447 1241475 1308274 1299286
6414 1299286 1254946 1274968 1305190 1335173 1226256 1212204 1161932 1216578 1313901 1136578 1300493
6403 1300493 1330058 1201331 1286446 1271908 1205790 1182115 1287485 1163378 1262785 1217784 1219713
6392 1219713 1304738 1422252 1298501 1212119 1373201 1374869 1413358 1311769 1305191 1428433 1299430
6381 1299430 1374490 1418471 1431722 1413864 1446925 1412889 1467478 1420561 1478237 1520222 1453613
6370 1453613 1471382 1465028 1751661 1477598 1593565 1597540 1786464 1497675 1524986 1631204 1647413
6359 1647413 1673510 1709030 1647455 1721954 1815727 1756764 1900664 1758779 1705540 1833677 1961484
6348 1961484 1977639 1938557 1857699 1995960 1952390 2075542 1976516 2043351 2177644 2220766 2198814
6337 2198814 2280386 2267800 2403039 2500275 2424193 2422301 2492370 2615789 2700175 2688631 2789019
6326 2789019 2683683 2892678 2984842 2926382 2990393 3051457 3117141 3075370 3353997 3381532 3368602
6315 3368602 3420680 3626283 3746929 3711525 3787884 3875259 3948992 3992809 4148025 4250610 4215058
6304 4215058 4376503 4528175 4624416 4540806 4745107 4763411 4917209 4929889 4886905 5089180
6294 5089180 5208202 5265159 5347732 5402977 5455547 5495148 5760180 5646273 5714166 5951494 6106170
6283 6106170 6123426 6154470 6235132 6377357 6478310 6345758 6518289 6543931 6574282 6725050
6273 6725050 6682171 6751573 6721107 6976401 6915129 6983595 7256719 7296025 7368588 7457702 7544091
6262 7544091 7523933 7644678 7769738 7874328 7846132 8004108 8067500 8155162 8055009 8240036
6252 8240036 8323115 8308794 8329449 8399034 8504185 8486209 8557127 8562852 8643195 8568684 8683949
6241 8683949 8713700 8587465 8592130 8612151 8799107 8515436 8654044 8551895 8746573 8389294
6231 8389294 8409131 8271372 8236520 8080486 8146249 8038526 7895827 7902468 7942686 7795572 7712925
6220 7712925 7724755 7650899 7570874 7568788 7502492 7508867 7477964 7393270 7291375 7399309 7363777
6209 7363777 7461085 7294662 7252685 7344957 7391649 7256798 7119698 7198338 7230668 7191154 7086946
6198 7086946 7048879 6965496 6944303 6977042 6849181 6709979 6733478 6921893 6760045 6774233 6793335
6187 6793335 6779894 6782999 6828236 6884181 6762373 6911034 6934510 6884371 6810242 6915379 7007699
6176 7007699 7086198 6928489 6957127 7012766 7036438 7129479 7108920 7036488 7271515 7257603 7264889
6165 7264889 7270313 7352770 7514381 7572874 7622079 7569391 7777150 7853101 7913204 8031191 8086357
6154 8086357 8163010 8426565 8398897 8544382 8657280 8845184 8877049 9102635 9173232 9275910
6144 9275910 9589024 9692657 9699378 9929251 10137519 10244773 10412105 10538974 10799087 10921902
6134 10921902 11047323 11435467 11539623 11720051 12040898 12271337 12404532 12836214 12935379 13293117
6124 13293117 13440921 13721147 13995240 14454432 14612448 14936807 15227604 15678554 15968436
6115 15968436 16351080 16751183 17093994 17486162 18000451 18296637 18750459 19203325 19733748
6106 19733748 20251349 20581712 21169984 21634222 22288810 22748524 23464910 23984059 24600561
6097 24600561 25316749 26001535 26744156 27417808 28202383 29002531 29949749 30657771 31633683
6088 31633683 32604316 33570869 34601258 35717818 36777747 37927629 39232741 40592199
6080 40592199 41875221 43360832 45084081 46690052 48402704 50280462 52394515 54521935
6072 54521935 56921765 59594409 62307515 65280322 68633961 72467907 76213958 80585222
6064 80585222 85452065 90883598 96783683 103337497 110614999 118775751 127931057 138220156
6056 138220156 149869748 162904420 177489467 194270497 213106241 234114665 257749449
6049 257749449 283715321 311976606 342219357 373340783 403618809 430977970 452612941
6042 452612941 465903302 468513578 460135375 441318298 414672479 382948590 349099064
6035 349099064 315710693 283903199 254933977 229224507 206424517 186589458 169366847
6028 169366847 154482112 141439740 130249735 120377038 111905687 104218644 97402295 91389411
6020 91389411 86131237 81172639 76876189 72942534 69318460 65952254 63120462 60270247
6012 60270247 57891385 55507316 53322410 51407904 49341419 47661500 46048809 44393578
6004 44393578 42843521 41495414 40108290 38814397 37477189 36353590 35275192 34198963
5996 34198963 33095716 32251809 31208702 30412161 29531373 28685114 27813870 27099189 26491898
5987 26491898 25886239 25012141 24369924 23918594 23259223 22754833 22106863 21669529 21099607
5978 21099607 20766359 20283574 19811879 19390784 19013576 18716943 18283106 17849761 17649946
5969 17649946 17307846 17032568 16500643 16354935 15966510 15728321 15468719 15174527 14894737
5960 14894737 14708744 14491116 14353088 14062485 13847923 13722091 13323836 13169983 12956846
5951 12956846 12834361 12520847 12471561 12293200 12057346 11799992 11757265 11629092 11491223 11237286
5941 11237286 11093231 11021702 10860347 10884064 10711595 10531198 10581231 10495257 10437815 10218388
5931 10218388 10295104 10121483 10191685 10051454 10069939 9901775 9935894 9950026 9883588 9835373 9716713
5920 9716713 9894617 9804265 9823381 9864963 9642970 9711089 9910210 9724620 9759692 9760452 9852399
5909 9852399 9816673 9860353 9735190 9998124 10104023 10201061 10053545 10289554 10257652 10320001
5899 10320001 10444690 10518368 10520800 10489904 10669746 10882555 10826633 10923801 11024805 11102012 11267693
5888 11267693 11196908 11561815 11527252 11729522 11765846 12026922 12197052 12172271 12389526 12635225
5878 12635225 12818953 13005609 13212436 13411601 13694227 13922073 14120347 14263771 14390380
5869 14390380 14677768 14819208 15034820 15216702 15275458 15620923 15633066 15900730 15968883 16106349
5859 16106349 16349664 16506288 16649254 16688562 16879357 16948895 17156381 17166066 17219796 17412275
5849 17412275 17360097 17560424 17586029 17529795 17625371 17758141 17667239 17695376 17649730 17642782 17658675
5838 17658675 17665489 17598442 17579326 17484076 17510755 17317465 17339494 17272808 17122823 17116900 17074464
5827 17074464 16979500 16758840 16784948 16718701 16573276 16409090 16374559 16317887 16094484 16031059
5817 16031059 15818233 15728421 15493740 15449421 15297670 15136627 15004760 14672042 14642616 14373664
5807 14373664 14153158 14027588 13885830 13649594 13405792 13227900 12982267 12839313 12547609
5798 12547609 12444954 12004557 11936130 11737703 11425604 11218111 11174427 10900796 10725442 10612008
5788 10612008 10439977 10134882 9992027 10006093 9694505 9746393 9449543 9430592 9212563 9128550
5778 9128550 8985825 8926514 8790757 8744658 8594499 8509685 8434870 8459220 8274757 8135510
5768 8135510 8119942 7996397 7868939 7790717 7693426 7737958 7555242 7599027 7607667 7329194 7404507
5757 7404507 7373007 7231034 7225956 7198688 7205847 7074051 7028141 6855764 6893145 6885876 6905267
5746 6905267 6866792 6872729 6720441 6834397 6632054 6611184 6679576 6587905 6574245 6707444 6544713
5735 6544713 6594158 6583243 6626473 6659146 6455714 6655398 6551776 6603728 6642993 6636274 6676090
5724 6676090 6626378 6663651 6815711 6688149 6669544 6678326 6651781 6644929 6739499 6667125 6548593
5713 6548593 6677981 6691438 6596238 6678501 6692996 6838718 6780871 6860309 6868269 7031642 6956920
5702 6956920 7307986 7213651 7311046 7334144 7493595 7636450 7694848 7832301 8019350 8123725
5692 8123725 8349449 8582272 8595486 8843631 8952178 9268238 9515296 9712153 9879872 10371923
5682 10371923 10567087 10929766 11227874 11681866 11989163 12526991 12866216 13509851 13847810
5673 13847810 14456820 15187595 15825785 16376548 17159374 17976682 19091280 19894733 20871951
5664 20871951 22076227 23285594 24593401 26129025 27610503 29140176 30826999 32799782
5656 32799782 34960815 36906773 39080737 41571042 43906727 46242100 48538641 50727038
5648 50727038 52939317 54841076 56331693 57470205 58281086 58713691 58654458 57969837 56929063
5639 56929063 55616547 53725743 51656015 49417633 46928789 44479855 42054215 39719100
5631 39719100 37328502 35033095 33003683 31157159 29278496 27603132 26190642 24719390
5623 24719390 23461634 22240122 21296013 20204889 19451054 18652249 17901573 17197808 16682201
5614 16682201 16184547 15665147 15363132 14978142 14681197 14629492 14324701 14493379 14562140 14919074
5604 14919074 15211771 15235112 14775264 14203527 13344561 12481074 11751787 11227756 10678703 10362057
5594 10362057 10139837 9675304 9490002 9189876 9038928 8817278 8651086 8309080 8343573 8155233
5584 8155233 7926939 7814423 7565216 7511169 7280638 7145698 6958349 6980104 6754335 6683388
5574 6683388 6624467 6434270 6312157 6281967 6222367 6005773 5908329 5800378 5763572 5567379
5564 5567379 5476016 5360617 5281724 5137708 5165380 5005785 4891011 4664975 4725272 4620362
5554 4620362 4536792 4386245 4307875 4324651 4212936 4056020 3985984 3905134 3824939 3875460 3673328
5543 3673328 3560698 3637158 3516430 3499435 3429532 3400252 3306814 3330401 3276118 3058881 3094538
5532 3094538 2972440 3099035 2986280 2898147 2922061 2890693 2770171 2853835 2781233 2758185 2698602
5521 2698602 2782031 2596082 2627060 2519032 2710012 2539826 2648602 2443115 2413023 2618614
5511 2618614 2505647 2518752 2368702 2510536 2465774 2407266 2331666 2272511 2314011 2200195 2441189
5500 2441189 2374477 2292900 2243735 2407774 2347019 2215595 2323321 2322959 2420221 2398679 2423415
5489 2423415 2376639 2309911 2515068 2658289 2549221 2568924 2788961 3068756 3197853 3578418
5479 3578418 4109822 4493977 4880776 5156264 5038734 4659895 4208311 3551937 3078822 2781378
5469 2781378 2487310 2399342 2223025 2251265 2138728 2012228 2002131 2085849 2055693 2103218 2017459
5458 2017459 2014086 1914845 2045024 1991189 2057663 2081035 2154333 2300256 2329638 2252611 2292845
5447 2292845 2338172 2195669 2265848 2121680 2159432 2080675 1989210 2012915 1790903 1859269 1752775
5436 1752775 1885435 1808214 1837676 1672643 1919578 1728482 1744898 1759381 1647884 1730935
5426 1730935 1762256 1569759 1744426 1689631 1615985 1724824 1693478 1699827 1729674 1791458 1684862
5415 1684862 1749663 1723686 1803104 1913846 1778091 1795239 1856258 1842472 1742341 1799256 1884588
5404 1884588 1830079 1929198 1760396 1786400 1972031 1970569 1913713 1978848 2056281 2041555 2164242
5393 2164242 1997974 2139492 2067595 2167658 2169240 2344739 2126396 2259472 2405326 2487576
5383 2487576 2380458 2528382 2511170 2607654 2601472 2567662 2757506 2779992 2873593 2783230 2981289
5372 2981289 2909977 3091914 3060051 3247367 3351644 3415545 3482152 3606665 3560236 3639822 3774649
5361 3774649 3875956 3813837 4020972 4151480 4286599 4437954 4515419 4658797 4790006 4926350
5351 4926350 5029713 5218714 5441390 5683046 5976189 6106625 6565481 7007081 7455516 8032909
5341 8032909 8752134 9500232 10348976 11716048 13039278 14915022 17615012 20902286 25338607
5332 25338607 29902995 31991767 30648171 26882170 22911664 19695629 17609738 16350700
5324 16350700 15839830 15989374 16399578 17146023 18444952 20119624 22131442 24733469 27433024
5315 27433024 30006236 32228654 34232828 36046222 38495578 41934735 45350559 48910341
5307 48910341 51169513 52425601 52779314 53563916 55196551 57499367 59713653 60950651
5299 60950651 59855434 57225529 54122536 51667470 50090366 49179539 48018885 45688622
5291 45688622 42255907 38329512 34892135 31952864 29708254 27733193 25772217 23244452
5283 23244452 20777357 18193754 15889030 14213138 12701312 11648543 10747090 9947097
5275 9947097 9477697 8955993 8722116 8349322 7990619 7912222 7612888 7425044 7385262 7121478
5265 7121478 7164092 7074668 6935406 6945594 6763980 6720286 6729581 6611567 6602903 6490976 6692153
5254 6692153 6726249 6634352 6629427 6625266 6715676 6672848 6818494 7128758 7050526 7129043 7321849
5243 7321849 7398523 7387767 7492217 7612801 7899539 7964455 8218642 8435905 8447231 9001201
5233 9001201 9078092 9299489 9328962 9648506 10005271 10067876 10353548 10672285 10924837 11526966
5223 11526966 11857426 12351479 12924117 13598196 14458059 15310602 16281807 17458915 18906546
5214 18906546 20434823 22111935 24212237 26563596 29013483 32132104 35464547 39232278
5206 39232278 43496568 48463747 53962917 59526551 64973582 69790567 73092168 74333734
5198 74333734 73401861 70294196 65538497 59925289 54021537 48426512 43843142 40091156
5190 40091156 37310429 35351421 34271706 33773135 33782892 33712284 33648337 32916658 31517442
5181 31517442 29596804 27121209 24363059 21736511 19300856 17175901 15417302 13961211
5173 13961211 12877192 11885575 10932301 10342950 9704724 9208790 8689793 8317660 8032996
5164 8032996 7603025 7423037 6963883 6754565 6565190 6317621 6097480 5967418 5766502 5543551
5154 5543551 5435717 5279221 4929597 4983587 4839131 4835554 4651497 4452442 4421812 4277417
5144 4277417 4095933 4115478 3932536 3881181 3835653 3736645 3531567 3670553 3631045 3379006
5134 3379006 3439555 3382036 3424429 3190652 3316612 3126200 3157288 3065048 3210312 2855335
5124 2855335 2982874 2875113 2971363 2805082 2856322 2765189 2894675 2685052 2786236 2752455
5114 2752455 2748198 2734613 2802884 2745538 2665692 2727644 2754470 2747290 2703231 2767575 2710244 2699062
5102 2699062 2803670 2775195 2826130 2740132 2815534 2895154 2803102 2942943 2873375 2966265 2844518
5091 2844518 2991711 3056232 3176072 3207364 3330655 3376740 3374625 3629351 3794209 3859916 3862042
5080 3862042 4076629 3990473 4080390 4231362 4415740 4517743 4497086 4691874 5021985 5043209
5070 5043209 5297023 5494426 5688076 5955291 6152893 6535654 6647675 7025603 7332730 7761333
5060 7761333 7852994 8224643 8538314 8981568 9205872 9454181 9756154 9963952 10429688 10668453
5050 10668453 10911324 11035479 11264167 11680930 11693612 11802413 12045565 12126556 12255132 12264219
5040 12264219 12336331 12083592 12153916 12099178 11974044 11729809 11594594 11473066 11296966 11041491
5030 11041491 10684555 10506984 10344351 10026404 9846433 9408197 9022957 8797884 8396714
5021 8396714 8142894 7602925 7420420 7104011 6834572 6441573 6148474 5890837 5700972 5420859
5011 5420859 5157547 4900340 4617719 4580322 4322916 4057929 3744535 3717778 3575596 3354989
5001 3354989 3244275 3104918 2990961 2960618 2867179 2736962 2587065 2546584 2468178 2312656
4991 2312656 2208111 2206563 2088653 2013999 2041074 1932608 1785604 1917708 1949447 1734585
4981 1734585 1735557 1773839 1774882 1785178 1641775 1641863 1666388 1683601 1703082 1574525 1542961 1546835
4969 1546835 1604054 1604763 1431145 1531929 1483266 1506922 1437165 1489790 1391327 1465862 1465443 1455519
4957 1455519 1418014 1345624 1422405 1464456 1461170 1454194 1542199 1456596 1618296 1529303 1417097
4946 1417097 1434446 1479425 1380209 1291386 1224567 1256696 1275642 1250053 1065904 1255839 1000926
4935 1000926 1243940 1111579 1214210 1146760 1291423 1312217 1308443 1300866 1402772 1284604 1378482
4924 1378482 1289731 1084409 1130605 1093115 1081980 1095575 1037197 1022266 1141399 981456 1075566
4913 1075566 1080998 937259 1078438 988149 953887 981234 1013014 873902 1014984 1003221 954465
4902 954465 972143 1037262 931071 1025724 960135 1049752 920725 957972 990590 1013256 992070
4891 992070 1026100 982894 977422 978956 945216 1074778 915765 1128792 1068353 1026127 1021349 1073564
4879 1073564 1089193 1164660 1007287 1130283 1186057 1119840 1136450 1230150 1174177 1279496 1303979
4868 1303979 1243229 1307486 1274060 1382317 1282380 1368427 1447775 1477337 1426126 1395407 1546415
4857 1546415 1467928 1614073 1600748 1652157 1633016 1725478 1882000 1889858 2010947 2087967 2358193
4846 2358193 2451338 2491182 2493976 2873766 3140309 3357962 3699802 4202212 4460447 5202870
4836 5202870 5884754 6758563 8249400 10069880 12444843 15248898 17301489 17026332 15226543
4827 15226543 12335947 9862308 7919886 6817807 5703992 5429733 4965264 4852201 4644901
4818 4644901 4387810 4228384 4073684 3866404 3753811 3762379 3773240 3746338 3796440 3528694
4808 3528694 3202668 3002527 2961765 2822873 2771070 2573457 2719102 2747370 2643414 2658349
4798 2658349 2659836 2629226 2687657 2712561 2644369 2528762 2705083 2865065 2593997 2735230 2614470
4787 2614470 2839671 2796815 2841659 2823088 3053359 2899909 3113737 3036799 3171699 3153661
4777 3153661 3367156 3276054 3468833 3474407 3640018 3719713 3778230 3861081 4061128 4150247 4237694
4766 4237694 4327669 4378538 4552526 4527674 4721421 4754001 4876509 4813468 5063982 5065955 5236380
4755 5236380 5210691 5325344 5408197 5228936 5418209 5586681 5466782 5690650 5565859 5643529
4745 5643529 5763984 5803365 5738758 5874099 5971827 6058703 6159829 6100359 6417888 6628369
4735 6628369 6676396 6953175 7286208 7421339 7734017 8099302 8285047 8749117 9121093 9705806
4725 9705806 10006111 10534893 11013652 11648911 12158702 12685654 13239089 13871406 14270748 14873839
4715 14873839 15466149 15721251 16205322 16655102 17025368 17405323 17729674 18048601 18350285
4706 18350285 18492006 18748516 18933916 18981130 19184143 19181128 18975020 18890602 18877073 18684985
4696 18684985 18304626 18062638 17703051 17494115 17251745 16831275 16470805 16107697 15771024
4687 15771024 15482144 14873728 14522094 14086451 13649056 13141875 12567887 12059365 11579819
4678 11579819 11114706 10640451 10149286 9692944 9328890 8973863 8662231 8367231 8102843
4669 8102843 7840371 7776551 7472522 7293499 7199318 7205255 7041706 6996062 6873825 6978119
4659 6978119 7013854 6941999 6966529 6972913 6981606 7010157 7044288 7019510 6994861 7081296 7109790 7012752
4647 7012752 7002000 7022679 6990773 7091321 7087697 7042160 7064524 7071812 7130279 7103588 7044579 7116181
4635 7116181 7290749 7225535 7289082 7295583 7358342 7593760 7589026 7743180 7858739 8133941 8369113
4624 8369113 8513614 8639568 8823874 9130698 9284422 9488823 9690295 9713847 9857682 9868645
4614 9868645 9880293 9783718 9766555 9843335 9627014 9549109 9470756 9408432 9343015 9293485 9232276
4603 9232276 9316975 9294488 9341010 9516806 9532969 9680298 9798337 9840642 10154330 10185009 10510239
4592 10510239 10694848 10963832 11215690 11650155 12041651 12389314 12825517 13265425 13818124
4583 13818124 14482283 14968689 15596957 16342887 17090692 17908324 18700670 19382736 20278394
4574 20278394 21220405 22022369 22761952 23422759 24319140 24944751 25575145 26193959 26846181
4565 26846181 27402382 28100706 28753649 29536727 30083059 30922618 31812143 32506951 33407107
4556 33407107 34171013 34947602 35518569 36042620 36215768 36536505 36336138 36258608 35698395 35082365
4546 35082365 34198814 33440193 32451477 31421911 30641440 29589667 28709619 27933504 27189824
4537 27189824 26498068 25867329 25213931 24749729 24042449 23477447 22906937 22188362 21567705
4528 21567705 20871621 20066522 19294967 18530456 17781946 17118043 16319932 15681658 14971258
4519 14971258 14374240 13820664 13183358 12587599 12220221 11752097 11357770 10933217 10677641
4510 10677641 10287758 10127121 9853772 9525308 9479446 9081978 9100599 8904047 8740015 8713465
4500 8713465 8540308 8497097 8494209 8421342 8364523 8470619 8363169 8525997 8405598 8673192
4490 8673192 8685393 8715507 8590739 8643416 8666379 8580142 8471902 8376337 8088304 8085729 7856777
4479 7856777 7683746 7314069 7156369 7029947 6806565 6668347 6415994 6245568 6159333 6100143
4469 6100143 5935587 5782516 5617645 5602019 5469476 5358107 5309601 5220553 5114031 5193335
4459 5193335 4980585 4951137 4849157 4924228 4888529 4738812 4528739 4701818 4638612 4452981
4449 4452981 4512649 4520819 4439230 4331945 4407162 4189659 4359696 4208927 4316294 4265319 4279517
4438 4279517 4192309 4378029 4093334 4215530 4101192 4355355 4243368 4365047 4378312 4416841
4428 4416841 4351443 4453390 4400548 4544522 4552910 4605570 4639773 4800953 4630748 4778874 4863812
4417 4863812 5069655 5000663 5206546 5164687 5286679 5273882 5527922 5591720 5729926 5840775
4407 5840775 5976775 6033734 6026986 6238921 6392844 6633640 6700274 6818154 6885059 7165507
4397 7165507 7295529 7460639 7527324 7806248 7983111 8182989 8403378 8638896 8832648 9099917
4387 9099917 9379513 9756415 9917487 10343806 10695172 10979433 11248621 11851394 12259611 12941681
4377 12941681 13354114 13941697 14624803 15447064 16119372 16917121 17933029 18874674 20031059
4368 20031059 21179348 22350745 23763375 25237364 26805210 28445273 30206414 32078138
4360 32078138 34040840 36010015 37829578 39753670 41689127 43515475 45235205 46548857
4352 46548857 47797301 48969687 49754682 50325752 50619239 50796765 50766478 50760799 50220371 49727565
4342 49727565 48999449 48043914 47003369 45778795 44050787 42650010 40990497 39096294
4334 39096294 37263774 35485867 33674232 31902516 30285527 28628394 27117999 25717827
4326 25717827 24473720 23361360 22169220 21211909 20487745 19649022 18817372 18199387 17573685
4317 17573685 17047705 16622717 16229615 15623221 15355630 14918277 14770046 14608334 14523433 14324937
4307 14324937 14385698 14466551 14499493 14565641 14746731 14920791 15007683 14981646 15025988 14943962 14481059
4296 14481059 14029881 13662969 13110399 12607677 12252341 11776393 11604978 11140897 10847315
4287 10847315 10473368 10327109 10081494 9895430 9785620 9553672 9493478 9334291 9217356 9135913
4277 9135913 9135991 9054739 9038348 9015584 8927176 8904383 8932310 8811845 8763517 8612824 8662548 8310531
4265 8310531 8195112 8213940 8085226 8077434 7937714 7893245 7935351 7711931 7804113 7862627 7897976
4254 7897976 7912879 8122268 8065685 8272160 8492937 8367955 8861830 8987382 9318037 9345323
4244 9345323 9877802 10046562 10362776 10638280 11095940 11478167 11896884 12456367 12857843 13599946
4234 13599946 14110904 14885501 15671911 16557869 17349870 18458255 19259268 20207458 21067976
4225 21067976 22134665 23019545 23852357 24350665 25131131 25639463 25841300 26075294 26183701
4216 26183701 26164676 26090566 25832819 25465445 25010871 24384159 23766162 23167614 22131732 21197803
4206 21197803 20357894 19407121 18305055 17240764 16460119 15392462 14647017 13819659 12969796
4197 12969796 12240424 11691476 11154878 10546792 9877360 9639819 9245985 8938266 8435060
4188 8435060 8308334 7885842 7722543 7515926 7121779 6944709 6812435 6583954 6416821 6369802
4178 6369802 6007478 6159271 6051513 5860232 5731076 5617115 5605682 5590333 5545386 5453318
4168 5453318 5518881 5495411 5595588 5552838 5584922 5576453 5609519 5559596 5271229 5332822 5246528
4157 5246528 5030109 4969943 4720201 4601596 4591129 4424570 4371351 4128362 4167314 3954018
4147 3954018 3892747 3794983 3634678 3631315 3549201 3444186 3525721 3348982 3271023 3364553 3225329
4136 3225329 3289497 3232105 3225942 3181487 3112812 3000626 3125053 3059949 3071075 2975756 3135744
4125 3135744 2995026 3021755 3088067 3014100 3024051 2998754 3013594 2998263 2976623 2929135 3018645
4114 3018645 2959060 2905570 2959057 2937219 3018483 3031210 3106100 3035879 3099836 3077929 3010767
4103 3010767 3199676 3157625 3139271 3273730 3242833 3204794 3178204 3224825 3174803 3378238 3306682
4092 3306682 3352290 3310404 3482607 3470185 3635613 3511688 3493349 3571901 3758778 3770971 3673045
4081 3673045 3827970 3854712 3885335 4053188 4103778 4034161 4189137 4301809 4278783 4367160 4355161
4070 4355161 4525572 4601280 4586405 4811702 4864715 4879369 5187041 5196419 5234347 5474891 5574504
4059 5574504 5671087 5806013 5982297 6107860 6323596 6354368 6613937 6750930 6894115 7072851
4049 7072851 7390484 7643878 7711169 7946853 8296004 8494054 8716881 9051274 9415203 9691921
4039 9691921 10116968 10530350 10936751 11338360 11867993 12362132 12894864 13505181 14049028 14563552
4029 14563552 15405982 16198521 16807596 17872603 18800786 19774793 21117141 22211396 23480843
4020 23480843 25147736 26599639 28446598 30274753 32387686 34588075 37157772 40051216
4012 40051216 43357236 46784265 50828103 55528602 60572041 66155348 72441213 79256916
4004 79256916 86667448 94563831 102661296 110570150 117611532 123062862 126359347 126590264
3996 126590264 123626848 118137562 110580993 101786140 92539078 83690741 75561261 68200436
3988 68200436 61784248 56201521 51388655 47169305 43649505 40571665 37696294 35349922
3980 35349922 33257400 31235604 29376122 27648416 26253245 24872032 23674119 22637672
3972 22637672 21632158 20626936 19917328 19246344 18400653 17712864 16963454 16485451 15642160
3963 15642160 15058266 14346513 13799938 13119449 12665354 12035463 11557713 11210077 10793335
3954 10793335 10412561 9982495 9704196 9405081 9101361 8757721 8603189 8295405 7960919
3945 7960919 7767583 7596611 7277899 7050817 6877081 6695236 6564933 6305397 6174591 6010576
3935 6010576 5779629 5695209 5497352 5422387 5211486 5137940 5047559 4824174 4632131 4678559
3925 4678559 4556530 4454567 4432924 4157674 4135498 4047387 4097704 3759908 3820595 3640667
3915 3640667 3801761 3568609 3491523 3410012 3316906 3385346 3261673 3182126 3042675 3150668
3905 3150668 3035958 3118755 2806666 2834068 2895164 2868867 2585310 2632529 2505856 2586262 2524932
3894 2524932 2450067 2402421 2278823 2497213 2321788 2104906 2180549 2136292 2174578 2099411 2018336
3883 2018336 1939937 1944516 2098056 1817481 2019621 1751727 1814823 1767534 1797621 1700842 1746311
3872 1746311 1648122 1892186 1628658 1539072 1637855 1552852 1477375 1525068 1418758 1495306 1446648
3861 1446648 1396894 1372539 1318230 1280736 1393851 1290631 1268378 1312124 1212816 1393015 1261421
3850 1261421 1179472 1204800 1131431 1202462 1100471 1098547 1118289 1131397 1061907 1002785 990805
3839 990805 995082 967590 872283 986904 948077 957382 822856 814197 879348 830188 906240 772837
3827 772837 869910 847932 873532 935357 781424 872108 805729 826429 696622 750074 669491
3816 669491 870480 694568 687168 662735 755298 636789 726731 600575 794935 523946 724309
3805 724309 591874 647441 523927 725460 646603 688456 587772 463690 615965 615990 506392
3794 506392 663156 614533 591532 648807 592585 518415 636802 546930 561137 665887 530116
3783 530116 603425 519756 562678 557969 561159 575424 588456 534614 577592 584452 763150 475030
3771 475030 556042 604074 658806 542684 700685 664431 616123 710176 705441 563735 712713
3760 712713 671109 718256 746309 712784 801551 823885 724221 941879 917545 933581 983144
3749 983144 890784 779805 947140 822715 784317 807777 713532 650959 744254 716427 606652
3738 606652 530179 590988 550730 487362 519893 420524 456581 542959 438827 459596 467891 424103
3726 424103 444264 478010 415760 463899 463098 343556 444983 343569 368163 390996 388496 484730
3714 484730 350654 289958 354692 378091 267951 365927 413805 240338 348471 334374 346330
3703 346330 316075 326486 385170 306481 330432 229677 318957 337110 326390 187199 230177
3692 230177 228947 205065 313006 208179 244515 294870 272859 314588 267901 115176 278896
3681 278896 291683 194983 187775 241109 200242 218565 239738 154730 286791 117687 189750
3670 189750 228365 228652 113759 282364 106065 153548 214805 112121 254601 164759 231348
3659 231348 205568 249108 195361 210202 209694 272845 175895 113056 263729 93742 279231
3648 279231 156379 62158 248516 284530 175815 193841 129426 184523 267959 224230 217669
3637 217669 107813 211363 205712 233603 58416 179156 181294 144907 210845 268698 56608
3626 56608 213920 272544 99523 154739 158287 245292 174285 45702 151829 198871 115376
3615 115376 170947 145733 221056 53254 263842 159120 71767 86366 222538 87502 221710
3604 221710 165050 117012 104058 255323 186763 123300 24637 145190 166466 134693 138323
3593 138323 157380 140356 32429 210844 39335 56069 201512 32194 158088 135688
3583 135688 40580 70918 162297 151519 113008 104312 279442 149031 180194 160168 21570
3572 21570 144022 94564 129202 58244 122122 183943 284707 129415 139408 68240 236989
3561 236989 109112 134870 151237 80748 36055 65215 249120 160516 175924 85392 194641
3550 194641 143043 95485 117309 137155 153695 290394 102491 154402 72281 187628 53579
3539 53579 56056 150459 108167 87353 183028 76446 149952 122701 172197 120040 69870 132220
3527 132220 151185 93631 30191 83797 89861 123347 78961 92938 60537 147405 176592 144061
3515 144061 185293 105110 132805 74547 176677 135767 73726 100595 83926 231491 -36024
3504 -36024 83486 34692 145881 51581 140054 41761 258687 81878 93876 169389 111782
3493 111782 69800 182530 160007 -52244 259662 -72755 115982 -22785 203822 51565
3483 51565 180269 149271 111774 143718 110746 190600 94644 156812 135234 159058 -53738
3472 -53738 133355 -85588 118933 194556 98859 100431 99580 89602 89915 64318 99415 161649
3460 161649 83705 74512 14406 127659 47253 184002 12922 54760 49056 142438 95382
3449 95382 121042 151934 103798 129725 152410 178244 79135 69996 129812 161875 112598 -1739
3437 -1739 113998 142563 1289 131205 147912 99019 161957 154865 61148 58127 151879 86853
3425 86853 134551 97248 244264 65983 97817 73275 33904 119595 131511 43825 133820
3414 133820 136308 99241 154544 130139 85697 90772 81140 87812 227703 69270 108521 291696
3402 291696 41101 110654 66910 113080 154976 199194 199089 237086 105362 54344 190395
3391 190395 202898 91745 123864 184998 141552 97441 195383 201907 188632 254829 211703 233221
3379 233221 159666 215009 116979 359618 115715 258457 225461 256056 203818 173793 206591
3368 206591 310808 266165 316327 288875 280056 286436 303998 270491 259607 247032 313335 401463
3356 401463 294878 238130 454733 365736 402792 353109 465979 342876 519270 423774 499870
3345 499870 434740 483046 609828 589562 573739 473393 711945 696489 755861 741677 875233
3334 875233 873849 1020787 960140 1160998 1254739 1449637 1605611 1850007 1935356 2102694 2369064
3323 2369064 2720106 2905986 3505841 4049636 4658850 5922128 7300056 9321525 11950771
3314 11950771 14826454 15881687 14427683 11514173 8807556 6710423 4879324 3889540
3306 3889540 3154987 2656410 2269933 2012610 1913720 1706569 1610849 1653561 1333025 1116892
3296 1116892 1155564 1043752 960984 719864 787282 851275 768255 532881 720529 496521
3286 496521 630391 620158 673558 526735 555743 461511 658820 529978 335757 441023
3276 441023 518020 335500 402937 301973 344792 380317 369129 353544 352786 299856 360202 422857
3264 422857 152148 297562 249392 259669 310905 310830 228190 297908 273759 302269 180500 212158
3252 212158 262266 317256 181137 159632 219897 195657 215811 237087 149455 217991 218248 243025
3240 243025 151004 165229 190301 164829 132474 119966 236598 98668 219418 73229 215921
3229 215921 54034 120315 69773 134118 120798 155202 159077 232924 139316 94388 214257
3218 214257 47964 70405 108376 149580 168736 102153 17794 17541 159938 115578 66653 62875
3206 62875 124472 88023 164453 23843 244112 89193 88906 217072 124150 110990 51857
3195 51857 73536 99640 -19190 66573 67025 78862 44512 46376 63315 124145 35108 158532
3183 158532 167079 96814 -12033 5134 56225 -2643 7109 -29488 156749 123199 -13836
3172 -13836 47993 16715 -65399 17981 51085 73229 10010 -17609 137736 117258 -161026
3161 -161026 32879 17221 20816 35613 9803 144855 -60748 83166 157926 -72492 74519
3150 74519 69158 -24187 -47999 149747 -18373 75573 27760 -83360 120410 19380 -90244
3139 -90244 133053 -71754 -106535 134816 -51272 -37041 -39 -109793 65439 -14071 28501
3128 28501 90968 -5986 22127 97261 -80981 2374 17282 62511 58354 -898 -40693 -37163
3116 -37163 110024 24509 21919 -134416 107736 -89413 99499 57628 6572 -45055 110096
3105 110096 -95905 8965 -56589 -61690 45981 -106336 873 56097 -79668 -24678 18677
3094 18677 -19403 -31957 81231 -42469 123424 -65683 -29431 82719 40353 77812 92243
3083 92243 9483 -1671 76904 68763 71612 30792 66413 -16964 -52838 60814 56754 32924
3071 32924 32883 102203 -87212 -26408 29746 -23385 59612 -86646 71111 27341 -52161 -2210
3059 -2210 136535 -99046 55997 44588 -37604 -81863 -6811 12228 70202 44723 37964 58307
3047 58307 4361 34272 7349 -2571 -95031 88559 -79178 -1512 -21401 -29946 -62464 49341
3035 49341 -20459 -49741 -57082 68707 -38927 -65610 -30435 -54243 107578 50511 -31541
3024 -31541 3370 -12362 -15421 -1734 -39518 -80677 -1424 37888 -29649 19608 13908 2331
3012 2331 119107 -47499 -60734 -47339 -111897 83008 13902 -24742 30997 -6431 -11453 32792
3000 32792 -30815 35596 44721 56766 -8340 -85520 -55497 -74862 -78196 3619 -27526 19461
2988 19461 -62613 136612 -2515 -38515 -16456 -36851 50344 -50008 28736 -57639 -44588
2977 -44588 -39701 6943 -9406 -8645 4388 -72786 -126124 -13775 -92269 -10646 -8273 -6085 -51621
2964 -51621 -13456 -112726 -76453 -17304 28313 18396 -23934 -11781 -33416 145466 -66403 -117164
2952 -117164 28456 5663 -62958 64096 -95105 38984 -134084 -23556 -52818 84066
2942 84066 -44379 72672 -65035 12731 -63624 -47180 79692 -37757 -79861 13673 -46139
2931 -46139 -57912 60524 -7430 -75472 -19179 -223 -43949 7556 -116253 51309 -48415
2920 -48415 -70358 -17838 -27274 -42818 -92304 -59654 36737 -8305 -33853 -63428 -56711 -8785
2908 -8785 45236 -10622 101231 -85403 69917 -48414 -85306 -86867 159 7727 -96904
2897 -96904 18 43996 -51097 21438 36028 -92499 -26395 -58385 -7255 -78753 -28422 -28343
2885 -28343 -1305 -127270 -12581 -55350 52118 127669 -27006 -11989 -19374 74960 63104
2874 63104 -106715 -36247 -75271 20171 -30095 -41642 -108281 77799 -21413 -131342 -44611
2863 -44611 -9590 57513 -39782 -72163 -10435 44653 -45159 -80210 26835 -124214 54178
2852 54178 -20016 -68715 -105654 -72800 94152 34736 -127713 29796 54950 53858 4698
2841 4698 2421 -109843 -54293 38885 -88253 -127973 -22151 -34836 -41282 -31245 -63587 -23718
2829 -23718 20813 -56193 -11995 -53753 -85412 9000 55875 -67342 -126751 75318 -39250
2818 -39250 -1988 -90919 -78632 -47300 24588 -78603 68658 81061 -156038 29344 -70490
2807 -70490 -105856 -4178 -33474 48175 -71022 28418 -70262 18731 -18973 -43052 -64236
2796 -64236 -69575 -91235 -28556 20047 -51945 27386 23985 -43262 12831 -81142 10918 -116895
2784 -116895 -51822 69405 -111412 -73102 3446 76182 -110036 -79771 17500 18872 -12015
2773 -12015 -6951 -49392 -24092 -85652 68938 -125944 -37819 -69352 -47844 38387 -80707
2762 -80707 -45241 -60198 -19451 -43901 6539 -172109 -14359 6526 -25247 -124795 -19951
2751 -19951 23073 -66769 -52328 -82592 -145328 31955 30201 34398 -38429 -59010 46043 36651
2739 36651 -19471 -123579 -78023 -97732 53248 -113733 -120342 -54260 -1421 -62906 -10042
2728 -10042 -51033 -51931 -28759 81476 -119586 43045 -66542 -96437 20030 -136916 -25490
2717 -25490 -93087 23831 -135951 9087 41445 -42452 -86310 -37259 -111203 -41062 -45059
2706 -45059 -34812 -98237 -58299 -50331 -133776 -111405 -111272 -45515 21427 -81779 -1234 -46053
2694 -46053 -37002 -41985 -9550 -116935 42065 -124443 23406 -79430 -73444 -97639 20447
2683 20447 -170085 -82270 34386 -86396 -74817 -10327 9484 -144852 24263 2106 14509
2672 14509 -140068 64109 -48880 -68943 -116801 34342 -47115 -82239 -21242 -37486 -31171
2661 -31171 -11443 26318 -65183 8091 -62100 -41522 -73810 -50966 -129643 -12837 55310 -43044
2649 -43044 -102254 -5329 64512 6379 -148176 -27780 -57227 54469 -73588 99104 -111820
2638 -111820 -47654 12919 -58887 -58539 -87277 -18246 -102592 -4792 -106966 10252 -125628
2627 -125628 30986 -112551 11734 -170370 169 -56657 -107514 -117771 12850 -50888
2617 -50888 44851 -51639 -20831 -35476 -41333 12762 75268 -36834 -35615 -85239 -36884 -78466
2605 -78466 -60300 -124131 -149389 -75195 -151353 16021 -97272 -162129 49205 -44719 -79520
2594 -79520 -34555 -113416 44231 28595 -73235 11818 -34936 -6522 -3447 -82208 -42675 -169616
2582 -169616 -70241 -7634 28211 -35069 -27419 -16144 -15829 -92829 43453 -35429 19523 -80549
2570 -80549 -136007 -80738 -56678 -26215 -28435 5208 22040 -89082 31669 -6027 -165632
2559 -165632 8657 9437 -95806 -53164 -65843 2015 -47554 -113811 125351 -70027 -78281
2548 -78281 -67731 -783 -264151 -26002 -43521 21905 22234 -108815 -12406 -22782 -52682 -40920
2536 -40920 29444 -94105 -36422 -2679 -101841 -77391 -65073 -76086 31032 -54557 67356
2525 67356 -118510 -108563 -67246 -73039 -44640 -154355 -123137 -14537 11509 -125239 -15954
2514 -15954 -62680 -113776 27760 -88774 34511 -36262 -92015 -19127 16944 -169216 -50893
2503 -50893 -86181 -76508 -5898 -151690 -101057 -117549 -140340 57248 -109737 -140390 -41040
2492 -41040 -54495 -124201 -107883 -24303 -68450 -11672 -93061 -123596 -212560 -132985 48111 -15665
2480 -15665 -124010 51626 136188 -138867 -3711 -90343 -25365 23427 -64840 3851 -134163
2469 -134163 -49584 -72951 -123060 -84884 -48832 -75587 -33566 -105435 -46699 3488 -38664 81405
2457 81405 -119432 -63413 -51560 11314 -87726 -137268 18964 -40894 -24231 -132878 -73581
2446 -73581 -85513 -30186 -60429 -7689 -183874 -144086 -2586 -74769 29014 -192721 16135
2435 16135 -20562 85352 -136130 -74644 -38727 -51910 4026 -120343 -58601 -113803 19635
2424 19635 -73123 -55771 -195075 98573 -83563 -133629 -72618 -45916 -61381 -59780 -102051
2413 -102051 -32131 37389 -137924 -33200 -61341 16928 -139717 -87938 -33544 -105245 -95222
2402 -95222 -128443 -45398 -187870 -78393 -79904 -59084 -117708 -30689 -20823 -25777 -61159 -69764
2390 -69764 -36212 -78075 6841 -2198 19230 19758 -56299 -64775 -83973 -133893 38558 -108775
2378 -108775 36767 -71911 -59027 -36498 -53708 -40582 -107704 -129458 4423 -37225 -122694
2367 -122694 -184898 -108237 20514 -50368 -33706 -12556 -79934 -134617 -15095 7512 -74077
2356 -74077 -177960 50619 -33538 -39082 -152574 -38540 -41159 -189527 -153836 64202 -84014
2345 -84014 -26366 -93660 -38336 -118939 -66748 -44992 88560 -101430 -40478 10099 -119452
2334 -119452 -16108 -24801 70005 -46755 -7114 -122833 -81057 -54332 -94336 -98211 -68701
2323 -68701 11569 -12671 -32790 -92164 -51518 -55225 -93757 -19046 -82424 -101305 -113932 126711
2311 126711 -71177 -23075 -12388 -65517 -83314 -135757 -71534 55380 -45761 -128924 -4765
2300 -4765 13483 -119409 -66984 40698 -154494 14208 -118351 -75862 -85250 -68196 -133801
2289 -133801 -15691 -95099 4509 -44775 -26183 -128043 -66471 16689 60910 -178146 48336
2278 48336 -17828 75099 -41984 -117699 -19235 -91562 -52763 -66292 -62863 -122095 -30045 -82145
2266 -82145 -222907 -8464 -94438 -78872 -63549 -63853 -104277 -29856 -61624 -33178 51553 -113715
2254 -113715 154902 -114886 -66197 -204883 110972 -74196 -55795 -135656 -39750 -171749
2244 -171749 -64681 -8793 -28061 -189877 -108299 67932 -64725 -235738 -104137 20402
2234 20402 9740 -52773 -71955 -62817 -112261 -32485 -92534 -28292 -9433 -58194 -571 65507
2222 65507 -163826 -102769 -21960 -117563 24504 -142841 -90898 -152454 -113217 -115016 -42213
2211 -42213 -196479 -161250 54935 -93997 -159904 -157547 22387 -40135 26127 -109745 -103211
2200 -103211 -22578 1423 8981 -207598 -133830 -83715 56113 -82643 -82562 -57756 -15664 -177393
2188 -177393 67889 -194772 -124459 -15382 -41314 -55429 -55750 -43580 32858 -68143 -145215
2177 -145215 -92801 -40749 -182521 42079 -33298 -48254 -100433 -48378 -68269 -80098 -104597
2166 -104597 -112655 -798 -66120 -60292 -131707 -19845 -221112 -22631 -73991 -74756 -61505 -14550
2154 -14550 -65187 -85380 2882 -89925 48780 -51772 -41351 -169598 -132051 5278 -162882
2143 -162882 -122491 -60345 -53482 -120385 -38674 -33345 -140523 -105436 -18657 -123846 -218017 -107472
2131 -107472 -93934 5474 -165035 -149518 -73128 22775 -1884 -63404 -90820 -17957 -20906 -39178
2119 -39178 -24506 -114377 -187568 -76717 26675 3531 -170981 -94616 -30815 -83555 -105585
2108 -105585 -115238 -33532 -67190 -61924 -1094 -125843 -61529 -99612 -97427 -62602 -64054 -93028
2096 -93028 -48006 -112973 -137660 -8352 -78177 -96021 -87839 -55294 -123965 -108126 -26441 31539
2084 31539 -149928 -170042 -77279 1387 -174505 -14326 -235779 -155834 -96264 -37886 -68655
2073 -68655 -101169 10779 -88015 -20403 -104443 -28540 -159284 -97305 -56248 -138086 -123555
2062 -123555 -123919 -3776 -98946 -32656 -205801 -140026 -114277 -82231 -117951 -113909 13740 -61050
2050 -61050 -94238 25786 -106106 -103316 -45174 -30689 -103867 -34189 -113999 -23444 -102233 -181432
2038 -181432 13150 -129040 -91371 -13015 -78073 -51535 -128144 -38230 -61042 -78010 9645
2027 9645 -137411 33510 -124869 28258 -92252 -52323 -61029 -18025 -185182 -178810 15359
2016 15359 -104138 -131654 -16441 -99542 -165593 -88224 31711 -157009 -58302 -142157 -17004
2005 -17004 -87318 -227901 -37184 -142519 -51114 -100093 15104 -148439 -13049 -63410 -41906
1994 -41906 -142027 -30818 10060 -71295 -181538 -123725 32886 -69336 -20162 -117959 -126002
1983 -126002 -110173 3628 -194275 -16148 -94358 -101027 -68815 -117565 -83837 -150160 -77593
1972 -77593 -17168 -95570 -1079 -52146 -105332 -13446 -78751 -48629 -121350 -147140 -49874 -109164
1960 -109164 -104269 -122200 -143293 -87916 13452 -130568 -54029 -151113 40647 -63734 -153169
1949 -153169 -86991 -96449 -58899 -106248 -81657 -80958 -114314 -61016 -82447 -146496 -145151 -208523
1937 -208523 47037 -15343 -51511 -21129 -47551 -45289 -17192 -22659 -37595 11393 -83901 50051
1925 50051 -147984 -62476 -63089 -37235 -161784 -153612 -18160 -151528 60781 -178609 -68398
1914 -68398 -104703 -10332 -46562 -12896 -184404 20072 -78865 -117331 1440 -128015 42278
1903 42278 -167464 25199 -207122 -74660 -68752 -83519 -164409 -70216 -176836 -32445 -109538
1892 -109538 19236 -129968 -1671 -28080 -25020 80188 -136313 -69171 -58565 -53578 -209248
1881 -209248 -74184 -127549 -30629 -112878 -105746 -124994 -101454 -76543 24178 -54573 -74763
1870 -74763 -95464 31711 -117213 -88386 -106388 -108380 8073 -20688 -119761 -64571 -139634
1859 -139634 -104109 -44151 -61384 -109955 -41333 -144577 -32320 -49602 -88530 -59852 -96744
1848 -96744 -68458 -182856 -70238 -129856 -97875 -34016 -112923 -108871 385 -182335 -2959
1837 -2959 -84262 -59915 -111737 -82710 -90429 -47426 -239492 -31958 -48404 85927 -235671
1826 -235671 -30976 -86789 -140124 -50801 -128876 -145514 -113870 -80012 -82211 -3397 -148713
1815 -148713 -130721 -152727 -22089 -33385 -120203 -20441 -119538 -32091 -55537 -37025 -87639
1804 -87639 -50952 -105790 13868 -225790 -40393 12059 -119226 -187331 -159309 -39520 -96094
1793 -96094 -35215 -174417 -77845 -92218 -79977 -183172 -46433 -204488 -92242 -38898 -37083
1782 -37083 -98531 -126609 -37918 -110297 -102667 -22876 -101762 -143971 35163 -78622 -146476 -118195
1770 -118195 -22707 -57275 -143729 -153556 -36284 -71427 -31517 25392 -107249 -103433 -40475 -31888
1758 -31888 -94995 -63465 -103630 125778 -174378 -48115 -131426 -83846 -48084 -102590 -121577
1747 -121577 -93652 -81850 -78599 54587 -156730 -101611 -86976 -15352 -61432 -223124 -70545
1736 -70545 -1404 13088 -86291 -144261 -86932 -22896 -100688 -68226 -139263 32327 -71779
1725 -71779 104512 -94865 -129375 -138691 -12042 -191884 -93715 -167005 24861 -37532 -139245
1714 -139245 -221752 -56897 -191092 -75721 -91905 -55077 -67368 17609 -32305 -107490 -8970
1703 -8970 -55383 -51057 -56777 -158684 -187288 -95629 -154024 -119552 -217349 -111793 -84028 -138658
1691 -138658 -242062 -165635 -45621 -96139 -9053 -157634 -201311 -49905 -52866 -263596 -124180
1680 -124180 -39353 -87192 -57949 -94843 -58521 -64687 -84484 28033 -95278 -167107 -26581
1669 -26581 17336 -130262 -81259 19435 -158660 -46240 -144832 -37441 -28536 -109209 -113119
1658 -113119 -18598 -59255 -108678 -42877 -33130 -91456 -118445 -111202 -166033 -42559 -74462 -147130
1646 -147130 16800 -46429 -8523 -24090 -85929 -177739 -36218 -73316 -51850 -275106 -138734
1635 -138734 -72362 -54025 -172240 -163964 -77384 -11153 -60302 -80194 -83526 -124482 7381 33308
1623 33308 -28347 -148410 -96605 47771 -70055 -213905 -177859 -79168 -148955 -66444 -146544
1612 -146544 -220831 -75959 14584 -100124 -133845 -138817 -75702 -129425 -112768 -79337 -114006
1601 -114006 -19744 -12629 -27163 -103336 -125687 -43109 -52454 -131033 -54663 -80169 -14742 -134203
1589 -134203 -79882 -100024 -79317 -130256 -19548 -90483 -91816 -81328 -211802 -69743 -106462
1578 -106462 -67892 -115054 -201514 12429 -51257 -28912 -74330 -68777 -112708 -21887 -63024 -86421
1566 -86421 -248752 -83024 -47317 -150976 -75524 -95985 -125021 -127285 -115828 19087 -255559
1555 -255559 -83383 -60245 -107640 -131641 -72983 -57295 -127926 -45187 -89548 -39305 -9531
1544 -9531 -16688 -124933 32918 -43341 -22542 -96328 -123645 -119653 -173201 -82988 -74248 -133231
1532 -133231 -135690 -7671 -31095 -56193 -135391 -72513 -82833 -35214 -49454 -181629 -36562
1521 -36562 -71536 -127653 -82812 -164528 -108374 -20625 -216983 -64914 -52164 -210752 -17046
1510 -17046 -164811 -106403 -101283 -68330 -124970 -216856 -80273 -149201 -124540 -123025 -42059 -129946
1498 -129946 -95377 -153458 -65570 -143907 -128339 -105380 -29314 -74117 -150363 -83492 -127887 -48041
1486 -48041 -108662 -152847 -78915 -94210 -163857 -11769 -23048 -186916 -63198 -25318 -38442
1475 -38442 -71561 -56871 -121239 -468 -25052 -128837 -159833 29027 -84559 -46710 -240212
1464 -240212 -93889 -39559 -50987 -82483 -84004 -191061 -87717 -63279 -162749 -199645 -108931
1453 -108931 -111766 -115042 -195051 -152505 -24333 -30976 -118035 -183148 103127 -68287 -62442 6732
1441 6732 -105026 -192715 43589 -75428 -52929 -148017 -85433 -65363 -103570 -139500 -98690
1430 -98690 -36543 -15986 -211768 -139175 -177393 -140277 -101277 -142736 -123807 -249155 12809
1419 12809 -1637 -86859 -132217 -80903 -36201 -65766 -35559 -189763 -58739 -120738 16821
1408 16821 -72239 -48297 -99192 -62070 -106906 -145264 -170777 -116029 -127357 -168755 -69180 -118655
1396 -118655 -124995 -111740 -17851 -118842 -59940 -15788 -129934 -54431 -72228 -127260 -60887
1385 -60887 -30985 -138118 5918 -176024 -103780 -92668 -41778 -141253 -200161 -29070 -34571
1374 -34571 -81938 -79159 -128115 -45463 -110054 -118318 -26201 -126265 -35506 -110563 -118394 -77332
1362 -77332 -78519 -63346 -35544 -170699 -62895 -92268 18369 -110420 -112074 -38091 -78546
1351 -78546 -123212 -38908 -208558 -65756 -135146 -120966 5978 -133309 -115069 24506 -46443
1340 -46443 14896 -142283 8871 -101075 9140 -121630 -60006 -165991 -70178 -150356 -62481
1329 -62481 -149592 -228001 -103112 -139718 -156469 -156725 -172593 -38934 -63147 -222416 -57719
1318 -57719 -136061 10684 -154743 71035 -103649 -63978 -65971 -12310 -159578 -143221 -103356
1307 -103356 -48041 -63222 -78849 -64609 -198481 492 -121287 -198899 -178573 -51554 -50803
1296 -50803 -98692 -166893 -94563 -141645 -59069 -87107 -204449 -91228 -38545 -33007 -140355
1285 -140355 -48842 -17080 -102268 -117583 -83890 -135945 -92382 -52099 -122850 -154641 -144833 -29192
1273 -29192 -221130 -77924 -234838 -56590 -170707 -38295 -37076 -93038 -45646 -4541 -116243
1262 -116243 -118703 -151545 -9043 -11198 -85051 -162517 -78853 18598 -156423 -33496 -129406
1251 -129406 -48368 -100581 -106237 -134457 -62176 -121346 25759 -165520 -209090 -137552 -94189
1240 -94189 -96414 -132661 -120597 5003 -65720 -83731 -95886 -70125 -147797 -111989 -35759 -25258
1228 -25258 -104986 -57470 -121184 -59874 -214368 -110864 -163194 -111615 -117171 -141687 -36937
1217 -36937 -94442 -119380 -110435 3931 -246477 -14519 -71284 -55641 -115348 -85754 -78225 -142278
1205 -142278 -125343 -53548 -90589 -181780 -109446 -71015 -30128 -179350 -60060 -43584 -52579
1194 -52579 -145068 -99728 -151841 -105518 -92054 -136357 -105606 -106753 -71161 -74542 -35625 -100332
1182 -100332 -107639 -101997 -105545 -91253 -174095 -96834 -6050 -59033 -188089 -153447 -159040 -128620
1170 -128620 -44221 -116272 -30575 -74183 -53156 -166675 -24722 -90200 -17488 -174951 -51664
1159 -51664 -136790 -8041 -108562 28300 -104719 -119062 -90289 -58213 -153819 -137982 -63113
1148 -63113 -94339 -121579 -107297 9788 -87194 -120531 -33958 -172415 -121874 -115727 -82483 -103599
1136 -103599 -63173 -6168 -131084 -112410 -28316 -124777 -157573 -31448 -78445 -72069 -161819
1125 -161819 -85496 -100757 -213930 -107797 -8078 -173024 -42166 -103752 -132903 -175518 -113673
1114 -113673 -118008 -209723 -144999 -190071 -108840 -41791 -46797 -7237 -71110 -109482 -67625 -55044
1102 -55044 -48738 -116094 -105661 -84327 -84327 -87141 -142878 -173432 -58606 -38349 -141213 -119334 -109944
1089 -109944 -80320 -27010 -168155 -128092 -130939 -104911 -3401 -100553 -91208 -92189 14476 -45606
1077 -45606 -149925 -106487 -109948 -88619 -78072 -120537 -103428 -110239 -68927 -114755 -102331 -177301
1065 -177301 -127799 -88679 -43743 -120179 -87885 -157655 -66051 -182977 -87117 -15853 -3045
1054 -3045 -100466 -11510 -102386 -52125 -135438 -44106 -81547 -188997 3815 -87919 -122315 -101132
1042 -101132 -112704 -145126 -86997 -65030 -107861 -97725 -142067 -89752 -160164 -70581 -882 -203445
1030 -203445 -61871 -62945 -94682 -225891 -86149 -118139 -154700 23657 -187055 -45630 25790
1019 25790 -192188 28409 -26684 -177466 -118107 -108345 -94895 -95325 -116701 -82638 -72457 -149964
1007 -149964 -165659 -91641 -128721 -59113 5288 -22953 -190931 -108687 15732 -38765 -20212
996 -20212 -244748 -52685 -69873 -62327 -189316 -96813 -48729 -91265 55433 -257676 -1315
985 -1315 -144148 37911 -122119 -84009 -120157 -7102 -74955 -139465 -158880 -4831 -99730
974 -99730 -80334 -78169 -159025 -48593 -39883 -92633 -102051 -98722 -201666 -106584 -145446 -55370
962 -55370 -127371 -102161 -74387 -63865 -70399 -151529 -173277 -39270 -161439 -21908 -94571 -44284
950 -44284 -38717 -155460 -48677 -114733 -130387 -141740 -8824 -8051 -230389 -73810 -204205
939 -204205 -49952 -100583 37991 -354708 114484 -154230 4880 -185305 -190256 9102
929 9102 7630 -101206 -119461 -122709 -149690 71160 -54655 -123305 -201289 -841 -61965 -142223
917 -142223 -99265 -64252 -124258 -42682 -38683 -169586 -173335 -122533 -85997 -60418 -265490 -93548
905 -93548 28964 -137484 -113871 7676 -85783 -45822 160400 -220577 -55071 -3556 -29359
894 -29359 -68977 -30634 -96110 -144701 -55745 -23421 -136526 -199650 -24235 -133635 -124395 -155666
882 -155666 -135715 -176639 -95719 -138038 -97250 -187475 -15149 -3276 -112748 -84565 -20502
871 -20502 -60475 -160594 -122690 -87189 -83508 -78711 -108183 -136586 -130630 -136008 -22387 -210104
859 -210104 -90549 -130931 -123595 -121523 -106317 -147543 -88775 891 -4721 -72658 -132721 -196669
847 -196669 24820 -123961 -144260 -96261 -101623 -137734 -41152 -123371 -241926 -26495 -57796
836 -57796 -55110 -160688 -107647 -140795 -23925 -173653 -131760 -51900 -53229 -164030 -24268
825 -24268 -111008 -186700 -31366 -44032 -35234 -140328 -120962 -91675 -87744 -138654 -43172 -103633
813 -103633 -44159 -145480 -56628 -171393 -207970 -112031 -34585 -157983 -54851 -98636 11104
802 11104 -173671 -108752 -125224 -154895 -171927 -7593 -147108 -110964 -82622 -115444 -110342 -127192
790 -127192 19491 -154588 60050 -118970 -78229 -193101 -181410 -40556 -137602 -238524
780 -238524 -162153 -164282 -67468 -56114 -129730 -67553 -72663 -36665 -47562 -98835 -121238 -85183
768 -85183 -15341 -4210 -141590 -135260 60453 -55141 -129865 -171121 -77392 -71114 -101301 -87107
756 -87107 -166273 -64403 -153121 -39302 -180035 -175138 -23301 -6157 -119314 -99836 -105991
745 -105991 -81793 -141650 -24035 -170573 -53810 -175539 13909 -156073 -104544 -185394 -91759
734 -91759 -173085 -196162 -163576 -106219 -141569 -84939 -218754 -147541 -85634 -92950 -20131 -136890
722 -136890 -58528 -146795 -38687 -188338 -41126 -143375 -92360 -191623 -147484 -39954 -205656
711 -205656 -114498 -139265 -94713 -173486 -87368 -59380 -214106 -45018 -46804 -125346 -174720 -103042
699 -103042 -5857 -95276 -49854 -164557 -54787 -59320 -94434 -188839 -115148 -44949 -85808 -21487
687 -21487 -109665 -166385 -115519 -33220 -162159 -148870 -156126 -42879 -120169 -110899 -160622 -64587
675 -64587 -84717 45982 -56531 -111425 -158690 -33141 -28586 -83215 -73754 -95949 -56631 -27725
$$ [...]
##END NTUPLES=NMR SPECTRUM
##END=
