##TITLE=abcd
##JCAMPDX= 6.0         $$ Bruker NMR JCAMP-DX V2.0
##DATA TYPE= NMR SPECTRUM
##DATA CLASS= NTUPLES
##ORIGIN= UXNMR, Bruker Analytische Messtechnik GmbH
##OWNER= root
$$ XWIN-NMR		Version 3.5
$$ Sat Nov 15 09:32:44 2025 Russian Standard Time (UT+4h)  servis@DPX200
##.OBSERVE FREQUENCY= 200.131235884673
##.OBSERVE NUCLEUS= ^1H
##.ACQUISITION MODE= SIMULTANEOUS
##.ACQUISITION SCHEME= undefined
##.AVERAGES= 32
##.DIGITISER RES= 18
##SPECTROMETER/DATA SYSTEM= spect
##.PULSE SEQUENCE= zg
##.SOLVENT NAME= CDCl3
##.SHIFT REFERENCE= (INTERNAL, CDCl3, 0, 16.4885)
##AUDIT TRAIL= $$ (NUMBER, WHEN, WHO, WHERE, WHAT)
$$ ##TITLE= Audit trail, XWIN-NMR		Version 3.5
$$ ##JCAMPDX= 5.01
$$ ##ORIGIN= Bruker BioSpin GmbH
$$ ##OWNER= servis
$$ F:\spectra/data/av/nmr/H1/1/pdata/1/auditp.txt
$$ ##AUDIT TRAIL=  $$ (NUMBER, WHEN, WHO, WHERE, WHAT)
(   1,<2025-11-15 09:31:35.32 +0400>,<servis>,<DPX200>,
      <created by zg, POWCHK disabled, PULCHK disabled
       configuration hash MD5:
       00 E9 B6 7A A2 85 ED C7 34 08 36 98 17 FE 4E 26
       data hash MD5: 32K
       99 01 F3 17 45 39 59 13 E8 8C F5 50 94 94 E0 58>)
(   2,<2025-11-15 09:31:37.09 +0400>,<servis>,<DPX200>,
      <Start of raw data processing
       efp BC_mod = 2 LB = 0.05 FT_mod = 6 PKNL = 1 PHC0 = -179.162 PHC1 = 1.301565 SI = 16K 
       data hash MD5: 16K
       FA EC 2E 54 A4 9B 3B 8F C2 9B 1E E9 9A BD 33 B9>)
$$ ##END=
$$ 
$$ hash MD5
$$ 9D 62 05 24 E1 7D 45 48 F9 54 45 9A 2D 7F 24 49
##$RELAX= 
##$RELAX= 
##$RELAX= 
##$RELAX= 
##$RELAX= 
##$RELAX= 
##$RELAX= 
##$RELAX= 
$$ Bruker specific parameters
$$ --------------------------
##$DU= <F:\spectra>
##$EXPNO= 1
##$NAME= <H1>
##$PROCNO= 1
##$TYPE= <nmr>
##$USER= <av>
##$AMP= (0..31)
100 100 100 100 100 100 100 100 100 100 100 100 100 100 100 100 100 100 
100 100 100 100 100 100 100 100 100 100 100 100 100 100 
##$AQSEQ= 0
##$AQ_mod= 1
##$AUNM= <au_zg>
##$AUTOPOS= <>
##$BF1= 200.13
##$BF2= 200.13
##$BF3= 200.13
##$BF4= 200.13
##$BF5= 500.13
##$BF6= 500.13
##$BF7= 500.13
##$BF8= 500.13
##$BYTORDA= 1
##$CFDGTYP= 0
##$CFRGTYP= 5
##$CHEMSTR= <none>
##$CNST= (0..31)
1 1 145 1 1 1 1 1 1 1 1 1 1 1 1 1 1 1 1 1 1 1 1 1 1 1 1 1 1 1 1 1 
##$CPDPRG= <>
##$CPDPRG1= <>
##$CPDPRG2= <>
##$CPDPRG3= <>
##$CPDPRG4= <mlev>
##$CPDPRG5= <mlev>
##$CPDPRG6= <mlev>
##$CPDPRG7= <mlev>
##$CPDPRG8= <mlev>
##$CPDPRGB= <>
##$CPDPRGT= <>
##$D= (0..31)
0 2 0 0 0 0 0 0 0 0.06 0 0 0 0 0 0 0.0002 0 0 0 0 0 0 0 0 0 0 0 0 0 0 
0 
##$DATE= 1763184694
##$DBL= (0..7)
120 120 120 120 120 120 120 120 
##$DBP= (0..7)
150 150 150 150 150 150 150 150 
##$DBP07= 0
##$DBPNAM0= <>
##$DBPNAM1= <>
##$DBPNAM2= <>
##$DBPNAM3= <>
##$DBPNAM4= <>
##$DBPNAM5= <>
##$DBPNAM6= <>
##$DBPNAM7= <>
##$DBPOAL= (0..7)
0.5 0.5 0.5 0.5 0.5 0.5 0.5 0.5 
##$DBPOFFS= (0..7)
0 0 0 0 0 0 0 0 
##$DE= 6
##$DECBNUC= <off>
##$DECIM= 32
##$DECNUC= <off>
##$DECSTAT= 4
##$DIGMOD= 1
##$DIGTYP= 9
##$DL= (0..7)
0 120 120 120 120 120 120 120 
##$DP= (0..7)
150 150 150 150 150 150 150 150 
##$DP07= 0
##$DPNAME0= <>
$$ [...]
##$SUBNAM4= <"">
##$SUBNAM5= <"">
##$SUBNAM6= <"">
##$SUBNAM7= <"">
##$SUBNAM8= <"">
##$SUBNAM9= <"">
##$SW= 20.6817932712277
##$SWIBOX= (0..15)
0 0 3 0 0 0 0 0 0 0 0 0 0 0 0 0 
##$SW_h= 4139.07284768212
##$TD= 32768
##$TD0= 1
##$TE= 0
##$TE2= 300
##$TE3= 300
##$TEG= 300
##$TL= (0..7)
0 120 120 120 120 120 120 120 
##$TP= (0..7)
150 150 150 150 150 150 150 150 
##$TP07= 0
##$TPNAME0= <>
##$TPNAME1= <>
##$TPNAME2= <>
##$TPNAME3= <>
##$TPNAME4= <>
##$TPNAME5= <>
##$TPNAME6= <>
##$TPNAME7= <>
##$TPOAL= (0..7)
0.5 0.5 0.5 0.5 0.5 0.5 0.5 0.5 
##$TPOFFS= (0..7)
0 0 0 0 0 0 0 0 
##$TUNHIN= 0
##$TUNHOUT= 0
##$TUNXOUT= 0
##$USERA1= <user>
##$USERA2= <user>
##$USERA3= <user>
##$USERA4= <user>
##$USERA5= <user>
##$V9= 5
##$VALIST= <valist>
##$VCLIST= <CCCCCCCCCCCCCCC>
##$VD= 0
##$VDLIST= <DDDDDDDDDDDDDDD>
##$VPLIST= <PPPPPPPPPPPPPPP>
##$VTLIST= <TTTTTTTTTTTTTTT>
##$WBST= 1024
##$WBSW= 30
##$XGAIN= (0..3)
0 0 0 0 
##$XL= 0
##$YL= 0
##$YMAX_a= 81845
##$YMIN_a= -79381
##$ZGOPTNS= <>
##$ZL1= 120
##$ZL2= 120
##$ZL3= 120
##$ZL4= 120
##$ABSF1= 0
##$ABSF2= 0
##$ABSG= 0
##$ABSL= 0
##$ALPHA= 0
##$AQORDER= 0
##$ASSFAC= 0
##$ASSFACI= 0
##$ASSFACX= 0
##$ASSWID= 0
##$AUNMP= <proc_1d>
##$AZFE= 0.1
##$AZFW= 0.1
##$BCFW= 0
##$BC_mod= 2
##$BYTORDP= 0
##$COROFFS= 0
##$CY= 18.4799938201904
##$DATMOD= 1
##$DC= 0
##$DFILT= <>
##$DTYPP= 0
##$F1P= 9.9274215381318
##$F2P= -0.165520771350173
##$FCOR= 1
##$FTSIZE= 16384
##$FT_mod= 6
##$GAMMA= 0
##$GB= 0
##$INTBC= 1
##$INTSCL= 4.127829e-11
##$ISEN= 128
##$LB= 0.05
##$LEV0= 0
##$LPBIN= 0
##$MAXI= 10000
##$MC2= 0
##$MEAN= 0
##$ME_mod= 0
##$MI= 50
##$NCOEF= 0
##$NC_proc= -8
##$NLEV= 6
##$NOISF1= 3.799351
##$NOISF2= 2.8
##$NSP= 0
##$NTH_PI= 0
##$NZP= 0
##$OFFSET= 16.48848
##$PC= 4
##$PHC0= -179.162
##$PHC1= 1.301565
##$PH_mod= 1
##$PKNL= yes
##$PPARMOD= 0
##$PSCAL= 4
##$PSIGN= 0
##$REVERSE= no
##$SF= 200.130005582386
##$SI= 16384
##$SIGF1= 3
##$SIGF2= 2
##$SINO= 400
##$SIOLD= 16384
##$SREGLST= <1H.CDCl3>
##$SSB= 0
##$STSI= 16384
##$STSR= 0
##$SW_p= 4139.07284768211
##$SYMM= 0
##$S_DEV= 0
##$TDeff= 32768
##$TDoff= 0
##$TI= <>
##$TILT= no
##$TM1= 0
##$TM2= 0
##$TOPLEV= 0
##$USERP1= <user>
##$USERP2= <user>
##$USERP3= <user>
##$USERP4= <user>
##$USERP5= <user>
##$WDW= 1
##$XDIM= 16384
##$YMAX_p= 472409764
##$YMIN_p= -2700587
$$ End of Bruker specific parameters
$$ ---------------------------------
##NTUPLES= NMR SPECTRUM
##VAR_NAME=  FREQUENCY,     SPECTRUM/REAL,   SPECTRUM/IMAG
##SYMBOL=    X,             R,               I
##VAR_TYPE=  INDEPENDENT,   DEPENDENT,       DEPENDENT
##VAR_FORM=  AFFN,          ASDF,            ASDF
##VAR_DIM=   16384,         16384,           16384
##UNITS=     HZ,            ARBITRARY UNITS, ARBITRARY UNITS
##FACTOR=    0.252644378177508, 1,           1
##FIRST=     3299.83951724647, 0,            0
##LAST=      -839.233330435636, 0,           0
##MIN=       -839.233330435636, -2700587,    0
##MAX=       3299.83951724647, 472409764,    0
$$ Real data points
##PAGE= N=1
##DATA TABLE= (X++(R..R)), XYDATA
$$ [...]
$$ plain form
12150 -451163 -355952 -325188 -341658 -419605 -394627 -367925 -225594 -376756 -347605 -259138 -455613
12139 -455613 -488031 -443305 -385143 -382868 -438690 -315163 -395542 -412295 -351314 -264910 -391711
12128 -391711 -388490 -436127 -416766 -413058 -270248 -421911 -204510 -371751 -306081 -352473 -383630
12117 -383630 -400194 -379570 -301345 -379270 -379659 -323604 -299003 -313497 -308293 -293784 -352701 -302309
12105 -302309 -309845 -251651 -366118 -330982 -393661 -324648 -422863 -455687 -361739 -330366 -262236
12094 -262236 -289741 -241391 -327650 -375929 -393708 -331589 -429137 -343842 -328255 -370937 -244728
12083 -244728 -285470 -246054 -381561 -213091 -306710 -259644 -234191 -309728 -380630 -464338 -325012
12072 -325012 -254921 -351469 -269607 -380050 -285381 -337714 -340148 -454600 -305879 -222612 -340674
$$ packed form
12150d51163R5211L0764j6470p7947K4978K6702J42331j51162K9151Q8467j96475
12139d55613l2418M4726N8162K275n5822J23527q0379j6753O0981Q6404j26801
12128c91711L221m7637J9361L708J42810j51663K17401j67241O5670m6392l1157
12117c83630j6564K0624P8225p7925l89N6055K4601j4494N204J4509n8917N0392
12105c02309p536N8194j14467L5136o2679O9013r8215l2824R3948L1373O8130
12094b62236k7505M8350q6259m8279j7779O2119r7548Q5295J5587m2682J26209
12083b44728m0742L9416j35507J68470r3619M7066K5453p5537p0902q3708J39326
12072c25012P0091r6548Q1862j10443R4669n2333k434j14452J48721Q3267j18062
$$ plain form
12061 -340674 -238222 -372880 -370065 -264148 -362049 -227563 -373735 -372512 -355881 -389850 -294891
12050 -294891 -394678 -286828 -275543 -438756 -319712 -420858 -438124 -461716 -327985 -290771
12040 -290771 -524107 -440559 -424762 -353953 -404370 -423267 -381830 -409849 -405300 -308891 -414181
12029 -414181 -426264 -332484 -385663 -339076 -259893 -412494 -305659 -410360 -313496 -396162 -361547
12018 -361547 -315046 -482903 -390349 -393785 -404147 -467158 -400333 -406279 -391371 -299676 -257927 -428249
12006 -428249 -433332 -399031 -456457 -315768 -480837 -370631 -296566 -187117 -356452 -393955 -390950
11995 -390950 -241060 -324299 -335310 -384606 -322791 -366377 -324018 -312927 -320263 -394549 -421469
11984 -421469 -195186 -364027 -214133 -147055 -361458 -316342 -168821 -298364 -373750 -311579
$$ packed form
12061c40674J02452j34658K815J05917r7901J34486j46172J223J6631l3969R4959
12050b94891r9787J07850J1285j63213J19044j01146j7266k3592J33731L7214
12040b90771k33336Q3548J5797P0809n0417j8897M1437k8019M549R6409j05290
12029d14181j2083R3780n3179M6587P9183j52601J06835j04701R6864q2666L4615
12018c61547M6501j67857R2554l436j0362o3011O6825n946J4908R1695M1749j70322
12006d28249n083L4301n7426J40689j65069J10206P4065J09449j69335l7503L005
11995c90950J49890q3239j1011m9296O1815m3586M2359J1091p336p4286k6920
11984d21469K26283j68841J49894O7078k14403M5116J47521j29543p5386O2171
$$ plain form
11974 -311579 -337539 -344348 -316677 -228237 -338441 -181409 -330214 -312109 -370939 -225363 -291122
11963 -291122 -260446 -349887 -402133 -363012 -388816 -323426 -273565 -293419 -406046 -267047 -299626
11952 -299626 -318040 -321663 -300286 -260260 -338502 -384488 -237516 -301370 -323149 -336788 -281064
11941 -281064 -303921 -363285 -347693 -377866 -476012 -420484 -288740 -253179 -246111 -346380 -387499
11930 -387499 -380987 -421627 -368269 -263408 -392968 -210673 -334538 -286194 -306131 -340857 -251343
11919 -251343 -205548 -490932 -303819 -336639 -199135 -281241 -382838 -160654 -330926 -419724
11909 -419724 -410309 -273653 -377531 -352020 -361036 -332043 -277857 -301586 -554938 -258235 -260409
11898 -260409 -349349 -311471 -315102 -333593 -205314 -281955 -336638 -230337 -411212 -281135 -308164
$$ packed form
11974c11579k5960o809K7671Q8440j10204J57032j48805J8105n8830J45576o5759
11963b91122L0676q9441n2246L9121k5804O5390M9861j9854j12627J38999l2579
11952b99626j8414l623K1377M0026p8242m5986J46972o3854k1779j3639N5724
11941b81064k2857n9364J5592l0173r8146N5528J31744L5561P068j00269m1119
11930c87499O512m0640N3358J04861j29560J82295j23865M8344j9937l4726Q9514
11919b51343M5795k85384J87113l2820J37504q2106j01597K22184j70272q8798
11909d19724R415J36656j03878K5511r016K8993N4186k3729k53352K96703k174
11898b60409q8940L7878l631j8491J28279p6641n4683J06301j80875J30077k7029
$$ plain form
11887 -308164 -416204 -430043 -500151 -400290 -326166 -119063 -496699 -278709 -419013 -376926
11877 -376926 -485364 -295815 -437335 -424482 -265764 -243487 -398455 -425993 -291463 -364667
11867 -364667 -273566 -363538 -454151 -338725 -396799 -367164 -336991 -350738 -262447 -320518 -323040
11856 -323040 -236841 -230911 -277804 -276374 -360386 -447483 -468992 -361957 -458751 -373789 -356256 -321184
11844 -321184 -314775 -331669 -371100 -472182 -393230 -454789 -486061 -411551 -346098 -448046 -326389
11833 -326389 -264581 -401336 -364986 -328219 -347037 -433949 -273446 -327035 -567514 -441264 -416458
11822 -416458 -455071 -421982 -395194 -348654 -474615 -226636 -406558 -478420 -383998 -388457 -391042
11811 -391042 -442758 -397399 -473767 -326919 -415101 -390862 -416483 -457988 -442343 -355032 -463216
$$ packed form
11887c08164j08040j3839p0108R9861P4124K07103l77636K17990j40304M2087
11877c76926j08438J89549j41520J2853J58718K2277j54968k7538J34530p3204
11867c64667R1101q9972r0613J15426n8074K9635L0173j3747Q8291n8071k522
11856c23040Q6199N930m6893J430q4012q7097k1509J07035r6794Q4962J7533L5072
11844c21184O409j6894l9431j01082P8952o1559l1272P4510O5453j01948J21657
11833c26389O1808j36755L6350L6767j8818q6912J60503n3589k40479J26250K4806
11822d16458l8613L3089K6788M6540j25961K47979j79922p1862R4422m459k585
11811c91042n1716M5359p6368J46848q8182K4239k5621m1505J5645Q7311j08184
$$ plain form
11800 -463216 -304183 -498333 -370656 -355802 -527240 -281796 -392886 -477169 -430633 -371646
11790 -371646 -420457 -354877 -442905 -350396 -450048 -440942 -520387 -409655 -254752 -356262 -323241
11779 -323241 -407789 -372495 -355020 -361457 -380692 -391988 -154130 -255659 -360493 -411573 -277956
11768 -277956 -395277 -238080 -357010 -240402 -336852 -369992 -388295 -265313 -318696 -332508
11758 -332508 -370587 -287147 -328601 -352043 -362313 -509496 -413639 -465426 -381904 -378911 -468591
11747 -468591 -333537 -350139 -359633 -508549 -374060 -402864 -352088 -395965 -380622 -390783 -323275
11736 -323275 -361252 -322613 -274742 -339461 -336277 -374957 -409561 -441750 -369830 -327345 -459551
11725 -459551 -492823 -324592 -296549 -390531 -451894 -372010 -396840 -479477 -479601 -486441 -489470 -536198
$$ packed form
11800d63216J59033j94150J27677J4854j71438K45444j11090q4283M6536N8987
11790c71646m8811O5580q8028R2509r9652R106p9445J10732J54903j01510L3021
11779c23241q4548L5294J7475o437j9235j1296K37858j01529j04834n1080J33617
11768b77956j17321J57197j18930J16608r6450l3140j8303J22982n3383j3812
11758c32508l8079Q3440m1454k3442j0270j47183R5857n1787Q3522K993q9680
11747d68591J35054j6602r494j48916J34489k8804N0776m3877J5343j0161O7508
11736c23275l7977L8639M7871o4719L184l8680l4604l2189P1920M2485j32206
11725d59551l3272J68231K8043r3982o1363P9884k4830q2637j24o840l029m6728
$$ plain form
11713 -536198 -469276 -330162 -380643 -368916 -450582 -401719 -467979 -462784 -361484 -460463 -426355
11702 -426355 -328060 -329148 -296149 -317299 -406138 -368547 -313029 -348215 -356863 -389704 -428068 -368837
11690 -368837 -286207 -374981 -440119 -353555 -420004 -371277 -304252 -408911 -325289 -335158 -301859
11679 -301859 -287192 -355249 -403378 -468014 -276349 -376718 -336877 -431356 -188341 -210539 -203501
11668 -203501 -321516 -385500 -302431 -338247 -355722 -325577 -280577 -286509 -444507 -421301 -514284
11657 -514284 -465799 -352644 -336000 -376919 -485874 -427709 -370235 -533248 -488559 -344525 -487486
11646 -487486 -273031 -456981 -239685 -392664 -333100 -393567 -311532 -281571 -399925 -364746
11636 -364746 -428427 -260328 -301345 -289328 -262326 -407017 -322096 -504595 -308926 -366616 -353255
$$ packed form
11713e36198O6922J39114n0481J1727q1666M8863o6260N195J01300r8979L4108
11702d26355R8295j088L2999k1150q8839L7591N5518l5186q648l2841l8364N9231
11690c68837Q2630q8774o5138Q6564o6449M8727O7025j04659Q3622r869L3299
11679c01859J4667o8057m8129o4636J91665j00369L9841r4479K43015k2198P038
11668b03501j18015o3984Q3069l5816j7475L0145M5000n932j57998K3206r2983
11657e14284M8485J13155J6644m0919j08955N8165N7474j63013M4689J44034j42961
11646d87486K14455j83950K17296j52979N9564o0467Q2035K9961j18354L5179
11636c64746o3681J68099m1017J2017K7002j44691Q4921j82499J95669n7690J3361
$$ plain form
11625 -353255 -222568 -353999 -284495 -209452 -210600 -360542 -362534 -329926 -387137 -467892 -409071
11614 -409071 -447941 -373767 -314014 -347916 -273244 -347979 -358857 -287475 -376927 -436853 -511395
11603 -511395 -373619 -311583 -375422 -339375 -355601 -478908 -450277 -264811 -366470 -360207 -288071
11592 -288071 -313094 -375996 -380354 -368264 -288823 -307750 -393429 -332243 -324824 -225006 -390942 -442509
11580 -442509 -261727 -382622 -410847 -346677 -397283 -346152 -232647 -303255 -367092 -426824 -306484
11569 -306484 -475307 -251853 -436657 -354716 -439122 -289710 -467496 -329913 -364901 -279834
11559 -279834 -269506 -292297 -387664 -387215 -357826 -308869 -366502 -486884 -418970 -278843 -357464
11548 -357464 -403303 -266446 -326562 -382816 -250111 -357985 -361918 -450040 -369082 -279140 -361031
$$ packed form
11625c53255J30687j31431O9504P5043j148j49942j992L2608n7211q0755N8821
11614d09071l8870P4174N9753l3902P4672p4735j0878P1382q9452n9926p4542
11603e11395J37776O2036o3839L6047j6226j23307K8631J85466j01659O263P2136
11592b88071k5023o2902m358J2090P9441j8927q5679O1186P419R9818j65936n1567
11580d42509J80782j20895k8225O4170n0606N1131J13505p0608o3837n9732J20340
11569c06484j68823K23454j84804Q1941q4406J49412j77786J37583l4988Q5067
11559b79834J0328k2791r5367M49K9389M8957n7633j20382O7914J40127p8621
11548c57464m5839J36857o0116n6254J32705j07874l933q8122Q0958Q9942q1891
$$ plain form
11537 -361031 -347115 -416481 -291433 -264667 -308417 -264350 -460175 -299050 -396702 -253298 -321071
11526 -321071 -403151 -416876 -406817 -494009 -309782 -393778 -488560 -317229 -306634 -379779 -411823
11515 -411823 -398106 -398688 -392468 -464286 -396548 -457311 -380517 -455461 -416800 -343159 -491671 -430755
11503 -430755 -419832 -313864 -192600 -329634 -363157 -317646 -389646 -484195 -323927 -475589
11493 -475589 -408181 -386237 -375033 -452475 -229834 -327726 -415466 -426091 -326304 -471108 -382254
11482 -382254 -421280 -432674 -383664 -407940 -440737 -293359 -482404 -411677 -356129 -492678 -420849
11471 -420849 -504007 -401050 -316568 -446166 -464065 -457645 -477792 -449527 -396849 -381259 -235905
11460 -235905 -359875 -397488 -256447 -505599 -440791 -289267 -313752 -307956 -295890 -408409 -350282
$$ packed form
11537c61031J3916o9366J25048K6766m3750M4067j95825J61125r7652J43404o7773
11526c21071q2080j3725J0059q7192J84227q3996r4782J71331J0595p3145l2044
11515d11823J3717n82O220p1818O7738o0763P6794p4944L8661P3641j48512O0916
11503d30755J0923J05968J21264j37034l3523M5511p2000r4549J60268j51662
11493d75589O7408K1944J1204p7442K22641r7892q7740j0625R9787j44804Q8854
11482c82254l9026j1394M9010k4276l2797J47378j89045P0727N5548j36549P1829
11471d20849q3158J02957Q4482j29598j7899O420k0147K8265N2678J5590J45354
11460b35905j23970l7613J41041k49152O4808J51524k4485N796J2066j12519N8127
$$ plain form
11449 -350282 -362148 -375190 -442762 -310686 -387796 -370040 -290278 -375541 -346196 -380239 -364474
11438 -364474 -273216 -304328 -335387 -476971 -428057 -361641 -369669 -389184 -327953 -366853 -508758
11427 -508758 -441788 -209854 -260376 -284342 -309628 -345693 -429863 -275286 -385807 -246733 -314581
11416 -314581 -425135 -383842 -348028 -291223 -425868 -417958 -331819 -360692 -302092 -355834 -289934
11405 -289934 -376781 -421570 -351498 -411756 -338119 -168316 -430666 -397496 -292916 -266906 -307382
11394 -307382 -352189 -453200 -399848 -377881 -357785 -360027 -275649 -280346 -182730 -193112 -449452
11383 -449452 -337795 -393243 -518244 -221259 -278288 -255955 -372004 -273342 -426920 -368984
11373 -368984 -337627 -294151 -294637 -303547 -230242 -221870 -368325 -270674 -208322 -152078 -248304 -296758
$$ packed form
11449c50282j1866j3042o7572J32076p7110J7756P9762q5263K9345l4043J5765
11438c64474R1258l1112l1059j41584M8914O6416q028j9515O1231l8900j41905
11427e08758O6970K31934n0522k3966k5286l6065q4170J54577j10521J39074o7848
11416c14581j10554M1293L5814N6805j34645P910Q6139k8873N8600n3742O5900
11405b89934q6847m4789P0072o0258P3637J69803k62350L3170J04580K6010m0476
11394c07382m4807j01011N3352K1967K0096k242Q4378m697R7616j0382k56340
11383d49452J11657n5448j25001K96985n7029K2333j16049R8662j53578N7936
11373c68984L1357M3476m86q910P3305Q372j46455R7651O2352N6244r6226m8454
$$ plain form
11361 -296758 -288974 -326347 -179890 -404521 -235540 -376818 -296699 -243270 -267507 -343175 -336988
11350 -336988 -357643 -239008 -222887 -283239 -277782 -212121 -182957 -256101 -177559 -375770 -269494
11339 -269494 -359835 -235517 -340231 -240802 -311363 -392775 -342001 -320670 -267205 -235162 -241188
11328 -241188 -327049 -308805 -256793 -333835 -209994 -261085 -132734 -226838 -154226 -302526 -369758
11317 -369758 -179542 -417566 -378211 -518930 -461249 -324845 -302381 -548361 -404565 -377576
11307 -377576 -321428 -487286 -512602 -484754 -370439 -405418 -496754 -549105 -455362 -441777 -457806
11296 -457806 -463955 -425976 -432498 -217072 -401632 -389408 -320254 -245468 -380217 -269762 -291364
11285 -291364 -222528 -302760 -200870 -316041 -467857 -364848 -300036 -360034 -344867 -166463
$$ packed form
11361b96758P784l7373J46457k24631J68981j41278Q0119N3429k4237p5668O187
11350c36988k0655J18635J6121o0352N457O5661K9164p3144P8542j98211J06276
11339b69494r0341J24318j04714R9429p0561q1412N0774K1331N3465L2043o026
11328b41188q5861J8244N2012p7042J23841n1091J28351r4104P2612j48300o7232
11317c69758J90216k38024L9355j40719N7681J36404K2464k45980J43796K6989
11307c77576N6148j65858k5316K7848J14315l4979r1336n2351R3743J3585j6029
11296d57806o149L7979o522K15426j84560J2224O9154P4786j34749J10455k1602
11285b91364O8836q0232J01890j15171j51816J03009O4812n9998J5167J78404
$$ plain form
11275 -166463 -325298 -333340 -257730 -232835 -268027 -232310 -205144 -315381 -302847 -371345 -277043
11264 -277043 -282782 -343389 -224375 -146390 -338856 -231236 -335244 -150894 -135493 -248721
11254 -248721 -268692 -260899 -384452 -289232 -234611 -235398 -333546 -287181 -133183 -359723 -226677
11243 -226677 -267102 -371580 -236444 -272900 -265856 -332438 -172993 -283934 -189366 -273681 -277341
11232 -277341 -317825 -246344 -189940 -341594 -334806 -314528 -296920 -459011 -296648 -194454 -254185
11221 -254185 -346432 -285918 -263157 -346650 -274398 -274588 -279330 -311016 -386964 -277589 -417673 -246940
11209 -246940 -307536 -302339 -376242 -441385 -418925 -409932 -297614 -288329 -340964 -286626 -355976 -251554
11197 -251554 -342021 -439284 -432570 -311147 -367979 -325870 -387332 -492946 -558121 -437759 -439137
$$ packed form
11275a66463j58835q042P5610K4895l5192L5717K7166j10237J2534o8498R4302
11264b77043n739o0607J19014P7985j92466J07620j04008J84350J5401j13228
11254b48721j9971P793j23553R5220N4621p87r8148M6365J53998k26540J33046
11243b26677m0425j04478J35136l6456P044o6582J59445j10941R4568q4315l660
11232b77341m0484P1481N6404j51654O788K0278J7608j62091J62363J02194n9731
11221b54185r2247O0514K2761q3493P2252j90m742l1686p5948J09375j40084J70733
11209b46940o0596N197p3903o5143K2460Q993J12318R285n2635N4338o9350J04422
11197b51554r0467r7263O714J21423n6832M2109o1462j05614o5175J20362j378
$$ plain form
11186 -439137 -395255 -320375 -237911 -406407 -398196 -477661 -436682 -349607 -353194 -406259 -396208 -221671
11174 -221671 -296763 -351562 -221437 -339909 -382481 -356888 -322004 -224012 -412521 -283743 -361081
11163 -361081 -324661 -280451 -356964 -511269 -444105 -407140 -382296 -374428 -390832 -303241 -463763
11152 -463763 -260865 -298952 -254591 -317857 -263354 -321828 -240522 -334435 -378153 -364520 -397267
11141 -397267 -426398 -282140 -373381 -430468 -297253 -220056 -381434 -409494 -230152 -397325
11131 -397325 -302559 -402559 -232809 -323276 -371007 -204787 -431598 -421089 -237141 -343825
11121 -343825 -220798 -334910 -338520 -363462 -308688 -356202 -317336 -389376 -315050 -432881 -414743
11110 -414743 -383806 -372567 -265755 -333032 -301276 -413811 -312132 -257904 -296894 -409491 -316304
$$ packed form
11186d39137M3882P4880Q2464j68496Q211p9465M0979Q7075l587n3065J0051J74537
11174b21671p5092n4799J30125j18472m2572K5593L4884R7992j88509J28778p7338
11163c61081L6420M4210p6513j54305O7164L6965K4844P868j6404Q7591j60522
11152d63763K02898l8087M4361o3266N4503n8474Q1306r3913m3718J3633l2747
11141c97267k9131J44258r1241n7087J33215P7197j61378k8060J79342j67173
11131c97325R4766j00000J69750r0467m7731J66220k26811J0509J83948j06684
11121c43825J23027j14112l610k4942N4774m7514L8866p2040P4326j17831J8138
11110d14743L0937J1239J06812o7277L1756j12535J01679N4228l8990j12597R3187
$$ plain form
11099 -316304 -219654 -407737 -313045 -302669 -317143 -247339 -285724 -472966 -352315 -334143 -363952
11088 -363952 -263394 -332659 -412612 -290284 -362089 -439464 -453098 -535232 -494087 -371243 -329054
11077 -329054 -469370 -474377 -612882 -473142 -224921 -394604 -418839 -454422 -425310 -370076 -458269
11066 -458269 -400644 -235579 -415405 -363906 -334123 -338228 -387005 -387354 -473364 -359155 -302893
11055 -302893 -405975 -310543 -409006 -435193 -393704 -416656 -415568 -324341 -372067 -457651 -278583
11044 -278583 -427979 -331000 -430139 -536226 -351609 -319010 -427773 -342050 -231214 -250839
11034 -250839 -221176 -247867 -355829 -410608 -390274 -321730 -369756 -471993 -338346 -355532 -126156
11023 -126156 -420264 -442288 -223650 -327260 -285940 -355079 -332754 -340490 -359348 -383876 -387391
$$ packed form
11099c16304R6650j88083R4692J0376j4474O9804l8385j87242J20651J8172k9809
11088c63952J00558o9265p9953J22328p1805p7375j3634q2134M1145J22844M2189
11077c29054j40316n007j38505J39740K48221j69683k4235l5583K9112N5234q8193
11066d58269N7625J65065j79826N1499K9783m105m8777l49q6010J14209N6262
11055c02893j03082R5432r8463k6187M1489k2952J088R1227m7726q5584J79068
11044b78583j49396R6979r9139j06087J84617L2599j08763Q5723J10836j9625
11034b50839K9663k6691j07962n4779K0334O8544m8026j02237J33647j7186K29376
11023a26156k94108k2024K18638j03610M1320o9139K2325p736j8858k4528l515
$$ plain form
11012 -387391 -368082 -382859 -334883 -475175 -321084 -269529 -270924 -294690 -282489 -294584 -276830
11001 -276830 -320210 -316801 -198885 -414982 -366703 -278759 -365770 -301162 -378057 -351839 -277108
10990 -277108 -367811 -340779 -234280 -421032 -317172 -152157 -418117 -415000 -271975 -293071
10980 -293071 -335061 -390461 -355173 -227640 -219735 -236276 -331816 -254447 -311695 -201066 -259267
10969 -259267 -396712 -278590 -323548 -350843 -320611 -334215 -400023 -241811 -217602 -207262 -193189
10958 -193189 -258423 -322559 -285389 -242726 -302003 -371575 -264770 -210393 -350738 -211904 -372543
10947 -372543 -314695 -213180 -327721 -420087 -250831 -406855 -364936 -391754 -346240 -371153 -257141
10936 -257141 -275984 -418367 -341443 -347431 -358267 -348620 -370388 -337785 -435170 -335263 -369564 -343007
$$ packed form
11012c87391J9309j4777M7976j40292J54091N1555j395k3766J2201j2095J7754
11001b76830m3380L409J17916k16097M8279Q7944q7011O4608p6895K6218P4731
10990b77108r0703K7032J06499j86752J03860J65015k65960L117J43025k1096
10980b93071m1990n5400L5288J27533P905j6541r5540P7369n7248J10629n8201
10969b59267j37445J18122m4958k7295L0232j3604o5808J58212K4209J0340J4073
10958a93189o5234o4136L7170M2663n9277o9572J06805N4377j40345J38834j60639
10947c72543N7848J01515j14541r2366J69256j56024M1919k6818M5514k4913J14012
10936b57141j8843j42383P6924n988j0836R647k1768L2603r7385R9907l4301K6557
$$ plain form
10924 -343007 -242105 -379042 -414850 -339090 -428190 -495594 -444570 -415424 -280451 -473655 -438706
10913 -438706 -378860 -483682 -472143 -385642 -422250 -411309 -398345 -479108 -378258 -348664 -365883
10902 -365883 -361482 -324952 -341381 -397787 -544196 -341661 -426641 -444615 -427488 -459649 -439959
10891 -439959 -420386 -484945 -356216 -416298 -481758 -338652 -443612 -231296 -401394 -445911
10881 -445911 -535178 -401778 -303855 -422821 -504806 -437479 -421367 -464739 -422143 -342744 -354969
10870 -354969 -316759 -515708 -486652 -235269 -375524 -220817 -428864 -352008 -338766 -322190
10860 -322190 -489829 -279593 -403570 -371962 -376348 -132670 -218132 -329192 -345634 -267404 -381065
10849 -381065 -312316 -400479 -487774 -284607 -411780 -281373 -261669 -337907 -402887 -344275 -421878
$$ packed form
10924c43007J00902j36937l5808P5760q9100o7404N1024K9146J34973j93204L4949
10913d38706N9846j04822J1539Q6501l6608J0941J2964q0763J00850K9594j7219
10902c65883M401L6530j6429n6406j46409K02535q4980j7974J7127l2161J9690
10891d39959J9573o4559J28729o0082o5460J43106j04960K12316j70098m4517
10881d45911q9267J33400R7923j18966q1985O7327J6112m3372M2596P9399j2225
10870c54969L8210j98949K9056K51383j40255J54707k08047P6856J3242J6576
10860c22190j67639K10236j23977L1608m386K43678q5462j11060j6442P8230j13661
10849c81065O8749q8163q7295K03167j27173J30407J9704p6238o4980N8612p7603
$$ plain form
10838 -421878 -252604 -191039 -342629 -259402 -399007 -266620 -222365 -256693 -464646 -350800
10828 -350800 -339646 -174541 -276255 -298547 -218853 -219810 -281243 -443573 -290284 -286551 -375197
10817 -375197 -259808 -345177 -225211 -317578 -378628 -424423 -278688 -280225 -224976 -358953 -217831
10806 -217831 -297287 -296305 -269637 -299303 -362841 -337392 -349022 -372150 -404001 -288826 -395395
10795 -395395 -319595 -363985 -361288 -317573 -291315 -212482 -401044 -454579 -296966 -331311 -431079
10784 -431079 -315079 -378071 -358004 -224532 -384037 -318811 -212989 -268247 -324349 -278082 -439496
10773 -439496 -347432 -370802 -348178 -272049 -528427 -371678 -214085 -50650 -276326 -169639
10763 -169639 -338957 -377719 -410853 -235579 -273828 -353295 -416374 -286498 -376525 -375762 -387425
$$ packed form
10838d21878J69274O1565j51590Q3227j39605J32387M4255l4328k07953J13846
10828c50800J1154J65105j01714k2292P9694r57o1433j62330J53289L733q8646
10817c75197J15389q5369J19966r2367o1050m5795J45735j537N5249j33977J41122
10806b17831p9456R82K6668k9666o3538K5449j1630k3128l1851J15175j06569
10795c95395P5800m4390K697M3715K6258P8833j88562n3535J57613l4345r9768
10784d31079J16000o2992K0067J33472j59505O5226J05822n5258n6102M6267j61414
10773d39496R2064k3370K2624P6129k56378J56749J57593J63435k25676J06687
10763a69639j69318l8762l3134J75274l8249p9467o3079J29876r0027P63j1663
$$ plain form
10752 -387425 -376505 -357589 -277676 -314180 -222822 -263450 -463462 -409745 -381110 -348292 -230470
10741 -230470 -384930 -329586 -177492 -267600 -363729 -358837 -289630 -89911 -339897 -248791 -276682
10730 -276682 -304982 -326566 -185256 -276262 -322838 -325029 -91902 -144346 -134514 -191124 -130782
10719 -130782 -372525 -224915 -241861 -86727 -152597 -274562 -111050 -140312 -192672 -99728
10709 -99728 -189614 -195077 -79613 -183388 -240549 -189359 -107014 -129394 -214407 -207033 -229540 -315650
10697 -315650 -159432 -259887 -224350 -296887 -262080 -165802 -202082 -248705 -203023 -179300 -219298
10686 -219298 -176160 -233094 -379168 -308424 -287962 -275762 -352995 -341481 -225211 -169392 -247524
10675 -247524 -210017 -302892 -170290 -310569 -97383 -227985 -364544 -331663 -385984 -362421
$$ packed form
10752c87425J0920J8916P9913l6504R1358m0628k00012N3717K8635L2818J17822
10741b30470j54460N5344J52094r0108r6129M892O9207J99719k49986R1106k7891
10730b76682k8300k1584J41310r1006m6576k191K33127n2444R832n6610O0342
10719a30782k41743J47610j6946J55134o5870j21965J63512k9262n2360R2944
10709i9728q9886n463J15464j03775n7161N1190Q2345k2380q5013P374k2507q6110
10697c15650J56218j00455L5537p2537L4807R6278l6280m6623M5682K3723l9998
10686b19298M3138n6934j46074P0744K0462J2200p7233J1514J16270N5819p8132
10675b47524L7507r2875J32602j40279K13186j30602j36559L2881n4321K3563
$$ plain form
10665 -362421 -448691 -501223 -580454 -645783 -590818 -640055 -682357 -657332 -822834 -643911 -752567
10654 -752567 -784984 -646234 -804889 -778141 -661762 -624611 -695515 -592675 -603374 -579513 -617547
10643 -617547 -449077 -637484 -623556 -434972 -497059 -352362 -475313 -518128 -488982 -442801
10633 -442801 -442608 -460757 -490088 -385225 -421729 -388548 -600570 -343227 -444297 -357960 -458176
10622 -458176 -357794 -369593 -406900 -274607 -277147 -407350 -340179 -384851 -277689 -325914 -308152
10611 -308152 -332459 -222865 -306176 -213835 -252428 -191369 -115380 -268062 -181670 -8763 -192637
10600 -192637 -229048 -236751 -143898 -234295 -243208 -145616 -139856 -163401 -283005 -181007 -62244
10589 -62244 -237324 -69069 -142026 -50056 -180791 -130697 -201991 -197885 -173973 -102143 -128732
$$ packed form
10665c62421q6270n2532p9231o5329N4965m9237m2302K5025j65502J78923j08656
10654g52567l2417J38750j58655K6748J16379L7151p0904J02840j0699K3861l8034
10643f17547J68470j88407J3928J88584o2087J44697j22951m2815K9146M6181
10633d42801J93j8149k9331J04863l6504L3181k12022K57343j01070Q6337j00216
10622d58176J00382j1799l7307J32293k540j30203O7171m4672J07162m8225J7762
10611c08152k4307J09594q3311R2341l8593O1059P5989j52682Q6392J72907j83874
10600a92637l6411p703R2853r0397q913R7592N760k3545j19604J01998J18763
10589f2244j75080J68255p2957R1970j30735N0094p1294M106K3912P1830k6589
$$ plain form
10578 -128732 -104900 -181557 -229181 -219163 -227316 -194199 -68266 -100894 -191157 -171040 -185808
10567 -185808 -201248 -159952 -306193 -309183 -286129 -228922 -233165 -231635 -345706 -341100 -150258 -127072
10555 -127072 -187511 -406985 -309688 -174687 -258096 -335047 -193802 -258812 -301656 -336738 -395509
10544 -395509 -221669 -217992 -259041 -209304 -255416 -280389 -266029 -340873 -334064 -363055 -309607 -206723
10532 -206723 -321072 -452860 -150959 -209520 -275556 -307797 -323180 -372675 -272957 -261104 -413734
10521 -413734 -260828 -273938 -302108 -297271 -231959 -238042 -304163 -228192 -206209 -227093 -271257 -313243
10509 -313243 -280465 -242272 -313474 -238087 -215669 -272983 -329205 -177694 -447607 -281616 -309402
10498 -309402 -341273 -154494 -162533 -268787 -175514 -169273 -248762 -169011 -286847 -276802 -303063
$$ packed form
10578a28732K3832p6657m7624J0018q153L3117J25933l2628r0263K0117j4768
10567a85808j5440M1296j46241k990K3054N7207m243J530j14071M606J90842K3186
10555a27072o0439k19474R7297J35001q3409p6951J41245o5010m2844l5082n8771
10544c95509J73840L677m1049M9737m6112k4973J4360p4844O809k8991N3448J02884
10532b06723j14349j31788L01901n8561o6036l2241j5383m9495R9718J1853j52630
10521d13734J52906j3110k8170M837O5312o083o6121P5971K1983k0884m4164m1986
10509c13243L2778L8193p1202P5387K2418n7314n6222J51511k69913J65991k7786
10498c09402l1871J86779q039j06254R3273O241p9489P9751j17836J0045k6261
$$ plain form
10487 -303063 -319221 -34768 -374213 -242160 -212562 -320616 -356452 -211144 -324897 -284360
10477 -284360 -220231 -321573 -422704 -154202 -395508 -225100 -337807 -164621 -169838 -191397
10467 -191397 -420811 -335154 -281617 -355188 -235780 -400651 -275167 -314014 -302489 -404961
10457 -404961 -219173 -450236 -358812 -330320 -416001 -406746 -382116 -352488 -410049 -363446 -331897
10446 -331897 -367211 -308549 -416677 -411473 -359084 -349525 -318693 -402279 -436144 -309812 -323428
10435 -323428 -299713 -380306 -389463 -428681 -248338 -166028 -372447 -295461 -354742 -417803 -195117
10424 -195117 -384678 -304698 -210462 -278499 -212964 -365719 -294794 -257496 -127531 -399507 -251749
10413 -251749 -321794 -287491 -170324 -360836 -289421 -206614 -294029 -189957 -284877 -265629 -260765
$$ packed form
10487c03063j6158K84453l39445J32053K9598j08054l5836J45308j13753M0537
10477b84360O4129j01342j01131K68502k41306J70408j12707J73186n217k1559
10467a91397k29414Q5657N3537p3571J19408j64871J25484l8847J1525j02472
10457d04961J85788k31063R1424K8492q5681R255K4630K9628n7561M6603L1549
10446c31897l5314N8662j08128N204N2389R559L0832q3586l3865J26332j3616
10435c23428K3715q0593r157l9218J80343Q2310k06419P6986n9281o3061K22686
10424a95117j89561P9980R4236o8037O5535j52755P0925L7298J29965k71976J47758
10413b51749p0045L4303J17167j90512P1415Q2807q7415J04072r4920J9248M864
$$ plain form
10402 -260765 -213302 -129426 -319794 -219034 -221627 -89675 -92222 -203258 -282159 -207843 -251455
10391 -251455 -223958 -160752 -233915 -262727 -291374 -263663 -164120 -299314 -253229 -181826 -188287
10380 -188287 -322221 -165470 -202987 -137495 -339124 -202909 -236672 -216874 -234996 -297928 -563224
10369 -563224 -66931 -274074 -281488 -301797 -161846 -122047 -236272 -227553 -147863 -289365 -246271
10358 -246271 -188961 -313232 -324082 -200701 -144133 -226789 -195111 -208956 -209186 -128469 -460939
10347 -460939 -172993 -220443 -191574 -273524 -207266 -212423 -254799 -282802 -228783 -210828 -178459
10336 -178459 -66241 -253290 -133394 -315430 -236460 -294704 -295593 -177226 -165043 -161600 -142394
10325 -142394 -269505 -252419 -235641 -169728 -289356 -200724 -245822 -216222 -264894 -196681 -401291
$$ packed form
10402b60765M7463Q3876j90368J00760k593J31952k547j11036p8901P4316m3612
10391b51455K7497O3206p3163k8812k8647K7711R9543j35194M6085P1403o461
10380a88287j33934J56751l7517O5492k01629J36215l3763J9798j8122o2932k65296
10369e63224M96293k07143p414k0309J39951L9799j14225Q719P9690j41502M3094
10358b46271N7310j24271j0850J23381N6568q2656L1678j3845k30Q0717l32470
10347d60939K87946m7450K8869q1950O6258n157m2376k8003N4019J7955L2369
10336a78459J12218j87049J19896j82036P8970n8244q89J18367J2183L443J9206
10325a42394j27111J7086J6778O5913j19628Q8632m5098K9600m8672O8213k04610
$$ plain form
10314 -401291 -305442 -319377 -353468 -445390 -228466 -441087 -343252 -383231 -423576 -223995 -256163
10303 -256163 -329052 -401712 -351842 -321195 -356864 -303717 -321704 -293648 -344901 -296855 -271548
10292 -271548 -230014 -296507 -229779 -214187 -240013 -331720 -294740 -186179 -213443 -120080 -262610
10281 -262610 -220267 -202956 -273729 -110368 -245920 -207469 -203394 -193204 -167901 -125869 -216698
10270 -216698 -203213 -170771 -189467 -224253 -235076 -42425 -118154 76622 -97804 -169437 -168164
10259 -168164 -262568 -211864 -211841 -7167 -237680 -299378 -194323 -132210 -300817 -126154 -107319
10248 -107319 -184060 -203057 -167662 -299896 -251787 -198114 -18103 -161862 -5808 -203262
10238 -203262 -12799 -144892 -88863 -170908 -212194 -223458 -203657 -222949 -364088 -192678 -266783
$$ packed form
10314d01291R5849j3935l4091r1922K16924k12621R7835l9979m0345J99581l2168
10303b56163p2889p2660M9870L0647l5669N3147j7987K8056n1253M8046K5307
10292b71548M1534o6493O6728J5592k5826r1707L6980J08561k7264R3363j42530
10281b62610M2343J7311p0773J63361j35552L8451M075J0190K5303M2032r0829
10270b16698J3485L2442j8696l4786j0823J92651p5729J94776j74426p1633J273
10259a68164r4404N0704K3K04674k30513o1698J05055O2113j68607J74663J8835
10248a07319p6741j8997L5395j32234M8109N3673J80011j43759J56054j97454
10238b03262J90463j32093N6029q2045m1286j1264J9801j9292j41139J71410p4105
$$ plain form
10227 -266783 -179823 -212604 -143395 -272407 -199522 -290364 -144454 -233505 -332187 -293292 -270807
10216 -270807 -258717 -196500 -203962 -291514 -212122 -238373 -258329 -143373 -233094 -321892 -248000
10205 -248000 -184893 -295422 -311424 -322728 -455534 -271918 -265771 -207346 -277121 -295806 -265810
10194 -265810 -247666 -291438 -134337 -248012 -368476 -239373 -261775 -170679 -167908 -354741 -327936
10183 -327936 -176882 -330373 -262382 -206349 -383747 -184464 -232721 -294574 -167259 -264884
10173 -264884 -265924 -297574 -149113 -243944 -263777 -329038 -338448 -252360 -216041 -312798 -135976
10162 -135976 -287807 -250341 -216759 -180026 -201707 -249636 -305952 -206164 -223390 -269829 -149827
10151 -149827 -201612 -160447 -264601 -263339 -224679 -229637 -325133 -270488 -257809 -207029 -245711 -205443
$$ packed form
10227b66783Q6960l2781O9209j29012P2885r0842J45910q9051r8682L8895K2485
10216b70807J2090O2217p462q7552P9392k6251j9956J14956q9721q8798P3892
10205b48000O3107j10529j6002j1304j32806J83616O147N8425o9775j8685K9996
10194b65810J8144m3772J57101j13675j20464J29103k2402R1096K771j86833K6805
10183c27936J51054j53491O7991N6033j77398J99283m8257o1853J27315r7625
10173b64884j040l1650J48461r4831j9833o5261r410Q6088L6319r6757J76822
10162a35976j51831L7466L3582L6733k1681m7929n6316R9788j7226m6439J20002
10151a49827n1785M1165j04154J262L8660m958r5496N4645J2679N0780l8682M0268
$$ plain form
10139 -205443 -135227 -314243 -359765 -203017 -244409 -275958 -356232 -127985 -138671 -201201 -228028
10128 -228028 -292333 -221776 -149742 -245197 -236874 -156409 -355645 -281640 -269118 -160305 -212164
10117 -212164 -304705 -300670 -227577 -271626 -202569 -280735 -236166 -362454 -254493 -267463 -370492
10106 -370492 -166411 -252507 -251630 -186320 -241715 -249776 -227983 -393125 -268265 -136002 -324193
10095 -324193 -282483 -310832 -156059 -263599 -168670 -361864 -294554 -184466 -232007 -356357
10085 -356357 -131357 -385812 -378844 -149427 -352124 -172458 -298586 -284213 -184284 -241228
10075 -241228 -362021 -259467 -139563 -130253 -188295 -120121 -236726 -271664 -420014 -108864
10065 -108864 -233670 -67556 -240074 -213229 -49575 -339925 -232183 -193170 -147215 -151238
$$ packed form
10139b05443P0216j79016m5522J56748m1392l1549q0274K28247j0686o2530k6827
10128b28028o4305P0557P2034r5455Q323Q0465j99236P4005J2522J08813n1859
10117b12164r2541M035P3093m4049O9057p8166M4569j26288J07961j2970j03029
10106c70492K04081q6096Q77O5310n5395q061K1793j65142J24860J32263j88191
10095c24193M1710k8349J54773j07540R4929j93194O7310J10088m7541j24350
10085c56357K25000k54455O968K29417k02697J79666j26128J4373R9929n6944
10075b41228j20793J02554J19904R310n8042O8174j16605l4938j48350L11150
10065a08864j24806J66114j72518K6845J63654k90350J07742L9013M5955m023
$$ plain form
10055 -151238 -164558 -19558 -208978 -31123 -101142 -47229 -136401 -186419 -203533 -176448 -90645
10044 -90645 -101551 -193157 -309525 -145324 -95937 -154685 -197496 -152614 -129960 -94446 -208632
10033 -208632 -215467 -251231 -254108 -233472 -105060 -248374 -278935 -278759 -250953 -214756 -286253 -284916
10021 -284916 -280348 -138529 -132811 15879 -179888 -173884 -201488 -20967 -137483 -114296 -102506
10010 -102506 -201740 -96990 -193592 -13945 -73558 -210120 -217606 -115938 -169330 -150946 -126245
9999 -126245 -130062 -138240 -142905 -221811 -203720 -94522 -214919 -130632 -168587 -80595 -202731 -271591
9987 -271591 -31489 -110779 -109938 -128399 -3835 -276997 -146498 -102771 5457 -21208 -64074
9976 -64074 -79900 -121260 -84177 -54995 -81299 -116952 -68950 -60777 -298256 -170855 -187152 -146940
$$ packed form
10055a51238j3320J45000j89420J77855p0019N3913q9172n0018j7114K7085Q5803
10044i0645j0906r1606j16368J64201M9387n8748m2811M4882K2654L5514j14186
10033b08632o835l5764k877K0636J28412j43314l0561J76K7806L6197p1497J337
10021b84916M568J41819N718J48690j95767O004k7604J80521j16516K3187J1790
10010a02506r9234J04750r6602J79647n9613j36562p486J01668n3392J8384K4701
9999a26245l817q178m665p8906J8091J09198j20397Q4287l7955Q7992j22136o8860
9987b71591K40102p9290Q41j8461J24564k73162J30499M3727J08228k6665m2866
9976f4074j5826m1360L7083K9182k6304l5653M8002Q173k37479J27401j6297M0212
$$ plain form
9964 -146940 -39949 -171535 -58365 -224493 -245860 -231091 -161272 -164754 -171004 -243265 -106482
9953 -106482 -116581 -220370 -164492 -131789 -174510 -111202 -119899 -35348 -140284 -118327 -52400
9942 -52400 -306134 -230740 -188818 -194300 -224921 -112723 -178843 -248485 -120761 -206936 -295333
9931 -295333 -202724 -218425 -200635 -312144 -220534 -381974 -192441 -259132 -204080 -228780 -217908
9920 -217908 -175581 -259844 -276115 -235301 -225599 -244719 -305858 -325002 -316504 -150295 -91085 -266181
9908 -266181 -243017 -231169 -249349 -251083 -294669 -383355 -282086 -376257 -363712 -138543 -244772
9897 -244772 -283625 -175633 -132891 -277190 -168369 -263534 -125856 -278215 -172496 -125747
9887 -125747 -214229 -273294 -403001 -212111 -238537 -253397 -208078 -305217 -102313 -295901 -211472
$$ packed form
9964a46940J06991j31586J13170j66128k1367J4769O9819l482o250p2261J36783
9953a06482j0099j03789N5878L2703m2721O3308q697Q4551j04936K1957O5927
9942e2400k53734P5394M1922n482l0621J12198o6120o9642J27724q6175q8397
9931b95333R2609j5701J7790j11509R1610j61440J89533o6691N5052k4700J0872
9920b17908M2327q4263j6271M0814R702j9120o1139j9144Q498J66209N9210j75096
9908b66181K3164J1848j8180j734m3586q8686J01269r4171J2545K25169j06229
9897b44772l8853J07992M2742j44299J08821r5165J37678j52359J05719M6749
9887a25747q8482n9065j29707J90890k6426j4860M5319r7139K02904j93588Q4429
$$ plain form
9876 -211472 -62326 -242993 -254549 -211114 -261899 -233331 -177071 -262112 -186829 -70269 -19925
9865 -19925 -238362 -140041 -268285 -208012 -176752 -175676 -76006 -86292 -89073 -169607 -106206 -72782
9853 -72782 -222285 -265730 -305847 -135144 -239843 -189706 -189657 -179079 -247011 -205976 -244248 -270035
9841 -270035 -301033 -277906 -193615 -141450 -252635 -215562 -320963 -205917 -209192 -178629 -122673
9830 -122673 -131527 -244370 -42206 -340631 -238041 -306697 -212280 -145818 -192712 -257630 -171377
9819 -171377 -126257 -141980 -384836 -191000 -174684 -220979 -159318 -239533 -356196 -112117 -132626
9808 -132626 -192036 -287028 -205578 -162507 -142134 -210945 -200140 -230817 -296917 -275963 -298710 -114100
9796 -114100 -126415 -144808 -104883 -163851 -65247 -209162 -220532 -97182 -264693 -352591 -286491
$$ packed form
9876b11472J49146j80667j1556M3435n0785K8568N6260q5041P5283J16560N0344
9865a9925k18437R8321j28244O0273L1260J076R9670j0286k781q0534O3401L3424
9853g2782j49503m3445m0117J70703j04699N0137M9J0578o7932M1035l8272k5787
9841b70035l0998K3127Q4291N2165j11185L7073j05401J15046l275L0563N5956
9830a22673q854j12843K02164k98425J02590o8656R4417O6462m6894o4918Q6253
9819a71377M5120j5723k42856J93836J6316m6295O1661q0215j16663K44079k0509
9808a32626n9410r4992Q1450M3071K0373o8811J0805l0677o6100K0954k2747J84610
9796a14100j2315j8393L9925n8968R8604j43915j1370J23350j67511q7898O6100
$$ plain form
9785 -286491 -186915 -153666 -102010 -126772 -243460 -135155 -110018 -189372 -174094 -185878 -234183
9774 -234183 -168530 -222307 -179882 -310619 -163666 -163079 -72660 -147100 -156705 -172851 -373993 -125835
9762 -125835 -249771 -312107 -316991 -266546 -177133 -339531 -180424 -266509 -266123 -82538 -138140
9751 -138140 -297791 -73256 -225398 -176929 -238753 -174811 -278827 -300850 -275682 -153728 -216500
9740 -216500 -140031 -244328 -218122 -339408 -303679 -232895 -260223 -341217 -359145 -346275 -124389
9729 -124389 -287714 -174617 -209406 -206655 -204202 -290099 -254991 -155832 -202194 -90311 -266318
9718 -266318 -112867 -114183 -94480 -213843 -77589 -103581 -12818 -73174 -19455 -2585 -96002
9707 -96002 -288877 -128776 -45236 -69510 -14327 -84840 -20065 -151785 -129611 66 -143863
$$ packed form
9785b86491R9576L3249N1656k4762j16688J08305K5137p9354J5278j1784m8305
9774b34183O5653n3777M2425j30737J46953N87R0419p4440r605j6146k01142K48158
9762a25835j23936o2336m884N0445Q9413j62398J59107q6085L86J83585n5602
9751a38140j59651K24535j52142M8469o1824O3942j04016k2023K5168J21954o2772
9740b16500P6469j04297K6206j21286L5729P0784k7328q0994j7928J2870K21886
9729a24389j63325J13097l4789K751K453q5897L5108R9159m6362J11883j76007
9718b66318J53451j316J9703j19363J36254k5992R0763o0356N3719J6870r3417
9707i6002j92875J60101Q3540k4274N5183p0513O4775j31720K2174J29677j43929
$$ plain form
9696 -143863 -8847 59534 -66107 1540 -978 -24198 -233701 -77263 -18266 -174451 -79210
9685 -79210 -22385 -26580 -127632 -76394 -168857 -21795 -168452 -120958 -96358 -99256 -54749 -36323
9673 -36323 -35758 -1907 -29603 -103898 -102496 -72368 -57107 -83833 -160306 28564 107780 82150
9661 82150 -40222 26367 -5581 -154912 -76730 -59885 -127969 66354 -111692 -52747 15889
9650 15889 -171534 18364 -162372 -160050 -70134 -172064 -23404 -257064 -125958 -63003 -204999
9639 -204999 -192881 -149199 -105788 12940 -63381 6151 -84215 -5177 -80480 -16185 -11427 -175704
9627 -175704 -127853 -23592 -148741 -313505 -25831 -220674 -106371 -24488 -206917 -178323
9617 -178323 -139869 -243899 -51566 -216708 -118221 -101845 -135149 10399 -77626 48545 -32912
$$ packed form
9696a43863J35016O8381j25641O7647k518k3220k09503J56438N8997j56185R5241
9685g9210N6825m195j01052N1238r2463J47062j46657M7494K4600k898M4507J8426
9673c6323N65L3851k7696p4295J402L0128J5261k6726p6473J88870P9216k5630
9661H2150j22372O6589l1948j49331P8182J6845o8084J94323j78046N8945O8636
9650A5889j87423J89898j80736K322Q9916j01930J48660k33660J31106O2955j41996
9639b04999J2118M3682M3411J18728p6321O9532r0366P9038p5303O4295M758j64277
9627a75704M7851J04261j25149j64764K87674j94843J14303Q1883j82429K8594
9617a78323L8454j04030J92333j65142R8487J6376l3304J45548q8025J26171q1457
$$ plain form
9606 -32912 -242090 -216310 -126343 -56100 -180522 -156725 -150247 -97439 -119373 -88436 -114805 -21472
9594 -21472 -147965 31320 -131281 -64364 -99687 -165859 -92044 -138994 -92857 11941 -64130
9583 -64130 -48606 -105351 58726 -44265 4413 33013 -361748 -55456 -44455 -61190 -13652
9572 -13652 -58534 -93670 -57876 -67043 -42584 -146943 -85906 100418 33156 126203 -60785
9561 -60785 5629 29720 16449 -48815 25656 93802 80039 -24093 -71179 80549 42061
9550 42061 153788 -18233 129181 35523 -16862 149875 -21753 7036 109297 107239 140731
9539 140731 105897 188014 314144 61043 99872 124832 133897 100799 232533 233753 149305
9528 149305 163128 226140 154835 133165 163907 104306 117231 251212 415193 358410 294351
$$ packed form
9606c2912k09178K5780Q9967P0243j24422K3797O478N2808k1934L0937k6369R3333
9594b1472j26493J79285j62601O6917l5323o6172P3815m6950M6137J04798p6071
9583f4130J5524n6745J64077j02991M8678K8600l94761L06292J1001j6735M7538
9572a3652m4882l5136L5794r167K4459j04359O1037J86324o7262R3047j86988
9561f0785O6414K4091j3271o5264P4471O8146j3763j04132m7086J51728l8488
9550D2061J11727j72021J47414r3658n2385J66737j71628K8789J02261k058L3492
9539A40731l4834Q2117J26130k53101L8829K4960R065l3098J31734J220q4448
9528A49305J3823O3012p1305k1670L0742n9601J2925J33981J63981n6783o4059
$$ plain form
9517 294351 442574 334363 398679 264792 418465 526946 564147 623420 588950 767587
9507 767587 794164 991507 1229033 1464342 1514718 1785709 1985205 2311100 2614304 2769109
9497 2769109 2784962 2700844 2470633 2276201 2228952 2215597 1970747 1842438 1451833 1200245
9487 1200245 1130714 1037734 865343 933560 704302 590418 537514 554446 358292 167937
9477 167937 282544 329850 214054 179126 228557 315517 378791 250982 166522 40848 181585
9466 181585 177571 112124 117480 209138 135977 163316 58631 151924 233898 183644 167414 51420
9454 51420 195973 146896 26101 80567 32948 45821 110402 110652 71546 81003 -14145 103097
9442 103097 125779 175271 191904 67410 181660 20186 106144 68126 122631 27907 75675
$$ packed form
9517B94351J48223j08211O4316j33887J53673J08481L7201N9273l4470J78637
9507G67587K6577J97343K37526K35309N0376K70991J99496L25895L03204J54805
9497B769109J5853q4118k30211j94432m7249j3355k44850j28309l90605k51588
9487A200245o9531r2980j72391O8217k29258j13884n2904J6932j96154j90355
9477A67937J14607M7306j15796l4928M9431Q6960O3274j27809q4460j25674J40737
9466A81585m014o5447N356R1658p3161K7339j04685R3293Q1974n0254j6230j15994
9454E1420J44553m9077j20795N4466m7619J2873O4581K50l9106R457r5148J17242
9442A03097K2682M9492J6633j24494J14250j61474Q5958l8018N4505r4724M7768
$$ plain form
9431 75675 31168 86919 137529 65085 -7830 171934 201332 170883 122476 196189 35755
9420 35755 118806 112653 135326 71656 156532 98995 197194 249743 327293 222573 203247 157356
9408 157356 164068 227888 151897 164792 117758 239235 170856 182294 136619 83049 131017 311463
9396 311463 224839 94296 207320 163527 139739 255641 255670 265358 297616 315456 344726 384056
9384 384056 187211 418233 233635 286812 371647 425747 455662 362223 473914 419588 355252
9373 355252 572460 389340 406312 419482 492366 523589 560378 473078 477331 392820 401129 412664
9361 412664 501995 433435 516521 415257 463748 581223 442470 548993 491895 414296 576626
9350 576626 526567 608824 568429 525459 591502 493235 531360 610740 668887 568285 756991
$$ packed form
9431G5675m4507N5751N0610p2444p2915J79764K9398l0449m8407P3713j60434
9420C5755Q3051o153K2673o3670Q4876n7537R8199N2549P7550j04720j9326m5891
9408A57356O712O3820p5991J2895m7034J21477o8379J1438m5675n3570M7968J80446
9396C11463q6624j30543J13024m3793k3788J15902K9R688L2258J7840K9270L9330
9384C84056j96845K31022j84598N3177Q4835N4100K9915r3439J11691n4326o4336
9373C55252K17208j83120J6972J3170P2884L1223L6789q7300M253q4511Q309J1535
9361D12664Q9331o8560Q3086j01264M8491J17475j38753J06523n7098p7599J62330
9350E76626n0059Q2257m0395m2970O6043r8267L8125P9380N8147j00602J88706
$$ plain form
9339 756991 707177 719803 707397 734571 748601 796045 810078 830251 822965 761814 782595 834529
9327 834529 867563 888017 743844 825587 875202 791447 871554 846685 803103 751638 834327
9316 834327 955580 885188 816251 850854 774463 838625 824715 724132 929736 794652 896488
9305 896488 1020398 822303 998170 867155 1100195 1073492 1050906 891109 1180808 1182119
9295 1182119 1277414 1307570 1314446 1395424 1293998 1299615 1180126 1279157 1432708 1303510 1362614
9284 1362614 1337830 1419922 1437418 1490624 1343472 1461986 1648361 1536999 1529300 1395089 1642994
9273 1642994 1482785 1525666 1499687 1621646 1804168 1528034 1751903 1574944 1834517 1761732
9263 1761732 1777669 1810003 1801465 1968605 1910057 1928692 1809229 1989917 2024884 1998720 1967012
$$ packed form
9339G56991m9814J2626j2406K7174J4030M7444J4033K0173p286o1151K0781N1934
9327H34529L3034K0454j44173Q1743M9615q3755Q0107k4869m3582n1465Q2689
9316H34327J21253p0392o8937L4603p6391O4162j3910j00583K05604j35084J01836
9305H96488J23910j98095J75867j31015K33040k6703k2586j59797K89699J311
9295A182119R5295L0156O876Q0978j01426N617j19489R9031J53551j29198N9104
9284A362614k4784Q2092J7496N3206j47152J18514J86375j11362p699j34211K47905
9273A642994j60209M2881k5979J21959J82522k76134K23869j76959K59573p2785
9263A761732J5937L2334q538J67140n8548J8635j19463J80688L4967k6164l1708
$$ plain form
9252 1967012 2048040 2172328 2015051 2153947 2243193 2178189 2246967 2258483 2204629 2466232 2210033
9241 2210033 2245911 2264903 2296817 2239613 2381865 2481917 2365449 2501341 2542948 2538780 2814014
9230 2814014 2801436 2942895 2894861 2886688 3012450 2975215 3281176 3232858 3373677 3396439 3498567
9219 3498567 3700576 3722301 3756279 3870684 4016486 3886855 4046360 4102669 4223813 4179934
9209 4179934 4199954 4286257 4425085 4413248 4619445 4583478 4728396 4754308 4915178 4965658 4987368
9198 4987368 5337008 5266703 5194531 5342302 5436736 5658351 5765727 5881203 5915881 6108121
9188 6108121 6260611 6309493 6324134 6488488 6624297 6796594 7445726 7022010 7117828 7074009
9178 7074009 7258999 7513251 7714389 7961793 8080499 8357067 8580602 8873972 8944950 9359832
$$ packed form
9252A967012Q1028J24288j57277J38896Q9246o5004O8778J1516n3854K61603k56199
9241B210033L5878J8992L1914n7204J42252J00052j16468J35892M1607m168K75234
9230B814014j2578J41459m8034q173J25762l7235L05961m8318J40819K2762J02128
9219C498567K02009K1725L3978J14405J45802j29631J59505N6309J21144m3879
9209D179934K0020Q6303J38828j1837K06197l5967J44918K5912J60870N0480K1710
9198D987368L49640p0305p2172J47771R4434K21615J07376J15476L4678J92240
9188F108121J52490M8882J4641J64354J35809J72297O49132m23716R5818m3819
9178G074009J84990K54252K01138K47404J18706K76568K23535K93370P0978M14882
$$ plain form
9168 9359832 9511687 9786083 9882686 10185117 10224819 10544797 10746048 10882200 11052863 11113493
9158 11113493 11227853 11359085 11470963 11524910 11780931 12022350 12195171 12434313 12694439 12982312
9148 12982312 13272881 13675899 13919170 14345083 14741932 15150897 15542193 15831835 16371682
9139 16371682 16847033 17237350 17611588 17828424 18228028 18619588 19158817 19619257 20040462
9130 20040462 20624203 21064888 21494644 22124758 22644038 23079211 23814885 24642299 25217912
9121 25217912 26030177 27020871 27862601 29041633 30253009 31576363 32929663 34259943 35896032
9112 35896032 37849126 39917548 41932959 44033257 46555357 49597723 53227883 57678969
9104 57678969 62876041 68124279 73523623 79922520 87058197 95231561 104756767 116830334
$$ packed form
9168I359832J51855K74396R6603L02431L9702L19978K01251J36152J70663O0630
9158A1113493J14360J31232J11878N3947K56021K41419J72821K39142K60126K87873
9148A2982312K90569M03018K43271M25913L96849M08965L91296K89642N39847
9139A6371682M75351L90317L74238K16836L99604L91560N39229M60440M21205
9130B0040462N83741M40685M29756O30114N19280M35173P35674Q27414N75613
9121B5217912Q12265R90694Q41730J179032J211376J323354J353300J330280J636089
9112C5896032J953094K068422K015411K100298K522100L042366L630160M451086
9104E7678969N197072N248238N399344O398897P135677Q173364R525206J2073567
$$ plain form
9096 116830334 131306472 149746160 171448923 195938808 222909385 248567733 277793516
9089 277793516 312245823 356294151 397052001 437271226 464376707 472409764 456626419
9082 456626419 422273149 389945896 369394700 352495554 322756504 284732416 247060172
9075 247060172 212404449 184444127 161019979 137900648 118973666 102216610 86441933
9068 86441933 72819554 62381942 54960633 49209358 44666551 41154574 38184902 35773189
9060 35773189 34081906 32345708 31100434 30113070 28942248 28148756 27454160 26655698 25659877
9051 25659877 24509717 23448543 22528617 21753440 21237508 20725661 20095667 19812412 19261463
9042 19261463 19006407 18539611 18423342 18078775 17962277 17685540 17517688 17381107 17334795 17183240
$$ packed form
9096A16830334J4476138J8439688K1702763K4489885K6970577K5658348K9225783
9089B77793516L4452307M4048328M0757850M0219225K7105481Q033057j5783345
9082D56626419l4353270l2327253k0551196j6899146k9739050l8024088l7672244
9075B47060172l4655723k7960322k3424148k3119331j8926982j6757056j5774677
9068H6441933j3622379j0437612p421309n751275m542807l511977k969672k411713
9060C5773189j691283j736198j245274r87364j170822p93492o94596p98462r95821
9051B5659877j150160j061174r19926p75177n15932n11847o29994k83255n50949
9042A9261463k55056m66796j16269l44567j16498k76737j67852j36581m6312j51555
$$ plain form
9032 17183240 17112025 16994569 17072945 17019134 17014041 17015009 17067327 17257192 17399786 17499702 17922728
9021 17922728 18212669 18372231 18736410 19065945 19262868 19610269 19568214 19540205 19568426 19465484
9011 19465484 19223233 19102455 18906431 18690396 18529440 18232490 18114783 17984199 17992400 17667915
9001 17667915 17837636 17706787 17778105 17803368 18067893 18240975 18578022 18814652 19094090 19726776
8991 19726776 20119595 20685905 21110672 21588695 22188337 22853566 23292380 23787844 24041476
8982 24041476 24106748 24204136 24224792 24139584 23935676 23753610 23577993 23259517 23054159 22906467
8972 22906467 22735286 22754710 22668859 22768208 22759636 22904353 23025858 22996750 22809170 22801270 22545080
8961 22545080 22082193 21676777 21146707 20604142 19762834 18782100 18040581 17052542 16249636
$$ packed form
9032A7183240p1215j17456P8376n3811n093R68N2318J89865J42594R9916M23026
9021A7922728K89941J59562L64179L29535J96923L47401m2055k8009K8221j02942
9011A9465484k42251j20778j96024k16035j60956k96950j17707j30584Q201l24485
9001A7667915J69721j30849P1318K5263K64525J73082L37047K36630K79438O32686
8991A9726776L92819N66310M24767M78023N99642O65229M38814M95464K53632
8982B4041476O5272R7388K0656q5208k03908j82066j75617l18476k05358j47692
8972B2906467j71181J9424q5851R9349q572J44717J21505k9108j87580p900k56190
8961B2545080m62887m05416n30070n42565q41308r80734p41519r88039q02906
$$ plain form
8952 16249636 15127911 14269263 13281306 12446377 11699596 10741342 10045574 9532373 8858984
8943 8858984 8478876 8042905 7530842 7109656 6921161 6639885 6410725 6154550 5936051 5675431
8933 5675431 5548456 5467446 5290228 5215709 5093274 4919090 4734542 4782165 4499923 4544739
8923 4544739 4313666 4251468 4152212 3893555 3971599 4028442 4038411 4041160 3903285 3983231 3844712
8912 3844712 3899695 3910882 3951239 3995330 4094637 4117537 4130408 3921209 4000984 4117721 4082395
8901 4082395 3938045 4000250 3990421 3986738 4108011 3921463 4017467 4013673 3961638 4044915 4043698 4150948
8889 4150948 4053447 4151517 4262732 4290486 4346260 4465192 4583400 4764383 4959741 5212243
8879 5212243 5405717 5715765 6013506 6331490 6686788 6842126 7263403 7591554 7838609 8193500
$$ packed form
8952A6249636j121725q58648r87957q34929p46781r58254o95768n13201o73389
8943H858984l80108m35971n12063m21186j88495k81276k29160k56175k18499k60620
8933E675431j26975q1010j77218p4519j22435j74184j84548M7623k82242M4816
8923D544739k31073o2198r9256k58657P8044N6843R969K749j37875P9946j38519
8912C844712N4983J1187M0357M4091R9307K2900J2871k09199P9775J16737l5326
8901D082395j44350O2205r829l683J21273j86548R6004l794n2035Q3277j217J07250
8889D150948r7501R8070J11215K7754N5774J18932J18208J80983J95358K52502
8879E212243J93474L10048K97741L17984L55298J55338M21277L28151K47055L54891
$$ plain form
8869 8193500 8521498 8699026 8884430 8914969 8830644 8823516 8791938 8620894 8436625 8278270
8859 8278270 7916395 7599256 7419229 7157602 6956378 6741403 6479092 6378682 6184626 6072358
8849 6072358 6036625 5889663 6012333 6117636 6173682 6184638 6303117 6554880 6800725 6979384
8839 6979384 7006908 7131655 7454635 7675821 7840966 7923880 8165462 8131276 8462626 8395194
8829 8395194 8407874 8304632 8352233 8399198 8494930 8374511 8675015 8579345 8749321 8852188
8819 8852188 8960828 8948999 8845889 8876106 8804010 8805616 8604160 8602042 8522425 8201485 7992837
8808 7992837 7670608 7310083 7004593 6902158 6441024 6219437 6063203 5829277 5641024 5653500
8798 5653500 5590283 5544711 5516554 5526712 5650957 5775572 6042983 6358472 6470020 6946156
$$ packed form
8869H193500L27998J77528J85404L0539q4325p128l1578j71044j84269j58355
8859H278270l61875l17139j80027k61627k01224k14975k62311j00410j94056j12268
8849F072358l5733j46962J22670J05303N6046J0956J18479K51763K45845J78659
8839F979384K7524J24747L22980K21186J65145Q2914K41582l4186L31350o7432
8829H395194J2680j03242M7601M6965R5732j20419L00504r5670J69976J02867
8819H852188J08640j1829j03110L0217p2096J606k01456k118p9617l20940k08648
8808G992837l22229l60525l05490j02435m61134k21587j56234k33926j88253J2476
8798E653500o3217m5572k8157J0158J24245J24615K67411L15489J11548M76136
$$ plain form
8788 6946156 7250933 7508265 8606234 8169724 8322937 8631620 8791774 8846009 8885615 8977318
8778 8977318 8758680 8638948 8484006 8124491 7880304 7495911 7172404 6859830 6512565 6223422
8768 6223422 5888705 5635845 5606174 5396371 5271188 5063301 5020198 4827479 4682001 4596332
8758 4596332 4668406 4657404 4887570 4867103 5010918 5109576 5013616 4966138 5048945 5103776 5024377
8747 5024377 4946104 5004944 4776779 4701611 4653532 4586047 4382870 4176074 4217128 4052924 3965790
8736 3965790 3748294 3457346 3538982 3340351 3263745 3278589 3171510 3134185 2864728 2985899
8726 2985899 2857084 2585475 2687889 2606453 2536627 2542849 2338175 2372266 2281825 2279241 2118894
8715 2118894 2098674 2176858 2112022 2130340 1997913 1823991 1860959 1920418 1856499 1872572 1896025
$$ packed form
8788F946156L04777K57332J097969m36510J53213L08683J60154N4235L9606R1703
8778H977318k18638j19732j54942l59515k44187l84393l23507l12574l47265k89143
8768F223422l34717k52860k9671k09803j25183k07887m3103j92719j45478q5669
8758D596332P2074j1002K30166k0467J43815R8658r5960m7478Q2807N4831p9399
8747E024377p8273N8840k28165p5168m8079o7485k03177k06796M1054j64204q7134
8736C965790k17496k90948Q1636j98631p6606J4844j07079l7325k69457J21171
8726B985899j28815k71609J02414q1436o9826O222k04674L4091r0441k584j60347
8715B118894k0220P8184o4836J8318j32427j73922L6968N9459o3919J6073K3453
$$ plain form
8704 1896025 1789527 1847495 1840344 1841068 1971764 1831682 1744943 1767195 1744178 1666835 1626645
8693 1626645 1709730 1557985 1666149 1549905 1620209 1715906 1678123 1626145 1545830 1685403 1857471
8682 1857471 1856088 1893052 1737044 1946676 2079166 2205953 2421273 2428059 2664274 2780628
8672 2780628 3168410 3437194 3754020 4032411 4244074 4262475 4299385 4099724 3712067 3659806
8662 3659806 3618937 3416191 3031215 2836782 2437505 2283532 2061197 1954116 1890319 1605143
8652 1605143 1498677 1383948 1206336 1168688 1101599 1143679 1089100 998540 885257 954240 893215
8641 893215 966530 1021197 1044987 1055540 1221425 979771 1075979 1245260 1051088 1193287 965055
8630 965055 1039417 1071869 940875 881427 786180 914345 636763 719909 501960 433812 603394
$$ packed form
8704A896025j06498N7968p151P24J30696j40082q6739K2252k3017p7343m0190
8693A626645Q3085j51745J08164j16244P0304R5697l7783n1978q0315J39573J72068
8682A857471j383L6964j56008K09632J32490J26787K15320O786K36215J16354
8672B780628L87782K68784L16826K78391K11663J8401L6910j99661l87657n2261
8662C659806m0869k02746l84976j94433l99277j53973k22335j07081o3797k85176
8652A605143j06466j14729j77612l7648o7089M2080n4579r0560j13283O8983o1025
8641H93215P3315N4667K3790J0553J65885k41654R6208J69281j94172J42199k28232
8630I65055P4362L2452j30994n9448r5247J28165k77582Q3146k17949o8148J69582
$$ plain form
8619 603394 506173 535897 462585 423365 256586 373986 361194 254923 148634 279149 208427
8608 208427 187936 105860 360472 199127 227730 313442 243439 255582 160052 268054 282953
8597 282953 189162 236274 218748 127125 67237 88608 312228 39480 325322 172588 160986
8586 160986 275401 264757 129295 291757 144910 221133 302718 99136 112961 227587
8576 227587 176192 168157 211884 -24578 45215 54629 208714 173768 174794 67900 -13393 106690
8564 106690 98528 -13818 184738 -76432 111992 90682 119093 33507 61085 -102058 16041
8553 16041 62732 -94229 73979 -12598 -57468 69544 -35984 -44510 -98520 -177288 -47517
8542 -47517 -75082 -81935 -286878 -398580 -2700587 -141809 228881 16942 47832 170657
$$ packed form
8619F03394r7221K9724p3312l9220j66779J17400j2792j06271j06289J30515p0722
8608B08427k0491q2076K54612j61345K8603Q5712p0003J2143r5530J08002J4899
8597B82953r3791M7112j7526r1623n9888K1371K23620k72748K85842j52734j1602
8586A60986J14415j0644j35462J62462j46847P6223Q1585k03582J3825J14626
8576B27587n1395q035M3727k36462O9793R414J54085l4946J026j06894q1293J20083
8564A06690q162j12346J98556k61170J88424k1310K8411q5586K7578j63143J18099
8553A6041M6691j56961J68208q6577m4870J27012j05528q526n4010p8768J29771
8542d7517k7565o853k04943j11702k302007K558778L70690k11939L0890J22825
$$ plain form
8532 170657 18680 92705 -24714 -19652 110558 -19235 166092 -68490 -1181 -59550 -29990
8521 -29990 -81545 36148 -24011 35310 16739 3660 -125766 3303 -92670 -50440 -14664
8510 -14664 38076 46702 6062 4629 88973 308504 -178274 -57166 71786 -33901 -113061
8499 -113061 55266 151254 4401 -70130 74914 33263 -44591 -96024 -39905 72951 -123713
8488 -123713 46515 -49966 -99092 88878 -67935 10831 13759 -56769 -43018 -12846 8458
8477 8458 43498 -62514 -104706 -124425 10941 -72876 71808 -21457 71799 -136044 -178330
8466 -178330 22602 -148346 -144031 -27188 -50519 -93201 -129176 -168874 -290934 -112832 -189735
8455 -189735 -273400 -77758 -226457 -85024 -239485 -249909 -247522 -43821 -142085 -155175 3840
$$ packed form
8532A70657j51977P4025j17419N062J30210j29793J85327k34582O7309n8369K9560
8521b9990n1555J17693o0159N9321j8571j3079j29426J29069r5973M2230L5776
8510a4664N2740Q626m0640j433Q4344K19531m86778J21108J28952j05687p9160
8499a13061J68327R5988j46853p4531J45044m1651p7854n1433N6119J12856j96664
8488a23713J70228r6481m9126J87970j56813P8766K928p0528J3751L0172K1304
8477H458L5040j06012m2192j9719J35366q3817J44684r3265R3256k07843m2286
8466a78330K00932j70948M315J16843k3331m2682l5975l9698j22060J78102p6903
8455a89735q3665J95642j48699J41433j54461j0424K387K03701r8264j3090J59015
$$ plain form
8444 3840 -218665 -118540 -81290 -274575 -59920 -189966 -169333 -227230 -214450 -94931 -220523
8433 -220523 -130314 -155882 -175816 2466 -79028 -49785 -96131 -107991 -129806 82911 56270
8422 56270 -81632 -51650 -70822 -155795 -180543 -1793 -30020 -12366 32915 109499 8781
8411 8781 -26293 -108798 -139166 30954 -106129 -79046 48345 -12516 -87868 143947 -66215
8400 -66215 -17312 -212814 -30012 -168684 -14710 72018 1494 -170218 39655 83914 -1042773
8389 -1042773 -170799 -157994 -135109 -79978 68389 -25388 -191354 -167946 5612 -95215
8379 -95215 -112025 44281 136266 36154 -186036 -146366 -162244 -70786 -73138 -105158 -134816
8368 -134816 -136289 -164296 -118857 28002 99840 -9498 -105733 -43577 -30744 -97977 -117402
$$ packed form
8444C840k22505J00125L7250j93285K14655j30046K0633n7897J2780J19519j25592
8433b20523R0209k5568j9934J78282q1494K9243m6346j1860k1815K12717k6641
8422E6270j37902K9982j9172q4973k4748J78750k8227J7654M5281P6584j00718
8411H781l5074q2505l0368J70120j37083K7083J27391o0861p5352K31815k10162
8400f6215M8903j95502J82802j38672J53974Q6728p0524j71712K09873M4259j126687
8389a042773Q71974J2805K2885N5131J48367r3777j65966K3408J73558j00827
8379i5215j6810J56306R1985j00112k22190L9670j5878R1458k352l2020k9658
8368a34816j473k8007M5439J46859P1838j09338r6235O2156J2833o7233j9425
$$ plain form
8357 -117402 -98331 -33048 -7932 -110779 67070 259106 88472 81449 110213 295992 392767
8346 392767 445417 275113 281351 507804 353468 376308 427536 383719 583101 308495 540230
8335 540230 342341 208304 296302 248753 268591 205846 223581 -19785 69025 -69535 -37007
8324 -37007 -190661 27925 10290 142152 -97336 88317 -166737 -256085 -43668 -26411
8314 -26411 -157592 -227093 -150432 -269509 -65990 -91659 202254 -71086 -152780 -44740 -170506
8303 -170506 -364984 -261514 49326 -173294 -221359 -252139 -277454 -132937 -180689 -229113 -44155
8292 -44155 -84829 -79953 -47920 -63586 -193821 -140738 -314754 -28531 8604 -157771 -101248
8281 -101248 -212789 -117436 -82721 -291528 -196433 -149778 -130658 -227262 -301193 -90308 -60728
$$ packed form
8357a17402J9071O5283K5116j02847J77849J92036j70634p023K8764J85779R6775
8346C92767N2650j70304O238K26453j54336K2840N1228m3817J99382k74606K31735
8335E40230j97889j34037Q7998m7549J9838o2745J7735k43366Q8810j38560L2528
8324c7007j53654K18586j7635J31862k39488J85653k55054q9348K12417J7257
8314b6411j31181o9501P6661j19077K03519k5669K93913k73340q1694J08040j25766
8303a70506j94478J03470L10840k22620m8065l0780k5315J44517m7752m8424J84958
8292d4155m0674M876L2033j5666j30235N3083j74016K86223L7135j66375N6523
8281a01248j11541R5353L4715k08807R5095M6655J9120r6604p3931K10885K9580
$$ plain form
8270 -60728 -96659 -226648 -298939 -280989 -162865 -88854 -183337 -324991 -132806 -326087 -55522
8259 -55522 -214044 -23792 -109832 -222204 -294267 -304484 -441796 -142862 -204878 -57745 -191701
8248 -191701 -445811 -64239 -253107 -156125 -134181 -124618 -161294 -310852 -341826 -235309 34257
8237 34257 -282336 11971 33651 -49840 -370181 92455 -291840 -337586 -192271 -199623 86442
8226 86442 -165561 -29785 -31686 -203233 -263209 62882 -464342 -627897 98612 -67598
8216 -67598 -376039 -80035 -281634 -167352 -209890 -409820 -218716 171297 49312 -429484
8206 -429484 -258900 -41456 -239884 684645 373020 295939 -478629 -333533 281964 294412
8196 294412 -254302 372299 1088151 388761 -1168733 -28623 -1254770 -674479 -898523
$$ packed form
8270f0728l5931j29989p2291J7950J18124P4011r4483j41654J92185j93281K70565
8259e5522j58522J90252q6040j12372p2063j0217j37312K98934o2016J47133j33956
8248a91701k54110L81572j88868R6982K1944R563l6676j49558l0974J06517K69566
8237C4257l16593K94307K1680q3491l20341M62636l84295m5746J45315p352K86065
8226H6442k52003J35776j901j71547n9976L26091n27224j63555P26509j66210
8216f7598l08441K96004k01599J14282m2538j99930J91104L90013j21985m78796
8206d29484J70584K17444j98428R24529l11625p7081p74568J45096O15497J2448
8196B94412n48714O26601P15852o99390j557494J140110j226147N80291k24044
$$ plain form
8187 -898523 -357412 -363384 -902677 -76903 -727800 -166468 -578862 -179359 -28733 -227084
8177 -227084 -291524 -186814 -133547 -321783 -269111 -518916 -68118 -561635 -683075 -137480
8167 -137480 -299440 -297279 -583834 -634566 -148116 -435337 -227627 -38447 -156060 -228206
8157 -228206 -227163 -379874 -79941 -329303 -226944 -187610 -236170 -256000 -430394 -438475 -253737
8146 -253737 -310616 -349358 -314605 -60892 56640 -8115 -17918 -121828 -310535 -181126 -252662
8135 -252662 -266644 -136557 -193578 -181874 -35259 -177180 30766 -75146 -261294 -120122
8125 -120122 -330424 -2137 -88114 -181831 -158305 -358281 -217133 -242628 -197380 -180442 -168572
8114 -168572 -119779 -172118 -317461 -155272 -318306 -178464 -87139 -127600 -186424 -318802 -272172
$$ packed form
8187h98523N41111n972n39293Q25774o50897N61332m12394L99503J50626j98351
8177b27084o4440J04710N3267j88236N2672k49805M50798m93517j21440N45595
8167a37480j61960K161k86555n0732M86450k87221K07710J89180j17613p2146
8157b28206J043j52711K99933k49362J02359L9334m8560j9830j74394q081J84738
8146b53737n6879l8742L4753K53713J17532o4755r803j03910j88707J29409p1536
8135b52662j3982J30087n7021J1704J46615j41921K07946j05912j86148J41172
8125a20122k10302L28287q5977r3717K3526j99976J41148k5495M5248J6938J1870
8114a68572M8793n2339j45343J62189j63034J39842R1325m0461n8824j32378M6630
$$ plain form
8103 -272172 -356226 -396860 -47382 -334634 -220589 -8343 -266461 -324672 -311958 -185757
8093 -185757 -232608 -315503 -280715 -93521 -133189 -283509 -142026 -181122 -388201 -209574 -266733
8082 -266733 -204837 -145205 -279586 -124045 -109727 -324779 -173937 -220914 41644 -306062
8072 -306062 -58451 68403 -223325 -193983 -276847 -379019 -283349 -51860 -146891 -239464 -153139
8061 -153139 -157716 -242931 -304126 -220648 -227960 -134653 -344032 -215454 -211766 -277882 -216947 -266458
8049 -266458 -27764 -163341 -200751 -257270 -283441 5986 -36157 -219392 -155000 -225885 -324662
8038 -324662 -218625 -152368 -293202 -133397 -46668 -94476 -172839 -267046 -67895 -160186 -13243
8027 -13243 -209230 -106079 -236948 -172901 -141929 -50399 -195090 -32853 -400761 -157990
$$ packed form
8103b72172q4054m0634L49478k87252J14045K12246k58118n8211J2714J26201
8093a85757m6851q2895L4788J87194l9668j50320J41483l9096k07079J78627n7159
8082b66733O1896N9632j34381J55541J4318k15052J50842m6977K62558l47706
8072c06062K47611J26854k91728K9342q2864j02172R5670K31489r5031r2573Q6325
8061a53139m577q5215o1195Q3478p312R3307k09379J28578L688o6116O0935m9511
8049b66458K38694j35577l7410n6519k6171K89427m2143j83235O4392p0885r8777
8038c24662J06037O6257j40834J59805Q6729m7808p8363r4207J99151r2291J46943
8027a3243j95987J03151j30869O4047L0972R1530j44691J62237l67908K42771
$$ plain form
8017 -157990 -187403 -235111 -269622 -99579 -239398 -179590 -187971 -78173 -204546 -197534 -121160
8006 -121160 -35661 -75490 -59011 4433 -20539 -156834 -144519 -165036 -354635 -123179 -232667
7995 -232667 -77926 -507406 -150227 -110801 -82524 -16128 -117673 -158589 87669 -96474
7985 -96474 -165960 -10741 -110708 382 52620 -43107 -70043 -17385 -4362 -191868 -59080
7974 -59080 -36473 -51476 -149790 -79964 -42188 15943 -196095 -203407 -127134 -14385 -76248 -8076
7962 -8076 -59318 -54110 -919 128629 46270 -95375 47612 193186 80711 51244 113674
7951 113674 59250 75264 273388 92806 220846 154098 109428 107574 247452 231300 295403
7940 295403 132325 252521 144661 268717 262148 341114 257221 359167 240521 104835
$$ packed form
8017a57990k9413m7708l4511J70043j39819N9808q381J09798j26373P012P6374
8006a21160Q5499l9829J6479O3444k4972j36295J2315k0517j89599K31456j09488
7995b32667J54741m29480L57179L9426K8277O6396j01545m0916K46258j84143
7985i6474o9486J55219r9967J11090N2238r5727k6936N2658J3023j87506J32788
7974e9080K2607j5003r8314O9826L7776N8131k12038p312P6273J12749o1863O8172
7962h076n1242N208N3191J29548q2359j41645J42987J45574j12475k9467O2430
7951A13674n4424J6014J98124j80582J28040o6748m4670j854J39878j6152O4103
7940B95403j63078J20196j07860J24056o569P8966q3893J01946j18646j35686
$$ plain form
7930 104835 308061 228936 363858 118702 276179 267578 216379 141481 232317 106463 88436
7919 88436 201839 27067 84720 -54408 32112 -30383 180974 -64898 -12903 -6813 44847
7908 44847 38324 -4776 15490 108721 89706 7480 -54781 -141055 -55525 23293 -102471 -35938
7896 -35938 -111036 49994 74057 69407 100698 -28213 136859 7084 130444 176078 74489
7885 74489 -4595 169843 74611 3645 114201 159928 80329 272765 137492 274272 270229
7874 270229 245159 346630 366343 331421 111974 335869 351175 473937 401317 412439 408426
7863 408426 206442 531575 330970 264801 256635 312221 300336 181972 277096 298264 213455
7852 213455 347460 286275 420666 578246 554153 1306253 -609553 444531 -489177 -429837
$$ packed form
7930A04835K03226p9125J34922k45156J57477q601n1199p4898R0836j25854j8027
7919H8436J13403j74772N7653j39128Q6520o2495K11357k45872N1995O090N1660
7908D4847o523m3100K0266R3231j9015q2226o2261q6274Q5530P8818j25764O6533
7896c5938p5098J61030K4063m650L1291j28911J65072j29775J23360M5634j01589
7885G4489p9084J74438r5232p0966J10556M5727p9599J92436j35273J36780m043
7874B70229k5070J01471J9713l4922k19447K23895J5306J22762p2620J1122m013
7863D08426k01984L25133k00605o6169q166N5586j1885j18364R5124K1168q4809
7852B13455J34005o1185J34391J57580k4093P52100j915806J054084r33708N9340
$$ plain form
7842 -429837 -272458 -334306 -310415 -259663 -196553 -88203 -133257 -213502 -186471 -171309 -75983
7831 -75983 -258174 -176574 -40994 -262715 -197552 -139687 -121802 -244879 -208600 -103402 -100535
7820 -100535 -319337 -118657 -65958 -215845 -145792 -204440 -130783 -99011 -212742 -215116 -173853
7809 -173853 -166725 -222976 -134932 -192344 -178898 -179902 -39533 -208853 -154307 5717 -32636
7798 -32636 -230991 -212893 -52153 -114189 -68236 -40083 -161855 -276469 38036 -111347 -77355
7787 -77355 -36270 17959 -20849 -28454 20240 2038 -18112 -77119 -57106 12261 -128821 -77510
7775 -77510 -199831 -110016 6688 91930 52893 -92872 -20234 26444 -115452 202511 55549
7764 55549 27554 -53312 118585 21424 119339 -134118 72729 107435 121626 -68253 -79456
$$ packed form
7842d29837J57379o1848K3891N0752O3110J08350m5054q0245K7031J5162R5326
7831g5983j82191Q1600J35580k21721O5163N7865J7885j23077L6279J05198K867
7820a00535k18802K00680N2699j49887P0053n8648P3657L1772j13731k374M1263
7809a73853P128n6251Q8044n7412J3446j004J40369j69320N4546J60024l8353
7798c2636j98355J8098J60740o2036M5953K8153j21772j14614L14505j49383L3992
7787g7355M1085N4229l8808p605M8694j8202k0150n9007K0013O9367j41082N1311
7775g7510j22321Q9815J16704Q5242l9037j45765P2638M6678j41896L17963j46962
7764E5549k7995q0866J71897r7161R7915k53457K06847L4706J4191j89879j1203
$$ plain form
7753 -79456 138877 14014 -48537 59028 148165 -43694 158279 65893 112465 -5162 62587
7742 62587 313670 146779 201770 182394 263495 192220 449662 445503 299964 186164 539160
7731 539160 465497 521610 646323 568172 587692 616082 667166 635382 598507 672128 585121
7720 585121 453178 517536 479884 528355 486433 362428 522165 293840 402441 268690
7710 268690 165501 288282 205798 375077 296042 254114 338738 208104 111309 117841 197513
7699 197513 129169 159277 206198 309395 222521 102265 152943 -13786 243429 242662 294392
7688 294392 248755 252773 416361 314580 347255 449956 535297 403915 527236 532840 350934
7677 350934 523840 334646 603351 476727 440528 378420 273513 251084 135975 127887 77227
$$ packed form
7753g9456K18333j24863o2551J07565Q9137j91859K01973r2386M6572j17627O7749
7742F2587K51083j66891N4991j9376Q1101p1275K57442m159j45539j13800L52996
7731E39160p3663N6113J24713p8151J9520K8390N1084l1784l6875P3621q7007
7720E85121j31943O4358l7652M8471m1922j24005J59737k28325J08601j33751
7710B68690j03189J22781q2484J69279p9035m1928Q4624j30634r6795O532P9672
7699A97513o8344L0108M6921J03197q6874j20256N0678j66729K57215p67N1730
7688B94392m5637M018J63588j01781L2675J02701Q5341j31382J23321N604j81906
7677C50934J72906j89194K68705j26624l6199o2108j04907k2429j15109q088n0660
$$ plain form
7666 77227 136381 113408 48716 -7403 56881 41455 66617 97784 134287 -255464 -10492
7655 -10492 72344 34528 -13255 -133707 32712 -180556 -22442 -1946 -101621 -248455 -772
7644 -772 6368 -50135 -155177 -100829 -16089 -80017 -123609 -30092 -10373 -55511 68387 -86538
7632 -86538 -144443 -99481 15967 -79967 -196106 -13053 -44806 23751 55418 -73021 -62319
7621 -62319 1352 -31853 -18313 -74809 -84852 -59838 -147140 -7980 12384 -109959 -80139
7610 -80139 19506 -77634 -70941 -6150 137571 62194 129286 -54578 -118699 134913 -6828
7599 -6828 183569 -884036 -152144 -58071 -65153 -80864 -19757 -10616 -117112 -3273 -20321
7588 -20321 -99682 -43498 -23714 -95864 -94049 -4000 23067 -70708 -31511 88639 -77931 10765
$$ packed form
7666G7227N9154k2973o4692n6119O4284j5426K5162L1167L6503l89751K44972
7655a0492Q2836l7816m7783j20452J66419k13268J58114K0496r9675j46834K47683
7644g72P140n6503j05042N4348Q4740o3928m3592R3517J9719m5138J23898j54925
7632h6538n7905M4962J15448r5934j16139J83053l1753O8557L1667j28439J0702
7621f2319O3671l3205J3540n6496j0043K5014q7302J39160K0364j22343K9820
7610h0139R9645r7140O693O4791J43721p5377O7092j83864o4121K53612j41741
7599f828J90397j067605P31892R4073p082j5711O1107R141j06496J13839j7048
7588b0321p9361N6184J9784p2150J815R0049K7067r3775L9197J20150j66570Q8696
$$ plain form
7576 10765 21344 46437 -79311 45307 24229 -168017 -43967 116151 -12397 -2168 100854
7565 100854 -95272 26154 -95493 74876 -3755 24374 -52787 12227 33791 -15550 -39354
7554 -39354 87063 -63807 -3027 134905 -50244 -85647 16622 111664 85847 -64647 11987
7543 11987 121895 74152 -6558 -13012 -157865 202259 132419 26116 114527 138084 40791
7532 40791 54546 142983 160098 215726 100062 348077 371906 304917 300625 235050 349067
7521 349067 335076 374374 264541 264737 304958 482569 327815 461837 324414 399761 413241
7510 413241 370824 458189 381090 528779 400541 443936 409995 445549 351917 264083 398447
7499 398447 457333 307858 342611 396219 407817 368513 417440 336324 383412 355292 351005 454954
$$ packed form
7576A0765J0579K5093j25748J24618k1078j92246J24050J60118j28548J0229J03022
7565A00854j96126J21426j21647J70369p8631K8129p7161O5014K1564m9341k3804
7554c9354J26417j50870O0780J37932j85149l5403J02269R5042k5817j50494P6634
7543A1987J09908m7743q0710o454j44853L60124o9840j06303Q8411K3557r7293
7532D0791J3755Q8437J7115N5628j15664K48015K3829o6989m292o5575J14017
7521C49067j3991L9298j09833J96M0221J77611j54754J34022j37423P5347J3480
7510D13241m2417Q7365p7099J47689j28238M3395l3941L5554r3632q7834J34364
7499C98447N8886j49475L4753N3608J1598l9304M8927q1116M7088k8120m287J03949
$$ plain form
7487 454954 560833 483047 532567 508501 520506 538963 648969 451959 621246 751215 719232
7476 719232 714612 734613 956862 812186 806406 778361 845330 749011 813654 852128 590629
7465 590629 764125 536685 693726 612350 671536 418711 419325 117196 269083 264870 224141
7454 224141 222400 326290 24691 101570 -54320 141756 142367 57900 46299 206847 94752
7443 94752 87861 322653 59966 73307 55100 150164 118319 117512 107004 -38770 130611 -22120
7431 -22120 -43749 25085 19973 -4168 -59280 -194914 90838 -5853 -38001 127273 -58184
7420 -58184 32928 130773 158103 73626 39752 -2182 229910 -106186 -247257 -36587 -8594
7409 -8594 39335 -37302 -102049 557 32428 21679 -7589 177940 -19988 40798 41568 23753
$$ packed form
7487D54954J05879p7786M9520k4066J2005J8457J10006j97010J69287J29969l1983
7476G19232m620K0001K22249j44676n780k8045O6969r6319O4643L8474k61499
7465E90629J73496k27440J57041q1376N9186k52825O14l02129J51887m213m0729
7454B24141j741J03890l01599P6879j55890J96076O11q4467j1601J60548j12095
7443I4752o891K34792k62687J3341j8207R5064l1845q07j0508j45774J69381j52731
7431b2120k1629O8834n112k4141n5112j35634K85752r6691l2148J65274j85457
7420e8184R1112R7845K7330q4477l3874m1934K32092l36096j41071K10670K7993
7409h594M7929p6637o4747J02606L1871j0749k9268J85529j97928O0786P70j7815
$$ plain form
7397 23753 101153 -48312 125303 159420 25256 138318 14746 -12326 35973 -45553 38749
7386 38749 72700 44278 116355 -55068 40779 110501 101445 45159 101910 89085 59919 151586
7374 151586 198785 104908 78606 -4674 203740 -21092 -65093 118341 567 93330 13805
7363 13805 -29364 29147 79206 8439 21411 125252 204039 -29705 74600 141389 -119598
7352 -119598 63006 110477 186568 -122303 109796 80383 90473 144072 173264 64662 -23400
7341 -23400 153053 151712 65533 95004 74220 47860 58610 74632 -84560 226590 128251
7330 128251 118267 130327 18566 20821 100276 153388 76913 -4232 98830 124717 170029 -91764
7318 -91764 50996 72441 101833 132951 239313 98425 233945 142628 -7530 176232 10774
$$ packed form
7397B3753P7400j49465J73615L4117j34164J13062j23572k7072M8299q1526Q4302
7386C8749L3951k8422P2077j71423R5847O9722r056n6286N6751j2825k9166R1667
7374A51586M7199r3877k6302q3280K08414k24832m4001J83434j17774R2763p9525
7363A3805m3169N8511N0059p0767J2972J03841P8787k33744J04305O6789k60987
7352a19598J82604M7471P6091l08871K32099k9413J0090N3599K9192j08602q8062
7341b3400J76453j341q6179K9471k0784k6360J0750J6022j59192L11150r8339
7330A28251r984J2060j11761K255P9455N3112p6475q1145J03062K5887M5312k61793
7318i1764J42760K1445K9392L1118J06362j40888J35520r1317j50158J83762j65458
$$ plain form
7307 10774 -32710 105498 162345 -10614 36407 187009 56842 210462 189932 219332 224402
7296 224402 130515 352745 116588 155047 138774 276806 123627 221213 201633 115762 275603
7285 275603 212243 286249 155508 180661 183103 165005 199639 263427 255488 178371 202530 162290
7273 162290 216122 91957 301158 157684 157350 244487 239858 270442 269203 232595 155106 239723
7261 239723 231136 135009 183365 257834 265625 303927 83223 141025 242532 86917 327009
7250 327009 275008 216673 222960 243468 221427 262176 272642 297869 214300 351008 200545
7239 200545 270354 266975 280358 138074 299944 388240 338640 246354 368467 263284 243720
7228 243720 196113 311347 364825 482948 197031 329973 346629 314714 481676 359255
$$ packed form
7307A0774m3484J38208N6847j72959M7021J50602j30167J53620k0530K9400N070
7296B24402r3887K22230k36157L8459j6273J38032j53179R7586j9580q5871J59841
7285B75603o3360P4006j30741K5153K442j8098L4634O3788p939p7117K4159m0240
7273A62290N3832j24165K09201j43474l34Q7137m629L0584j239l6608p7489Q4617
7261B39723q587r6127M8356P4469P791L8302k20704N7802J01507j55615K40092
7250C27009n2001n8335O287K0508k2041M0749J0466K5227q3569J36708j50463
7239B00545O9809l379J3383j42284J61870Q8296m9600r2286J22113j05183j9564
7228B43720m7607J15234N3478J18123k85917J32942J6656l1915J66962j22421
$$ plain form
7218 359255 331265 409174 448353 377612 335502 472539 392040 349850 395627 383893 341522
7207 341522 435185 451886 217323 325267 -1822 629871 455377 484591 517841 529562 520782
7196 520782 427792 449254 588037 532977 420484 490953 439736 392137 535095 515939 588740
7185 588740 539364 592644 492992 637689 537644 607256 584456 439974 345984 454869 442298
7174 442298 557562 403118 493881 535351 597223 579755 614015 581785 519860 653975 429510
7163 429510 676914 579415 590030 584515 611103 680609 745204 679230 733863 741450 832602 579709
7151 579709 764233 660996 620631 743538 765461 726819 683218 760329 643810 795796 988302
7140 988302 754047 710534 893369 708910 672613 769195 709984 829658 907629 864577 792256
$$ packed form
7218C59255k7990P7909L9179p0741m2110J37037q0499m2190M5777j1734m2371
7207C41522R3663J6701k34563J07944l27089O31693j74494K9214L3250J1721q780
7196E20782r2990K1462J38783n5060j12493P0469n1217m7599J42958j9156P2801
7185E88740m9376N3280r9652J44697j00045O9612k2800j44482r3990J08885j2571
7174D42298J15264j54444R0763M1470O1872j7468L4260l2230o1925J34115k24465
7163D29510K47404r7499J0615n515K6588O9506O4595o5974N4633P587R1152k52893
7151E79709J84524j03237m0365J22907K1923l8642m3601P7111j16519J51986J92506
7140I88302k34255m3513J82835j84459l6297R6582n9211J19674P7971m3052p2321
$$ plain form
7129 792256 894141 748783 870218 770350 904833 865465 786531 954582 1098732 919549
7119 919549 1137719 1114661 1123149 1040773 1171070 1108517 1332737 1065208 1307915 1131625 1175392
7108 1175392 1223352 1300577 1404880 1402825 1335895 1485600 1341433 1361786 1414057 1531177 1468434
7097 1468434 1487724 1531736 1449931 1618731 1677963 1622185 1640182 1582737 1677809 1730345 1719929
7086 1719929 1730075 1893240 1840172 1995435 1905519 1952643 1959042 1863843 1894682 1982831 1935224
7075 1935224 2043188 2120141 2084058 1987277 2088910 2128988 2067065 2180275 2207489 2299518 2256808
7064 2256808 2345538 2259886 2365847 2412741 2232870 2337191 2535804 2371119 2350558 2326943
7054 2326943 2567850 2573313 2576684 2412042 2654240 2628680 2706570 2736403 2688679 2675426 2831981
$$ packed form
7129G92256J01885j45358J21435r9868J34483l9368p8934J68051J44150j79183
7119I19549K18170k3058Q488q2376J30297o2553K24220k67529K42707j76290M3767
7108A175392M7960P7225J04303k055o6930J49705j44167K0353N2271J17120o2743
7097A468434J9290M4012q1805J68800N9232n5778J7997n7445R5072N2536j0416
7086A719929J0146J63165n3068J55263q9916M7124O399r5199L0839Q8149m7607
7075A935224J07964P6953l6083r6781J01633M0078o1923J13210K7214R2029m2710
7064B256808Q8730q5652J05961M6894j79871J04321J98613j64685k0561k3615
7054B326943K40907N463L371j64642K42198k5560P7890K9833m7724j3253J56555
$$ plain form
7043 2831981 2990547 2920135 3005182 2943597 2965670 3102747 3161406 3200194 3265317 3274617 3336403
7032 3336403 3339827 3325223 3274305 3312000 3337433 3276652 3149579 3266305 3119585 3062825 3059460
7021 3059460 2948047 2960363 2920954 2750754 2855321 2796204 2727034 2873961 2905428 2809433 2663473
7010 2663473 2858392 2728904 2717649 2722732 2567940 2726640 2663914 2661086 2633084 2673686 2651918
6999 2651918 2504769 2598578 2616752 2485733 2494119 2633305 2519701 2559127 2504910 2514728 2595408
6988 2595408 2426057 2471867 2414389 2425382 2356567 2360446 2425071 2333280 2495337 2329979 2395735
6977 2395735 2371492 2397209 2229897 2355250 2448158 2327615 2328182 2298948 2305983 2316555 2239071
6966 2239071 2422131 2249830 2351458 2236323 2203785 2235891 2268660 2232680 2180137 2169264 2230467
$$ packed form
7043B831981J58566p0412Q5047o1585K2073J37077N8659L8788O5123R300O1786
7032C336403L424j4604n0918L7695K5433o0781j27073J16726j46720n6760l365
7021C059460j11413J2316l9409j70200J04567n9117o9170J46927L1467r5995j45960
7010B663473J94919j29488j1255N083j54792J58700o2726k828k8002M0602k1768
6999B651918j47149R3809J8174j31019Q386J39186j13604L9426n4217R818Q0680
6988B595408j69351M5810n7478J0993o8815L879O4625r1791J62057j65358O5756
6977B395735k4243K5717j67312J25353R2908j20543N67k9234P035J0572p7484
6966B239071J83060j72301J01628j15135l2538L2106L2769l5980n2543j0873O1203
$$ plain form
6955 2230467 2242058 2262364 2165804 2240210 2324403 2295619 2110506 2191815 2232044 2132844 1990565
6944 1990565 2241617 2246171 2146213 2195624 2251047 2043646 2157298 2167283 2232793 2187959 2157779
6933 2157779 2089067 2262172 2129345 2121927 2084910 2161436 2219566 2124493 2236745 2043689 2180446
6922 2180446 2116005 2204864 2130219 2184879 2349275 2335666 2300321 2239132 2160875 2227154 2210668
6911 2210668 2180480 2287484 2182593 2261269 2207867 2394548 2391935 2496232 2462549 2584802 2479533
6900 2479533 2507824 2607228 2652322 2630779 2629620 2572517 2632972 2639712 2597824 2608178 2605977 2455522
6888 2455522 2630229 2633924 2534603 2528311 2653344 2688518 2804186 2697310 2699065 2700246 2828775
6877 2828775 2654249 2864924 3012614 2975412 2917461 2927105 3134632 3115302 3008919 3145250
$$ packed form
6955B230467J1591K0306r6560P4406Q4193k8784j85113Q1309M0229r9200j42279
6944A990565K51052M554r9958M9411N5423k07401J13652R985O5510m4834l0180
6933B157779o8712J73105j32827p418l7017P6526N8130r5073J12252j93056J36757
6922B180446o4441Q8859p4645N4660J64396j3609l5345o1189p8257O6279j6486
6911B210668l0188J07004j04891P8676n3402J86681k613J04297l3683J22253j05269
6900B479533K8291R9404M5094k1543j159n7103O0455O740m1888J0354k201j50455
6888B455522J74707L695r9321o292J25033L5174J15668j06876J755J181J28529
6877B828775j74526K10675J47690l7202n7951R644K07527j9330j06383J36331
$$ plain form
6867 3145250 3093452 3131947 3068913 3224307 3260651 3340429 3131235 3307661 3209834 3230350 3350407
6856 3350407 3405268 3314327 3336150 3278027 3410110 3373123 3349442 3237159 3212651 3326106 3120961
6845 3120961 3332000 3241822 3204751 3200795 3237974 3184560 3169572 3189206 3282851 3161692 3180997
6834 3180997 3116282 3179622 3147706 3325102 3206232 3259060 3094752 3219102 3169038 3131741 3202661
6823 3202661 3220790 3149817 3053099 3215655 3139211 3176835 3094138 3037302 3205829 3179167 3087112
6812 3087112 3086804 3218877 3132092 3142505 3146237 3343174 3536051 3026654 3163189 3216926 3099790
6801 3099790 3134914 3123331 3200192 3192225 3084838 3131664 3015966 3047971 3071675 3076330 3169603
6790 3169603 2980292 3086807 3040959 2909098 2991424 2938856 2965761 2978408 2966694 2902873 2767977
$$ packed form
6867C145250n1798L8495o3034J55394L6344P9778k09194J76426r7827K0516J20057
6856C350407N4861r0941K1823n8123J32083l6987k3681j12283k4508J13455k05145
6845C120961K11039r0178l7071l956L7179n3414j4988J9634R3645j21159J9305
6834C180997o4715O3340l1916J77396j18870N2828j64308J24350n0064l7297P0920
6823C202661J8129p0973r6718J62556p6444L7624q2697n6836J68527k6662r2055
6812C087112l08J32073q6785J0413L732J96937J92877n09397J36535N3737j17136
6801C099790L5124j1583P6861p967j07387M6826j15698L2005K3704M655R3273
6790C169603j89311J06515m5848j31861Q2326n2568K6905J2647j1714o3821j34896
$$ plain form
6779 2767977 2885737 2893348 2942441 2893625 2850908 2819233 2755274 2817648 2775371 2895260 2807144
6768 2807144 2874905 2868247 2911133 2785321 2751014 2817702 2922067 2852727 2731432 2844165 2790834
6757 2790834 2838226 2815343 2809058 2827351 2806065 2753312 2823639 2842530 3036666 2894415 3016127
6746 3016127 3052749 2975687 2940131 2916319 3107592 2883577 3091476 3060899 3026464 3070674 3014495
6735 3014495 3002687 2931069 3062333 2929144 2971184 3147741 2965939 3089288 3020344 3123952
6725 3123952 3204446 3205752 3125458 3072365 3381598 3184551 3198680 3253414 3256610 3200753 3083961
6714 3083961 3307100 3232114 3293544 3170208 3148612 3212078 3263356 3195506 3307742 3169470 3325552
6703 3325552 3245350 3341431 3331708 3452953 3181832 3319804 3310953 3428316 3393793 3401934 3371452
$$ packed form
6779B767977J17760P611M9093m8816m2717l1675o3959O2374m2277J19889q8116
6768B807144O7761o658M2886j25812l4307O6688J04365o9340j21295J12733n3331
6757B790834M7392k2883o285J8293k1286n2753P0327J8891J94136j42251J21712
6746C016127L6622p7062l5556k3812J91273k24015K07899l0577l4435M4210n6179
6735C014495j1808p1618J31264j33189M2040J76557j81802J23349o8944J03608
6725C123952Q0494J306q0294n3093L09233j97047J4129N4734L196n5857j16792
6714C083961K23139p4986O1430j23336k1596O3466N1278o7850J12236j38272J56082
6703C325552q0202R6081r723J21245k71121J37972q851J17363l4523Q141l0482
$$ plain form
6692 3371452 3349772 3340636 3476422 3439650 3379480 3374366 3445717 3417110 3584008 3505897 3579702
6681 3579702 3553134 3474561 3519995 3424308 3439599 3367075 3473662 3396501 3512115 3437903 3391069
6670 3391069 3310051 3397193 3459563 3297654 3489201 3440024 3547046 3602854 3600869 3609537 3385543
6659 3385543 3498138 3498950 3422439 3441938 3605747 3526042 3572075 3400386 3514598 3488901 3381735
6648 3381735 3467728 3487142 3289551 3439431 3353652 3350803 3472463 3531742 3422932 3342384 3428855
6637 3428855 3320597 3454236 3475754 3479081 3343222 3526989 3458921 3563838 3549091 3595874 3540052
6626 3540052 3453607 3550343 3576395 3481803 3466802 3502959 3607092 3548999 3515710 3496379 3590758
6615 3590758 3619246 3476051 3527694 3514534 3626994 3591871 3601499 3566536 3716660 3660544 3697964
$$ packed form
6692C371452k1680r136J35786l6772o0170n114P1351k8607J66898p8111P3805
6681C579702k6568p8573M5434r5687J5291p2524J06587p7161J15614p4212m6834
6670C391069q1018Q7142O2370j61909J91547m9177J07022N5808j985Q668k23994
6659C385543J12595Q12p6511J9499J63809p9705M6033j71689J14212k5697j07166
6648C381735Q5993J9414j97591J49880q5779k849J21660N9279j08810q0548Q6471
6637C428855j08258J33639K1518L327j35859J83767o8068J04917j4747M6783n5822
6626C540052q6445R6736K6052r4592j5001L6157J04133n8093l3289j9331R4379
6615C590758K8488j43195N1643j3160J12460l5123R628l4963J50124n6116L7420
$$ plain form
6604 3697964 3717033 3699852 3753006 3762159 3789989 3845641 3809001 3890858 3847240 3850685 4041342 3869504
6592 3869504 3910505 4079285 4045111 4124473 4170269 4089248 4168680 4212541 4299008 4254237 4363704
6581 4363704 4525166 4529991 4661347 4677422 4854174 4948565 4899147 4972762 5134506 5241266 5150265
6570 5150265 5344213 5409354 5261199 5311711 5454629 5331831 5315736 5455870 5454485 5386710 5369719
6559 5369719 5492476 5490077 5527408 5404169 5554743 5650890 5531011 5648161 5562255 5601920 5559886
6548 5559886 5500261 5609236 5607626 5511203 5542190 5604512 5610025 5567847 5563559 5698031 5579589
6537 5579589 5515998 5605043 5672523 5743254 5763812 5786999 5876805 5807598 5921487 5985634 6029330
6526 6029330 5989511 5977824 6278043 6231873 6461973 6265858 6467347 6417737 6643833 6436071
$$ packed form
6604C697964J9069j7181N3154R153K7830N5652l6640Q1857m3618L445J90657j71838
6592C869504M1001J68780l4174P9362M5796q1021P9432M3861Q6467m4771J09467
6581D363704J61462M825J31356J6075J76752R4391m9418P3615J61744J06760r1001
6570E150265J93948O5141j48155N0512J42918j22798j6095J40134j385o7775j6991
6559E369719J22757k399L7331j23239J50574R6147j19879J17150q5906L9665m2034
6548E559886n9625J08975j610r6423L0987O2322N513m2178m288J34472j18442
6537E579589o3591Q9045O7480P0731K0558K3187Q9806o9207J13889O4147M3696
6526F029330l9819j1687L00219m6170K30100j96115K01489m9610K26096k07762
$$ plain form
6516 6436071 6547703 6617965 6839667 6837944 6955743 6888108 7087085 7128216 7137011 7254164 7278953
6505 7278953 7417925 7471226 7495472 7449686 7466898 7413208 7542886 7671778 7662183 7633433 7694288
6494 7694288 7767433 7691349 7840463 7725461 7901204 7984562 7949124 7955988 8104402 8174801 8239787
6483 8239787 8323333 8359351 8540469 8703446 8890461 9103466 9342801 9620212 9796768 10135669
6473 10135669 10478804 10953211 11318620 11572248 11996869 12319886 12689509 12899059 13158143
6464 13158143 13241081 13493992 13699831 13698162 13710189 13775443 13801735 13677134 13732669 13709343 13845940
6453 13845940 14054975 14120897 14068981 14493887 14711044 15112531 15358052 15735059 16051621 16299848
6443 16299848 16625578 17005093 16997521 17190976 16951227 16800974 16536857 16346745 15902805 15575895
$$ packed form
6516F436071J11632P0262K21702j723J17799o7635J98977M1131Q795J17153K4789
6505G278953J38972N3301K4246m5786J7212n3690J29678J28892r595k8750O0855
6494G694288P3145p6084J49114j15002J75743Q3358l5438O864J48414P0399O4986
6483H239787Q3546L6018J81118J62977J87015K13005K39335K77411J76556L38901
6473A0135669L43135M74407L65409K53628M24621L23017L69623K09550K59084
6464A3158143Q2938K52911K05839j669J2027O5254K6292j24601N5535k3326J36597
6453A3845940K09035O5922n1916M24906K17157M01487K45521L77007L16562K48227
6443A6299848L25730L79515p572J93455k39749j50253k64117j90112m43940l26910
$$ plain form
6433 15575895 14996570 14557431 14074141 13616603 13276295 12720219 12427340 12108198 11900549
6424 11900549 11545151 11252503 11120525 11020490 10959072 10828916 10854986 10769150 10600116 10711693
6414 10711693 10675877 10752801 10793588 10331941 10879262 10795052 10927542 10864941 10895982 10894106 10981378
6403 10981378 10982453 10966849 11320697 11416432 11432077 11572188 11684998 11784822 11828819 12116123 12230886
6392 12230886 12323075 12410056 12636106 12607438 12558333 12949129 12963811 12976818 13141792 13257918
6382 13257918 13333290 13507746 13410221 13493576 13569601 13706290 13631232 13593777 13567456 13523159 13643880
6371 13643880 13402207 13425183 13449485 13316396 13102297 13216761 13183110 12897629 12953921 12725995
6361 12725995 12709170 12587691 12518806 12352161 12295643 12125661 12034847 12001854 11648072 11593077
$$ packed form
6433A5575895n79325m39139m83290m57538l40308n56076k92879l19142k07649
6424A1900549l55398k92648j31978j00035o1418j30156K6070q5836j69034J11577
6414A0711693l5816P6924M0787m61647N47321q4210J32490o2601L1041j876Q7272
6403A0981378J075j5604L53848R5735J5645J40111J12810R9824M3997K87304J14763
6392A2230886R2189Q6981K26050k8668m9105L90796J4682J3007J64974J16126
6382A3257918P5372J74456r7525Q3355P6025J36689p5058l7455k6321m4297J20721
6371A3643880k41673K2976K4302j33089k14099J14464l3651k85481N6292k27926
6361A2725995j6825j21479o8885j66645n6518j69982r0814l2993l53782n4995
$$ plain form
6351 11593077 11441046 11441908 11261046 11092068 11029763 10851200 10757062 10560746 10507589 10305203
6341 10305203 10110756 10162307 9940348 9995251 9763136 9590586 9609370 9395986 9299023 9128299
6331 9128299 9073528 8723681 8954639 8786501 8697480 8560773 8637693 8604098 8459789 8482341
6321 8482341 8392431 8487762 8227807 8201310 8202333 8082120 8114509 8208040 8071348 7837879 7951690
6310 7951690 7989754 7789666 7808046 7675891 7633777 7530327 7419122 7427922 7335914 7247479 7028296
6299 7028296 7048000 6932722 6786272 6776100 6711059 6532180 6667745 6529881 6423001 6478502
6289 6478502 6418468 6320825 6363207 6257530 6195387 6322618 6193547 6231885 6141497 6096967 6142890
6278 6142890 6017306 6134006 6155967 6248389 5995615 6199244 6114822 6113020 6177061 6160052 6061796
$$ packed form
6351A1593077j52031Q62j80862j68978o2305j78563r4138j96316n3157k02386
6341A0305203j94447N1551k21959N4903k32115j72550J8784k13384r6963j70724
6331I128299n4771l49847K30958j68138q9021j36707P6920l3595j44309K2552
6321H482341q9910R5331k59955k6497J023j20213L2389R3531j36692k33469J13811
6310G951690L8064k00088J8380j32155m2114j03450j11205Q800r2008q8435k19183
6299G028296J9704j15278j46450j0172o5041j78879J35565j37864j06880N5501
6289F478502o0034r7643M2382j05677o2143J27231j29071L8338r0388m4530M5923
6278F142890j25584J16700K1961R2422k52774K03629q4422j802O4041j7009r8256
$$ plain form
6267 6061796 6116605 6106036 6081943 6217653 6028782 6102160 6249680 6252145 6301442 6228821 6343616
6256 6343616 6247298 6374799 6527622 6688083 6557754 6634533 6689596 6687384 6774644 6915536 6902030
6245 6902030 6941047 7077616 7062462 7130948 7049258 7215683 7359706 7264422 7223284 7400029 7336372
6234 7336372 7337604 7371198 7443989 7506615 7303224 7374635 7447508 7377889 7323763 7490690 7388319
6223 7388319 7422042 7620573 7622428 7541609 7574883 7714673 7526572 7618797 7649478 7714898 7641985
6212 7641985 7817553 7735089 7803151 7825868 7810681 7825593 7967369 8087430 8050664 8103458 8216231
6201 8216231 8180344 8208334 8166959 8247605 8466704 8471538 8553527 8477834 8587428 8752406 8880272
6190 8880272 8948284 9060828 9061905 9078488 9200382 9266180 9324222 9387152 9576031 9625672 9712972
$$ packed form
6267F061796N4809j0569k4093J35710j88871P3378J47520K465M9297p2621J14795
6256F343616r6318J27501J52823J60461j30329P6779N5063k212Q7260J40892j3506
6245F902030L9017J36569j5154O8486q1690J66425J44023r5284m1138J76745o3657
6234G336372J232L3594P2791O2626k03391P1411P2873o9619n4126J66927j02371
6223G388319L3723J98531J855q0819L3274J39790j88101R2225L0681O5420p2913
6212G641985J75568q2464O8062K2717j5187J4912J41776J20061l6766N2794J12773
6201H216231l5887K7990m1375Q0646K19099M834Q1989p5693J09594J64978J27866
6190H880272O8012J12544J077J6583J21894O5798N8042O2930J88879M9641Q7300
$$ plain form
6179 9712972 9729407 9642879 9897552 9837329 9810610 9882853 10011491 10061600 9997262 10313521 10282714
6168 10282714 10378531 10566060 10693038 10951913 11022982 11285652 11667953 11976247 12364191 12718458
6158 12718458 13187132 13619767 14132650 14862018 15517191 16192066 16820669 17723524 18455461
6149 18455461 19283426 19966623 20793711 21470485 22119965 22836604 23165891 23699967 23951364
6140 23951364 24176592 24408209 24560820 24406373 24224744 24232186 23819660 23467790 22916347 22390446
6130 22390446 21917042 21220802 20651071 19926139 19057011 18427723 17586207 16849506 16083003
6121 16083003 15365697 14789213 14009310 13621208 13040993 12341461 11982953 11715527 11203771
6112 11203771 10816214 10411712 10331485 9932474 9813406 9578922 9349160 9215918 9222766 9062416
$$ packed form
6179I712972J6435q6528K54673o0223k6719P2243J28638N0109o4338L16259l0807
6168A0282714R5817J87529J26978K58875P1069K62670L82301L08294L87944L54267
6158A2718458M68674M32635N12883P29368O55173O74875O28603R02855P31937
6149A8455461Q27965O83197Q27088O76774O49480P16639L29287N34076K51397
6140B3951364K25228K31617J52611j54447j81629P442m12526l51870n51443n25901
6130B2390446m73404o96240n69731p24932q69128o29288q41516p36701p66503
6121A6083003p17306n76484p79903l88102n80215o99532l58508k67426n11756
6112A1203771l87557m04502q0227l99011j19068k34484k29762j33242O848j60350
$$ plain form
6102 9062416 8776198 8697067 8681139 8361977 8319099 8258854 8099454 8121825 8097358 7920325 7895288
6091 7895288 7985231 7820152 7916494 7850181 7811826 7918303 7880496 7717636 7896538 7927243 7851190
6080 7851190 7952972 7844871 7974585 7898873 7988117 7904280 7887704 7844852 7850985 7945051 7836745
6069 7836745 7797139 7844022 7692321 7776800 7693382 7613167 7562678 7641235 7529482 7783348 7539641
6058 7539641 7532392 7464928 7398718 7606372 7406065 7410215 7495298 7328988 7442501 7360807 7239434
6047 7239434 7307006 7268436 7344668 7287656 7359903 7238729 7321916 7147545 7334803 7199355 7275713
$$ packed form
6102I062416k86218p9131j5928l19162m2878o0245j59400K2371k4467j77033k5037
6091G895288Q9943j65079R6342o6313l8355J06477l7807j62860J78902L0705p6053
6080G851190J01782j08101J29714p5712Q9244q3837j6576m2852O133R4066j08306
6069G836745l9606M6883j51701Q4479q3418q0215n0489P8557j11753K53866k43707
6058G539641p249o7464o6210K07654k00307M150Q5083j66310J13513q1694j21373
6047G239434O7572l8570P6232n7012P2247j21174Q3187j74371J87258j35448P6358
$$ [...]
##END NTUPLES=NMR SPECTRUM
##END=
