##TITLE=1H_DE-80H_X3
 200.13MHz, d2o
 8 sc
 
 19ns.26.2.2025
##JCAMPDX= 6.0         $$ Bruker NMR JCAMP-DX V2.0
##DATA TYPE= NMR FID
##DATA CLASS= NTUPLES
##ORIGIN= UXNMR, Bruker Analytische Messtechnik GmbH
##OWNER= pz
$$ XWIN-NMR		Version 3.5
$$ Fri Dec 19 10:40:27 2025 Russian Standard Time (UT+4h)  Yarkov@DPX200
##.OBSERVE FREQUENCY= 200.1313
##.OBSERVE NUCLEUS= ^1H
##.DELAY= (6, 6)
##.ACQUISITION MODE= SIMULTANEOUS
##.ACQUISITION SCHEME= undefined
##.AVERAGES= 8
##.DIGITISER RES= 18
##SPECTROMETER/DATA SYSTEM= spect
##.PULSE SEQUENCE= zg30
##.SOLVENT NAME= DMSO
##.SHIFT REFERENCE= (INTERNAL, DMSO, 0, 14.3821)
##AUDIT TRAIL= $$ (NUMBER, WHEN, WHO, WHERE, WHAT)
$$ ##TITLE= Audit trail, XWIN-NMR		Version 3.5
$$ ##JCAMPDX= 5.01
$$ ##ORIGIN= Bruker BioSpin GmbH
$$ ##OWNER= Yarkov
$$ C:/Bruker/XWIN-NMR/data/yarkov2/nmr/H-C/1/audita.txt
$$ ##AUDIT TRAIL=  $$ (NUMBER, WHEN, WHO, WHERE, WHAT)
(   1,<2025-12-19 10:39:50.93 +0400>,<Yarkov>,<DPX200>,
      <created by zg, POWCHK disabled, PULCHK disabled
       configuration hash MD5:
       00 E9 B6 7A A2 85 ED C7 34 08 36 98 17 FE 4E 26
       data hash MD5: 16K
       81 F1 14 3E 92 E6 6F FD 8B 06 01 A9 E8 E3 F5 93>)
$$ ##END=
$$ 
$$ hash MD5
$$ 49 C5 52 E1 0C 83 76 4C 0C 71 F0 CE FD A8 57 A2
##$RELAX= 
##$RELAX= 
##$RELAX= 
##$RELAX= 
##$RELAX= 
##$RELAX= 
$$ Bruker specific parameters
$$ --------------------------
##$DU= <C:/Bruker/XWIN-NMR>
##$EXPNO= 1
##$NAME= <H-C>
##$PROCNO= 1
##$TYPE= <nmr>
##$USER= <yarkov2>
##$AMP= (0..31)
100 100 100 100 100 100 100 100 100 100 100 100 100 100 100 100 100 100 
100 100 100 100 100 100 100 100 100 100 100 100 100 100 
##$AQSEQ= 0
##$AQ_mod= 1
##$AUNM= <au_zg>
##$AUTOPOS= <>
##$BF1= 200.13
##$BF2= 200.13
##$BF3= 200.13
##$BF4= 200.13
##$BF5= 200.13
##$BF6= 200.13
##$BF7= 200.13
##$BF8= 200.13
##$BYTORDA= 1
##$CFDGTYP= 0
##$CFRGTYP= 5
##$CHEMSTR= <none>
##$CNST= (0..31)
1 1 145 1 1 1 1 1 1 1 1 1 1 1 1 1 1 1 1 1 1 1 1 1 1 1 1 1 1 1 1 1 
##$CPDPRG= <>
##$CPDPRG1= <>
##$CPDPRG2= <>
##$CPDPRG3= <>
##$CPDPRG4= <mlev>
##$CPDPRG5= <mlev>
##$CPDPRG6= <mlev>
##$CPDPRG7= <mlev>
##$CPDPRG8= <mlev>
##$CPDPRGB= <>
##$CPDPRGT= <>
##$D= (0..31)
0 0.7 0 0 0 0 0 0 0 0 0 0.03 0 0 0 0 0 0 0 0 0 0 0 0 0 0 0 0 0 0 0 0 
##$DATE= 1766126390
##$DBL= (0..7)
120 120 120 120 120 120 120 120 
##$DBP= (0..7)
150 150 150 150 150 150 150 150 
##$DBP07= 0
##$DBPNAM0= <>
##$DBPNAM1= <>
##$DBPNAM2= <>
##$DBPNAM3= <>
##$DBPNAM4= <>
##$DBPNAM5= <>
##$DBPNAM6= <>
##$DBPNAM7= <>
##$DBPOAL= (0..7)
0.5 0.5 0.5 0.5 0.5 0.5 0.5 0.5 
##$DBPOFFS= (0..7)
0 0 0 0 0 0 0 0 
##$DE= 6
##$DECBNUC= <off>
##$DECIM= 32
##$DECNUC= <off>
##$DECSTAT= 4
##$DIGMOD= 1
##$DIGTYP= 9
##$DL= (0..7)
0 120 120 120 120 120 120 120 
##$DP= (0..7)
150 150 150 150 150 150 150 150 
##$DP07= 0
##$DPNAME0= <>
##$DPNAME1= <>
##$DPNAME2= <>
##$DPNAME3= <>
##$DPNAME4= <>
##$DPNAME5= <>
##$DPNAME6= <>
##$DPNAME7= <>
##$DPOAL= (0..7)
0.5 0.5 0.5 0.5 0.5 0.5 0.5 0.5 
##$DPOFFS= (0..7)
0 0 0 0 0 0 0 0 
##$DQDMODE= 0
##$DR= 18
##$DS= 0
$$ [...]
##$SUBNAM2= <"">
##$SUBNAM3= <"">
##$SUBNAM4= <"">
##$SUBNAM5= <"">
##$SUBNAM6= <"">
##$SUBNAM7= <"">
##$SUBNAM8= <"">
##$SUBNAM9= <"">
##$SW= 18.0517328524113
##$SWIBOX= (0..15)
0 0 2 0 0 0 0 0 0 0 0 0 0 0 0 0 
##$SW_h= 3612.71676300578
##$TD= 16384
##$TD0= 1
##$TE= 0
##$TE2= 300
##$TE3= 300
##$TEG= 300
##$TL= (0..7)
0 120 120 120 120 120 120 120 
##$TP= (0..7)
150 150 150 150 150 150 150 150 
##$TP07= 0
##$TPNAME0= <>
##$TPNAME1= <>
##$TPNAME2= <>
##$TPNAME3= <>
##$TPNAME4= <>
##$TPNAME5= <>
##$TPNAME6= <>
##$TPNAME7= <>
##$TPOAL= (0..7)
0.5 0.5 0.5 0.5 0.5 0.5 0.5 0.5 
##$TPOFFS= (0..7)
0 0 0 0 0 0 0 0 
##$TUNHIN= 0
##$TUNHOUT= 0
##$TUNXOUT= 0
##$USERA1= <user>
##$USERA2= <user>
##$USERA3= <user>
##$USERA4= <user>
##$USERA5= <user>
##$V9= 5
##$VALIST= <valist>
##$VCLIST= <CCCCCCCCCCCCCCC>
##$VD= 0
##$VDLIST= <DDDDDDDDDDDDDDD>
##$VPLIST= <PPPPPPPPPPPPPPP>
##$VTLIST= <TTTTTTTTTTTTTTT>
##$WBST= 1024
##$WBSW= 4
##$XGAIN= (0..3)
0 0 0 0 
##$XL= 0
##$YL= 0
##$YMAX_a= 136160
##$YMIN_a= -115254
##$ZGOPTNS= <>
##$ZL1= 120
##$ZL2= 120
##$ZL3= 120
##$ZL4= 120
##$ABSF1= 10
##$ABSF2= 0
##$ABSG= 5
##$ABSL= 3
##$ALPHA= 0
##$AQORDER= 0
##$ASSFAC= 0
##$ASSFACI= 0
##$ASSFACX= 0
##$ASSWID= 0
##$AUNMP= <proc_1d>
##$AZFE= 0.1
##$AZFW= 0.1
##$BCFW= 1
##$BC_mod= 2
##$BYTORDP= 1
##$COROFFS= 0
##$CY= 83.5205535888672
##$DATMOD= 1
##$DC= 2
##$DFILT= <>
##$DTYPP= 0
##$F1P= 10.8118882576601
##$F2P= -7.23987719738617
##$FCOR= 0.5
##$FTSIZE= 0
##$FT_mod= 4
##$GAMMA= 1
##$GB= 0.15
##$INTBC= 1
##$INTSCL= 1
##$ISEN= 128
##$LB= 0.25
##$LEV0= 0
##$LPBIN= 0
##$MAXI= 10000
##$MC2= 0
##$MEAN= 0
##$ME_mod= 0
##$MI= 1.114404
##$NCOEF= 0
##$NC_proc= 0
##$NLEV= 6
##$NOISF1= 3.799351
##$NOISF2= 2.8
##$NSP= 1
##$NTH_PI= 0
##$NZP= 0
##$OFFSET= 14.38212
##$PC= 1
##$PHC0= -5306.755
##$PHC1= 10.82193
##$PH_mod= 1
##$PKNL= yes
##$PPARMOD= 0
##$PSCAL= 0
##$PSIGN= 0
##$REVERSE= no
##$SF= 200.129724274929
##$SI= 16384
##$SIGF1= 3
##$SIGF2= 2
##$SINO= 400
##$SIOLD= 16384
##$SREGLST= <1H.CDCl3>
##$SSB= 0
##$STSI= 0
##$STSR= 0
##$SW_p= 3205.1282051282
##$SYMM= 0
##$S_DEV= 0
##$TDeff= 0
##$TDoff= 0
##$TI= <>
##$TILT= no
##$TM1= 0
##$TM2= 0
##$TOPLEV= 0
##$USERP1= <user>
##$USERP2= <user>
##$USERP3= <user>
##$USERP4= <user>
##$USERP5= <user>
##$WDW= 1
##$XDIM= 8192
##$YMAX_p= 0
##$YMIN_p= 0
$$ End of Bruker specific parameters
$$ ---------------------------------
##NTUPLES= NMR FID
##VAR_NAME=  TIME,          FID/REAL,        FID/IMAG
##SYMBOL=    X,             R,               I
##VAR_TYPE=  INDEPENDENT,   DEPENDENT,       DEPENDENT
##VAR_FORM=  AFFN,          ASDF,            ASDF
##VAR_DIM=   8192,          8192,            8192
##UNITS=     SECONDS,       ARBITRARY UNITS, ARBITRARY UNITS
##FACTOR=    0.0002768,     1,               1
##FIRST=     0,             0,               0
##LAST=      2.2672688,     0,               0
##MIN=       0,             -115254,         0
##MAX=       2.2672688,     136160,          0
$$ Real data points
##PAGE= N=1
##DATA TABLE= (X++(R..R)), XYDATA
0 0 0 0 0 0 0 0 0 0 0 0 0 0 0 0 0 0 0 0 0 0 8 -8 8 -8 8 -8 16 -16 16 -21 24 -25 32 -35 40 -45 51 -56 63 -69 77
41 77 -86 99 -108 121 -133 146 -161 177 -197 216 -238 262 -292 321 -353 390 -432 481 -537 602
61 602 -680 772 -887 1031 -1215 1457 -1757 1923 4 136160 99077 -65997 -59245 13100
75 13100 15432 -13575 8846 10458 -25717 -11012 39019 14262 -33135 -19229 25769 19742 -35193
88 -35193 -33861 43319 48545 -25679 -40531 7045 21449 -3337 -11617 5038 2132 -295 22148
101 22148 9412 -32541 -25228 11860 26042 10944 -11965 -7522 4567 -7060 -4196 11679 -2216
114 -2216 -18370 1963 28760 8549 -31013 -11204 21627 -7021 -20383 16958 22916 -4547
126 -4547 -13868 -5915 -673 -2390 5640 13365 -4111 -13549 5385 17670 5789 -23569 -26847 19417
140 19417 34505 -6284 -17668 1445 828 -4587 2833 6956 -5257 -10301 9939 11662 -9532
153 -9532 -6533 2106 -3882 -1007 2637 5001 9200 -5381 -15401 -556 8541 3446 -1937 -1450 1983
168 1983 -1771 1984 8026 -8611 -11602 10641 7641 -5083 1532 2366 -3079 -2883 -912 3151 1803
183 1803 -484 499 -4029 -399 5802 -2378 -2335 436 -6884 3797 13124 -5551 -13339 556 8931
198 8931 3215 -6205 -1746 4638 -2366 -1406 1990 -2266 2917 2368 -5664 1748 3918 -2791 1790 654
214 654 -5361 323 7006 3694 -7644 -7472 8343 5033 -7222 1041 3729 -3181 -522 -1212 -720
229 -720 4343 -1739 -4370 2263 3989 1563 -4497 -4958 2014 730 2449 5022 -6749 -4397 9044
244 9044 428 -7391 183 4194 3136 -1834 -3720 2559 2150 -507 -2208 -5332 4690 9898 -4204
259 -4204 -6568 225 -7 3649 1326 -6038 -183 5029 2404 -2099 -5271 478 2492 -2971 1592
274 1592 2512 -2269 3307 -67 -7421 1094 5297 -328 -2086 -1654 3551 3646 -3516 -2188 -46 -614
290 -614 3328 165 -971 4105 -2731 -5036 3512 1077 -1596 1399 -48 -1 95 353 1528 -5183 -3545
307 -3545 6949 2522 -3092 -181 -907 1259 169 -5274 1404 4950 -1455 -1270 514 1223 993 -3850
323 -3850 -826 3021 -1393 1841 3169 -3638 -1154 874 -854 2056 -491 -1283 3509 -525 -2794
338 -2794 458 434 1029 -2497 -2911 6430 2890 -6013 -930 1068 -885 840 -737 931 1602 -2445
354 -2445 1322 1862 -3155 159 513 -1196 2309 353 -4 1335 -3806 -1217 3880 -20 -400 -1088
370 -1088 -1211 4327 175 -4512 1028 1092 -390 864 -873 1480 728 -4025 599 1932 -2032 992
386 992 429 -409 2068 -1780 -1232 1809 -2261 29 2695 -1426 -284 884 368 1208 -3516 -1879 4796
403 4796 651 -1870 79 -1692 2168 2195 -3681 -9 2118 -1072 433 316 -1 -194 -2808 1771
419 1771 2902 -3133 708 2144 -3478 385 2054 -1192 195 -1140 -404 3029 -214 -1318 -335 -408
435 -408 2712 -1355 -3546 4613 1431 -4820 919 2309 67 396 -2215 -301 1716 -342 1053 -439
451 -439 -2235 1579 368 247 1496 -3914 -582 5281 -2066 -3337 2711 849 -543 -785 -282 1906
467 1906 -667 -969 931 -1693 1488 2199 -3519 929 2492 -3812 747 3730 -2306 -1910 985 1276
483 1276 31 -1656 1663 412 -3598 2957 2544 -3865 155 273 -1823 3377 759 -3957 697 2248
499 2248 -208 -1796 -612 2898 -1224 -2573 3531 -522 -2624 3629 -480 -3560 2195 918 -409
514 -409 976 -1696 -994 1532 1805 257 -3567 287 4057 -2718 -805 3651 -3715 -1818 4424 -212
530 -212 -1792 124 -387 830 254 -291 -315 -1716 1738 799 -2892 3268 1959 -5749 1025 3545 -3213
547 -3213 -255 2952 -778 -1978 -174 2747 492 -2844 978 184 -1153 3208 -1584 -3615 4576
562 4576 496 -4652 2442 2453 -2788 -1184 2136 1655 -2850 -1192 3681 -1494 -2101 3615 -1234 -1808
578 -1808 2778 -2407 -1208 3998 -973 -2821 1515 1719 -1029 -1550 2753 1494 -5495 -78 4859 -2027
594 -2027 -507 2494 -2814 -53 2443 -2079 -509 1884 -302 -1455 14 2215 -1156 -3120 4033
609 4033 1207 -5183 2270 2536 -4079 693 2341 -1215 -33 -442 -1168 974 1844 858 -3343 -1407
625 -1407 4160 -1738 -2466 5237 -930 -4601 3259 1322 -2813 913 1196 -812 -1217 602 1731 -1131
641 -1131 389 1452 -3566 608 4192 -4093 -1588 5279 -1351 -2772 2063 92 -2100 116 2721
656 2721 387 -3534 697 1543 -2656 2321 2407 -4084 709 1878 -3567 1479 3671 -2515 -2685 1251
672 1251 2173 -1008 -1222 3147 -1077 -4137 3217 1291 -3146 2296 65 -2740 2688 996 -2683 351
688 351 1337 -521 -1718 1404 2358 -3857 -1054 5518 -1277 -3295 2608 -1402 -1910 3479 249 -1621
704 -1621 517 -808 -897 780 2644 -21 -4377 1067 2849 -3818 1369 4472 -4186 -2228 3549 51
720 51 -693 336 -670 -475 35 1369 -325 -1867 2169 -211 -3110 3886 1136 -5446 1334 3376
736 3376 -2151 -74 1629 -575 -1594 -88 2734 -151 -2366 1015 -1233 -592 4322 -1497 -3224
751 -3224 3071 -531 -2699 3054 1613 -2458 -1785 1263 2076 -1494 -190 2240 -2656 -789 3295 -1641
767 -1641 -570 2135 -2780 -182 3771 -1177 -2209 609 1231 -837 -1686 2424 867 -4250 1246 3518
783 3518 -2503 11 1373 -2562 779 1686 -1314 430 514 -986 -637 860 2574 -1610 -3069 3232
799 3232 346 -3475 2770 1440 -3175 559 973 -205 764 -891 -660 101 343 1098 -1354 -326 2594
816 2594 -2566 -1212 4379 -1593 -3230 2210 551 -1065 258 68 404 -895 -523 1627 -688 -103
832 -103 415 -2240 1438 2272 -3115 260 2505 -2154 -485 2011 -47 -1117 -1173 1364 1213 -1933 648
849 648 1260 -1963 952 493 -1868 1828 85 -2414 1842 1154 -1473 -170 446 1039 -1068 -1590 2617
866 2617 -71 -2518 1966 310 -1370 1430 -737 -777 1617 -1060 -617 1324 -259 -356 -660 665 1883
883 1883 -1977 -920 2793 -1548 -1344 1955 -737 -363 576 -886 1137 438 -1435 501 -104 54 438
900 438 -1562 1119 1379 -2690 836 2036 -1888 -147 467 -446 717 -772 -126 1484 -1270 -206
916 -206 919 -446 692 -694 -1532 2349 -285 -2300 1817 512 -1014 306 -461 794 -3 -1880
932 -1880 1434 724 -1544 777 318 -211 982 -1497 134 1919 -1635 -673 1402 -615 183 -152 -362
949 -362 1454 -1120 -1078 2047 -543 -941 741 -531 924 137 -1669 1361 349 -1546 1097 40
965 40 -484 679 -1133 516 1217 -1779 392 1350 -1092 116 -200 -38 1498 -1610 -550 2312 -889
982 -889 -654 1101 -758 332 -1 -1182 1395 76 -1570 877 318 106 259 -1650 1010 829 -2262
999 -2262 986 1636 -1755 210 414 -157 589 -1306 37 1369 -1239 -10 796 -567 883 -919
1015 -919 -1233 2633 -406 -2029 1482 57 -1072 498 28 626 -401 -1192 1623 175 -1251 730
1031 730 -758 -251 1534 -1643 -23 2152 -1888 -794 1662 -24 -598 -866 536 1338 -1583 211
1047 211 1984 -1782 -363 1079 -1423 911 745 -2073 857 1222 -1141 -97 346 418 -501 -1009 2295
1064 2295 439 -3101 1268 1484 -1729 971 554 -1135 869 -349 -766 970 -137 -346 -470 157
1080 157 1827 -1282 -1540 2705 -917 -2102 2498 171 -1646 737 47 237 281 -777 354 -329 -126
1097 -126 815 -1095 576 1653 -2728 154 3122 -1987 -1383 1870 -201 -564 119 372 413 -1156 295
1114 295 1040 -1148 946 372 -2249 1672 921 -2783 1309 2017 -1994 -325 1309 201 -1110 -786
1130 -786 1978 -47 -1882 1677 150 -1769 1931 -134 -1858 2324 -98 -2204 1380 1160 -812
1145 -812 -834 727 1191 -1934 -324 2799 -1627 -1712 2395 -692 -1156 1826 -828 -524 1301 -700 -752
1162 -752 523 628 -358 -1631 1570 1386 -3035 688 2827 -2392 -563 1820 -1425 -309 1141 -275
1178 -275 167 101 -122 -454 -322 1602 -463 -2106 2567 397 -3262 2081 1873 -2418 11 1205 -619
1195 -619 -328 299 715 -298 -569 1032 -1018 -511 2424 -1532 -1528 3000 -941 -2568 2295 962 -1603
1212 -1603 -136 1029 131 -1540 449 1954 -1561 -584 1621 -1821 118 2413 -1842 -406 2224
1227 2224 -1627 -1502 1697 910 -913 -1037 1498 471 -2493 1452 1745 -2459 448 1183 -2066 964
1243 964 1314 -1548 450 1065 -1070 -967 704 1482 -1223 -1361 2351 -487 -2696 2366 1025 -2119
1259 -2119 969 277 -1449 775 412 -608 223 375 -199 -1182 674 2003 -2076 -907 2903 -1530
1275 -1530 -1932 2686 187 -1399 890 167 -532 -290 267 521 -707 506 328 -2088 1281 1844 -2715
1292 -2715 372 2325 -2301 -896 1982 99 -822 -48 684 -146 -1362 1098 464 -1589 1229 -48
1308 -48 -2022 2072 835 -2340 1355 1314 -1740 -401 1074 530 -1190 -467 1751 -767 -1495 1971 -111
1325 -111 -1320 1639 -753 -1396 1760 -186 -1156 1110 591 -916 -919 950 1165 -1870 -194 2123 -1882
1342 -1882 -911 2292 -830 -633 1070 -1091 -182 1018 -412 -389 199 676 -431 -1374 1751 802 -2679
1359 -2679 776 1921 -2157 -41 1419 -769 22 418 -232 90 -290 116 -137 -225 1380 -887 -1647
1376 -1647 2283 45 -2280 1708 742 -1914 107 763 9 -174 -386 664 -273 -339 1050 -806 -340
1393 -340 1443 -1435 -665 2333 -1003 -1314 1446 227 -829 -63 519 498 -1237 46 1404 -1100 -48
1410 -48 1111 -1263 456 1107 -1792 303 1158 -1221 -256 819 301 -646 -942 1093 481 -1808 920
1427 920 896 -1557 585 745 -793 752 -2 -1019 769 297 -515 -240 114 927 -832 -832 1815 -352
1445 -352 -1676 1415 190 -1094 777 -160 -237 532 -382 8 433 -299 181 -612 248 1064 -1448 -193
1463 -193 1829 -1127 -772 1302 -309 -398 134 -148 507 -324 -483 762 -218 -7 361 -801 722 416
1481 416 -1701 750 930 -1183 140 583 -19 19 -673 377 590 -1155 212 585 -532 366 -254 -589
1499 -589 1176 -463 -1136 1018 3 -667 318 -52 437 -169 -711 1233 -86 -979 858 -118 -386 567
1517 567 -762 141 951 -1032 97 772 -403 -179 -275 64 906 -967 -219 1435 -644 -423 571 -342
1535 -342 257 -112 -663 948 -115 -864 671 29 -295 207 -583 547 398 -1204 480 730 -856 107
1553 107 -32 158 642 -926 21 1245 -823 -399 660 -228 140 -219 -363 966 -221 -601 841 -301
1571 -301 -193 330 -566 671 258 -1097 763 398 -1163 146 210 25 162 -719 581 804 -1195 112
1589 112 522 -429 451 -242 -316 1135 -619 -839 923 -137 -406 254 -145 444 -365 -429 1067 -343 -864
1608 -864 861 -117 -354 510 -668 187 782 -1072 -205 766 -151 -85 -543 466 734 -1286 -46 1232
1626 1232 -901 -125 770 -481 178 333 -634 359 -40 -529 245 -16 313 -162 -571 1195 129 -1623
1644 -1623 879 884 -1207 85 460 -104 103 -470 133 465 -406 201 -246 -340 959 -712 -703 1440 -419
1663 -419 -1063 1251 153 -791 168 235 152 -333 -208 866 -329 -574 682 -557 205 747 -1368 102
1681 102 1568 -832 -628 889 -1 -390 -239 405 330 -861 341 756 -1158 434 766 -977 433
1698 433 322 -1102 568 466 -886 -263 581 457 -762 -572 1371 -123 -1506 1077 499 -1002 649
1715 649 -44 -907 836 110 -649 384 367 -122 -521 155 689 -993 -258 1723 -1006 -1063 1715 10
1733 10 -996 447 214 -80 95 -195 159 144 425 -67 -1087 839 1018 -1516 257 1492 -1231 -371
1751 -371 1010 -433 -391 292 215 -236 -494 554 218 -776 613 -73 -1001 1265 60 -1470 1158 987
1769 987 -1446 -272 949 133 -550 -107 768 -402 -700 986 -304 -733 1346 -518 -1084 1385 -46
1786 -46 -945 975 287 -995 -136 761 220 -1322 319 1509 -1309 -783 1428 -493 -302 944 -995
1803 -995 -233 1090 -401 -567 444 610 -442 -1011 876 552 -1371 780 979 -1635 252 1265 -843
1820 -843 -137 507 -274 -122 92 -56 -144 183 764 -993 -1003 1780 78 -1693 1276 756 -1300 264
1838 264 385 -356 154 220 -34 -508 -28 708 -716 -134 1095 -975 -524 1436 -837 -945 1543 54
1856 54 -1230 109 718 152 -662 171 579 -672 73 616 -1002 663 1065 -1525 -174 1301 -701
1873 -701 -318 764 64 -524 -212 652 -248 -1023 1021 411 -1515 364 669 -799 771 268 -1104 570
1891 570 633 -728 -391 617 771 -902 -711 1316 -291 -991 1156 -152 -1037 852 4 -745 435
1908 435 158 -408 45 -14 -68 -276 567 604 -1352 36 1552 -1041 -692 1233 -71 -548 231 -347 64
1927 64 317 35 -120 -357 507 131 -927 717 632 -1411 452 1024 -1225 222 881 -450 -549 122 510
1946 510 -53 -731 439 228 -469 611 -349 -728 1370 -22 -1450 721 735 -728 -171 325 83 -314
1964 -314 -241 622 -507 -539 1142 -346 -604 843 -388 -293 909 -710 -516 841 104 -589 -302 817
1982 817 404 -1159 -11 1091 -691 -272 608 -503 189 693 -666 -36 575 -217 -79 76 65 38 -487
2001 -487 733 81 -1183 827 740 -1217 135 538 -330 136 -225 -210 476 -13 -143 -96 83 655 -641
2020 -641 -792 1165 -165 -958 731 194 -593 487 106 -239 -2 -156 405 -208 -497 474 -120 46 611
2039 611 -802 54 987 -792 -638 850 65 -374 -221 29 467 -395 -237 353 -338 203 393 -754 239
2058 239 395 -574 467 442 -617 200 229 -197 -194 -132 670 183 -954 400 481 -561 156 -54 -290 729
2078 729 -207 -620 541 96 -165 -2 -84 451 -217 -405 851 -316 -439 855 -45 -511 265 -138 211
2097 211 93 -622 287 316 -459 -142 -70 305 534 -803 -66 939 -444 -366 327 -172 316 48 -345 351
2117 351 -165 -332 460 -334 -267 332 -155 368 10 -568 451 232 -704 60 233 26 130 -724 166 701
2137 701 -511 -226 412 -156 213 -247 -365 556 -191 -243 455 -202 -101 246 -170 143 -64 -459 496 -83
2157 -83 -587 259 195 -92 58 -399 380 343 -833 140 551 -253 201 -180 -254 526 -383 -287 434 -264 -115
2178 -115 245 -244 212 -189 -158 646 -324 -473 662 -69 -310 271 -273 252 144 -714 184 282 -258 -36
2198 -36 -245 202 444 -824 56 678 -562 -115 450 -441 3 152 -174 301 -313 -78 302 -331 -42 67
2218 67 -407 578 -118 -840 615 449 -748 44 320 31 20 -396 242 187 -420 266 -3 -281 546 -298
2238 -298 -363 696 -332 -432 584 -50 -329 212 217 157 -369 -194 648 -304 -477 565 -301 -45 363 -616
2258 -616 68 545 -518 -226 293 102 -123 -398 316 340 -706 249 470 -787 27 396 -573 24 173
2277 173 -274 280 102 -199 116 9 292 -260 -491 762 72 -948 665 377 -691 306 157 -220 188
2296 188 -83 4 95 -96 229 -255 -63 446 -607 -315 978 -556 -662 846 -67 -531 333 308 -15 -234
2316 -234 -24 417 -260 87 345 -474 276 592 -860 35 824 -629 -351 679 -26 -412 -132 274 64
2335 64 -567 462 444 -730 174 232 -492 609 290 -637 449 434 -565 -92 452 289 -427 -264 627 -201
2355 -201 -611 692 -81 -646 516 -95 -420 398 82 -291 160 54 -188 -188 444 407 -722 -192 861 -527
2375 -527 -447 990 -69 -327 286 -232 -40 369 -99 15 -168 134 88 -583 415 448 -888 249 665 -849
2395 -849 -58 771 -276 -255 162 153 44 -191 280 0 -373 320 -170 -595 770 79 -957 507 369 -687
2415 -687 -18 337 -3 -287 -86 252 -298 -384 600 -218 -309 583 -357 -423 853 -253 -612 457 43 -408
2435 -408 -128 352 175 -589 -63 651 -660 -119 623 -494 -46 422 -527 59 649 -235 -155 207 49 -219
2455 -219 -315 660 236 -773 431 466 -864 161 518 -453 72 148 -322 164 148 -199 -167 21 353 -388
2475 -388 -459 806 -215 -697 651 85 -716 319 259 -107 71 -64 43 -56 -62 245 -267 -40 499 -637
2495 -637 -252 936 -453 -579 686 -44 -423 128 182 73 -187 22 269 -383 115 347 -588 323 433
2514 433 -728 73 699 -519 -149 447 -56 -175 -128 434 40 -492 313 240 -547 252 63 -442 314 26
2534 26 -682 371 192 -341 -112 145 200 -415 -180 606 -211 -478 562 -4 -490 386 -75 -350 315 -160
2554 -160 -123 136 -1 -204 -206 71 365 -553 -126 743 -453 -181 514 -240 -191 261 -231 -14 -54 -247 97
2575 97 -23 155 -32 -395 301 290 -570 291 497 -582 29 297 -146 -131 49 126 114 -180 54 115 -237 319
2597 319 -46 -365 468 28 -623 462 178 -367 185 164 187 -197 -273 375 -116 -334 404 -132 -71 253 -402
2618 -402 -50 391 -300 -248 339 -51 -257 -105 50 205 -408 -9 391 -310 -99 298 -218 50 52 -324 164
2639 164 149 -336 54 183 11 -50 -303 224 88 -431 256 204 -381 217 27 -122 241 -170 -58 126 -163
2660 -163 -151 186 -47 245 -141 -168 505 -57 -418 462 -9 -297 183 23 124 93 -191 204 135 -215 190
2681 190 -85 55 303 -261 96 497 -247 -155 289 -114 -9 -74 -26 244 -284 -196 340 -148 -102 174 -196 129
2703 129 125 -244 319 153 -325 63 32 -29 71 -209 79 236 -350 63 212 -299 88 -107 -121 253 -191 -54
2725 -54 271 -136 -127 136 -4 135 -26 -218 279 31 -195 240 -29 -131 89 -192 128 170 -384 151 298
2746 298 -161 18 -11 -58 224 -239 -129 362 -203 -75 90 -116 118 -71 -224 401 -152 -314 372 -152 -88
2767 -88 133 -39 25 0 -207 221 221 -239 214 -31 -75 249 -359 -29 348 -414 -2 322 -117 70 -72 -43
2789 -43 109 -273 -115 313 -223 32 142 -248 271 66 -309 269 82 -316 82 44 12 -6 -139 276 113
2810 113 -318 160 155 -219 104 8 -116 289 -156 -121 241 -85 -149 -66 -7 127 -198 -70 404 -135 -238 324
2832 324 -109 -142 89 -114 -73 179 -146 82 167 71 13 -205 213 293 -444 62 338 -399 -99 354 -172 -27
2854 -27 110 -74 242 -84 -14 141 -187 145 60 -353 412 5 -555 298 174 -361 98 279 -45 -64 -32 129
2876 129 -17 -236 88 -86 -163 307 -142 -239 467 -69 -371 449 16 -310 6 140 155 -239 22 401 -226
2897 -226 -175 362 -49 -46 309 -281 -25 367 -280 -75 266 -69 -168 -213 253 199 -475 173 269 -294 166 255 -306
2920 -306 35 83 -210 107 154 -215 23 77 186 -167 -190 365 18 -339 574 199 -492 139 236 -127 165 16
2942 16 -106 128 -136 42 -99 20 300 -329 -240 545 -212 -445 459 81 -262 137 177 6 55 13 136 -197
2964 -197 -11 205 -196 108 341 -477 87 410 -321 -51 297 -22 -282 -19 217 55 -208 207 1 -321
2984 -321 50 237 -318 327 143 -489 264 221 -253 -55 221 -10 -151 -151 353 -126 -364 381 8 -312 359
3005 359 8 -134 303 -9 -249 246 46 -21 -174 127 190 -461 -71 473 -276 -266 365 -198 -240 277 -26
3026 -26 -2 103 -57 -52 68 41 5 -274 294 300 -504 169 476 -482 -4 315 -92 -93 88 43 95 -40 -47 20 -122
3051 -122 338 42 -402 346 63 -480 305 129 -365 110 183 -83 -183 -83 72 -157 -144 209 -76 -151 235
3072 235 -140 -160 469 -274 -291 368 13 -184 108 194 74 -385 14 334 -312 -51 428 -259 -66 130 -220
3093 -220 71 195 -172 -147 173 97 -110 -35 310 128 -494 228 227 -386 103 211 -243 41 96 -313 87 122
3115 122 -108 -53 32 280 -100 -229 329 -69 -421 324 43 -441 221 28 -129 40 -29 42 45 82 68 -169 69
3138 69 292 -342 -164 400 -252 -262 181 -136 -105 125 46 122 -49 -15 209 -181 13 21 -140 107 204 -294 37
3161 37 291 -266 -85 201 0 26 -57 102 133 -195 161 72 -205 140 88 -232 219 89 -220 220 162 -119
3183 -119 9 23 148 -109 -175 290 -139 -287 191 -37 -188 117 -131 -158 228 -201 -5 95 -86 -35 -160
3204 -160 90 266 -229 21 448 -252 -210 372 -111 9 43 -28 3 155 -131 59 -16 120 104 -130 131 81
3226 81 -298 172 339 -264 12 131 7 88 -113 -121 122 -151 -89 8 30 270 -17 -281 340 -46 -288 287
3248 287 -10 -223 87 -115 92 -30 -202 127 -68 -249 134 -139 -143 202 -314 34 306 -262 -100 123 -62
3269 -62 30 25 -16 188 -109 -107 245 -118 -15 107 -73 156 128 -232 83 135 -194 149 -48 -45 27 -223 106 45
3293 45 -344 83 99 -196 70 -15 -116 87 -172 -38 174 -88 -127 29 -115 114 -76 -172 176 52 -179 173
3315 173 -48 26 229 -177 7 29 -127 113 42 -132 119 32 27 51 -195 -51 199 -115 8 212 -133 104
3337 104 -36 -170 228 -111 -83 265 -89 -109 118 -80 -19 -31 -103 167 73 -190 156 20 -95 83 -227 -16
3359 -16 233 -169 -36 188 -41 -167 21 23 217 -260 21 214 -201 28 61 -120 -22 62 -159 217 53 -283
3381 -283 113 -3 27 -100 -62 84 61 -194 150 81 -156 108 46 -106 139 -51 -63 189 -86 -53 48 6 162
3404 162 -34 -188 328 -24 -300 199 110 -121 188 -160 82 -18 -164 16 13 -81 16 -149 14 146 -190 48
3426 48 236 -215 -132 262 -130 20 4 -71 -8 -139 -53 57 -212 44 146 -137 255 141 -275 94 34 -250
3448 -250 19 149 -13 44 -95 137 -61 -174 50 49 -85 17 -31 -161 296 -60 -193 106 -1 -117 -76 5
3470 5 175 -125 -132 179 -57 -262 186 -6 -56 163 -154 -1 83 -57 -36 26 -33 -31 -153 68 154 -352 69 283
3494 283 -360 -30 323 -82 -59 70 -94 196 46 -74 -53 -3 80 12 -174 277 142 -388 240 164 -291 71
3516 71 61 -20 29 -56 24 64 -127 88 -36 -101 174 -182 -126 288 -135 -236 246 70 -95 56 133 -60 -177
3539 -177 -45 167 -172 29 271 -244 6 163 -237 48 284 -178 -52 106 7 -69 -72 173 116 -268 48 305
3561 305 -305 52 163 -226 133 8 -175 80 209 -150 -9 -21 82 -157 -83 192 30 -305 297 81 -291
3582 -291 182 49 -119 51 -21 -87 32 -19 49 -117 -141 204 -307 -104 303 -94 -174 243 -70 -170 99 43
3604 43 -30 -1 12 119 -61 39 191 -126 38 93 -283 55 342 -182 -100 149 -139 -22 -29 28 -104 -190 9
3627 9 -13 -214 178 98 -141 144 94 -254 184 21 -188 12 -18 76 -156 -10 143 -28 -184 224 -45 -222
3649 -222 73 -32 -242 184 -33 -273 138 108 23 -109 82 133 -206 39 269 -238 -251 212 -32 -84 149 -145
3671 -145 -9 88 -14 -28 21 73 87 -153 61 132 -193 130 214 -323 -2 181 -125 -100 62 -54 -16 8 -29 70
3695 70 -178 157 -74 -84 189 -18 -190 199 156 -238 105 191 22 -26 25 6 114 -33 163 -136 -23 141
3717 141 -120 -43 239 -130 -127 138 114 -41 38 56 78 -130 8 139 -8 -155 118 -57 -113 222 -172 -24 248
3740 248 -125 15 156 106 -26 -11 126 185 -146 76 116 -268 21 89 -176 41 18 -172 76 23 -134 96
3762 96 -28 36 -116 -207 265 -104 -221 188 122 -205 29 81 8 153 -36 -83 9 -134 -65 -82 19 165 -89
3785 -89 -102 180 -44 -173 105 -55 -77 113 -54 101 -60 13 28 -55 -70 53 -42 34 103 -125 104 117 -177 -22
3809 -22 143 -65 44 -140 -33 36 -170 83 -31 -82 -25 39 -54 21 100 -76 129 49 -59 101 -28 92 18
3832 18 13 233 2 -134 48 -87 -81 69 -40 15 109 -21 9 113 -81 83 -13 -26 46 -194 48 232 -152 -101
3856 -101 93 -15 -2 4 -140 84 42 -208 72 81 -9 136 -116 85 119 -217 146 102 -15 93 -30 3 59 -107
3880 -107 -97 154 -54 101 95 -137 48 4 11 170 92 -82 102 56 -112 113 -83 176 87 -202 88 108 -166
3903 -166 25 19 -32 41 -102 43 62 -133 -125 159 -15 43 76 61 142 -100 -63 141 -55 -29 102 13 65 -48 -224
3928 -224 141 5 -173 21 -81 67 106 -119 56 56 -122 -31 39 -90 101 -73 -100 149 -112 57 222 0
3950 0 -61 40 -85 -69 39 -172 131 -74 -59 185 -18 -23 152 -50 -30 93 -149 119 71 -171 41 89 53 85
3974 85 -122 34 118 -71 -99 79 -54 23 -131 -177 176 -26 -86 162 104 -155 -72 -63 2 -4 -130 4 -46 -95 67
3999 67 -58 -36 16 -118 22 188 -69 -86 43 -73 -78 -17 96 65 -142 -51 182 -153 6 202 -137 -33 83
4022 83 -208 -14 -62 -174 78 -67 28 -11 -97 238 109 -129 52 79 -99 74 77 -69 105 -120 -130 34 -31
4045 -31 -77 -70 -47 51 -165 -23 250 -111 -150 210 -36 -9 61 -33 -36 57 -144 30 11 -185 81 -52 -93 166 -94
4070 -94 -29 161 -73 -72 183 -24 -137 85 11 62 -92 19 32 -134 38 158 -194 -1 125 -139 46 80 -292
4093 -292 -77 79 -114 40 -60 80 -3 -128 108 0 -215 68 -120 -148 144 -20 -91 120 -55 -31 -65 -53
4115 -53 -51 -102 -100 89 -66 -108 115 17 -192 144 -132 -115 70 -140 -65 162 21 -117 -114 132 56 -163 65 171
4139 171 -142 1 147 -156 16 69 -80 -45 -21 -8 42 -51 175 11 -29 9 -68 -232 16 87 -242 72 62 -194
4163 -194 16 98 86 -68 -12 74 -153 -26 132 -103 -144 127 -56 -126 156 39 -205 92 29 44 -111 -60 134
4186 134 -11 -52 26 -144 -151 228 -45 -26 83 -128 -123 77 100 76 -34 77 42 -130 218 -30 -99 -5 69 -128
4210 -128 7 100 -151 76 85 -12 -21 -2 117 -65 -153 131 -33 -111 155 160 -117 191 70 -157 144 -21 -61 -139
4234 -139 13 32 -39 -36 171 -24 -49 62 -171 -80 211 -110 -138 9 20 97 -54 80 90 5 99 118 -172 68
4258 68 91 -220 -104 219 -134 17 97 -82 -57 -38 31 54 -16 36 -1 -256 87 72 -190 157 12 -120 134 140
4282 140 -136 -38 15 65 -15 -148 152 -108 -60 64 -82 -151 12 -133 -101 32 -41 22 95 64 -147 -26 82 83
4306 83 -29 13 230 -231 -56 128 -131 -173 136 -36 -124 176 -132 -16 125 36 -59 -116 125 121 -127 -43 201
4329 201 -114 7 79 -58 -25 106 -32 175 -5 -77 3 -35 177 -25 -106 298 72 -158 183 31 -57 20 2
4352 2 -18 49 47 43 -99 -5 62 -30 -65 167 -110 -24 244 -111 -142 65 -59 -18 2 -50 -3 -39 -66 136 -40 -41 94
4379 94 -92 140 67 -179 -30 95 -132 16 67 -66 62 -4 84 27 -74 146 82 -49 135 196 -23 106 -59
4402 -59 -101 43 -82 -12 72 -74 -58 -67 -94 32 71 -64 36 135 -63 20 -13 -105 -53 -55 -154 -23 2 69 75 73 58 -124
4430 -124 -133 138 -30 -150 148 -21 44 134 -106 0 -71 -4 79 -114 34 11 -70 -49 37 -66 -43 120 -96 -7
4454 -7 13 -54 -52 -67 2 109 -34 69 105 -174 70 39 -1 28 18 -22 171 90 -59 93 24 -59 88 -111 168 -129
4480 -129 -30 33 7 -52 122 6 75 185 -68 -13 42 -87 -6 88 -45 81 2 -12 168 -127 -130 30 -79 75
4504 75 -44 23 62 60 -1 185 -16 -2 81 -168 205 75 -60 -40 -25 -101 46 -43 -103 37 -150 37 28 -157 -112
4529 -112 40 -7 66 -30 -70 52 84 -115 65 -39 47 3 -42 27 -67 -82 -41 129 -137 7 -74 -37 135 -5 76
4554 76 97 -160 32 62 -144 131 -104 0 117 -136 -28 51 -94 23 -45 96 -54 87 -157 66 0 -88
4576 -88 81 -101 110 67 -70 -4 132 -32 -52 50 33 17 39 3 -17 -56 -75 133 41 -19 119 -112 21 -9 -120
4601 -120 145 11 -40 90 43 8 13 1 163 55 -183 166 29 -262 -76 -100 -105 122 -27 11 55 -115 -1 -67
4625 -67 -16 156 -17 -63 157 65 -163 120 38 -39 40 65 -20 114 -60 28 -93 -3 155 -39 -51 105 -87 34
4649 34 141 -18 2 60 33 -135 18 54 47 9 -65 146 -146 31 68 -154 -52 9 -184 -17 77 -201 60 36
4673 36 -10 -15 -129 28 40 -29 172 31 -119 89 -40 -131 105 -36 47 7 57 -31 -58 -7 49 -83 -72 137 -184
4698 -184 -103 181 -109 41 171 -105 -5 70 69 -24 -63 -21 13 -132 138 107 -193 -41 188 -81 -121 147 -36
4721 -36 -32 92 -64 72 152 -30 68 -91 88 71 -65 32 46 -113 160 163 -24 11 14 20 -2 47 -55 10 -46 65
4747 65 105 -42 86 28 -17 172 -28 -64 47 7 -63 17 49 94 -223 -4 143 -6 -85 69 11 -26 108 -118
4771 -118 -2 128 -33 -28 50 11 -62 -25 -41 40 -89 45 191 -62 110 38 -173 27 100 -48 -49 35 31 -85 43
4796 43 47 -98 -98 55 43 -200 163 17 -148 18 95 -75 -26 28 46 77 -1 41 58 95 147 -149 -91 33 -67 -31
4822 -31 111 -2 3 -27 21 86 71 -61 43 5 124 129 -97 42 44 -176 -13 12 -224 -10 26 -30 -94 -32 48 57 -33
4849 -33 -32 71 -154 25 13 -47 169 74 -50 16 26 6 -72 100 141 -42 -42 61 10 -116 158 -81 -199 42 -15
4874 -15 37 164 -87 -80 23 5 68 -10 -44 109 -165 90 130 -30 -126 72 -98 27 38 -72 -40 107 -8 35
4898 35 -90 27 35 37 80 119 -110 74 133 -8 9 14 -50 17 56 -72 2 -95 114 -31 -32 -27 46 -41 155 71 -104 152
4926 152 71 -79 -6 13 -35 -11 -114 69 82 -33 20 -12 3 69 -100 -104 45 -42 7 -28 86 21 40 -3 64 -43
4952 -43 2 79 -87 -15 4 39 -48 12 -12 -89 84 -108 -78 1 -19 -90 4 -117 24 -4 -41 147 -92 13 69 -97
4978 -97 72 84 -104 22 -40 -51 41 53 -6 -39 -6 36 -142 -99 -18 25 -1 -43 107 23 -32 -104 43 -57 -67 75
5004 75 -32 -60 103 -50 -66 84 -95 -82 12 75 0 -51 -61 5 -110 -76 141 -48 -10 -29 -57 -52 47 -19 54 53 -80
5031 -80 94 81 -5 -57 -62 15 -20 4 79 79 5 35 45 -29 41 51 -99 -26 4 -67 -46 -70 -11 -16 -60 55 7 -1 73 -21 -113
5062 -113 23 -130 106 72 -216 5 36 70 -73 159 15 -9 20 -5 50 75 22 4 -41 -66 -87 -32 106 11 -18
5087 -18 145 -68 -56 -5 -146 -54 65 -41 6 21 -53 82 98 -46 5 -102 88 20 -57 -94 24 -33 45 21 -68
5112 -68 29 29 -39 62 19 61 41 15 -56 -20 -10 67 3 -157 59 -64 47 -144 -23 72 -50 -38 69 33 -161 17
5138 17 -43 -62 150 -108 -133 27 -18 28 155 26 -63 -87 -1 49 45 -118 97 -85 -173 99 -18 107 51 -50 -69
5163 -69 110 -30 -16 -7 17 57 -162 30 2 -26 -124 -34 -13 64 129 -24 139 -95 -83 43 -27 -83 123 -47 40 107
5189 107 -207 8 65 -111 138 8 -3 90 -14 -94 -60 -19 139 36 -20 52 35 -47 20 -79 -90 49 44 13 28 18
5215 18 40 -22 -54 183 7 -103 69 -61 -98 56 -122 -68 52 27 -48 22 -137 -26 -76 4 168 20 45 106
5239 106 -60 -36 137 -65 -26 64 -78 55 -32 -100 -39 26 -3 13 -3 69 29 -85 -22 -41 -155 9 -25 -116 42
5264 42 33 -139 -39 -30 -37 11 -58 51 -94 -40 101 -133 -86 -24 -52 -80 85 47 12 -82 33 -23 68 128 160 -4 -15
5291 -15 54 -31 3 115 -91 9 40 -34 -4 -76 37 8 -153 -59 40 -160 -45 136 -123 25 97 -100 -2 77 13
5316 13 -42 -9 -65 -11 5 -15 7 -242 81 73 8 23 -84 64 87 -89 22 -15 10 32 -32 -20 106 16 59 67 -93
5343 -93 -52 -12 -24 19 21 -29 -68 55 48 -135 27 -13 -62 -61 96 113 -22 0 235 -76 11 83 -111 -69 120 41 -14
5370 -14 31 -59 60 35 69 58 -69 72 148 -116 57 54 -54 51 56 -133 -14 -27 62 35 -58 8 44 -78 82 -19
5396 -19 -92 132 -113 -214 94 57 83 -19 87 53 -81 51 100 3 -18 134 -84 2 -11 -92 39 139 -46 -67
5420 -67 -83 -5 -54 -88 94 69 -86 12 98 -22 71 119 -83 -18 47 3 -20 60 -9 13 8 -6 -83 -72 14 -77 -76 -36 26
5449 26 -12 88 -37 13 112 43 -45 -56 138 73 -35 -47 114 6 -162 30 39 -128 105 1 -205 -4 -69 3
5473 3 -69 -2 29 -84 -76 -17 15 -44 206 -93 -119 106 -106 62 56 -46 24 -70 18 34 -65 33 100 -74 73 57 -37
5500 -37 64 9 -98 19 132 35 16 -61 61 -42 -61 70 -86 -42 89 33 -92 64 4 16 116 -44 32 85
5524 85 -55 -76 2 43 72 -32 -53 152 -114 -123 90 -10 -11 25 7 56 24 -4 -54 16 -79 61 101 30 -21 -150 -124
5551 -124 94 -133 78 13 -125 27 -2 -47 36 -104 137 -12 -27 -5 -24 -71 70 -68 -121 85 15 -12 -45 -58
5575 -58 -30 83 8 4 40 -80 -32 34 -25 48 -91 29 161 41 43 -134 -77 -13 -48 54 17 39 -41 133 44 -44 94
5602 94 34 9 121 -54 -11 16 -106 30 14 -73 -46 -107 -40 40 23 73 89 -90 -1 46 82 -43 88 -87 9 0 -59
5629 -59 41 -49 101 -59 -123 45 47 2 19 26 -38 27 -24 5 26 -151 -14 -110 -92 -1 31 47 -53 -44 -53 98 -78 -20
5657 -20 43 8 62 -4 -6 103 6 46 33 -12 40 111 -62 61 -23 -30 35 43 -81 7 35 43 -20 7 75 -71 -176 2 77
5686 77 -12 -67 -82 27 73 -34 -26 87 -16 13 87 92 49 25 -109 123 0 -50 114 114 -23 22 21 22 -9 -34 163 -28
5714 -28 -28 10 -46 16 -13 9 -69 63 13 -63 95 -144 -17 -19 12 50 -111 -120 25 52 -13 160 -1 61 -116 -58 -93
5741 -93 -6 -50 34 43 53 138 -65 76 114 -22 66 16 -21 -70 -5 -12 -65 -81 2 46 12 -20 -23 -5 24 3 -72 82 52 -131
5771 -131 20 14 -141 127 19 -3 103 -40 166 14 62 88 -72 -133 -70 -36 -67 143 108 15 145 52 46 -1 -60
5796 -60 34 -17 -18 -20 -97 -81 -10 -35 -107 -32 26 37 -3 39 -51 -117 35 4 -132 -92 183 -98 -56 -41 -97 24 11 -11 -26
5825 -26 -52 -36 98 -80 50 82 -74 105 14 -53 100 77 30 -7 9 50 74 21 -9 98 104 36 41 -52 1 -48 -44 75
5853 75 -69 -92 59 -34 36 -42 2 -26 -1 -59 148 -56 9 118 11 -10 53 -8 82 -42 -134 -14 124 -17 -25 -53
5879 -53 58 61 -38 53 -37 56 -8 -47 10 -107 95 43 26 91 -95 139 21 -49 -101 -9 -52 -21 -45 -41 -74 -63 -106 33
5907 33 24 58 -9 16 31 -13 13 -11 -89 132 -16 45 73 3 -64 122 4 25 23 62 147 11 -21 -17 65 47 22 -77 -43
5936 -43 -24 -96 -68 49 -79 75 133 -46 -98 -57 114 -31 -98 18 -32 7 -26 -37 -27 73 -33 -91 -4 85 -50
5961 -50 118 60 84 -17 60 -35 -68 -24 -14 41 22 68 -107 -57 51 -26 -170 -140 7 1 -78 -38 -62 -113 8 129 -44
5988 -44 -19 57 -42 -30 93 -24 -50 71 -1 -7 -6 -118 -101 45 60 -88 -66 46 154 -50 -88 -17 -44 -5 9 -38 -60
6015 -60 -3 13 8 -116 -109 78 -107 86 23 -6 -4 28 -102 121 28 9 -22 -82 33 -30 -36 121 -68 -48 104 47 112
6042 112 68 12 -59 33 4 -4 54 -48 44 -134 20 57 -160 -13 16 -97 -156 -27 -11 46 99 48 -9 -13 158 -37
6068 -37 62 12 105 -20 182 -22 -50 72 -55 -86 72 99 -35 -40 34 -77 114 31 47 44 -80 -22 -20 -127 48 12
6094 12 31 131 -67 22 -6 49 -82 82 -87 -66 -2 37 60 -104 36 43 -53 -69 66 54 27 7 1 -24 -136 -27
6120 -27 49 -67 1 -66 -35 103 -1 -17 42 -18 -62 50 141 12 -38 10 92 58 30 15 66 -83 64 16 -21 74 87
6147 87 35 -66 -99 -100 -7 -7 -38 -76 -6 93 -46 -85 -24 27 -55 -19 -69 18 4 -1 -46 229 10 77 2 -29 177 -92 18
6176 18 -11 -7 -3 83 26 39 69 -69 88 36 -50 53 -16 5 172 -67 -93 -63 -32 86 81 -157 130 111 -53 36 2
6203 2 -90 100 -76 86 110 -65 69 82 -33 9 -77 34 -41 -4 5 16 -73 52 22 -10 24 20 14 -2 9 22 33 -17
6231 -17 55 78 -84 -56 -6 15 -8 25 11 -28 1 -74 50 -119 -55 47 101 57 96 5 115 87 -43 -61 -104 -116 34
6258 34 -69 40 -52 -59 25 91 25 -3 -42 -61 81 -175 -21 102 77 -31 5 38 60 -13 22 112 -74 -188 -47 -85
6284 -85 -131 -3 -77 -49 -40 -31 -8 71 91 18 20 -151 28 -76 -6 39 -39 9 -43 14 -61 48 -24 83 -41 -111 27 17
6312 17 17 -58 -63 59 -50 -50 0 -20 -90 -29 62 72 82 -71 27 42 27 -18 -33 152 62 36 -52 53 58 -42 82 -91
6340 -91 -6 59 24 -36 43 -23 8 -29 89 -19 0 -128 -66 -37 116 68 -81 86 -39 -47 60 77 -3 -16 -17 -10 76 -20
6368 -20 107 92 -70 119 -24 -20 58 -87 -32 4 -19 11 52 -152 2 2 -87 -37 -87 16 0 59 62 18 -35 193 133
6395 133 -18 -31 80 -14 44 -22 41 128 -99 53 -109 41 34 -34 -42 76 -98 58 -41 -6 -55 36 17 -115 -28 20
6421 20 83 -32 -150 81 -2 -85 105 -21 23 -18 -26 -92 65 67 -84 -8 -40 136 -15 -45 116 -105 -120 79 36
6446 36 12 5 96 -63 0 -65 -142 31 -140 19 7 3 -58 -63 166 93 -29 -47 39 -68 39 -47 -110 97 63 -22 194
6473 194 -68 99 56 23 57 -31 -144 83 2 -137 12 23 87 -39 -104 64 -8 -51 -38 -33 76 53 8 -59 50
6498 50 -76 -90 -29 -99 -92 63 6 15 -3 -46 55 -5 -81 43 -96 80 35 -94 45 -24 -96 21 101 -19 55 73
6524 73 42 3 -58 86 -11 -150 -47 86 -26 -113 171 -63 52 7 55 -103 57 161 -32 56 151 -35 -68 79
6548 79 -76 -81 -41 30 -12 97 63 -28 -21 -99 20 92 -22 68 -43 -23 163 -46 5 11 15 43 6 7 39 -21 6 -38 -73
6577 -73 -14 -82 31 38 108 -204 115 16 -67 6 128 3 -93 -24 1 -66 -19 -29 -63 -70 -28 -159 -87 95 -55 -8 -63
6604 -63 69 -62 129 75 -21 54 16 -45 -124 -68 29 -63 -19 50 -50 -29 40 -159 62 60 8 -27 -89 -68 22 -9 74 23
6632 23 -63 -8 48 -45 -96 63 -63 -9 -34 -34 43 -9 6 52 75 59 -31 -2 49 49 -38 -23 22 -93 39 30 -6 9 -57 50
6662 50 38 28 -29 -56 -71 27 -117 -32 71 0 -53 59 -31 39 99 -37 -6 -108 -75 40 99 43 33 19 14 -37 9 21
6690 21 151 27 -4 27 64 -27 68 74 172 -12 -17 38 -3 35 89 -94 91 48 -79 -12 -37 -44 32 -20 -37 12 -4 89 30
6719 30 -24 76 -125 5 -24 40 -29 0 109 -114 94 -30 51 -41 49 132 4 67 59 -160 34 -48 -11 66 -24 -27
6745 -27 0 -32 -20 58 -11 -48 107 -66 -79 149 8 -32 48 -35 15 76 -41 31 -27 -19 61 36 -35 48 15 41 38 -69
6773 -69 -21 -1 -22 96 -13 -9 75 -67 49 45 -12 42 -6 -61 -34 131 122 57 -116 -44 37 -44 44 42 -78 -38 -16 -42 21
6802 21 -41 -70 30 45 7 64 -14 3 117 -20 39 -16 -59 36 54 -95 33 -100 21 42 -95 164 68 -59 -59 24
6828 24 5 6 -42 -121 34 23 71 -16 -3 71 -55 -24 52 -15 -56 -35 -193 -80 28 73 -70 -31 -63 49 10 21 -31
6855 -31 25 31 -17 28 -70 34 -70 -18 74 -58 -45 18 -117 -39 13 98 28 -100 22 -90 17 40 -13 -53 67 51
6881 51 -19 108 26 -27 7 24 -20 80 49 -108 8 -45 -49 99 -62 94 -14 -29 92 43 -31 79 6 -93 15
6906 15 114 -73 31 -25 83 108 -12 -33 -22 25 -32 -71 -88 13 13 -19 -88 -15 12 -23 63 39 -22 20 84 16 -2 -41
6934 -41 -27 101 137 -58 -46 -38 -150 13 30 49 -44 -70 62 -37 28 30 21 76 59 9 -1 45 -3 -90 -67 60 53 -56 -1
6963 -1 106 74 -36 48 22 -35 -151 -66 83 26 -26 -8 1 37 39 -85 -46 -34 -14 -35 -122 -109 -19 -18 -131 213 74 -25
6991 -25 21 -31 -5 -36 45 43 -17 9 84 -40 -39 -58 23 1 51 36 -10 142 37 88 -4 -68 -93 90 -12 -7 -92 74 46
7020 46 21 7 29 59 121 26 42 59 16 38 -116 86 80 89 39 49 -79 33 114 42 94 -10 32 46 22 -66 -29 -43 -29
7049 -29 82 -90 -152 63 -33 51 -36 -95 21 72 -18 -127 29 -69 25 8 -115 -24 75 127 12 -123 31 14 -67
7074 -67 94 -12 15 18 72 -14 74 59 -77 63 47 103 17 -118 -16 25 -65 -80 10 -96 -125 81 -45 -46 49 -10 -15
7101 -15 11 -112 -29 87 103 40 -3 -14 13 26 47 7 108 36 -7 -37 -2 -33 17 -22 -79 77 -14 -32 133 -22 -74
7128 -74 133 -60 16 -59 5 47 -79 -120 42 10 -22 69 -20 37 57 -92 -66 71 123 4 -28 -122 27 33 -143 74
7154 74 -89 -11 86 -41 33 32 -69 20 25 31 43 12 -40 -26 25 -11 -41 -110 -16 -55 -50 -58 59 27 65 30 -24 82 52 -30
7184 -30 116 57 -27 3 28 82 28 -101 75 57 88 -32 99 14 123 -31 -41 26 -99 18 -31 6 -31 -24 44 37 -3
7211 -3 -46 -79 -25 61 -31 15 42 -37 -22 43 -67 -46 -18 -66 31 36 -90 29 21 -152 -19 -111 5 -93 39 17 37 11
7239 11 91 13 54 96 24 -19 132 -106 34 19 95 55 24 14 -22 -77 -33 -3 -61 52 84 -97 -78 -4 -85 -30 18 -113
7267 -113 -81 11 -15 35 -32 80 -46 35 -59 26 -33 -34 58 -130 0 85 -11 -6 -29 -37 105 31 -81 -18 -55 125 -37
7294 -37 -44 124 -140 37 -80 -33 18 25 35 -4 115 0 74 -7 -49 198 -11 -20 51 -42 114 -9 -69 -105 92 -18
7320 -18 -8 -56 65 -50 -61 15 -51 -18 63 -10 52 115 -101 -107 -50 76 -8 58 -52 -41 52 65 -3 -29 -78 -68 16 4
7348 4 -13 9 -63 -7 12 7 -24 14 -6 -116 -11 -18 -86 -15 78 -35 3 -96 20 -6 19 81 -13 92 -112 -65 108 -97
7376 -97 -11 44 -26 63 -45 57 130 -103 -5 60 -57 50 45 27 6 -10 -49 42 31 -2 -11 -20 21 133 -113 -15 -153 -77
7404 -77 19 -29 16 -7 51 -24 56 -5 -77 19 55 5 37 -38 -43 -20 10 16 44 -1 -47 47 120 14 -101 -36 32 26 -3 58 11
7435 11 -21 -124 67 81 -54 45 -15 46 16 -17 -36 66 -7 16 -56 -52 -11 113 32 -43 -57 -12 -18 -23 -75 141 67 37 22
7464 22 -61 -87 -28 19 -170 72 -11 -52 25 31 88 -113 -9 -50 14 -12 -21 56 -29 -12 -141 -35 -105 -45 50 -44 47 69
7492 69 -34 40 -88 74 -40 75 -5 16 41 -15 72 75 -79 47 -13 -2 -83 60 57 0 54 58 24 -38 -13 -21 19 -34
7520 -34 -140 5 126 -26 50 -6 -61 56 -31 20 82 -41 -46 68 -22 179 1 -29 28 -59 -41 -35 -96 12 39 -75
7546 -75 -6 64 33 12 4 -70 43 76 -53 -39 -5 -82 66 -160 -41 -20 -15 2 47 75 2 84 -102 58 41 11 -25 -2
7574 -2 3 -24 -17 102 -71 5 46 4 60 11 4 4 -85 -205 89 31 101 57 -7 -17 18 -30 109 41 -38 -36 116 -34 16 -98
7604 -98 33 -36 57 4 -36 23 -100 12 87 11 -20 11 50 7 28 52 -8 -49 46 82 5 38 -21 20 32 87 22 86 67
7633 67 -108 35 33 0 -66 -90 6 -105 -30 -27 -134 -32 10 -33 62 -77 17 80 45 -22 -8 -130 -7 184 24 -52
7659 -52 -72 -2 29 -154 53 78 6 44 -111 -172 27 26 -21 17 -52 -19 86 -8 28 -19 -99 29 -10 -30 0 97 -55
7686 -55 -83 37 -1 62 39 27 71 61 -21 -20 31 8 -38 -54 64 12 47 4 -15 52 68 84 26 4 -58 -42 -69 -40 -17 126
7716 126 83 -58 61 146 60 -120 83 120 -62 22 109 -44 -154 33 8 -61 -79 6 61 25 -89 27 -2 -9 13
7741 13 -3 -9 -22 19 -16 42 103 -21 -87 8 29 -19 83 -9 -68 32 -4 -3 37 -14 24 75 51 -91 -93 15 -33 -72 -5
7770 -5 86 -9 34 45 65 17 41 -31 -108 -11 58 119 6 -2 -31 18 59 -55 -98 -32 13 -58 40 -58 125 -89 -52 -27 18
7799 18 -80 6 52 -14 -66 96 -51 -13 9 -139 -65 20 45 16 -37 31 21 -118 52 -38 33 -82 -11 -58 29 -28 23
7826 23 -30 82 104 52 -3 47 -4 -22 -32 55 58 47 -19 23 155 -51 50 85 -31 -9 105 7 -55 -1 9 46 99 7
7854 7 133 -31 -29 -12 -65 -20 -5 52 15 -66 30 83 -11 -17 25 40 21 -102 -65 -23 -9 5 29 23 62 -66 13 44 90 39
7884 39 28 8 46 63 -24 105 143 6 -21 65 61 42 20 1 -6 7 -3 -41 78 -49 -12 -108 38 -105 -28 -29 -51 -40 -1
7913 -1 67 -178 -13 49 -10 32 -61 -82 126 -91 2 -33 59 -65 66 29 65 81 24 27 -16 8 84 -33 79 -24 -45
7940 -45 76 12 42 105 53 -1 39 -43 35 -80 -36 -50 -12 -14 8 -48 -49 -64 55 14 41 -25 -110 -12 -6 18 -36 39 -15 -20 -137
7971 -137 -89 15 19 -5 100 131 -11 8 10 89 -97 -5 47 40 -53 40 -50 17 -21 -35 76 -46 89 9 -46 30 55 131
7999 131 8 -72 -37 35 63 -31 -124 -14 57 -24 -53 -79 24 -9 45 -102 7 70 4 -74 -82 -16 -19 -21 0 61 -69 -100
8027 -100 -37 -24 -47 43 48 -4 -86 4 -62 -31 -76 24 3 44 -67 27 52 16 47 46 25 -8 11 80 39 -21 -19 -48 45 -3
8057 -3 -68 82 -23 84 44 13 46 -130 -78 16 88 -80 16 -81 104 -54 -13 29 -41 -74 -89 5 -35 -43 -3 1 3 25 -24
8086 -24 9 36 62 86 -52 15 -75 36 48 -23 49 32 95 9 -29 156 88 4 76 -63 121 45 69 -77 49 84 11
8113 11 -12 -20 -68 19 32 -100 43 -85 127 93 3 61 39 -58 115 5 -33 29 -14 32 26 16 -4 13 -69 33 -77
8140 -77 -63 -78 -50 -71 44 -91 -28 17 -51 40 0 15 -25 38 119 60 -131 -6 -58 -34 7 -63 -59 45 -135 -68 10 -78
8168 -78 -53 -27 -19 -20 33 -7 82 -46 -40 25 -23 -137 -17 33 93 -43 140 135 -50 0 -21 -41 3
8191C
$$ Imaginary data points
##PAGE= N=2
##DATA TABLE= (X++(I..I)), XYDATA
0 0 0 0 0 0 0 0 0 0 0 0 0 0 0 8 -8 8 -8 8 -16 16 -24 24 -32 32 -40 48 -56 64 -72 80 -96 104 -120 136 -152
35 -152 175 -193 216 -244 272 -303 336 -373 413 -456 502 -557 613 -677 743 -821 902 -995
53 -995 1099 -1213 1344 -1492 1663 -1862 2097 -2379 2729 -3167 3745 -4538 5700 -7569 11078
68 11078 -19933 91698 110356 -115254 -83359 18343 34392 -14541 7311 17511 -9166 -11937
80 -11937 31131 3357 -42197 -20487 31742 22849 -23522 -25308 39154 36127 -41412 -50016 17220
93 17220 34626 1363 -13898 3515 3871 -6225 6989 4512 -27217 -12887 28103 28721 -616
106 -616 -22522 -14513 7542 2365 -771 13077 1929 -15743 1088 21399 2130 -30666 -10418
119 -10418 28130 3735 -21047 12213 19795 -13770 -19664 -1254 7530 4030 3542 6789 -7004
132 -7004 -15225 5566 16240 107 -19818 -16179 22313 32334 -13824 -27731 3579 9813 -725
145 -725 3153 5882 -4175 -9208 7339 11879 -10074 -9559 6174 516 -1287 4353 2523 3159 -5380
160 -5380 -13336 2501 12105 1291 -5795 -3727 1404 631 117 5502 -5411 -11238 9802 9881 -8523
175 -8523 -2367 4133 -2512 -1592 1563 3313 1833 -2242 -644 -1252 -325 5805 -1030 -5255 1957 -2226
191 -2226 1775 11163 -5027 -14008 3131 10516 1089 -7650 -3326 5635 -51 -3055 2701 -1366 -615
206 -615 2187 -5123 -279 5823 -2307 -793 2044 -4204 153 6250 1436 -6796 -5602 8463 7333
221 7333 -8098 -1996 5889 -2695 -1568 1563 -557 2945 -835 -4974 2447 4202 -349 -3990 -3837
236 -3837 3448 3285 -542 1866 -5348 -5751 8493 2468 -8656 667 5939 1325 -2775 -4002 2015
251 2015 2928 -2177 -1799 -1914 3799 8813 -4430 -8840 2589 3031 1674 1161 -5322 -531 6267 1193
267 1193 -3422 -4186 800 4400 -1844 -439 3340 -2617 -66 1024 -6189 792 6778 -1025 -3305
282 -3305 -802 2197 2640 -4097 -3236 2463 861 2429 1216 -2783 1800 -1224 -5264 3739 3403 -2548
298 -2548 974 749 -787 515 -467 460 -2635 -2736 6698 3380 -5614 -1083 711 300 1010 -3601 442
315 442 5462 -2039 -3279 1027 459 399 -2337 -1208 4257 -74 -650 2596 -3485 -2640 2538 -112 954
332 954 915 -1692 2475 547 -3619 668 1185 -111 -769 -1844 4986 3522 -6727 -2109 3565 -396
348 -396 95 162 -396 1314 -2106 -399 2358 -2861 -763 2443 -733 1436 961 -1826 390 -2382 -1488
365 -1488 4686 744 -2081 -138 -862 2594 816 -5123 536 3185 -743 608 -141 106 1312 -3248
381 -3248 -180 3420 -1748 -331 1457 -1199 1071 -557 -2119 2174 -664 -1161 2915 -1114 -1633 1395
397 1395 61 227 -1760 -1631 4641 1178 -3882 -16 -23 816 2317 -3174 -1063 3560 -706 -443 849
414 849 -860 -105 -1525 632 3458 -2607 -1190 3200 -2324 -905 3025 -1403 -1012 -27 -707 2452
430 2452 46 -2414 397 233 1547 -71 -3571 3008 2606 -5408 -80 3741 -753 -516 -1018 -555
446 -555 2523 -215 -588 149 -2177 1237 1676 -910 887 -2057 -1459 4942 -1052 -4729 2749 1720
462 1720 -1793 -447 -118 1484 19 -1822 1251 -504 -172 2202 -2914 -1021 3389 -2610 -766 4444
478 4444 -1856 -2977 1664 1157 -244 -1375 698 1402 -2748 1373 3478 -3874 -1081 2625 -1447 1742
494 1742 1402 -4285 320 3233 -568 -1578 -375 2189 66 -3173 2389 1128 -3551 2396 1273
509 1273 -4026 1842 2343 -1726 300 -982 -1265 1827 1105 -541 -2602 -196 4374 -1312 -2650 3502
525 3502 -1758 -3148 4455 607 -3296 636 550 539 582 -837 -251 -966 810 1739 -2454 1057 2847
542 2847 -4824 -533 5144 -2299 -1640 3178 -912 -2521 223 2156 739 -2942 426 2004 -1388
557 -1388 1568 -123 -3935 3209 2188 -4862 1431 3802 -2975 -1412 2329 1182 -2532 -1758 3383
572 3383 -94 -3257 2998 638 -3068 2450 -265 -2350 3449 -161 -3833 1505 2194 -983 -1376 1642
588 1642 1631 -4272 -1164 5733 -1053 -3016 2612 -1587 -1359 3195 -1351 -1356 2307 -235 -1719 -22 1378
605 1378 -499 -2990 2699 2723 -4899 534 4267 -3711 -927 3490 -1621 -1123 577 -584 1143 1502
621 1502 -62 -2434 -1575 3820 -30 -3763 3639 773 -5400 2635 3339 -3151 103 1789 -1138 -1087
637 -1087 526 1764 -730 -940 1547 -1994 -671 4374 -2621 -3275 5102 -263 -4281 2077 1340 -1872
653 -1872 585 2401 219 -3467 -172 2605 -1840 358 3059 -3563 -896 3583 -2295 19 3901
668 3901 -2544 -3508 1834 2493 -709 -1748 2014 239 -3987 2207 2981 -3579 473 1723 -3079 1586
684 1586 2060 -2969 73 2161 -565 -1394 593 1886 -2538 -2118 5140 20 -4736 2421 1068 -2527
700 -2527 2772 981 -3009 215 115 -566 1238 1781 -180 -3676 265 3981 -2507 -1034 4259 -3224
716 -3224 -3471 4351 1060 -2096 370 -269 -427 382 735 79 -2028 1174 1212 -2885 2149 2506 -5168
733 -5168 236 4598 -2180 -1623 1743 -591 -1317 504 2254 191 -2942 664 735 -1123 2911 -360
749 -360 -4249 2594 1499 -2969 2292 1983 -3036 -1680 1579 1878 -1244 -1379 2095 -1155 -1777 3395
765 3395 -462 -2183 2023 -1502 -1399 3658 -713 -3140 1106 1756 -446 -1282 1262 1265 -3598 -16 4321
782 4321 -2155 -1799 2340 -1608 -221 2463 -1351 -622 790 -1061 -386 1000 1707 -870 -3035 2524
798 2524 2113 -3819 1269 2424 -3393 -366 2239 -478 254 -339 -944 706 212 513 -766 -1061 2004
815 2004 -1004 -1984 3917 -88 -4009 2268 1659 -1896 -32 177 -6 -441 -563 1628 216 -1090 839
832 839 -1194 336 2521 -2629 -1411 3131 -1438 -1529 2406 188 -1514 -598 971 1354 -1910 -477
848 -477 1970 -1491 -17 1667 -1598 703 1078 -2682 994 1974 -1990 -541 855 697 -381 -1299
864 -1299 1832 827 -2970 1062 1428 -1970 916 323 -1371 1538 -153 -1293 1366 -178 -922 -106
880 -106 162 1542 -1167 -1666 2830 -340 -2128 2070 128 -1411 794 -550 306 890 -1368 246
896 246 656 -459 523 -964 182 1480 -2142 -221 2603 -1463 -847 1549 -550 208 -314 -759 1365
913 1365 -584 -1114 1513 -149 -200 259 -1411 1584 628 -2685 1178 1446 -1711 266 267 24 548 -1452
931 -1452 491 1416 -1884 36 1047 -788 679 -423 -566 2048 -953 -1478 1897 -278 -601 346
947 346 -447 917 -387 -1685 1967 240 -1652 820 -124 9 639 -1559 699 1371 -1598 572 906
964 906 -1047 357 -491 -379 1537 -1340 -419 2005 -951 -510 622 -268 1022 -857 -1326 2172 -184
981 -184 -1563 1405 -305 -345 694 -982 850 592 -1824 523 826 -428 361 -981 262 1599 -1918
998 -1918 62 2160 -1725 -728 1217 -498 325 -374 -496 1540 -665 -822 1175 -587 96 -40 -1200
1015 -1200 2049 722 -2576 1120 969 -1592 417 347 4 -33 -1006 1064 830 -1795 569 384 -833
1032 -833 1392 -809 -1056 2174 -1090 -1492 2028 172 -1186 -256 291 1248 -936 -851 1996 -1016 -1245
1049 -1245 1883 -748 -194 1131 -1784 82 1816 -1219 -647 788 197 -158 -867 1176 1076 -2977
1065 -2977 213 2524 -1874 -54 1435 -1256 479 541 -1112 816 209 -716 -17 79 1291 -531 -1930
1082 -1930 2309 431 -2734 1908 1258 -2249 338 726 -447 315 -575 87 358 -518 703 -474 -368
1099 -368 1638 -1938 -911 3241 -1190 -2377 2266 323 -1253 347 167 110 -844 25 1400 -922
1115 -922 -129 1203 -1813 627 1838 -2589 281 2626 -1882 -922 1838 112 -977 -489 1467 515
1131 515 -2106 977 1094 -2094 1125 1028 -2206 1344 907 -2516 1007 1553 -1359 -870 676 1050 -1059
1148 -1059 -897 2682 -495 -2548 2247 403 -2030 1492 -55 -1297 1451 -19 -952 650 510 -434
1164 -434 -1302 700 1695 -2338 -436 3340 -1753 -1837 2428 -667 -1064 1339 -256 -350 183 -383 -93 -25
1182 -25 1080 195 -2229 1378 1286 -3211 980 2814 -2553 -806 1954 -450 -650 401 342 -104 -943
1199 -943 566 -96 -1081 1745 -320 -2238 2444 278 -2985 1880 1650 -2221 -269 1279 61 -961
1215 -961 76 2013 -974 -1457 1817 -720 -1037 2483 -1060 -1531 2333 -554 -1782 1709 1020 -1292
1231 -1292 -992 978 761 -1964 480 2432 -2099 -659 2137 -1472 -307 1922 -1510 -426 1414
1246 1414 -882 -818 953 1172 -851 -1761 1843 522 -2868 1701 2070 -2579 250 1352 -1474 413
1262 413 965 -769 47 236 -174 -698 284 1790 -1282 -1675 2864 -402 -2645 2426 1012 -2256 463
1279 463 812 -722 49 307 459 -521 -198 615 -1433 314 2194 -2097 -758 2799 -1436 -1743 2331
1296 2331 324 -1479 -17 669 238 -998 586 1130 -1531 359 942 -2006 1200 1591 -2470 358
1312 358 2001 -1551 -706 1366 431 -1124 -678 1386 -8 -1841 1573 844 -1851 1158 223 -1926
1328 -1926 1465 500 -1782 685 801 -1090 -620 933 1226 -1458 -830 2218 -1119 -1852 2295 -10
1344 -10 -1446 1268 -329 -821 1317 -188 -704 332 266 -258 -1108 906 1386 -2347 117 2610 -1681
1361 -1681 -1099 1883 -683 -756 742 -283 -41 -14 109 140 -351 746 -173 -1748 1501 826 -2503 947
1379 947 1580 -1971 -122 1272 -176 -395 -301 396 204 -768 999 -46 -984 1292 -509 -1283 2066
1396 2066 -323 -2032 1423 735 -1157 -50 502 324 -825 -401 1334 -829 -1004 1286 -612 -320
1412 -320 1462 -1237 -516 1612 -914 -732 1032 154 -572 -564 774 825 -1655 245 1535 -1451 -160
1429 -160 1333 -975 37 685 -1047 617 750 -785 -147 175 517 -389 -1024 1392 284 -2020 1026
1446 1026 1069 -1415 393 491 -702 497 -339 -232 640 -272 -29 -72 -91 974 -985 -948 1845 -526 -1335
1465 -1335 1499 61 -933 309 58 363 -35 -757 657 -23 -456 456 -532 132 950 -1326 118 1400
1483 1400 -1163 -359 1025 -179 -225 -290 173 779 -819 -238 990 -544 -58 232 -690 885 279 -1214
1501 -1214 987 743 -1094 224 173 77 118 -736 766 383 -1074 658 463 -801 460 -254 -259 831
1519 831 -624 -344 1057 -287 -410 171 -103 582 -616 -636 1405 -155 -1015 621 46 -82 282 -527
1537 -527 553 376 -1104 363 419 -568 379 -116 59 648 -949 52 928 -815 -337 435 -152 446
1555 446 -697 -413 1329 -453 -958 874 -21 -298 34 -443 666 101 -826 763 6 -545 505 -367
1573 -367 206 549 -933 316 936 -1076 -10 727 -198 12 -391 48 801 -1009 -448 994 -370 74
1591 74 318 -621 786 -94 -1079 823 405 -730 359 119 151 -159 -715 752 262 -1071 707 290
1609 290 -717 417 -142 -173 733 -759 -597 979 14 -412 -57 272 740 -939 -499 1258 -670 -744
1627 -744 1019 -258 -378 599 -496 24 403 -481 246 221 -166 14 -646 661 650 -1464 415 1331 -1258
1646 -1258 -367 944 -361 -39 -165 -145 624 -238 -192 180 -322 626 -202 -1038 1080 227 -1474 905 584
1665 584 -1114 247 370 -47 -259 -382 685 -39 -786 640 -36 -381 939 -812 -421 1612 -568
1682 -568 -1058 978 210 -511 -165 457 587 -790 -125 992 -881 -249 1054 -902 -236 899 -822
1699 -822 86 950 -912 -294 779 177 -465 -590 1192 321 -1532 682 1116 -1204 161 495 -925
1716 -925 505 430 -702 114 528 -146 -352 2 607 -543 -686 1418 -456 -1489 1456 379 -1317
1733 -1317 604 440 -481 87 -263 -62 162 30 27 -733 260 1205 -1267 -334 1680 -790 -1139 1419 -57
1752 -57 -719 381 128 -154 -426 325 535 -759 113 524 -986 668 657 -1489 567 1355 -1389 -484
1770 -484 1144 182 -638 -252 685 63 -769 860 276 -1012 889 67 -1544 960 568 -1107 694
1787 694 541 -979 -165 714 190 -1053 -127 1462 -752 -1206 1484 99 -862 765 -506 -700 1124
1804 1124 -175 -885 495 573 -424 -802 595 877 -1162 9 1291 -1353 -378 1580 -608 -646 917
1821 917 -175 -169 150 -32 -25 94 364 -507 -1070 1431 574 -1846 715 1221 -1492 -212 857 -350 23
1840 23 183 -172 -299 12 735 -204 -584 997 -487 -1046 1334 -135 -1342 1436 382 -1405 58
1857 58 881 117 -566 -50 743 -446 -417 764 -620 80 1210 -1303 -764 1427 -346 -789 823 212
1875 212 -700 4 578 16 -984 617 900 -1349 -199 1144 -661 185 604 -1201 138 824 -623
1892 -623 -403 829 444 -703 -793 1210 390 -1212 799 452 -1267 686 579 -977 477 368 -369
1909 -369 -38 70 -34 -85 112 558 -990 -357 1718 -605 -1393 1365 299 -1101 304 173 -109 432
1927 432 -185 -296 45 244 334 -659 227 921 -1199 -128 1156 -959 -422 1256 -409 -801 346 395
1945 395 -7 -613 126 618 -586 149 173 -922 944 570 -1520 541 1031 -842 -277 427 202 -249
1963 -249 -261 510 -25 -659 812 -45 -1073 637 180 -623 724 -183 -651 862 215 -717 -133 414 436
1982 436 -754 -296 1219 -336 -823 742 -298 -320 698 -524 -320 753 -236 -230 190 21 -5 -390 279
2001 279 226 -977 407 1060 -1146 -248 1079 -274 -268 174 -297 375 54 -397 48 62 373 -93 -889 871
2021 871 328 -1147 483 388 -780 391 347 -381 -61 18 251 -46 -473 427 135 -325 378 -287 -352 1022
2041 1022 -526 -729 943 204 -501 -15 48 411 -141 -401 499 -147 -209 513 -418 -165 583 -509 66
2060 66 666 -572 -4 638 -315 -274 -42 359 321 -866 112 919 -574 -50 299 -361 474 -122 -791 407
2080 407 218 -490 20 9 238 132 -504 405 155 -772 569 229 -805 263 194 -90 112 -419 25 582
2100 582 -474 -109 69 4 411 -649 -317 793 -277 -679 405 -62 -103 208 -353 192 65 -544 328
2119 328 36 -386 317 -84 -13 192 -470 277 558 -779 -56 551 -98 76 -365 -23 693 -437 -348 580
2139 580 -24 -66 63 -336 340 -37 -410 478 -39 -421 546 -198 -100 203 -421 315 136 -761 251 511
2159 511 -425 48 -200 245 474 -718 -195 657 -248 -80 70 -260 437 -76 -487 493 3 -385 241 -258
2179 -258 -27 150 -125 406 -13 -612 668 221 -548 159 -57 -67 141 -518 58 516 -301 -126 -36 -44 439
2200 439 -545 -332 817 -375 -233 627 -250 -198 282 -253 84 -115 -213 454 -183 -218 363 -202 158 357
2220 357 -760 371 750 -846 -86 612 -97 -8 -236 67 349 -447 -10 261 -433 287 180 -517 571
2239 571 57 -711 521 -12 -620 111 140 -9 -240 -147 549 -83 -715 539 246 -456 413 -225 -190 697
2259 697 -465 -471 443 146 -179 -89 128 463 -535 -56 759 -657 -224 765 -376 -213 411 -306 44 243
2279 243 -436 83 277 73 -152 -424 564 253 -941 334 807 -774 -51 434 -355 135 81 -189 172
2298 172 -38 105 59 -230 358 -170 -522 727 -5 -935 876 238 -799 158 342 -53 -65 -54 376 -59
2318 -59 -212 326 -325 -136 644 -560 -259 937 -333 -507 609 1 -498 -41 212 70 -361 95 550
2337 550 -555 -156 600 -472 202 368 -740 166 703 -588 -226 371 31 -308 -301 544 153 -754 364
2356 364 385 -798 304 246 -591 389 141 -491 149 234 -182 13 368 279 -475 -385 1000 -203 -812 759
2376 759 53 -773 312 57 -153 385 -138 -102 43 92 118 -380 226 660 -846 40 958 -657 -361 857
2396 857 -210 -414 236 15 36 -82 197 144 -276 120 77 -601 504 330 -931 245 658 -703 -109
2415 -109 581 -73 -256 -166 229 -57 -374 524 115 -620 562 -12 -576 719 142 -783 480 248 -540
2434 -540 35 393 171 -481 -78 627 -223 -332 668 -295 -519 516 -340 -306 649 -39 -420 305 150 -211
2454 -211 -274 445 387 -706 122 896 -689 -188 684 -455 -250 223 -282 7 257 -119 -61 77 263 -142
2474 -142 -486 609 190 -902 460 532 -699 106 506 -266 -34 -4 -143 3 26 229 -46 -120 385 -333
2494 -333 -325 844 -108 -636 713 294 -564 229 312 -101 -160 24 328 -266 -60 478 -373 -13 559 -523
2514 -523 -245 781 -383 -433 545 35 -360 14 304 125 -486 196 427 -387 78 366 -483 210 353 -590
2534 -590 99 473 -378 -85 205 16 -145 -188 523 48 -595 467 316 -579 235 114 -326 288 -15 -194
2554 -194 287 110 -223 -181 138 362 -494 -239 654 -282 -450 478 14 -501 336 -95 -63 194 -23 1 66
2575 66 38 137 -269 93 417 -653 39 785 -459 -351 436 -88 -291 65 90 157 -136 14 262 -253 120
2596 120 145 -405 524 263 -632 319 278 -525 95 217 -61 -23 -129 241 35 -356 309 128 -210 170 -3
2617 -3 -229 497 -97 -322 262 -62 -288 -41 134 229 -296 -233 426 -177 -250 417 -88 -176 239 -249 81 215
2639 215 -300 -74 285 19 78 -196 210 150 -478 2 411 -362 -72 308 -183 56 99 -195 258 -38 -324
2660 -324 95 -15 142 0 -271 255 45 -572 289 264 -348 200 33 -122 124 -162 10 249 -233 53
2680 53 109 -169 111 -303 -167 468 -153 -296 251 82 -145 72 -86 144 -151 -158 419 2 -227 262 -27
2701 -27 -46 156 -397 144 326 -305 58 262 -196 68 24 84 306 -230 -60 298 -183 9 160 -108 282
2722 282 7 -334 331 20 -214 238 -11 -90 -10 -197 163 140 -302 212 95 -298 -45 -25 160 308 -289
2743 -289 63 317 -227 -42 158 -191 78 -109 -159 348 -81 -174 264 -56 32 -22 -148 300 -38 -415 263
2764 263 -17 -257 111 -97 -47 210 -232 78 150 -226 72 52 -134 50 -76 -78 435 -345 -241 341 -49 -37
2786 -37 51 8 160 -176 -83 241 -127 -119 252 -132 47 306 -366 119 308 -318 -121 116 -50 -21 -79 84 115
2809 115 -180 142 217 -266 82 72 -238 269 -2 -360 137 145 -311 118 -22 132 -109 -193 304 -51 -382 362
2831 362 103 -346 232 57 -118 242 -198 -127 171 -95 -24 -136 62 232 -249 -98 483 -308 -258 292 16
2852 16 -239 182 -4 119 51 -205 114 -7 -23 101 -246 124 364 -562 4 364 -538 -33 264 -78 -89
2873 -89 -13 32 96 -131 149 -9 -240 136 45 -316 362 122 -532 309 229 -403 -22 164 10 -259 -99 286
2895 286 -151 -343 212 -28 -226 297 -135 -192 359 -162 -230 246 94 -225 -151 143 128 -293 -111 442 -346
2916 -346 -151 449 -192 -141 296 -180 103 261 -146 -63 126 130 -32 -166 320 132 -517 188 315 -441 32
2937 32 243 -186 -82 76 -92 134 26 87 1 -61 175 -198 -242 484 -54 -645 325 59 -434 51 292 -155
2959 -155 -119 -9 187 -15 -46 193 -176 -4 335 -383 -105 521 -212 -356 347 -83 -158 -61 161 9 -153
2980 -153 -28 307 -218 45 232 -352 118 303 -517 100 496 -347 62 114 27 -272 -139 248 41 -414 295
3001 295 88 -310 145 93 -253 192 218 -368 154 281 -106 -15 119 268 -286 -117 555 -38 -422 429 -14
3022 -14 -397 218 31 -159 132 -119 -72 29 57 63 -173 76 199 -414 -16 551 -272 -237 416 -106 -185 165
3044 165 -38 -7 -143 -32 -41 -141 160 131 -307 298 132 -454 112 386 -362 29 289 -76 -126 -59 321 30
3066 30 -213 156 6 -282 133 -68 -317 427 48 -520 220 95 -342 -58 48 -29 -130 45 299 -44 -223
3087 -223 299 26 -210 306 -194 -176 362 -35 -213 334 95 -100 -52 123 125 -265 93 321 -271 -158 361
3108 361 -198 -15 233 -165 -33 220 41 -36 54 2 -128 -192 291 0 -542 157 185 -472 116 237 -239 8
3130 8 8 -32 26 -64 -8 -11 -139 188 -215 -176 420 -81 -358 304 -29 -415 114 18 -36 62 -26 0 -110 -55 236 -247
3156 -247 -68 309 -275 -90 400 -204 -44 318 -12 -243 -99 39 67 -353 15 236 -321 5 293 -277
3176 -277 44 154 -320 171 187 -319 -99 98 -20 -15 -172 258 59 -416 189 146 -232 178 68 -47 211
3197 211 -51 -108 124 22 -107 -45 135 110 -282 -211 276 -95 -350 304 -49 -212 124 -91 19 148 -111
3218 -111 15 207 -109 36 -182 -47 214 -244 68 403 -312 -69 175 -60 -4 75 66 72 -57 8 79 -87 -31
3241 -31 44 -194 282 15 -367 225 238 -238 85 94 85 114 -175 80 162 -209 161 156 -243 147 -50 -148 285 -66
3265 -66 -184 217 -81 -122 -38 -87 122 -129 -79 284 -53 -272 112 -65 -75 110 -177 61 212 -182 85 118
3287 118 51 74 -31 22 176 -334 28 159 -205 -64 141 -141 110 40 -178 227 -117 -311 38 -53 -52 56
3309 56 -98 222 114 -240 225 23 -224 -23 44 -33 184 -127 -12 170 -213 -7 195 40 71 -67 -135 59
3331 59 -31 -192 206 -110 48 64 -221 162 -23 -187 137 78 -191 84 24 2 100 -174 78 109 -271 60 132
3354 132 -68 168 -52 109 216 -71 -132 296 -67 -62 -25 -21 273 -112 -153 236 -74 -232 168 -32 -89 61 -187
3377 -187 -22 113 -122 -9 148 -96 64 15 20 106 -236 -17 220 -366 82 110 -194 135 -22 -96 126 2
3399 2 -52 168 -100 50 53 -102 238 65 -279 146 50 -215 3 -66 -28 135 -86 14 78 -154 48 44 34 116
3423 116 -180 -126 277 -296 -129 339 26 -233 195 -37 137 -29 -93 213 -116 -62 199 -169 -57 74 -246
3444 -246 117 176 -214 4 87 -75 63 -57 21 88 -251 65 134 -130 -36 27 -154 176 78 -204 242 125 -248
3467 -248 -38 52 69 -23 -127 230 -5 -365 104 94 -167 119 -71 -181 140 -130 -93 71 -99 -22 -110 13
3489 13 91 -177 -123 407 -232 -197 304 -13 -127 221 -67 77 126 5 82 -66 21 138 -227 227 129 -300 113
3512 113 276 -269 -63 213 -168 -40 -4 105 38 -136 27 69 -67 176 1 -233 280 -7 -292 248 123
3533 123 -250 -73 -12 8 -88 -83 124 63 -168 46 -64 -147 388 -175 -176 241 -92 -186 215 23 -178 -58 162
3556 162 133 -210 -50 121 -104 -20 239 -196 -4 171 -208 -47 194 -16 -71 28 52 -48 -135 83 114 -283
3578 -283 108 230 -290 85 164 -113 -5 81 -87 115 137 -22 -74 -57 139 -53 -261 307 -63 -265 210 72
3600 72 -81 122 20 -19 -2 -11 53 -22 -123 105 -142 -58 191 -169 -26 315 -137 -246 220 -67 -94 0 125
3623 125 92 -173 -36 113 -138 51 219 -166 -25 272 -281 60 213 -116 -6 96 16 3 -112 172 175 -225
3645 -225 128 145 -97 160 172 -206 111 22 -47 232 198 -147 8 35 126 -37 -14 299 -30 -335 304 -70 -125
3668 -125 256 -1 -216 -3 -30 -64 99 77 -41 -111 55 189 -274 -83 295 -174 -213 100 -82 -80 156 32
3690 32 -12 -27 4 -2 -59 74 55 -139 123 210 -300 87 234 -189 94 170 -167 12 -102 -22 -2 -92 88 3 -135
3715 -135 135 80 -181 139 -10 -347 129 -36 -224 -93 59 -125 -147 -55 137 -118 -32 289 60 -134 147
3736 147 -9 -126 174 -120 -110 244 26 -36 63 46 106 -75 -78 274 -334 -107 231 -57 24 111 -221 -29 210
3759 210 -87 19 -55 -18 -47 -163 50 -15 -301 142 183 -319 -32 218 -104 119 -1 -111 88 -18 85 -54
3781 -54 -116 67 -109 -123 175 20 -332 145 22 -135 -66 141 -10 -3 14 -5 131 -33 179 -99 -56 132 -225
3804 -225 4 237 -206 -105 151 -35 -17 -26 12 81 -16 -96 182 -176 39 4 -113 -16 2 -131 51 96 -219 73
3828 73 87 82 83 -27 -19 34 -157 28 80 -161 117 -7 -130 173 4 -124 48 -34 -108 175 10 32 -118 3
3852 3 271 -30 -133 255 -34 -237 54 -35 43 53 -187 -41 98 -74 144 -177 78 80 -101 64 81 -66 37
3875 37 44 -20 -67 -23 -29 186 -34 -4 202 -120 79 58 -63 86 -14 -176 176 149 -141 -40 -10 -1 121 -35 43
3900 43 108 -104 36 94 -94 88 -101 7 44 50 -86 67 -61 -55 64 -96 15 -62 -18 67 -72 -107 77 -41
3924 -41 -55 21 -44 117 134 -109 -21 56 -9 -7 16 -30 36 -235 -72 152 -65 -105 25 -15 54 -44 -19 296 -54 -57 169
3951 169 -93 -51 15 -23 34 53 -124 35 26 -10 103 -102 44 -82 -75 18 189 -55 51 76 -132 28 3 -26 24
3976 24 -16 -52 78 14 14 -33 -113 149 68 -168 69 124 -151 119 78 37 -77 -139 71 10 -77 44 78 -61 201
4001 201 -161 -50 144 -64 -77 134 -11 2 -2 11 21 -100 -92 102 -38 44 12 -73 -97 123 -67 72 208 -64
4025 -64 13 70 134 -126 -78 14 153 -238 48 160 -160 -29 26 -21 86 -48 -148 59 41 -68 -49 122 88 36
4049 36 -58 115 66 -133 148 -13 -108 8 103 -23 8 -5 22 44 -27 122 14 45 99 -106 -58 262 -27 -154
4073 -154 224 30 -171 29 138 13 -16 -89 64 -107 112 133 -51 -74 217 -227 84 86 -208 -58 209 64
4095 64 -87 28 108 65 -129 12 78 -95 124 7 -164 190 70 -143 8 94 -216 -16 134 45 -118 -52
4117 -52 247 71 -104 179 21 -212 107 -65 -140 38 8 -34 133 16 -14 80 -27 197 -59 -149 276 -164
4139 -164 -242 160 -181 12 89 55 -38 106 -114 51 -85 47 63 -41 88 117 -207 -78 216 -97 -127 135
4161 135 -11 -61 20 -36 139 -66 -4 -76 -11 151 34 -110 133 133 -197 164 163 -58 -25 -34 0 -45 12 42 -19 -227
4187 -227 93 41 -10 205 -65 -88 186 -33 -114 171 -8 -184 101 33 -14 -124 12 191 -6 -42 259 -82
4209 -82 14 177 -92 32 31 -183 -10 -63 6 11 -40 83 11 -292 88 149 -213 -62 85 -24 59 132 -14 38 -15
4234 -15 -16 -64 -77 77 -177 -82 215 87 -124 320 71 -140 4 83 -141 121 26 -117 -43 -35 155 -182 49 159
4258 159 -118 -45 169 -144 -67 290 -53 -54 -9 -20 45 28 -56 57 -52 -46 26 -214 67 209 -159 -30 231 -295
4282 -295 -46 224 85 17 -57 170 -34 -257 152 125 -85 61 35 -171 241 45 -159 147 -27 -112 -82 31
4304 31 90 -118 -14 168 -104 -191 104 9 -108 170 -44 29 146 -133 -103 74 103 -53 -36 18 73 -171 12
4327 12 293 -150 -86 99 -20 9 74 -21 -20 31 -102 28 -32 101 112 -114 135 -6 -129 89 133 -274 140 28
4351 28 -160 -78 -32 8 44 -26 38 -27 -99 -58 -28 -197 132 46 -157 17 2 -90 -14 -28 82 -51 -110 39 36 -30 137
4378 137 -86 104 85 -125 103 172 11 -56 115 -85 -81 16 16 34 -133 -24 77 -57 -21 12 -113 19 6 -139
4402 -139 -60 0 -170 65 -48 46 53 -118 81 15 -223 81 57 -123 4 42 -172 144 -46 -65 42 -108 -9
4425 -9 53 -28 66 -82 -66 101 -31 -110 112 -17 -58 -9 -50 87 -16 -35 20 71 11 22 -4 -69 83 -165 -68 206
4451 206 -98 -80 -2 -25 56 -95 -59 35 -24 -10 70 41 -60 9 -100 58 202 -121 97 95 -184 -23 21 55 44
4476 44 -34 -35 95 -115 47 143 -22 16 25 -214 16 -95 -83 -52 46 40 73 38 79 -104 -75 107 -138 57 95 -55
4502 -55 59 72 12 5 20 -139 -46 43 -61 28 -131 -4 -37 -41 -22 22 -40 -65 50 -98 -22 4 -49 153 15 -89
4528 -89 141 24 -2 44 -96 10 94 -80 -22 -52 -38 13 -46 24 44 -95 198 91 -118 7 30 -98 52 5
4552 5 -44 68 -84 130 153 50 -28 58 -135 76 -35 -80 91 19 -18 13 -18 91 -63 -70 86 161 -58 89 -10
4577 -10 -82 104 111 -119 230 -92 7 112 -69 42 -10 60 15 -81 -172 173 -75 -24 194 -108 -70 93 -53 -1
4601 -1 83 -24 117 107 -70 -58 -44 -51 27 -146 3 139 -164 32 121 -93 54 47 -56 64 -70 -3 61 -54 77
4626 77 -54 -73 81 83 -238 139 157 -84 100 -11 -119 7 -38 -43 18 2 53 -5 -107 113 -78 -170 49 -28 -21
4651 -21 35 56 -108 -10 33 15 -74 -94 107 -33 -13 163 -43 -10 93 -72 33 131 -129 -41 59 -8 29 -15 -2
4676 -2 106 -25 61 33 -29 31 113 -12 67 98 -31 62 55 97 22 -13 -9 -60 -12 161 50 -211 121 61 -158 -55 -38
4703 -38 -85 7 2 76 51 -10 97 122 -49 93 -161 -87 222 -117 -125 21 -71 -49 149 75 98 38 121 81 -15 36 67
4730 67 -2 -25 198 -87 7 101 -45 66 27 7 35 -107 32 55 -25 124 -27 -97 130 -35 -3 46 -14 -19 56 34
4756 34 -117 62 5 -51 -149 -70 92 -110 -36 -1 -69 -16 112 37 -97 108 64 -172 84 -28 -4 -64 128 190 -160
4781 -160 -3 91 -125 -201 137 95 -8 -23 -43 -30 -111 55 -12 -12 -1 -39 -62 98 86 -261 -17 113 -243 -4 49
4806 49 -88 -12 64 -39 -13 75 -69 -3 40 102 -37 -47 165 25 -94 79 -11 -156 -43 111 -148 -70 115 57
4830 57 -76 7 94 3 -93 107 -72 -153 161 -129 -93 115 -123 -151 30 -81 -55 49 -6 -83 -107 -60 79 -116
4854 -116 29 114 -186 -46 8 -3 49 104 14 -66 -53 4 -14 -173 79 109 -71 72 91 -19 -10 81 -42 -22 150
4879 150 -93 -3 64 130 -38 -32 144 -51 -69 75 27 -103 103 -30 -9 0 32 42 47 25 53 -4 39 164 -118 -97
4905 -97 95 -141 0 46 -176 -65 -41 123 69 96 -43 93 59 -11 42 -6 88 67 -67 114 100 -129 49 -7
4929 -7 14 -92 -47 -65 15 -33 101 -12 -145 105 -2 -92 18 -5 -79 92 53 -15 17 91 71 -154 -134 112 32 -118
4955 -118 151 -26 -24 54 14 11 129 -72 63 71 -31 -40 -19 -5 20 -26 25 213 -6 59 47 -43 57 -21 -3 100 -53
4982 -53 43 -55 -117 33 43 -74 83 137 -57 57 27 -75 -53 59 9 19 29 6 -45 10 88 157 -16 56 -27 -2
5008 -2 76 -67 -96 -4 -17 -85 -87 136 147 -113 -49 32 37 -18 -11 -53 -8 30 -120 20 58 45 -55 81 -46 -1 7 35 83
5037 83 -39 -157 160 12 -47 134 -40 21 23 -80 -22 -4 -6 5 33 -58 0 -42 -39 7 -84 43 21 -100 -3 1 -102
5064 -102 78 -90 -51 47 2 -26 98 -40 90 -10 -46 18 -45 -114 41 46 -71 32 -96 11 60 -217 21 29
5088 29 -13 147 -57 15 -9 -90 -34 120 -50 -42 2 75 46 23 -114 36 -26 -32 78 25 -14 0 -54 102 107 -142 131
5115 131 19 -94 -44 -66 42 56 -23 84 4 -44 67 13 -80 13 -85 -86 65 -79 -47 73 -121 -52 64 -47 44
5140 44 21 -160 71 -56 -66 130 -51 -4 6 -59 7 -24 -105 88 -26 -19 9 -109 24 58 -55 1 28 -55 -119 -46
5166 -46 43 74 17 -60 116 48 -6 10 -7 -31 -17 -119 80 32 -60 -21 34 -36 26 150 2 217 11 -11 -10 -111 40
5193 40 76 34 14 -77 -93 -26 52 -20 28 5 -105 -39 3 64 12 -108 128 118 -109 38 83 -43 0 -18 63 -58 -20
5220 -20 54 42 -48 90 59 -139 78 -63 -146 65 -36 -59 -18 1 94 -108 -39 41 -39 39 61 -106 30 -26 -67 56
5246 56 -20 -69 -53 76 -11 -40 -90 13 142 -74 -12 56 -88 -40 117 -67 1 70 -55 18 -10 91 10 66 -126
5271 -126 37 33 75 -51 -166 59 44 -74 56 3 -33 43 64 -11 -22 10 18 -32 -118 130 4 -70 87 11 -21 68
5297 68 89 9 60 -13 -29 -30 -43 23 -81 -31 62 -20 33 70 -134 -115 36 -6 -115 6 76 60 -60 64 31 -153 -39
5324 -39 56 -29 45 84 -115 3 -15 -43 78 31 -99 -8 -93 -84 -32 -11 86 28 -123 -6 27 -92 48 -39 -38 109 -23
5351 -23 -109 68 -82 -14 -89 -6 22 -23 -174 106 9 -175 59 -26 -93 81 -28 -89 10 38 -7 7 165 -67 1
5376 1 68 98 -11 -83 6 -74 -53 2 -85 -84 84 22 -53 54 -27 -46 -52 109 46 -41 76 57 -98 94 -70 -103 -41 46
5404 46 -19 -81 80 204 74 -51 115 -40 -60 -64 21 8 74 -132 -5 27 18 -20 -127 77 53 -160 -67 136 15
5429 15 -13 100 14 -2 101 -66 -15 -9 42 -9 -54 71 64 -26 55 82 -123 13 41 -15 89 39 -69 7 -55 -87 69
5456 69 -34 47 44 -90 29 -9 0 96 27 -166 43 116 -13 -17 85 63 -94 -43 82 62 -37 9 -123 76 80 -26
5482 -26 16 275 -1 -149 44 -57 17 -5 -2 14 -6 -51 63 -154 -46 36 63 -56 98 -105 -4 -46 -110 -55 -15
5507 -15 -26 -12 -56 102 69 -105 141 43 0 -12 28 -2 17 -39 -92 39 15 -96 -41 20 43 71 -74 87 -90 -67
5533 -67 -9 22 -40 0 -42 -122 8 -26 -2 29 -72 -3 -14 83 37 -157 -79 93 3 47 19 -26 0 30 51 56 -17 50 -5
5562 -5 -67 31 62 -140 53 17 -174 42 4 -16 48 172 -9 -54 -78 104 125 -46 98 86 -17 47 22 -4 51 -98
5588 -98 -43 65 88 56 23 29 75 -159 -104 39 -34 54 80 52 -54 173 -85 -50 73 -33 77 -44 -24 5 9 -24
5614 -24 128 -81 -51 132 26 -92 117 -9 17 219 97 40 2 -78 -27 44 58 11 84 114 42 -99 42 -44 -39
5639 -39 34 30 13 118 -97 -7 81 -68 -8 -21 0 52 26 -135 74 -5 -49 27 62 -103 120 33 66 -5 37 65 15
5666 15 -34 142 -29 157 106 -54 17 60 -158 -70 50 -24 115 -37 38 9 -99 50 83 47 -61 -48 42 26 -99
5691 -99 -128 16 -46 -22 31 80 26 13 -14 35 9 -52 108 -61 1 -64 74 105 113 36 -29 131 24 -37 12 5 -130 -74
5719 -74 -140 -2 -60 75 9 -73 32 71 77 -7 -100 8 -13 81 36 -91 83 26 33 14 -138 154 8 13 105 -11 67
5746 67 -77 -14 61 17 -73 -50 -68 -9 -98 -11 -35 3 6 -7 223 45 90 -48 7 25 -69 97 78 -97 119 91 -46
5773 -46 41 13 -68 -80 -42 -46 -64 -43 77 26 -81 40 17 22 73 72 -95 73 -95 9 -9 -12 1 -51 22 52 -70 -7
5801 -7 144 -59 -111 41 -2 -15 60 -21 -19 -15 48 72 -37 15 13 -25 4 -24 -40 17 75 -20 -83 54 -103 49 2 71 67
5830 67 -76 64 48 -125 48 149 -62 -44 -63 -47 -11 59 -37 -86 8 79 17 100 72 43 -36 178 22 -100 22
5855 22 19 -35 -4 4 21 31 -121 94 -21 0 122 20 -22 -12 69 -63 84 -104 -146 28 -35 8 -18 33 41 -64 4
5882 4 28 -21 -104 198 -29 -37 109 32 -135 -46 -83 80 -4 114 -31 -24 63 38 -120 14 190 -71 11 93 -60 -34
5908 -34 -66 -34 101 -38 36 28 -6 7 -28 54 22 -46 -117 63 39 16 -12 -37 32 7 -39 -124 69 3 -16 -21 -42 -11 -55
5937 -55 -61 80 -104 -135 42 -3 -220 101 29 61 55 50 37 -59 0 88 -43 75 49 27 3 -1 -113 -132 49 62 -40
5964 -40 -136 -63 98 -166 -21 -83 -115 -2 23 -53 -54 97 -56 -36 59 18 -28 -16 -57 -114 -54 128 19 26 22 93 -122
5991 -122 -21 54 -32 45 -52 -85 -23 8 128 -113 31 120 -15 63 55 3 -9 53 -25 -13 25 -72 24 88 35 95 0 17
6019 17 -62 -45 98 113 -44 -1 61 -134 14 29 6 -36 -103 10 89 -11 20 72 -9 55 77 -131 114 -9 35 50
6045 50 -96 -50 -61 106 -14 -82 -58 49 40 -85 25 18 62 96 10 11 101 -58 112 -47 117 64 -118 94 87 13
6071 13 -9 112 1 71 97 -95 16 -29 15 -16 12 59 -9 2 53 -29 37 101 86 -99 55 82 -106 69 48 -33
6097 -33 -63 -60 17 52 49 48 186 -135 0 -22 4 69 16 -66 138 -8 -135 160 26 -24 -28 27 3 14 -80 75 23 -98
6125 -98 7 -48 6 -23 -43 -66 -4 49 -69 113 46 11 -25 -39 40 6 84 32 -67 66 20 -47 118 -20 -94 35 -5
6152 -5 -81 -2 -10 99 -57 -41 16 125 18 -56 4 11 63 -89 10 88 52 -63 55 -28 2 -65 -51 -19 -47 -99 119 -50
6180 -50 -20 25 -59 3 -39 -18 -47 31 53 -19 -69 69 39 27 53 -10 15 40 148 -83 181 -35 45 24 59 74 27 63
6208 63 -18 -59 38 -11 99 -78 -4 44 -91 -102 -1 61 15 81 -55 33 -115 103 71 -39 -47 57 -5 80 20 62
6234 62 -1 -39 77 -4 -90 -34 -98 -91 107 -23 -28 35 43 11 130 -9 109 -36 -89 -3 -77 -49 -108 43 -43 -26 -75 2
6262 2 63 -39 -50 62 -24 -57 30 -32 7 -8 44 28 -95 -40 -39 -129 46 -66 -31 0 78 -15 19 25 6 113 -46 10
6290 10 57 -28 -83 35 -47 -40 15 6 66 76 -1 114 68 78 81 -6 74 35 3 118 7 -33 8 44 31 70 -136 -39 91
6319 91 -47 -8 -71 -42 31 31 -30 28 -79 -75 2 27 46 -15 97 -2 36 -77 2 -37 3 42 -34 174 -17 -39 60 -44
6347 -44 -53 111 7 -17 84 -50 -21 -55 9 26 37 -149 -82 60 20 85 29 6 123 -11 -50 82 -33 153 -35
6372 -35 35 105 97 -106 28 45 -179 1 -164 -6 59 -82 34 142 -38 39 -86 -124 22 -139 4 57 -48
6395 -48 -89 -6 -19 44 -31 -40 -1 23 43 -10 -62 -103 13 63 -27 56 -57 83 -37 -128 53 65 64 76 30 47 82 -55
6423 -55 84 -4 -108 -4 -31 15 77 54 -61 68 -23 -27 85 64 5 -84 7 98 73 -204 101 4 -100 99 -65
6448 -65 35 147 81 62 45 18 50 48 -44 4 -61 -63 49 -135 -98 89 61 -87 86 -12 -22 -91 14 50 79 38 155
6475 155 -22 2 101 -26 131 -100 -90 -7 158 -71 45 64 -112 26 -168 12 38 -74 -15 -45 -76 119 -46
6498 -46 -95 24 -25 -153 41 -34 156 20 -59 26 75 -130 96 -39 -102 11 28 -50 144 -23 -31 -21 -74 40 -4
6523 -4 -82 -17 46 -29 62 14 52 95 -93 -126 53 37 10 43 -60 1 67 -12 -123 -109 -10 12 -106 61 105 -55 -26
6550 -26 119 -75 -29 9 -41 17 -117 140 39 -97 26 -24 -43 99 -152 -88 7 -11 -162 34 21 9 -83 -3 -3
6575 -3 67 -10 43 -63 -54 -43 43 -27 12 -120 -36 134 68 -34 52 22 -90 -2 -9 2 28 -46 163 38 67 -39 -98 -29
6603 -29 -90 -59 15 119 -55 63 -93 -1 -6 -94 -22 -27 -25 90 -23 -46 -21 -6 -20 -103 29 -91 54 -136 82 -36
6629 -36 5 34 -19 46 18 -61 -128 -2 117 -26 -1 2 -14 42 -61 49 -123 12 102 -36 -113 41 -50 -65 -20 -98
6655 -98 32 33 -51 -1 90 24 -11 40 37 47 -86 -11 -69 -57 42 -73 -138 50 27 -103 148 -29 20 21 12 -8 66 -38
6683 -38 65 32 -68 84 -11 -25 33 -113 -38 43 75 -54 -41 -4 42 -74 -64 46 -8 68 16 25 56 26 -95 71
6709 71 50 -4 -123 -97 -142 -60 -118 28 27 -52 52 -76 -43 86 -78 32 10 33 26 8 96 31 17 -133 67 -69
6735 -69 27 66 -19 -28 -76 -35 -10 132 61 75 2 -139 -41 -12 30 -23 -296 34 150 44 -105 -48 -215 -13 -23 -94
6761 -94 110 172 -124 43 -94 85 47 -88 -1 59 -19 -14 -5 12 1 39 -115 58 56 64 -67 -76 -6 4 -17 -57 10 -10
6789 -10 54 60 -89 98 -90 -58 33 83 -60 39 -30 24 55 -15 58 1 -43 2 38 -54 53 -65 37 91 -42 -66 19
6816 19 -22 -66 -26 -115 -41 65 34 186 -44 47 19 -65 -3 -17 44 42 71 30 -71 -16 -95 -47 -75 16 57 -46 -128 -93
6844 -93 -20 -16 -23 -90 16 48 -7 -50 -24 -37 13 -68 114 -75 -14 16 -110 -103 32 -22 78 120 26 -10 51 -61 -16 18
6872 18 -6 -8 36 158 -52 94 104 119 33 52 95 -43 66 -60 1 79 50 -19 43 -5 8 130 -25 -48 -55 -42 45
6899 45 12 -23 51 -52 6 -15 -42 -71 94 45 -41 -25 -74 82 17 16 53 -33 49 21 6 -34 40 104 -22 118 18 -7
6927 -7 106 -43 19 85 24 -104 -83 47 -31 59 -75 -21 -17 89 -42 3 -33 -110 -60 -62 -54 109 88 -33 -15 -33 -77 125
6955 125 44 15 92 -7 106 80 -38 51 103 22 45 -71 15 46 -32 34 23 -43 -19 -24 -15 7 -50 -4 11 4 42 -15 34 -10
6985 -10 86 -75 -149 -1 -64 47 30 -26 46 -59 -64 36 18 64 -53 -90 97 -16 -180 -38 58 46 10 -32 -45 20
7011 20 79 -49 -47 93 107 -38 86 62 8 -25 1 7 -75 86 -45 23 75 -65 25 -79 6 28 -83 35 15 39
7037 39 54 59 83 66 136 33 -55 19 8 1 58 39 86 -45 -31 -91 50 38 26 -92 -13 28 -15 -69 55 21 65 -35
7065 -35 48 -35 -43 -61 0 26 -27 -48 -21 53 9 -24 -37 -42 -41 90 11 -37 46 -60 93 143 39 -35 1 41 53 -59 35
7094 35 95 9 3 49 -17 4 -27 -4 -59 -51 93 66 -29 133 -8 -39 -23 -58 63 71 -17 -40 -1 -40 5 -22 -41 25 -66 3
7124 3 -59 -19 75 -51 103 -40 -48 48 21 -18 -9 -15 4 -85 98 17 -114 89 -43 -5 20 -120 -109 1 48 11 -38 -16
7152 -16 84 -8 -1 -26 20 23 -1 -66 -28 -8 -64 33 -11 -50 -24 -29 32 46 31 -57 -3 -127 17 -103 -101 86 -5 -32 10 66
7182 66 -32 81 -8 62 -39 -18 14 73 -102 -16 2 -21 -113 11 7 -8 69 -25 28 -27 95 26 -42 -110 -16 36 4 -50
7210 -50 -162 143 -54 -73 73 -38 21 41 109 -125 -5 -39 -58 43 -48 50 -50 3 -31 -6 2 109 -219 -38 -85
7235 -85 -80 41 70 10 116 -72 -12 110 -13 107 -34 -55 12 -84 37 32 -86 -121 150 11 -65 -100 -53 20 12 -71
7261 -71 -32 -6 64 0 41 -20 -45 -13 -7 -66 1 -101 -6 57 38 35 -7 48 -70 -18 42 -32 -71 39 19 -29 21 101 -37
7290 -37 -42 -23 -123 -42 164 84 20 75 25 -13 -57 36 29 44 -27 -90 45 37 -17 -43 6 75 28 23 92 68 19 -67 -32 -93 -58
7321 -58 -41 -62 -71 14 -4 32 10 30 -8 -95 88 -33 6 17 18 -54 28 -9 45 76 -21 -7 -41 -20 149 -130 37 -25 -39
7350 -39 72 -60 -9 -34 -56 -11 4 59 -4 20 -93 -126 -15 -57 5 11 54 90 -49 5 40 -5 67 -1 -29 205 39
7377 39 -9 109 -58 1 159 -11 -34 -44 -90 -31 -49 26 -15 -14 98 -28 106 90 -70 72 83 -10 8 5 -12 -16 -164
7404 -164 -44 -105 -113 -23 -34 -10 -25 37 -65 -8 182 108 26 -31 27 13 105 74 32 -10 -25 63 62 52 110 -24 64 53 -120
7433 -120 -99 64 -36 -37 20 -44 31 22 4 -5 64 14 -94 16 49 17 -80 -68 104 15 32 39 -101 -40 -4 36 -11 28 -50
7462 -50 -36 -65 -67 -30 -111 37 65 75 -52 21 35 -63 20 2 14 -20 34 49 -14 -69 13 -4 -26 55 -31 0 91 -27 -27 -46
7492 -46 -11 160 70 -63 -157 -26 -35 -17 109 83 -74 -13 -62 -18 13 26 61 13 3 -89 77 53 -43 100 -39 58 14
7519 14 -44 17 -24 47 -76 12 -105 0 50 -48 -65 -42 -34 22 46 -45 -20 23 52 -40 9 110 -49 -92 37 4 -90 145
7547 145 -2 -90 45 47 -35 27 -32 69 61 10 -35 -44 -15 -8 8 25 25 -103 62 -90 -64 43 44 108 -37 -5 -30 -79 78
7576 78 -9 36 -68 101 28 -45 51 75 33 -12 23 -36 -113 31 0 -2 -74 -76 -96 87 77 -46 -65 -26 -23 -21 51 -73 42
7605 42 14 -86 173 -10 -40 1 -3 -45 -25 61 -30 44 -78 -23 37 -8 -58 72 20 29 -29 6 -120 -65 5 -16 -46 22
7633 22 -11 92 18 52 -44 64 -48 -64 118 86 107 61 7 -6 -99 -117 16 48 -16 101 -78 -70 68 -62 0 36
7659 36 -3 81 9 -8 -8 -89 18 -18 -99 80 -76 -78 -46 24 -40 -96 78 3 -48 17 -21 34 11 -111 17 -223 92
7686 92 -22 -75 -56 76 -57 -30 -8 90 -110 25 40 -43 -41 -41 -15 -61 18 88 -72 -17 -38 31 100 2 17 3 73 -27
7714 -27 24 -12 -43 -68 -35 -17 -43 -41 6 -17 -124 62 12 29 107 111 -4 -127 25 36 -72 -16 114 -23 35 52 58 -54
7742 -54 25 -103 -100 23 54 0 73 -116 18 -41 -67 72 56 -12 44 58 135 40 -173 -11 76 28 -13 79 -31 -119 -48
7769 -48 32 -34 25 138 40 54 54 15 10 -53 -43 14 17 -6 96 104 -1 60 -40 65 126 -127 27 74 -179 41 0 75
7797 75 130 -106 -35 37 31 71 -83 -125 62 -99 -51 22 105 5 -33 -120 -14 55 -73 54 -80 -73 87 51 -65 -55
7823 -55 -39 -28 37 -69 -60 -2 75 53 6 -25 -1 -67 49 -7 -42 -74 -39 -63 -55 1 -85 -21 60 27 -137 49 39 39 13 -22
7853 -22 -62 0 -76 63 -28 -42 89 33 -8 -15 -65 8 -20 26 53 63 107 25 -104 -13 -98 -32 -9 15 -16 -62 -42 -111 10
7882 10 -82 3 -123 96 54 181 21 82 18 -165 12 -35 -18 -54 -2 122 103 -97 71 -8 4 76 53 -96 23
7907 23 -18 -44 -1 -20 55 -52 -72 5 68 -165 -130 -3 -80 9 19 -17 69 -34 -18 13 10 163 -27 -36 103 1 65
7934 65 28 -20 12 105 37 50 34 -21 -34 -83 -91 -19 41 -15 -84 -26 16 -21 -97 57 39 -32 70 -45 -36 112 -38 2 -1
7963 -1 23 16 10 20 -7 -7 -6 -38 -91 12 -17 -143 20 78 17 -47 -31 60 31 -26 -63 32 -41 -29 55 -13 81 -82 -59 21 -90
7994 -90 3 20 -22 -16 -97 -72 28 8 -47 50 12 10 -8 4 -10 -87 -37 -126 -29 -4 -95 -35 93 -9 24 37 24 -32 2 0
8024 0 -25 -60 88 136 -146 59 11 -1 -22 -50 -10 -21 -7 30 -4 -12 -14 71 -3 23 -42 -16 4 -14 -42 -25 -148 -34 57
8053 57 41 -85 -63 -25 70 -41 106 -13 26 72 32 -49 -12 58 -75 -13 59 62 -29 -20 29 -38 -54 -3 74 11 163 -27
8081 -27 -81 -7 -68 9 51 18 25 -92 -92 7 42 -10 -6 -93 -126 100 -11 2 39 -3 48 28 -22 47 -54 28 62 -6 25 33
8111 33 -36 27 -93 -10 26 54 23 10 -13 -37 98 -39 -49 8 14 -55 -82 22 77 50 54 39 72 26 51 -55 105 -19
8139 -19 -108 32 52 20 -47 -8 -30 -13 -48 -135 -10 15 19 32 -19 -71 3 44 109 10 -9 154 -93 52 -55 -114 -36 50
8167 50 79 -20 22 -94 -8 45 -81 62 42 -41 -33 -5 -27 -14 24 -47 -26 -99 -35 31 28 153 -48 42
8191D2
##END NTUPLES=NMR FID
##END=
