##TITLE=1H_DE-80H_X3
 200.13MHz, d2o
 8 sc
 
 19ns.26.2.2025
##JCAMPDX= 6.0         $$ Bruker NMR JCAMP-DX V2.0
##DATA TYPE= NMR FID
##DATA CLASS= NTUPLES
##ORIGIN= UXNMR, Bruker Analytische Messtechnik GmbH
##OWNER= pz
$$ XWIN-NMR		Version 3.5
$$ Fri Dec 19 10:57:25 2025 Russian Standard Time (UT+4h)  Yarkov@DPX200
##.OBSERVE FREQUENCY= 200.1313
##.OBSERVE NUCLEUS= ^1H
##.DELAY= (6, 6)
##.ACQUISITION MODE= SIMULTANEOUS
##.ACQUISITION SCHEME= undefined
##.AVERAGES= 8
##.DIGITISER RES= 18
##SPECTROMETER/DATA SYSTEM= spect
##.PULSE SEQUENCE= zg30
##.SOLVENT NAME= DMSO
##.SHIFT REFERENCE= (INTERNAL, DMSO, 0, 14.3821)
##AUDIT TRAIL= $$ (NUMBER, WHEN, WHO, WHERE, WHAT)
$$ ##TITLE= Audit trail, XWIN-NMR		Version 3.5
$$ ##JCAMPDX= 5.01
$$ ##ORIGIN= Bruker BioSpin GmbH
$$ ##OWNER= Yarkov
$$ C:/Bruker/XWIN-NMR/data/yarkov2/nmr/H-C/1/audita.txt
$$ ##AUDIT TRAIL=  $$ (NUMBER, WHEN, WHO, WHERE, WHAT)
(   1,<2025-12-19 10:56:44.56 +0400>,<Yarkov>,<DPX200>,
      <created by zg, POWCHK disabled, PULCHK disabled
       configuration hash MD5:
       00 E9 B6 7A A2 85 ED C7 34 08 36 98 17 FE 4E 26
       data hash MD5: 16K
       2B A4 22 09 6D C2 6A 56 FA 58 E7 99 CB C5 BC 67>)
$$ ##END=
$$ 
$$ hash MD5
$$ EA 04 25 BA 49 BE 9A 20 79 8E 72 A2 E0 CC F0 54
##$RELAX= 
##$RELAX= 
##$RELAX= 
##$RELAX= 
##$RELAX= 
##$RELAX= 
$$ Bruker specific parameters
$$ --------------------------
##$DU= <C:/Bruker/XWIN-NMR>
##$EXPNO= 1
##$NAME= <H-C>
##$PROCNO= 1
##$TYPE= <nmr>
##$USER= <yarkov2>
##$AMP= (0..31)
100 100 100 100 100 100 100 100 100 100 100 100 100 100 100 100 100 100 
100 100 100 100 100 100 100 100 100 100 100 100 100 100 
##$AQSEQ= 0
##$AQ_mod= 1
##$AUNM= <au_zg>
##$AUTOPOS= <>
##$BF1= 200.13
##$BF2= 200.13
##$BF3= 200.13
##$BF4= 200.13
##$BF5= 200.13
##$BF6= 200.13
##$BF7= 200.13
##$BF8= 200.13
##$BYTORDA= 1
##$CFDGTYP= 0
##$CFRGTYP= 5
##$CHEMSTR= <none>
##$CNST= (0..31)
1 1 145 1 1 1 1 1 1 1 1 1 1 1 1 1 1 1 1 1 1 1 1 1 1 1 1 1 1 1 1 1 
##$CPDPRG= <>
##$CPDPRG1= <>
##$CPDPRG2= <>
##$CPDPRG3= <>
##$CPDPRG4= <mlev>
##$CPDPRG5= <mlev>
##$CPDPRG6= <mlev>
##$CPDPRG7= <mlev>
##$CPDPRG8= <mlev>
##$CPDPRGB= <>
##$CPDPRGT= <>
##$D= (0..31)
0 0.7 0 0 0 0 0 0 0 0 0 0.03 0 0 0 0 0 0 0 0 0 0 0 0 0 0 0 0 0 0 0 0 
##$DATE= 1766127404
##$DBL= (0..7)
120 120 120 120 120 120 120 120 
##$DBP= (0..7)
150 150 150 150 150 150 150 150 
##$DBP07= 0
##$DBPNAM0= <>
##$DBPNAM1= <>
##$DBPNAM2= <>
##$DBPNAM3= <>
##$DBPNAM4= <>
##$DBPNAM5= <>
##$DBPNAM6= <>
##$DBPNAM7= <>
##$DBPOAL= (0..7)
0.5 0.5 0.5 0.5 0.5 0.5 0.5 0.5 
##$DBPOFFS= (0..7)
0 0 0 0 0 0 0 0 
##$DE= 6
##$DECBNUC= <off>
##$DECIM= 32
##$DECNUC= <off>
##$DECSTAT= 4
##$DIGMOD= 1
##$DIGTYP= 9
##$DL= (0..7)
0 120 120 120 120 120 120 120 
##$DP= (0..7)
150 150 150 150 150 150 150 150 
##$DP07= 0
##$DPNAME0= <>
##$DPNAME1= <>
##$DPNAME2= <>
##$DPNAME3= <>
##$DPNAME4= <>
##$DPNAME5= <>
##$DPNAME6= <>
##$DPNAME7= <>
##$DPOAL= (0..7)
0.5 0.5 0.5 0.5 0.5 0.5 0.5 0.5 
##$DPOFFS= (0..7)
0 0 0 0 0 0 0 0 
##$DQDMODE= 0
##$DR= 18
##$DS= 0
$$ [...]
##$SUBNAM2= <"">
##$SUBNAM3= <"">
##$SUBNAM4= <"">
##$SUBNAM5= <"">
##$SUBNAM6= <"">
##$SUBNAM7= <"">
##$SUBNAM8= <"">
##$SUBNAM9= <"">
##$SW= 18.0517328524113
##$SWIBOX= (0..15)
0 0 2 0 0 0 0 0 0 0 0 0 0 0 0 0 
##$SW_h= 3612.71676300578
##$TD= 16384
##$TD0= 1
##$TE= 0
##$TE2= 300
##$TE3= 300
##$TEG= 300
##$TL= (0..7)
0 120 120 120 120 120 120 120 
##$TP= (0..7)
150 150 150 150 150 150 150 150 
##$TP07= 0
##$TPNAME0= <>
##$TPNAME1= <>
##$TPNAME2= <>
##$TPNAME3= <>
##$TPNAME4= <>
##$TPNAME5= <>
##$TPNAME6= <>
##$TPNAME7= <>
##$TPOAL= (0..7)
0.5 0.5 0.5 0.5 0.5 0.5 0.5 0.5 
##$TPOFFS= (0..7)
0 0 0 0 0 0 0 0 
##$TUNHIN= 0
##$TUNHOUT= 0
##$TUNXOUT= 0
##$USERA1= <user>
##$USERA2= <user>
##$USERA3= <user>
##$USERA4= <user>
##$USERA5= <user>
##$V9= 5
##$VALIST= <valist>
##$VCLIST= <CCCCCCCCCCCCCCC>
##$VD= 0
##$VDLIST= <DDDDDDDDDDDDDDD>
##$VPLIST= <PPPPPPPPPPPPPPP>
##$VTLIST= <TTTTTTTTTTTTTTT>
##$WBST= 1024
##$WBSW= 4
##$XGAIN= (0..3)
0 0 0 0 
##$XL= 0
##$YL= 0
##$YMAX_a= 76590
##$YMIN_a= -64645
##$ZGOPTNS= <>
##$ZL1= 120
##$ZL2= 120
##$ZL3= 120
##$ZL4= 120
##$ABSF1= 10
##$ABSF2= 0
##$ABSG= 5
##$ABSL= 3
##$ALPHA= 0
##$AQORDER= 0
##$ASSFAC= 0
##$ASSFACI= 0
##$ASSFACX= 0
##$ASSWID= 0
##$AUNMP= <proc_1d>
##$AZFE= 0.1
##$AZFW= 0.1
##$BCFW= 1
##$BC_mod= 2
##$BYTORDP= 1
##$COROFFS= 0
##$CY= 83.5205535888672
##$DATMOD= 1
##$DC= 2
##$DFILT= <>
##$DTYPP= 0
##$F1P= 10.8118882576601
##$F2P= -7.23987719738617
##$FCOR= 0.5
##$FTSIZE= 0
##$FT_mod= 4
##$GAMMA= 1
##$GB= 0.15
##$INTBC= 1
##$INTSCL= 1
##$ISEN= 128
##$LB= 0.25
##$LEV0= 0
##$LPBIN= 0
##$MAXI= 10000
##$MC2= 0
##$MEAN= 0
##$ME_mod= 0
##$MI= 1.114404
##$NCOEF= 0
##$NC_proc= 0
##$NLEV= 6
##$NOISF1= 3.799351
##$NOISF2= 2.8
##$NSP= 1
##$NTH_PI= 0
##$NZP= 0
##$OFFSET= 14.38212
##$PC= 1
##$PHC0= -5306.755
##$PHC1= 10.82193
##$PH_mod= 1
##$PKNL= yes
##$PPARMOD= 0
##$PSCAL= 0
##$PSIGN= 0
##$REVERSE= no
##$SF= 200.129724274929
##$SI= 16384
##$SIGF1= 3
##$SIGF2= 2
##$SINO= 400
##$SIOLD= 16384
##$SREGLST= <1H.CDCl3>
##$SSB= 0
##$STSI= 0
##$STSR= 0
##$SW_p= 3205.1282051282
##$SYMM= 0
##$S_DEV= 0
##$TDeff= 0
##$TDoff= 0
##$TI= <>
##$TILT= no
##$TM1= 0
##$TM2= 0
##$TOPLEV= 0
##$USERP1= <user>
##$USERP2= <user>
##$USERP3= <user>
##$USERP4= <user>
##$USERP5= <user>
##$WDW= 1
##$XDIM= 8192
##$YMAX_p= 0
##$YMIN_p= 0
$$ End of Bruker specific parameters
$$ ---------------------------------
##NTUPLES= NMR FID
##VAR_NAME=  TIME,          FID/REAL,        FID/IMAG
##SYMBOL=    X,             R,               I
##VAR_TYPE=  INDEPENDENT,   DEPENDENT,       DEPENDENT
##VAR_FORM=  AFFN,          ASDF,            ASDF
##VAR_DIM=   8192,          8192,            8192
##UNITS=     SECONDS,       ARBITRARY UNITS, ARBITRARY UNITS
##FACTOR=    0.0002768,     1,               1
##FIRST=     0,             0,               0
##LAST=      2.2672688,     0,               0
##MIN=       0,             -64645,          0
##MAX=       2.2672688,     76590,           0
$$ Real data points
##PAGE= N=1
##DATA TABLE= (X++(R..R)), XYDATA
$$ [...]
779b46R8M98n81L57J54n11N27k63k84O23m60N4K91m11J93K12o22N77p7m11N71
800B89m16q1N17m63K35K39o27M56j00l56M61l11q7N80o21J97L17n38M17%l69M71
822B10k29j17L66m67J86L77o42L56J56m43M33j67j56M61m33J11K65o23M00P3m82
843c65N83k74k62N46l24L3L67n58K72K23m70K93o4k20M26m39J13M33n51K91J62
864B15n22L91l4k72O77n40RL20m38K16K18m97L12pl75N57k91j26N00n60J97K32
886A82n03K57J67k08L46k74k20N54m63J5M65n31L25j8l41L70o3k69L58k40K2K55
908A86m79K50K51m23M21n8m20N60m65O5L60n02L47jl58M13j33k80N21l14p8L75
930B38m71J89K16m74L07L8l24M17j02k29L67l23P1K82m58L59p9k00L67k23p4L13
$$ y = [-246, -148, 350, -231, 126, 280, -231, 296, 33, -251, 372, -88, -34, 257, -154, 39, 251, -371, 206, 129, -282, 289, -127, -208, 309, -154, 81, 320, -307, 149, 49, -307, 154, -157, -244, 336, -285, -88, 229, -309, 108, 108, -261, 210, -19, -136, 230, -237, -51, 326, -316, 40, 196, -247, 186, 19, -137, 324, -109, 2, 267, -356, 44, 117, -365, 218, -56, -318, 228, -96, -63, 304, -254, 18, 241, -229, 64, 0, -220, 206, -233, -120, 313, -238, 53, 215, -307, 84, 50, -222, 455, -85, -76, 244, -194, 22, 240, -257, 55, 48, -327, 230, -61, -187, 313, -247, -50, 182, -321, -64, 103, -105, 241, -33, -253, 301, -162, -147, 318, -213, 112, 94, -247, 123, 60, -209, 149, -91, -69, 186, -293, -43, 208, -215, 206, 148, -272, 288, -177, -112, 248, -254, 93, 92, -266, 147, 14, -266, 255, -59, -137, 238, -233, -44, 172, -302, 5, 43, -281, 136, 34, -195, 172, -151, -80, 202, -256, 103, 24, -176, 191, -32, -106, 207]
952B07j88K7M0l60K91R6l81N43k69j23L89l12j00L79l80J12J29k50K70j52j96
973b28M82k67j45L39l57J20J76l52L41K2k14K09k79R2K43l88K63j9k36K24K7k67
995b14L53k31JL26k71m7K56k98J42P4j17J91j47j31K91l87K12J79m13K48J14k75
1017a44K44j88L2L20l73J47K37l59J13J28l14K16k7j48K74k40Q7J89l18J86N0
1038A12k37K36p8j53K64k13k5K79k88J55Lk50M24j86j93L24k69J61K20l65J34
1059E5R3l28K74J6k98L89k27j30L43l35O2L84m43K03p9q7J95J3k01J94j91J3L34
1082B49l62J98n4j76L46j00j89K82k43OJ15j40lK71l38J91p1k03L18r0o7K04j77
1105c3R5J7j93K14m6j40K68j90j00K29k22J25N4j95K11l3j49K98j74j61K84j33
$$ y = [207, 19, 46, 86, -274, 17, 113, -268, 275, 6, -117, 272, -40, -140, 239, -141, -29, 100, -150, 120, -32, -228, 254, -13, -158, 181, -176, -56, 120, -232, 109, 131, -83, 126, -153, -61, 182, -206, 57, 38, -198, 26, 53, -214, 139, -92, -91, 235, -36, -83, 173, -125, 17, 91, -26, 165, 18, -113, 178, -209, 3, 182, -231, 17, 131, -144, 100, -88, -56, 264, -109, 38, 275, -84, 29, 157, -157, 59, 32, -116, 158, -82, 5, 194, -124, 62, 112, -125, 111, 33, -120, 144, -69, -94, 185, -103, 52, 55, -195, 229, 43, -150, 174, -95, 66, 286, -79, 55, 148, -180, 94, 110, -188, 201, -26, -156, 187, -148, -86, 298, -145, 58, -21, -108, 87, 100, -101, 93, -98, -85, 249, -113, 85, 31, -145, 201, 101, -88, 194, -49, -43, 72, -68, -71, 200, -138, 53, -18, -221, 97, 7, -60, 144, -33, 62, 79, -114, 100, 54, -86, 182, -8, -108, 121, -101, 24, 78, -117, 94, 61, -88, 210, 36, -125, 159, 26]
1127B6k07M37m43J23O8p1J87k52%L33k47pJ84l60K27K10l49K23j09j84K24r2R1
1150A2J11j83OK19j52J04j47j74K31o2m9J06n4J30M6k40J51P8k34K12q4k5J17
1173A19j94R7J10k95K39po9J26k28K6J67k08P3M0m6O8M0j04J02l7r9K30j70J4
1197fP7j64J04k2j24K23o3n3J43j70m5J44j99J71J04n7j01R7j08K10k18OJ02j47
1221i6J19o2p5J31p3o3K57r3j46K23j93J60pk04O6J16j18MR0j08J43j68kK46k43
1246i6R1K4l7P6p8j42K48j26%No6R6J0k1O6p5k1M6p1L9J18k41J97J30k15N9M7
1273F3q8J03j98oJ45j39J36R7k09O0J31j60J87j35M9L7o6M0J6j55J94n2o5N8p6
1298c3M1J9l6l5K35j88J4J6j03J21N5j26N1l2L9N9p8N2prQqj40J41j54P2J39k51
$$ y = [26, -181, 256, -187, -64, 4, -67, 120, -132, -132, 201, -46, -53, 131, -229, -2, 208, -141, 82, -27, -211, 13, -79, 12, 123, -60, -54, 165, 13, 117, -30, -204, 27, -35, -84, 22, -32, 98, 144, -96, 55, 133, -101, 111, 27, 2, 119, -75, 22, 132, -163, 76, 69, 0, 126, -102, -76, 91, -117, -44, -4, -50, 18, 58, -46, 56, 19, -80, 150, -20, -6, 71, -93, 11, -11, -135, 88, 25, -28, 115, -55, -100, 44, -155, 16, 120, 63, -38, 59, -49, 161, -57, -51, 51, -96, 23, -39, -114, 17, -56, -119, 138, 45, -101, 122, -71, 89, 82, -122, -56, 60, -58, -54, 36, -72, 71, -97, -99, 147, -96, -5, 19, -18, 58, -20, -162, 86, -40, -40, -35, -101, -5, 5, -16, 50, -25, -46, 0, -71, -32, 86, -155, 42, 172, -43, 16, 63, -25, 78, -120, -126, 19, -120, 16, 113, -96, -36, 95, -65, 122, -13, 36, 73, 7, 47, 63, -92, 102, 50, -15, 43, -33, 8, 27, -9, -44, 191, 3, 17, 33, -70, 51, 106, -20, 31, -1, 38, 97, 19, 71, 64, 55, 63, 55, -85, 56, -98, -26, 113, -138]
1326a38K78j19k6J3p5OJ49k5r1J12j35l1J94j67R7l0l1J38oj58K13j64K5pp8K7
1352b9L1j39K08nn4q6R4M7p7r9K02j88j7J52j8n1O9j28P5N8j93J53J7n4R7k8p1
1379c4K5m0M5K8j28K19j53k2J15K2j40J66j19RJ13j85M4P3j92P8R0j23K38j19
1403A0o5R0j22J18q4o6R8J6O8q5J5m7J66j01p6J03onj8k0N7j75J85L9j07j3R7
1430G2o1n9R3j24J82n4j92J31n2kJ22k0L2L4j67J71m3j12K05j12j33J27k0l1M1
1455B8j94J13L0N5qklQ3j01r4K10k32J16L2p0K8Q7k20J65n1j1O4k0k3mj8L7L7
1483C4l2O5n2k7O6l0k9Q9j11L9O4p3j6k8N3R1p0n9J7NN6n0Ro5k4Q3M7m3PJ3r4
1514f5R6j20J34p4jk4J18j09J4N1n2P7K7j7M5o9m3Q1r3om7N4l5J20j67O2j2N3
$$ y = [-138, 140, 21, -5, 8, -67, -61, 88, 63, -28, 84, -51, -82, 112, -55, 42, 12, -19, 119, 113, -45, 168, 4, 29, 22, -56, -29, 2, -137, 71, 66, 12, -74, 20, 67, -10, -109, 93, -95, -112, 40, 22, -29, 40, -88, -13, 45, -148, 5, 22, -32, 65, 37, -34, -9, -49, -4, 24, -104, 115, -38, -60, 55, 77, -63, 103, -16, -7, 106, -79, -35, 38, -154, -76, 14, -109, 129, 10, -55, 35, -87, 31, -53, -119, -21, -5, 63, -22, -7, -54, 112, 11, -65, 38, 32, 27, 9, -11, 46, -129, 56, 95, -12, -25, 72, 11, -48, 45, -79, 103, 49, -143, -12, -64, -66, 56, 36, 68, 102, -65, 106, 63, -49, 156, 44, -89, 38, 18, -13, 28, -166, -53, -23, 32, 24, 22, 19, 102, 1, -93, 117, -115, 1, 33, -37, -9, 78, -142, 23, -28, -39, 25, 5, -18, -22, -40, -3, 34, 2, 67, 15, -12, 54, 24, -5, 84, -27, 12, 76, 3, -13, -41, 12, 103, 33, -26, -9, -4, 52, 2, 11, -54, -78, 5, 52, 9, 16, 29, -65, 31, -89, 45, -29, -30, -54, 64, -45, -31, 20, -32, 45, 72, 55, 100, 31, -12, 69, -24, -30, -77, -23, -58, 62, -105, -43, -55, -2]
1542bkO3j7j6n6mJ62j86R4M6o5J0N2o4K5K5j25j5N2O7m9m9J02j6j11L1N7nQ2j02
1572a6N4m7l7k2N3J16n7p2J3N5r2J7M7P6j69J71o8Rk5N7n2n9M6P3l4k1O8p8Q3
1601H9n5n5P9n3k8R4j19M9j5O7L8j47P0Q5kl4j45n4Q5J23q1L8q8J20O6m6m3q8
1629e0J47j00J8o4R6j3L4J4n6o7J07j01K8Rp7NM6M9Mj22R8k5M8m8PJ44j24Ko1
1658e2J24j97J19N6j1l0m1nJ18j5r8m1J29p9J8m4J48j04o4J85j52N1l3kM3p8j7
1685g2P3Q4j06K8p0J51j08Q8kk03J05JQ9n2RojO5j24R4oj78k9K02j59J22L3q6
1713e8J25o8n1K8N4o6J29r9l0Q5j05O6J6J6j29PJ23Q6j15jp8P3p2K35r8J4j04
1740a7k1m2J39j40R0RK6n5q0J02O9K5j11L9L1j64O3J6L6J9j83J17j4J09l6O8r5
$$ y = [-2, -4, 59, 42, 26, -30, -34, 128, -58, 36, 82, 17, 27, 79, 15, 40, 65, -60, -75, -23, 44, -5, -54, 48, 32, -79, -48, 9, 4, 86, -16, 38, -9, -46, -68, -15, 101, 44, -28, -15, 40, -52, -35, 12, 88, -81, 90, 22, 31, 6, 63, 11, -48, -2, 71, 37, 16, 84, 6, 89, 34, -21, 58, 5, -23, 71, -48, 1, -14, 53, 91, -56, 14, 99, 97, 63, -82, -136, -51, 72, -9, 29, -59, 61, 127, 81, 38, -50, 97, -3, 15, -49, 47, 34, 68, 82, 26, -41, 66, -35, -7, 2, -75, -70, -24, 25, 29, -93, 5, -20, 28, -20, -13, 131, 7, 9, -52, 72, -125, -6, 50, 39, 9, -32, -37, 81, 66, -32, -73, 56, -23, -5, -49, 99, -5, -69, 116, -36, 15, -18, -20, 23, -55, -72, 1, 85, -21, 7, -63, 88, -20, 68, 66, -137, -32, -31, 58, 6, 15, 9, 8, 73, -51, 43, 37, -141, -170, 32, -127, -5, 28, -58, 67, -1, -52, -24, 30, -36, 93, -6, -36, 49, -56, 10, 26, 42, -87, -80, 43, 129, 14, 13, -65, 8, -64, 171, 73, 87, -17, -38, -80, 59, -81, 9, 18, 44, -11, -91, 11, 80, 105, -6, 33, 64, -100, -37, -21, 15, 34, -149, -32, -46, 63, 27, 95, 0]
1767@o2pQ3j74K10J4j03J52p5J26j41m8O2m4P8j14J49j13m4N7O5m2j42N5M8qQ2
1794F4o8L6pKm9J1m7J5n1J24k9K7k1Pm0K0rmr4J76o1j1m2M8m0L0RO0j19p2O6k7
1826i6J06o7N8o0J0N4p6J34jj01kK9Q6L1j07J7l8J1j00Q7J09ojo0K5q0P6NL9j80
1856i8Q4M6q4n4J20j31M3Q1l3o2J02N1m6j20R7m7J01m5p5J18j5J71k25M5nJ9P0
1883A08k05Q4K8m6N5jpk0l6QL2j6jj1RP6q7qJ32o5j26k4J51m4Q2l0o0O4o3k4K5
1914b0L2q7L8l5J75j16M0n2J2jl0Q4j95Q1O4k6K0J06r2o6R8j26P8O5qj15Q2M4
1942E0nL0j1Mj88J45r1J16n8n1J26j3n4o1K3L5L3j22O8M9j12M0l3N5R0r1J46j06
1970A4k8k1J2Jm5K9j04J80o8QN6r0J1J1L2p7L5Q7q8J10o3LM4O1j43K9l3R2j53
$$ y = [0, -62, -69, 14, -160, 50, 64, -39, 113, 38, 164, 23, -25, 37, -7, 71, -43, 106, -7, -51, 6, 71, 29, -113, -58, -10, -18, 64, -4, 32, 25, 27, -22, -11, -58, -43, -94, 30, 1, 28, 7, 14, -26, -6, -15, -19, -113, 63, 2, -9, -51, -3, -43, -13, -4, 56, -63, -135, -69, -96, 10, -57, 1, -59, -49, 5, -71, 63, 62, -39, -41, -12, 74, 105, -2, 15, -23, -12, -112, -25, 84, 78, 77, 17, 42, -38, 38, 43, 82, -98, -14, 32, -52, -106, 14, -117, -74, 7, -26, -88, 14, 65, 19, -101, -4, -51, 50, 5, -70, 48, 33, 204, -21, 24, 19, 38, 108, -97, -13, 15, -31, 24, 23, 16, -4, -40, -32, 0, -16, -17, -28, -19, 57, -30, -38, 94, 29, -97, -121, 30, -14, 68, 38, -22, 42, -21, -45, -20, 12, -75, -37, -72, 103, -13, 27, -25, -13, -14, -44, 40, -155, -74, -10, -36, -16, 90, -2, -68, 30, -96, -18, 47, 39, -76, 6, 50, 45, 75, 64, 68, -120, 25, -66, 50, -8, -59, 67, 54, 0, -61, -38, -3, 30, -92, -24, 25, -87, -47, -80, -25, 65, -26, 120, 14, -14, -35, -23, -22, -67, -38, -142, 38, -30, -22, 34, -56, -45, -34, -2, -79, -44, 43, -45, 65, 2, 5, 49, 110, -33, -4, -37, 55, -98]
1999i8M1JR1N6n6o0P3n7K3J5j28R1L1k1M1m3K6M5j8pL0p4j7K3N4j11P9Q1j63J31
2029G9J6j15n5R9Jj32J38K0n1k3J9q2J64j18P8j9n0L3r8N7j4J29p4l9J05o1j2
2056eO7j2j2l3k8J9L2l1l4N4J1J2j65J34l0N2j57O2LP5j02J51j17R2j2q4P9N2
2084G3m9q2lK9Q5L6p0n0k5Q4M6o7M8q8l4k9Q9kJ7L1r2L9q5J36r5kM5o0L3J39j9
2115G8n0j7M9j57J53j00Pm6O7J7k7Q2O4r3Lj26j3J50m3p8L9M1m8M3p7L9M0J28
2143A25j69K7p1J21q8j5PmJ0J21j38oP7o2ok4J08P6j08o2R6n1M3n9M5J3N2j63
2171a05P2q3J04J5j7l1K0K1J0k8P8J0j0q9L6L0j7Q0j27P2Jj32L1K3J09q5Kq6J33
2200C7l9M0Pq8Q4p1J1J23j06j02J48K7J3q9R3j43J23j81J68M3j05q4P4L7J8m2
$$ y = [-98, -57, -56, 35, 91, 35, -25, 48, -9, 14, 29, -99, -8, 23, 2, 43, 0, 26, 71, 53, 46, 76, 2, -15, 8, 62, -49, 30, 111, -52, 79, 95, -20, -75, 24, 25, -107, 31, 51, 0, -23, -4, -86, 78, -40, 38, 19, -31, 2, -96, -39, -53, 76, 2, -37, 68, 7, -5, 62, 50, 38, 5, -23, -4, 28, -3, -37, 17, 28, 40, -125, 9, -21, 31, -126, -64, -61, 14, -88, 63, -54, 38, 26, -58, 21, 73, 24, -58, -61, -32, 53, 89, 19, -31, -56, 28, 74, 7, 55, -33, -67, -96, -7, -9, 8, 39, -53, -14, -99, 37, -58, -60, -15, -75, -42, 97, 78, 28, 11, 60, -97, 56, -44, -37, -83, -16, 1, -26, 56, 120, 27, 30, -96, -109, 41, -2, -80, -41, 0, -48, -5, -82, -43, -3, 125, -44, -17, -88, 33, -55, -70, -63, -67, -57, 64, -74, -80, -3, -65, -71, -95, 13, 89, -19, -81, 15, -36, 7, -52, -7, 6, 58, -105, -33, -116, -12, 3, -14, -45, -25, -4, 6, -22, 56, 66, 56, -33, 3, 33, 16, 96, -31, 41, 42, -90, -59, -36, 73, -12, -10, -96, 37, -2, 38, 45, -43, 41, -30, -19, 104, -2, -104, 44, 71, 84, -5, 88, -55, 68, -113, 55, 98, -7, -91, -17, 20, 38, -4]
2226dn3N2l4L1L6K1jj01J35j62OMo8O4R4n7O8o7J84j67K6Jl0j8O6P9j27Q7o7k1
2256b3M4m4m3J13q9n9Q7k3O8oq9n2K30j29o7J37Jm4j16P4J2M3P2p0J4k9l0J6k2
2285b4p0J09O5o9l0nJ38j57n8O6R6j6l9oN8j21J09j03N6Ql3L0l2P6j03M9m4N4
2313Dl7J19O2j36l5j5J24k9Lj35J62K0p5m3k0n5K4J37j24N3m1O2j1J8n9J21l4
2340F0r3l3J07R4o8K1j41J13p7K4Q2j36N4N0m8l8JM5l5M1p4o8N9L3J19l1J5k2
2368E4K0m7m2J7L1j4j12J47j60O9L1j04J3J74jj07PL0n1O1n9L7J23j5j73k6J5
2395h2J18Oj56J64Or1N0N0q5k1Q5L6m1K1l2n2O3j8rO1m2J39k20R8k9J39k12M0
2423a4O5j36K02p8P4j54R3l1pl4j4O7l4O4j14P9LM4m2j25J09j3k3j8J5J9J08n5
$$ y = [-4, -57, -5, -39, -8, 28, 49, 48, -53, 82, -80, -74, -70, -138, -74, 20, -37, 31, -36, 148, -19, 7, 8, -22, -40, 26, 105, -22, 65, -2, -23, 21, -23, -66, 47, -42, -101, -14, -37, 31, 25, -64, -116, 114, -15, -82, 55, 56, 12, -104, -30, -18, 25, 97, 27, 41, 12, -18, -2, -24, -94, 15, 80, 11, -19, -24, 114, -43, -101, -35, 61, 45, 6, 0, 58, -63, 46, -57, -1, 7, -26, 4, -28, 48, -55, -6, -50, 4, -33, 86, 148, 12, -23, -38, 86, 57, 60, -75, 87, 107, 32, -11, -31, -86, -62, 75, -49, 4, -37, 25, 14, 32, -27, 94, 60, -33, -66, 41, 135, 67, 88, -53, 60, -17, 7, 89, -47, 7, 57, 9, -29, -28, 17, -18, 23, -51, -119, -60, -27, 92, 61, 76, 54, 74, 27, -15, 2, 33, 19, -93, 54, -106, -37, -6, -110, -97, 77, 76, -31, -24, 6, -45, 16, -43, -6, 117, 102, -71, -97, -82, 36, 42, -114, 50, 56, -35, 15, 65, -20, -41, 44, 80, 39, 60, 28, -24, 39, 21, 12, 73, 31, 170, -50, 48, 19, 158, -54, -14, 51, -85, 117, 39, 113, -41, 52, 21, 14, -20, -34, 33, -1, 63, -51, 28, 31, 75, 33, -92, 17, 4, -19, -37, -22, -3, 105, 50]
2451E0r8N6P9q7j8J2Oj1J6m1J14m9o6L0J33j73o5LJ45Qm4mn0R8Pj4j20R9k9k5
2481c8O1M4p0M6r5O6p5N0M4j09J42j14Q2j19N4J21j47J02j16L0N3n2P5P3q8j7
2507CO3j30K3J20j84Q2M0o3J62j10j16P8Q5o5l7nK4J25j80K8K5k2M9p3K5mJ78
2534A21j20K4l1P1o7N5k4%j33J06j1p6K8J0J18p0l3L0%N8p5L3j07N9J54p7L0j3
2562F0q9O7K2j16m6J15K4Pk03J33L6k1J4PJ38j89jJ37k9J9q7j9nl4L3K7l9M4k4
2591a9J23r3J08J2p9n4L7J6j03J18j34lRO5P7k0P7j36LO4o2J7pm7k8M2l3P9L2
2620F1j27J17M7p3p4O0Oq3L9J8k5M8j4PQ1k5m4LPo5r9J64p9J7M8q8K02k40J41
2649C0J17k59J41J16j43Kl8L9r9J57j5n3J11r6n6Rk4j1J32m7j36J52k6p0pP3J57
$$ y = [50, -48, 8, 87, 0, -18, -6, 0, -11, 5, -36, 78, 29, -37, -7, 126, -47, -112, -109, 36, 44, 0, -4, -54, 44, 51, 37, -83, 16, -13, -38, 23, 67, -3, 43, -52, 14, -61, -11, 33, -76, 66, -48, 34, -85, -31, 90, -57, 45, -71, -41, 12, -40, 35, 108, 20, 3, 66, -64, -41, 79, -105, -23, 17, -46, 116, 6, -110, -32, 53, -12, -49, -54, -30, 95, -85, -57, -32, -54, -5, -78, -53, -57, 121, 1, 25, -6, 65, -2, 53, 29, 29, -104, 2, -9, -85, -57, -47, 71, 1, -32, -2, -2, 56, -19, 14, -93, -34, 120, 43, 73, 60, -29, 38, 60, -56, -102, 13, 37, 44, -159, -26, 10, -11, 3, 10, 148, -41, -42, 95, 66, 85, -2, -21, -26, -60, -27, 0, -39, 5, -19, 104, 11, 119, 131, 52, -2, 35, 51, -52, 66, -68, -71, -62, 3, 80, 60, 137, 1, 4, 68, 6, 23, 16, -31, -59, -17, -50, 29, 61, -66, 51, 98, 25, -49, 11, 17, -66, -27, -9, -34, 14, 0, 7, 88, 63, 19, 22, 29, -36, -135, 29, -50, -33, 15, -73, 129, -111, 30, 147, -112, 29, 145, 2, 4, -34, 5, -94, 63, 48, -5, 106, 10, -46, -37, -61, -72, 60, 13, -123, 29, 3, -67, -74, -1, 156]
2676A56l8j28m5P8J8j63R3o2N2k3J8R5j41N4Mn4R4J0o6R3j31R1Rp9J8M2O9q5J00
2705G9q4L1M4j31L6L1k2P3j65J71m3o0RJ05j14J9l8m8J95l4j07o7Q2R2m6k8K8
2732Hr3J3j3O2O5j34J78p3j6K4J7NQ6k33J59n5m0n6J03L4mj2j14M3N4j22J60j38
2760i2Q3L2j57R9P3m3L5L9rj32N5k0L4Q4o3m9RP7k5Qr8jm4J32M0j36J50r6K7p2
2790f0P1J5o2J0J9P4j11K6Rj03Q6M9j9q4R4J7n5J3N4mno6J6J29j71J04j49J01
2818bo7J03q7J02k0r0M8r4M8J7P3l4L8p7L0L4O3m6r5P5qR2j52J22n8J7o0L3L9
2847D4k4k5K8r9J53k18J66j4o3M7jK6j60J27J02j76J31L1k24K39r4rN5o6Q2m7
2873A1OM6j5n3j6l0O2p0J48p1P8j19M0j04O9O2q4lJ19p4J22j26o3n0J17n5n4k2
$$ y = [156, 118, -10, -55, 23, 41, -122, -29, -91, -39, -62, -44, 51, -90, -36, -32, -86, 8, 18, -48, 45, -86, 5, 14, -65, -47, -5, 64, -21, 79, -5, 26, 70, -61, -25, 6, -16, 57, -108, 63, 20, -40, -31, 74, -40, -21, -59, -107, 88, 54, -53, -120, -38, 54, 8, -20, 8, -85, -72, -85, -23, 42, -92, 86, 13, -3, 21, 38, 43, 129, -104, 55, 0, -40, -96, 7, 41, 37, 25, -89, -46, 8, -114, 46, -92, -9, 23, -134, -35, 38, -5, 30, 69, 60, -72, -17, -37, -3, 81, 18, -31, -22, 55, 30, 38, -60, -61, -105, 27, 67, -69, 81, -15, 12, -60, 11, 26, -36, -26, -7, 67, -44, -18, -9, -112, -26, 23, 4, -80, 14, 31, -24, -11, 43, 39, 34, -32, -16, 113, -58, 46, -103, -2, -69, 34, -53, 49, 29, -61, -13, -107, -59, -42, 31, -3, 35, -42, -12, 22, 85, 39, -56, 19, 11, 103, -49, 73, 15, 32, -28, 5, 44, 20, -5, 23, -76, 77, -141, 25, 11, -52, -5, -6, 20, -140, -13, 89, -87, 44, 75, -149, 90, -4, -13, 42, -24, 58, 11, 17, 63, 48, -5, -21, -51, 11, -59, 89, 18, 96, -23, 17, -87, -18, 44, -40, -43, 76, 2, 124, -2, -65, -115, 2, -53, -107, -129]
2901a29R0k7M4J50j41K5o6Q7r6R2j0k0j3l8R5k0j6m2J29j19M3lk1R4j21k6Q1k2
2929@P7j47L8Q5j24M4J15j62J24J0P0j65k5j4l5J47p0J21j82J89j74J32l8n1r
2954d4Q6j89J20N8M7j22J16m5m3J1L3P7j29P1j1k4j16J61j10K8J68j61j1P6N0
2979I7p2kl5n3J3J59p7q8jL7M1p5K6M4o3k4Q3M6j57J50q9M0M0k3P5j17M1K8K1
3008F5j02K8l0Q7j09J20j7m1pL4K1K1l0j28J31j40J14l1J5Q8j92J11Q7j67PJ49
3034H4l3r0rM7l0P7j33l2JJ92l7K0%n1nQ4j33j7j9J20n1j4L3k5r5J46j6n4J52
3063A12j36L3p1J80j44j5l9Q0r7J00j8J58p8j1o1PqK1j02N9L5j24J28K1k2Q7j40
3090d5j9J55j11j9JJ43r9j80J83p9L1J21j73J58n5p6J18n3P0PJ8m2N4j34rj3P0
$$ y = [-129, -39, -66, -22, 128, -13, 12, -54, 33, -63, 29, 19, -1, -14, -52, 43, 23, 7, -35, 94, -25, 18, 15, -6, 88, -33, -59, 22, 0, 77, -70, -32, 53, -71, -27, 88, -74, 50, 60, 130, -35, -60, -74, -109, 38, -32, 89, -93, 96, -78, 54, 16, -35, -44, 42, -147, -27, 31, 78, -44, 72, 27, -16, -5, 28, 105, -24, 47, 36, 12, -104, 57, -53, -25, 143, -18, -29, 47, 97, 25, 23, -12, -65, -52, 107, 30, -58, -59, -22, 19, -56, -30, 14, -49, -73, 10, 56, -101, 49, -40, 0, 40, 17, 92, -25, 16, 44, 65, -37, -9, -39, 48, -61, 59, 42, 1, -6, 28, 49, 70, 40, -88, 43, -97, 17, -14, 1, 89, -103, 8, 95, -72, -65, 84, 51, -39, -48, -1, -31, 46, -87, -119, -118, 74, 37, 57, 57, 6, 1, 85, -48, -65, -84, 36, -15, -29, 4, -21, -116, 30, 14, -40, 112, -24, 9, -62, 118, -26, -41, -80, 0, -97, 3, -15, 143, 65, 54, -7, 0, -8, 13, -89, -30, 5, -119, 9, 30, 8, 95, -45, -64, 91, -20, -39, -38, 105, 6, -174, 9, -70, -39, 82, -91, 67, 12, -64, 54, 1, 71, 78, 96, 54, 108, -26, -35, -48, 22]
3117B2j58M4J30q7R1m5l2P7j11J83j39J10r0O4m9j8O1j25O5n4R4J9k3j3K2MJj4
3145B9P7j46P9l2O7j72Q4Q8r0p5J25%l1O2jj2r9O5p8R3Nn9nKq3J75o7l1k7O4o3
3176e6M2O5l4M7p9J60j74n7J24m1N4j36J8R0jn9L5k3L2n0M6NP9r8P3j81J13n2
3204e8J07Lp5N6j82J26K5K7j49J7K09N7j78N8K6j42N7N6L4j18R9q4J27j81P6N5
3230D8k2o6R8l9j8K3K2L1j24p3Q3J4L8o0P6K7q6L1L9k4R7j40M2o5L8K5M0K8mr1
3260a2M4j32N8J10p4J16r6m2j6j1J6M6k8P2q9j6N5o3M5J0N8j65m0J59q1J05m8
3287a9J13r7j7M6N6j33N5l7L6Rk9L7n5n4J29Jj19Q6M4M4o9j20J26k1qP8m1j69
3315a28J49M3j74K09r3n9k0J49p9KQ5j6kl1j38J40K0k6j8l5Op5n6J74o4M9J30
$$ y = [22, -136, -92, 38, -49, 42, -3, -35, 42, -69, 114, -25, 85, -5, 59, 10, -8, 53, -72, -7, -61, 33, 52, 29, 16, 38, 42, 43, 29, 106, -40, 39, 7, 74, -98, -14, 74, -16, -91, 34, 34, 3, 65, 64, 52, -47, 18, -60, 33, 38, -21, -26, -24, -107, 68, 1, -30, -57, 7, -56, -14, 51, 17, 64, -15, 145, -29, -86, 38, -3, 51, -85, -67, 23, 22, -37, -2, -25, 7, -43, 3, 8, 87, -11, 62, -119, -6, -58, 49, 52, -23, 33, -149, -23, 2, 29, -120, -103, 106, 163, -15, 43, 69, -73, -16, 40, 74, -44, 55, -29, 98, -83, -7, 48, 26, -40, 58, 19, 1, 24, 46, 77, -47, -120, -37, -23, 15, -45, 31, 58, -28, 3, 42, 18, 115, -25, 17, -48, -10, 15, 55, 83, 79, -12, 32, -100, -42, 68, -6, 110, 14, -28, -44, -55, -39, 7, -21, 51, -38, -54, 1, -62, -17, -7, 51, -114, -154, 5, -76, 29, -19, 94, -3, -20, 26, 82, -51, 4, -33, 3, 12, -17, 20, -35, -89, 40, 41, -78, 8, 52, 96, 27, -93, 33, 12, 4, 82, 41, -128, 21, 64, -110, 99, 6, -53, -73, 76, -3, -1, 84, 68, 66, 35, -103, 37, 57, 31, 13, -22, -16, -91, -147, 27, -37, 12, 142]
3342A42m3r6j06J01k7M0r8J10m1N5P2r6oK3O9k0q9K9M0m3kRj3l2K6P5r3j58J36
3371c6L1k1o6J23O9r4L5Q0j18L3j14k4J55M2j25mJ2M5J22j94Q7%j47J84l9M2j80
3398a02L7M4O2n3L8J16j05j0j54J72n1qj4J04j9l6K6j01K01j49J3Ro9m3K45k83
3424a30J67o9l8M3J02N5j79L0M1p2N5j9O6m4p2J06j93J68Qm8l2J39r4o7J23j2
3450C4n8q9N1lo5J57kl0m9NJ31j47J26L7j49J67j81J27r0K3j13P3M8l3L7k6L7
3477A8K1q2N4n6k0J16j47J54j49M2J04j33N2M8j14J33o6Q6Qj68J44n8Q7o2L1L4
3503G7k7k1l5LM1j59M8J99j67J7M0R6j24M1J1Qo4J23j09M6m4P4l9j04J28o4n9
3530f4M1mj5j2Q7lj0O1k6j02N7M5r3K3J67j57O2o3q3K37j08r0o1J66o2m9J48P4
$$ y = [142, 99, 3, -103, -2, -29, 11, -87, 23, -18, 37, 109, 13, 7, 30, 99, 79, -10, 19, 59, 16, 14, 23, 10, -22, 4, 79, -14, -172, -36, -5, -26, -92, 31, 100, 6, 41, 121, 3, 36, -78, -102, 53, 95, -30, -34, -22, 23, 145, -49, 38, 38, -109, 75, 36, 78, -102, -65, -21, 41, -12, 26, 142, 37, 27, -127, 45, -6, -14, -28, 76, 57, 21, 47, -54, 147, -2, 11, 20, -49, -92, 153, -130, 37, -32, -70, -27, 75, 130, -49, -19, 22, -50, 5, -14, 52, 8, -64, 42, -151, 17, 25, -23, -55, 84, -10, -77, 46, 34, -24, -113, -62, -65, -130, 27, 25, -5, -54, -49, 82, -65, 61, 98, -51, 116, -65, 62, -28, -5, -118, -45, 3, -30, 7, -19, 18, 39, -43, 11, -45, -65, 51, -96, 58, -91, -49, 55, -78, -26, 22, -92, 41, -25, 61, 69, -99, 45, -13, 74, 12, 43, 77, 50, 29, -6, -3, 38, -121, -73, 126, -41, -24, 16, 112, -12, 29, 40, 48, -16, 107, -2, 44, 0, 74, 35, -69, 59, -5, -64, -23, -27, -42, -54, 33, 30, 20, 81, 55, -47, 10, 55, -38, -15, 152, -5, 57, -6, -89, 148, 40, -50, -111, 55, -7, -56, 92, 166]
3558A66j35J5j7n4J08j35O7j8n8RO8On6nL7m5k7M4K33k01L4o6QJ05k03J64J1p2
3586a7L3O2o6j88K19p3n1L7L4j04M2J28k4m0O5N5j58R2n1o4K2O2o1O8l6M4o1O5
3614C4l0Q9j75J36l7N4q6M7r4J59o7L0j7j26J33r3L0k3L9O8op2R4j84J11l8Q6
3641F2n3J19j54J03j3ln6j11J40k3nn8L9j07J25m3k4m2N9K0J10r2L8m8L0K1j13
3668g9J27l3J8k5j0j8N3j64J31J06O4q8p0o3MJ29j8q1J16j52N0R4r7N5o1m1L8
3695a5rO5q9N8lK1l5J11k3n1N9j11J06l2qP8j25Ln2J34j19R3jj5j00k4N9k6qN9
3725@Qk1O1m7k9P2j4l1M4M3j33J62j61o5K31j02Nk5L3j15J05m1R0p9k2J04K4m9
3753D8K0Mk9j06J46n0m2l5O0n7k7N6O5j22J33j98K89j10j6J6q1j2n1J36j03K3
$$ y = [166, 31, 46, 29, -25, 83, -52, 15, -3, -61, -52, 16, 22, -34, -39, -2, -47, -74, -30, 203, 2, 36, -30, -22, 83, -120, 44, 55, -17, 16, 78, 12, -176, 43, -30, -81, -44, -10, -114, -72, 56, 32, -8, 57, 112, -46, 46, -5, -69, -47, 15, -46, 22, -14, 30, -31, 34, 4, 93, -82, 54, 17, 71, -15, 32, -62, 97, 30, 60, 43, -83, 50, -43, -13, -36, 3, 71, 65, -7, 87, -97, 14, -24, 62, 9, 128, -26, 77, 64, 61, 5, -106, 34, 11, 6, -52, -13, -120, 5, -38, -62, -104, -45, -25, 85, -7, 31, -17, 13, 34, -79, 48, 15, 33, 8, -2, -20, 33, -131, 0, 106, 170, 82, 12, -51, -47, 82, 64, -17, 99, -53, -3, 91, -6, 49, -12, -53, -15, -24, 41, -48, 10, 7, 28, -7, 104, 81, 30, 89, -22, 84, 52, 44, 122, -3, 0, -52, 82, -37, 56, 55, 40, -60, -84, -25, -51, -59, 0, 8, -13, 48, 1, -28, 44, 30, -1, 43, 86, -47, 115, -46, -111, 120, 18, 23, -2, 31, -84, 21, -20, 70, -9, -31, 73, 97, 48, 68, 72, 43, -63, 83, 33, -9, -44, 16, -41, -68, -12, 53, -69, 64, -134, 155, 45, 29, 45, -36, -48, -99, 37, -66, -43]
3779d3o8Q9k5O6K2j1P7j0p5p9J53o2j2k5qr9K7%J10m4N1LLl6K3r0Q3kk1m1J02
3810E8J2Rj56J47j29J44j91QQ3j35J73r8N2n2K9L9N6Nq4m5J26r4R6k33K69lj5
3837G1k6j17J38m8j2o8K8J24j28l5J05oK9J20k01Q5m4k5n6N8k4j6N9O6j07J53
3863A23m4o5M6m8K1p0J29p5K5m7Qk2m1PN0N5j69J39q5J34j84Q7M0j41N8O8L2O1
3891I2j23K8PM5o3J2k9L1N0q7L9O8q1J5R0j68J43j21O5n4K4L3o5M7j43L06j16
3918D5o5Q2j17K7j4l1J24ro2OO5j21k7K0OO3j5N3n7NQ5j2o6J08M4j28l8O8o0O4
3948D3j1q6J8Q8p4J24j63J15P5j19O9ln1L0j41J07j00%K9M1J09j31k9O0k3J9R4
3975I0r1o1rL4J23k0p9l0M6r5R9n1J03L0q5J16j96Q0Q3j77J61o9Q7J5r5j1J2P
$$ y = [-43, -111, -22, -47, 19, 41, 30, 107, 97, 22, -57, 96, 34, 22, -3, -11, -110, -83, -83, 27, -17, 34, 37, 40, 4, 27, -63, 20, 18, -3, -44, 58, 70, 79, -77, 70, -59, 85, -106, -98, -15, -150, 23, -75, -23, -75, -46, -7, 49, 54, -30, -75, 51, -43, 53, -180, 89, 86, 71, 45, -72, 66, 18, 6, -62, -34, 90, -38, -73, 32, 26, 55, 175, -26, 59, 15, -10, -66, -8, -32, -48, 11, 77, -30, 123, 79, 14, 60, 12, 33, -37, 92, 17, 42, -5, 3, -19, -60, -53, -3, 52, -117, 22, -63, 71, -113, -26, 14, -127, -69, -1, 31, 92, -31, -3, 4, 49, -14, -2, -31, 0, 50, -37, 2, 70, -11, 4, 94, -74, 69, -52, 13, -41, -17, 16, -49, -2, -145, 161, 45, -20, 62, -55, -28, -42, -73, 51, 42, -20, -14, 51, -70, -97, -77, -71, -8, -23, 30, -27, -22, 63, 51, -15, 93, 137, 9, -29, 39, -21, 43, 32, -54, -36, 52, -22, 102, -61, 54, 129, 10, 79, 76, 25, 55, -86, 21, -79, -79, -50, -9, 100, -31, -60, 0, -23, -4, 90, -1, -62, -71, -37, 86, 66, -13, -43, 3, -92, 7, -44, 59, 89, 4, 120, -76, 4, 87, -90, 71, 2, 89, 104, 9, -2, 10, 17]
4003A7m5K9j0Qj15P2o4J51k2m2No0j1M8N5Mm3J45o2j18j8J08rk8k2R3rk5n3J3
4033hj8J28K1j09j8Q3j5j19M2O6j43J29j7k1N3q0J5l8P0NJ4m4K6p6R6l8k4J0l5
4062d5L9o5O2M5P0q7l1k0J33j36l7K8m9Q5l7lk3J10pk1J00j34J03J5p2K8k33J95
4090A3M5j16J61j66R3qj1j6P1m6K0p9K5L3J4k9m7J0n6O5J03j02K5L9k5n9J0J13
4118H0j51N7N8j15J14Q3r1k9l2K1Nj04R0J4J2p2J50rj06J9l4K7k9j9K7K7K2pJ8
4147B6N5j2j02m6Q9N0j47O3N6j2rJ4L6p7J2n2J07p0l6R5o6J19p5k0J16j59J04
4174E9j66J73p9M6n9M4j2j6k6O4r8J65j69L7J55r2kq4J35o5m8p2N0J04J8m5K9
4201D6n3%K5j7k3r4J02N9J4j14m4K42j14j62P3%L4J29k08J56n2L1k4n5M0kl9R
$$ y = [17, -28, 1, -9, -1, -116, -44, -108, 43, 21, -21, -16, -76, -87, -39, 16, 20, -23, 122, 60, -58, -76, 32, 23, -5, -27, 66, 57, 32, -21, -8, -26, 102, 123, 14, -4, 79, 64, -55, -13, 53, -90, 39, 22, 1, 54, -26, -11, -49, 21, 26, 40, -4, 22, -54, 42, 4, -20, -10, -45, -6, -71, -9, 36, 106, 19, -12, -32, 101, -35, -72, -44, -93, -8, -45, -48, -71, 39, 32, 11, 111, -23, 80, 95, 23, 51, -182, 13, 58, -58, 103, -63, 30, 22, 11, -5, 66, 20, 40, -39, -14, 19, 33, 4, -43, -33, -89, -24, 79, -23, 2, 41, 16, -43, -33, 80, -71, -14, 44, -71, 43, 126, 35, 6, -26, -5, 0, -104, -14, 0, 12, -60, 90, 81, -25, -6, -40, -13, -42, -61, -34, -7, 15, 8, 26, 81, 69, -33, -79, 10, 60, -87, -24, 32, 20, 11, 25, 61, -16, -4, -56, 51, -19, -55, 40, -26, 93, 18, -2, 114, -45, 59, -107, 66, -13, 33, -26, 18, 6, -10, -36, 28, -70, 95, -74, -37, 118, 26, 24, -60, 75, 10, -38, -110, -60, 44, 62, 17, 46, -7, -7, 18, 1, -22, -116, -14, 45, 59, -55, -99, 143, 29, -133, -60, -60, -26, 103, -105, 51, -1, 30, 6, -49, -9, -11, -50, -41]
4229d1J29j30L1NM0P4j36l6R8p9J77k2j54L3m8N9p9M9R6N5j08L2q9O1Q6j66O4
4256Ao5j2Q2j3J52j29j57K00M3j07o2J6q9J16nM3MQ2l3J2p0%qM4p4J1O6m4MJ2
4286B0n4J7LJ17r2o3RO7p7j8J53Rj40J67q1l4l2pR4j32O6J0M2m7l1%Q1k2p1j13
4316a59K69k12J64rj36Q0pK7l2o6N7q5R3L1qo4j27J38N7Kl6K0K9q7K7J45j26K7
4344A2p0Q5Q6j77p7J19Q9r8K0Q9j1j12l4Q8j27J25j1M1j5MJ3K3ol6m7R0j31MR5
4373C1l3J4J1no4KK2j2kN4j21J62j58J53Mj67J13Jpj1J18m6j8m6O2j46N9r1J16
4402el6m5J59O3oJ3r0p0J21j15M3o2O3K2o5l7J24o0j49J66j0j4L2n5j8OJ11r0
4430dn6M5j13J06J5k3m7L2j2l8L0J5J24j19k6N8p1J25n1K1qr4J05j1J0J8j13K06
$$ y = [-41, 88, -42, -11, -6, 34, 108, -28, -64, 34, -45, 132, 110, -44, -11, -59, 0, -79, -30, 66, 121, 13, 45, -44, 17, 103, -63, 1, -64, -76, 6, -7, 145, 16, -141, 59, 102, -5, -67, -51, -140, -24, -29, 14, 18, 100, 67, 79, 9, 9, 1, 45, -29, -18, 48, 4, 8, 20, -34, -17, -14, 103, 11, -52, -43, 24, -53, -71, 82, 91, -49, 118, 37, 3, -29, -36, 58, -74, -8, 2, 44, -3, -34, -34, 47, 25, -46, -159, 110, -102, 62, 53, -83, -3, -10, 17, -15, -81, -24, -109, -16, 15, 7, -57, -184, -46, 11, 13, -23, -3, 26, -61, -34, 111, -15, 12, -58, 27, 113, -64, -141, -22, 67, -31, -11, 78, 67, -45, -79, 9, -118, 7, -4, 37, 22, 26, 39, 62, 56, 20, -27, 63, -68, -64, 31, -2, 12, 23, 18, -46, -44, -22, -34, -36, 18, -103, 59, -99, 54, 58, -109, 4, 5, -2, -13, 105, 59, 41, -5, 57, -89, -30, -121, -5, -41, -86, 73, 136, 130, 143, 53, -17, 104, -11, 32, -30, 33, 55, -10, -47, 77, 17, -132, 34, 24, 10, 42, -13, -31, -25, 86, -4, -60, -15, -128, -22, -7, -30, -77, -45, -57, -95, -65, -50, 74, -45, -71, -13, -84, 41, -10, 11, 3, -91, 14, 3, 13, 31, -82, 124]
4458A24k34Q0k3L0L3j8N7r0LqJ50j13J16j82P7%r3J3J72j38k9M1L2m9K1j03J16
4485a5J7n6J04Q3j77M4m2k9R3L0o8P0l9P5q8n0O9Jk0n5N0Q4K4p3qq4J5L4K2j05
4515i4lJ02l5j0L9k0N3n3j5p7R4L4m6L5k7P4j91J10J32j36nM9p1J18l6J6l9m7
4543d9J38r0n3k3R1n9O2k8oN8r8N0n5J34j01J13o3r1J06l9j34J24O0oq1N7j13
4570i6R9j36J50J19j33n8N3n4J53n2j01j03J95p6JL0j5J8nL6p1oN3l3L4N3k8j04
4598g7J25q0Q7q6M4Mj74J56nm3N6j5N1rpp7Q7Q5j19j7M3p4J53j70J1J08j9M2P
4627H7Jj2K1j35J05n7Nj13J73m7MN5mL2j19K2j6O3L3j66O6OL5m5MnK7M0j52P8
4657a4j30J66o6Q1l2J06j22N6n2oN9q7J24k08J05J29p7P7k74J12J38k7j60J30
$$ y = [124, -110, -30, -53, -23, 10, -8, 49, -41, -38, -46, 104, -9, 107, -75, 2, 2, -91, -78, 94, -44, -73, -32, 0, -49, -28, -131, -15, 2, -54, 50, 133, -44, 0, -42, -71, 22, 52, -16, 54, 15, 90, 2, -48, 21, 22, 2, -53, -3, 81, 105, 32, 24, -60, -45, -11, 11, -94, -97, 5, -30, -40, -1, -21, 32, -21, -36, -113, -19, 15, -31, 4, -23, 51, -140, -30, 102, -34, -39, 10, -61, 57, 21, 37, -2, -49, 89, -1, -54, -77, 14, -45, 17, -11, -17, 41, -57, -7, -62, 72, -29, 84, 21, -70, 36, -3, -137, -13, 47, 41, -40, 17, -96, 3, -133, 17, 136, 3, -55, -2, -56, 97, 45, -56, -159, 36, -40, -39, -9, -24, -6, -11, 25, -46, -52, 1, -32, 2, 55, 27, -77, 48, -32, 55, -31, 13, 17, -157, -1, -6, -49, 7, -8, 43, 34, 27, -50, 37, 122, 3, -14, 29, -45, 108, -62, -51, 57, 38, 80, 87, 88, 76, 97, -38, 67, 10, 15, -98, 75, 28, 32, 87, 83, 115, -4, 18, 2, 65, 98, -68, -2, 4, 39, -6, -2, -7, 20, 60, -92, -14, -144, 22, -44, 37, 5, 111, -11, 45, -7, -13, 46, -41, 83, -125, -20, 109, 32, 109, -165, -53, 85, 58, -102, 28]
4681B8J3P6j68O5m9MN1jj33J27L0l1K7k2k7kM8m3MK5j04K03j37N1n1p6jJ20n2
4710b5K5M8n3L3n2M0qm2J09p6M0q4L7j14R5K1J5K6lN2r3Mq2N8M7jn5J7N%QN6M7
4743I5j43j0P0K5J3k6L9q9RJ23j44P7L5j10kR5j8p1N6L7r1n4L6l7J83j91o8J37
4771b4m5M3O0O9n8oq4N2J1n2N6p6Q5Or4N3O4J2o3O0n2K0k1lJ1N3p3Q8p4L1K2k9
4803D2p2J04o6O1j06O0j6L0k2LR6j68J33j26Q1q7O7K7o2k0QJ33j32R0n5m2M4K0
4831B5R3j28%O3m3j81J61O7l2o3L3RJ4N0m1Qjl0r9J00n0N6j9O6j08J07q2o1O0
4860b6K9J66j35om1k1J11qn0O1j09J9k9J65j34o1P0l3pl5M8M7j34J07m7J49j46
4887e0O3n3L1k4k8l9JJ02r2J31p3j4J8J21j50M8J1m5m5Q6pR9j32J18p7r9Q7jN4
$$ y = [28, 41, 117, -51, 14, -35, -31, 20, 19, -114, 13, 43, 12, 39, 17, -10, -12, 36, -7, -3, 22, -82, 121, -16, 35, -16, -92, -93, 27, -25, 0, 48, -5, 28, -24, 16, 8, -34, 75, -1, 39, -45, -8, -122, -27, -6, 9, 35, 32, 84, -9, -5, -87, -29, 18, 17, -38, -21, -16, -16, -8, 48, 95, -48, -58, 12, 37, 50, 24, 63, -26, -17, 106, -38, 39, 74, -36, -38, 57, 39, -32, 24, 61, -30, -84, -48, -85, 98, -93, -161, -24, -69, -26, 34, 103, 45, 39, -45, 7, 18, -34, 22, -54, 31, 37, -57, -4, 60, 72, 9, 69, 17, 37, 16, 13, 24, 77, 4, 92, 18, 49, 71, 42, -30, 74, 8, 69, -37, 23, 7, 37, 15, 18, 114, -54, 79, -47, 34, -53, 14, 41, -21, -41, -33, 100, -32, 58, 3, -39, 5, 25, 118, -10, -10, 53, 10, -171, -10, 57, 25, -38, -5, 4, 18, 68, 27, 35, 34, 4, -95, 5, -45, 11, -8, 58, -50, 57, -25, -86, -26, 3, 169, 34, 28, -13, -34, 77, 69, 19, 80, -29, -10, -39, 126, -8, -69, 1, -32, -39, -74, -26, 21, -113, -6, -53, 96, -50, 13, -40, -9, -33, -61, -100, -99, 3, -89, 42, -31, -45, -27, 94, -56, -8, 3, -42, -87, -1, -8, 91, -41, 77, 0, -99, -12, -13, 41]
4916D1n1l9M4l0r7J56p2m5J19o9L8O3k2l0k9n5m4J92k41J51K3L4L1j2o6O0N2j79
4944g7M4j1N0j05R5m6J43j48kQ9j2j15M6J01q4o8N9LJ31%l2N1o2j27J10p3RJ0
4972b1O8Ro5q4L4J20j05P4n0KQn6j7l0J12Q2j29KJ8J3O1p6J2k8n0L5J00n1Jo3
5002g4K4J31j54O2p2O1j4J24p7M2j53R6j55J94M2J7j59j2Q9Jm5j28K11r7J2J56
5028A22j14L0k6Q3p5j17J84k05J45L7j30J51j20m3M9O8n4O4%l9n3O7j6n2O5m8
5054b7n4J53j4j32J30r8J2J62j87J70j45jN8n1o2J67j54J87j16m5N5m4k8K5k6
5079f5p6N4O5m0K8M2rK4m8Q1k5P3q5l3n9P3N3M7j18OMO1r5QQ5q4M8n2n6l1J93
5110F9o1k2p2K9j5J12o7N3M6j26MQ7j04O2Q0m3pJ2j6l7O7k4n8J44j17L9oL0p3
$$ y = [41, -10, -49, -5, -35, -132, 24, -48, -93, 26, -43, -5, 58, 36, 6, -23, -78, -122, 70, -171, -20, 3, 37, 68, 56, -10, 50, 102, -77, -33, -44, 6, -99, -4, -50, 93, -55, -57, 32, 20, -95, -49, 52, -32, -100, -41, -38, 93, 93, 61, 112, 50, -77, 33, -40, -31, -21, 47, 56, -9, -93, -59, 61, -44, 30, -20, -18, -10, -66, -83, -113, -1, 81, -48, -46, -28, -15, 46, -30, -18, -46, -96, -61, 39, -12, -11, -74, -50, 81, -73, -11, -83, -22, -36, 88, 11, 53, -100, -4, -159, 35, 77, 94, -65, -77, 12, 13, -32, -160, 51, -46, -34, 122, 8, 38, 12, 95, 20, -97, 87, -118, 27, 64, -66, 85, -35, -78, -29, 39, -15, 49, 49, 10, -43, 24, 8, -44, 21, -27, -81, 72, 58, -74, 56, -42, -30, 132, -55, 115, -30, -31, 27, -24, -86, 81, -73, 114, -2, -47, 8, -36, -64, -39, -65, -141, -87, -22, -62, -34, 8, -1, 23, -25, 56, 31, 104, 19, -14, -73, 0, 53, 100, -18, -12, -8, 53, -42, -34, 51, -33, 15, -37, -93, -124, 69, 8, -14, -86, -57, -72, 40, -27, 26, 72, -54, -50, 37, -67, -5, 75, 32, 25, 37, 21, -16, 51, 27, -31, 113, -4, 35, 29, 59, -14]
5139a4J03j08n3K19j15j6j9j4M2j70K07j18J9R8m6P6j74Q3p2J02qn6O0J7o9n1
5165g7R3p6P2M8p4j4J0K0L0j8Ll9R2q0j7n0O4j00R8k0j9K9P6j84J35ll8n8J47
5194E0J9Qn0o1n4J30q2O0Mj1j11K10j29k0R3n8N0M6j11KN1m1m0O9P6j67M1K1M5
5223D0pk8l0m9P3J8L5j04O2Kkl6M0k3o4JLJ9L7N0j75J16n7Q4lN0o4L9l3Jj29J44
5255A0m2p8J50j03J11k8l5K6QM1j04O7q2J1%N8Lj3j4k7K12j96J2j03J56M5j78
5282i3J32K7r4L1J34o2m0l9j15J45m7J19j09k5P5k1N3p7O6K0q2Pq9j08J54L8m
5309dK5o6K1j5M2l9jQ2j4M6q9k1J6Np7m4J95k1k02J82mp6J40j26P6q9P4n3J14
5338G7j67k4K14p5m5n2P0M6n3J50o2r9n6N9K2j03O3M6j15L5qN9K2J28j12n0J56
$$ y = [-14, 89, -19, -72, 147, 32, 16, -3, -17, 25, -145, 62, -56, -37, 61, 15, 91, -83, 0, -72, 30, 22, -34, 26, 43, -26, -77, 16, -60, 12, 60, -14, -28, -18, 2, 32, 14, 17, -22, 70, -10, -27, -77, -13, -113, -15, -35, -54, -25, 51, -133, 2, -1, -39, -97, 50, 69, 77, 27, -34, -88, 42, -40, 20, 24, 13, -98, 112, -17, -37, 56, -2, 48, 94, -17, -15, 36, -5, -45, 24, 100, -67, -26, -5, 40, 33, 5, -25, -74, -1, 17, 52, -52, 10, 12, 10, -26, 14, -9, -73, -72, -69, -50, -13, 37, -138, -22, -79, 5, 2, 52, -12, 27, -6, -5, -134, 10, -32, -110, 40, -63, 48, 20, -15, 11, 19, 60, -44, 23, -59, -48, -48, 10, 13, 0, -14, -41, 171, -25, -13, -116, 40, 85, -93, 39, 66, -28, 3, 137, 75, 35, -4, -119, 26, -21, 98, -11, -36, 39, 18, 71, -6, 60, 80, -2, 5, -84, -192, -38, 0, -4, 21, -45, -24, -39, 3, -36, -37, 45, 31, 77, -12, -33, -17, -12, -89, -133, 62, 41, -161, 21, 17, -59, 81, -45, 31, -58, 16, -37, 77, -90, -114, 100, 25, -20, -72, -2, 44, -9, 141, 79, -20, -76, -17, 5, -98, -35, 11, -104, -69, -77, -18, 4, 132, 20, -30, 126]
5365A26j88k7J54K8j18Kn9Q6O0p2K9K7o8N9r2J8L9qL8l5N6j9P6j05j20P4J1o1
5393h9K7l8J31p3J14j27M8l7l2J44j71J76m9j6N1j79J07lK1PRpJ0J6j70K11r2
5420a1l4N1j3j19K05Pj09J31j88J04L8k7P2n0k6j08o4K76j32j37J58J1p0o0O2
5445c3M8RP0m7m2%M9j01k4P9k0lN5p9P6l6N2n0J2K9j29O9oJ8M0r5J23n2q2O3P2
5476F5m1M1q8q6J98j17n3Q8m9J48K3p9L7l2k8L0m1N6j4k6J3j64J85j36J18j5p9
5503d6o4J35j2q1QJ68j08o9L8O2Q3j36L8p6P0R3j21q7J08n6L5N8j56M4L5kL4J4
5531Im7N1m8K5R9j23J46j59L6L7P3n0p1J17k4m3j6m5P5M7j97J35l0L0o4M9Qj28
5559a08J4J03M4L7q8m3J14jj62R3M6p2l5O9j1j12R8j41J63k2K0j45J28j2K8k2
$$ y = [126, -62, -89, 65, 93, -25, -23, -82, 4, 64, -8, 21, 48, -20, 39, -53, -35, 4, -4, 34, -1, 55, 36, 112, 7, -113, -39, -28, -89, -62, -100, 31, -42, 72, -55, -7, -44, -76, 68, -103, 73, 24, 8, 59, -120, -13, -16, 5, 12, 21, 14, 24, 40, -130, 81, -11, -45, 6, -7, -126, 79, 86, -23, 108, -80, 24, 62, 35, 107, 57, 31, -77, -141, 135, 3, -134, 24, 35, -35, -95, -33, 15, 24, 94, 47, 5, 5, 54, -47, -71, 8, -12, -15, 40, -39, 37, 1, 53, 3, 15, 44, -85, -16, -22, -4, 36, -59, 64, 12, -70, -7, 65, 24, 65, -23, -109, 89, -28, -81, 7, -42, 106, 129, 50, 87, 55, 27, 57, 16, 72, 58, 32, 45, -119, 66, -70, 48, 33, -46, -110, 25, 13, -68, -60, 108, 0, -69, -31, 31, 114, -22, 16, -60, 10, 103, -18, -105, 3, -53, -18, 40, -116, -72, -37, -39, -5, 9, -38, 13, -35, -10, 89, -34, 112, -47, -11, 26, 99, 49, -22, 95, 71, 28, 12, -33, 42, 89, -108, 27, -3, 27, -37, 12, 20, -108, -94, 9, 53, 90, 2, -41, 73, 72, -90, 3, 49, -23, -58, 11, 0, -112, -14, -155, 8, -14, 6, -139, -11, -23, 5, -17]
5585a7J09m0r0rpN9L1p6N2R5q8q0Q3o1kM1p4n1J28m0j1K9m9M4j0m5M0Mq0J22o6
5616e9J20j57J3N2P8k6O6J4o2r8Q6N3p3J7J2q7n4j3J43N6r0K0k3M6m2M6Rk9j3
5645ELN5p3Nk3J3N8o3O3m8j05K40m1j26k3J29o6m5N1jm9N4K7r3n0O8Q3q5J3n5
5675g9k3R3lj9R9j12J02m0j26M6J62k7q6k6J06n2o6M2p9J31K8p3n3j0J10pK3o8
5703gPm6N9N4p7rJ06k8n1o2J34j09MNM3n4O3j01oM0L3K6Nr0j1K09k35m4J75qj07
5734h2Q4n8RJ35q3k8L3Jq2P9K7k7r9J03o7J02j8j4jJ7Nr8L7m7O5kk6nL7k5J00
5765G2j92P8R2r4O5j08J18kM9j15L5k3RL3J13j74K4N5r3Q1j49N6M9q0K4J38j1
5792E0m4K6j05l7J45j12o0K0PJ03Mj6M5J7m7l0M1M7j75K9Q3M3n8J6O3j10R7m8
$$ y = [-17, 92, 52, -38, -47, -54, 5, 36, -40, 12, 107, 19, -61, 22, -39, -41, 0, -74, -125, 3, -37, -48, -19, -68, -24, -34, -79, -39, -35, -115, 7, -59, 61, -96, -83, -31, 47, 21, 87, 101, 39, -59, 27, 80, 7, 24, 36, -51, -105, -118, 25, 81, -9, 11, -12, 34, -8, 38, 47, 18, 5, 8, 63, -10, -5, -28, -15, 43, -20, 43, -5, -110, 130, 89, -37, -60, 69, 3, -42, 9, 8, -41, 13, 40, -53, -103, -35, 48, -37, -24, -79, -102, -9, -12, -31, 68, -44, 58, 18, -108, -62, 100, 73, -13, -39, 67, 15, -51, -9, -88, 43, 71, -2, -55, -65, 45, 38, 61, -7, 0, -46, 13, 67, -10, -19, 87, 59, 8, -54, 80, -29, -25, -20, 23, -31, 32, -69, -75, -35, -2, 24, 29, -61, -72, 137, -98, -142, 33, 25, -82, 2, -56, -47, 88, 5, -23, 10, 11, -71, 8, 35, 8, -91, 12, -55, 47, 29, 15, 14, 31, 36, -62, -25, -72, -7, -9, -35, -40, -3, -28, 72, -120, -42, 50, -44, 21, -87, 31, 29, 78, -37, -2, -25, -16, 17, 130, -44, -20, 35, -58, 23, -126, -70, -21, -101, -77, 61, 50, 6, 32, -73, -110, 35, -77, -137, -117, -110, -7, -3, -19, 26, 43, -4, -34, 7, 54, -121, -92, -9, 34, -24, -8, 55, -55, 42, -6]
5820fj03M8J5J24j15Q2n1K6L7m9L0p9p4J61M7j24K1j31R5j5J34jo2n7R4j09l2
5847i4J15Jm6L0j03N6J30p4k9N6m0n6M2j9R0Rr8j7m2Q5N5J4l2n3L0L5j9k2P2j05
5877b9N3r2J06n9R5o5o0O2q5J22K6j11m2J03j0j13J67r8P0M3m3j4PJ1r5N8oj9
5905a8J09j08O9k0j15qN4l4J11k1Qj25J30M1j53P9JJ74k03O0r6P3m0k1P8p8K5
5932b8kN0K0j65R6qn9O1%K3q0J79rp5j01RL2J5j4P0K9n3k1M3j4J0n6NO2j03j27
5963b11J50Q1q1N0O7j36P6omNo9J06j3n2O1L4j35M3M9p0J08k6M6o4J7m2K6j6O7
5992F1n6m4O3LM1l9j1J6o1K3r1R6rM2Qq2J22n7k15J87o4Q9kr1J92m7l8L3p9K9
6022A9k2oJ2j07P4m4L0N1K1J08k38N8NM0j4Nk6l4J6M6jj37J53QL2p1R9j57J01
$$ y = [-6, -109, -61, -46, 78, -37, 45, -6, 20, 57, 8, 38, -41, -115, 46, 93, -31, -10, -141, -46, -61, 73, 72, 10, -47, 47, -62, -94, 21, 22, -24, 6, -97, -41, 89, 15, -14, 42, 2, -54, -12, -31, 59, 68, -30, -47, -89, -4, 51, 65, 33, -20, 10, 45, 26, 4, 76, -29, 24, -68, 38, -21, 74, 9, -51, 11, -74, 48, 74, -37, -79, 24, 14, -99, 68, -30, 40, 83, 40, 26, 33, 44, -51, 7, 1, -18, 91, -17, 52, 32, -83, -91, -37, -71, 40, 19, 27, -98, 32, 73, -80, -1, 0, 174, -29, 31, -65, 8, -32, -53, 25, -53, -28, -30, 20, 40, -125, -29, -37, -96, -35, -35, -12, -92, 87, 78, 3, -98, -89, -57, -42, -56, 14, 43, -10, -31, 12, -2, 8, -48, -43, 19, -84, -211, -61, 20, -61, -11, 56, -80, -4, -10, -14, -9, -78, 28, 15, -37, 24, 58, -77, -34, 15, -55, 53, 27, 73, 9, 26, -16, 10, -6, 61, 5, -39, 24, 27, 68, 29, 18, 34, -27, -4, -95, 1, -8, 34, 42, -40, 82, 25, -190, -3, -67, 22, 20, -71, 121, 74, 36, 69, -10, 19, -3, -9, 3, -104, -30, -74, -44, 7, 28, 136, -102, -44, -39, 1, -13, -8, -34, -68, -52, -6, -7, -144, 9, 17, 49, -22, 77, -80, 21]
6051B1r4R9l4j4M9n2L1ln7Q3k8M2r7J10r%j15j0P2p8R1r6J04J09j09j1p3R1J19
6080A41j51Q9j73L2O6m4R8j34M1R7n5n3n8L5P9K2j41J16j2K4J05o9oM1j40k4J08
6107C4Qo5Q7Lp7PJ06r4r7J03o3R9l3Qm8n5M2O2j0j65%J46j13J13p2J67N7k25J42
6136F7ol5K1j00Q2j4q8P0N2o5J20j40PJ2j07R3Q2m4nK0j02J57j18lR1j13J38m9
6164B3j4M6j33Q9L5j68J69j5p0k2P0OP9o3k02J12K8kL2pJ0L4R3j41N3m4M1Mj02
6193e9L1l6N2k9j73K27L0r1L4M5Pm3o2OJ08rj52J45L3p2K0R6j05p8j8J61k6l4
6221Hj2m5P7k9j27J82m5k7j6qj7J19p7Mj7j4r0J34n7J10m4o9J43L0r2k8k5J07
6249G5j30Q0j7j48L7J24m7J00m9O4q2n0kM7q7J12J7n5M4RP1k09K1j2M4J17r1j8
$$ y = [21, -73, 26, -8, -22, 27, -25, 6, 3, -54, 29, 1, 43, -54, 56, 47, 47, -68, -78, -6, -84, 7, -89, 15, 124, 15, 4, -69, 22, 141, -10, 79, -94, -62, 4, -40, 58, -76, -35, 62, 7, -46, -104, -69, 10, 32, -109, 7, -5, 19, 124, 55, 49, 90, -50, -74, 34, 42, -23, 64, 67, -10, -3, 103, 9, -88, 15, -48, 51, 18, 26, -22, -77, -35, 27, 17, -148, -148, -2, -115, -2, -74, 93, 150, -75, 67, 61, 26, 47, -53, 29, 15, -73, -3, 49, -16, 104, -36, -29, -17, -124, -31, 51, 7, 2, 22, -80, 77, -41, -44, 47, -66, 72, 23, 9, 55, -78, 11, 46, -122, 47, 32, -38, -60, 10, 16, 95, 32, -170, -58, -30, -32, 0, -7, 3, 37, 130, -11, 42, -2, 39, 43, -59, -28, -64, -12, -41, -214, 13, 43, -48, -14, 31, 38, -5, -67, -61, 47, 38, -114, 31, 64, -8, 12, 108, 3, -75, -93, 68, 42, 8, -4, -49, 28, -1, -128, 54, 9, -18, -34, -42, -59, 60, -17, -13, -30, -44, -134, 0, -57, 53, 9, -60, 83, 113, 21, -7, -32, 75, -55, 25, 8, -140, -103, 21, -26, 74, 25, 89, 7, -43, -45, 2, -85, 27, 44, -11, 33, 42, 113, -96, -75, -87, -43, 74, -17, -35]
6277c5O4j14O5Q0q8m6Q1J1n7j2N8Q1j04M0m4k1M0K3n6o0P5J25j41k3k9N4R1l3
6305B5o8l2Q9K5j16J24j7j41K27j67ON3o1OJ01r4K6J26p8N9q2nr2Q3n5O7N1r1
6333c1j7N4NR3q1J4N2p3P5o5Rj20J4J05r8L6N9o7J3P1r7K9M7o8Q9Q8j59K5m5J4
6363b9J29k8j20J01k3j02LM5K6j15J77j33O2Q5n2r1R8nk3m3j4Q3k2m2k6L9PO7
6391E4m2O2n9n1q0M7mO2pQ8j69J13L3n4l8L5j3K7l4K0m2P0KJ3k0N5o2j6M0Oo4
6422b8R7j48N6J34j14N2L8r0j0M0K3O4j99P3K9M2j08J62j12oO7J8k2l4j06Q9O1
6449F8j60Q0k4R0n0P1j76R3J29k01P1N9K7p6o4K2j49J33J18n3j6L1k5R9l5j13
6475e1J1P9j66J05l9J04j27J69r0j03N3K5rJ25j46L8J0J03k9k9J30j69p4O1N2
$$ y = [-35, 29, -85, -20, 60, -28, -74, 7, 18, -39, -51, 7, 88, -16, 24, -20, -41, -1, 22, -34, -94, -19, 106, -35, -58, -87, -33, 58, 25, -43, -75, 14, 39, -77, 47, 30, -111, 116, -51, -45, 8, -53, -47, 54, -40, -14, 112, 34, 93, 11, 6, -86, -3, -58, 9, 60, -31, -48, 6, 11, 104, 23, 37, 89, 16, 91, 26, 35, -85, -71, 34, -64, -28, 31, -36, -23, 48, -49, -20, 27, -41, 48, 136, -23, 2, -43, -29, 100, 72, -48, 53, 30, -72, -69, -24, 2, -113, 64, -69, -7, 78, 26, -65, 33, 28, 5, -38, -52, 31, 9, -33, -59, -20, -13, 54, 12, 74, 15, -36, -116, -69, -73, -11, -18, 70, -99, 14, 47, -7, -45, -10, -23, 4, -30, -10, -52, 18, 20, 33, 13, 68, 6, -10, 30, 36, -28, 69, -79, -23, 111, -3, 49, 87, -3, -13, 27, 50, 114, -85, -12, 17, 59, -49, 113, 1, -5, 62, 80, 58, 24, -82, 7, 68, -92, -12, -36, 54, 4, 75, -101, -8, 121, -80, -9, 50, 77, 1, -63, -41, -190, -57, 61, 8, -8, 23, -2, 97, 62, -51, -40, 39, -127, -22, -61, 43, -84, 85, -5, -108, -55, -30, -39, 86, -60, -22, -12, 91, 62, 33, 163, -6, -80, -19, 33]
6500C3j16J29j48M0J22r6R0P4j67l0Q5nm5O9O2q6o0R6rp1J03l1q8R5r9O3M2j27
6528g5O0KN7J1j8J48k02J46j09N0j9q9Q9k0j0nj8oM8k8L5N2j16MM0m1j7J42r0
6557B1j73J13P0m3O5j36Q7q6LK4L0L9M4j4p1L7q9J19j27P5P4m7k1Nn8Q2j4K0r5
6586f6J07k2Rk6l4J04j11M0R6k2j19R2j49J03m0R8m3R3r6p4M4kM2Q8j05J20j78
6613e1J03N7O9k14J15N4k12Q8m8N8k8L8K5j4K9n6n1P8j9N3r4N5j20J05M6j60P7
6640a7l8O2l4q6K35j45J3j24J05J4N2r4l2j6K8J54k7m6L7j20J53j53L7j0J32j05
6666b5M4N0p0k9LN7Q4j64P9m3k1po9R5Lj00O8Q3r7K4J30j27J14r4rJ16n1j07P
6695e6J11p5J4l1ojP0l1k9O6j04J04j4k8J26r4l1PMK3k7J8N2l9p6lo7J50j45N1
$$ y = [33, -83, 46, -102, -62, 60, -36, 54, 128, -39, -69, 16, 11, -34, 35, 97, 11, -49, 47, 38, -33, 70, 39, -49, 46, -53, 10, 52, -75, -15, -13, 44, 55, 37, 185, -17, 129, 20, 70, 51, -38, 51, 31, 21, 16, -2, -8, 40, 12, 47, 99, -17, -13, 27, -14, -31, 111, 21, -152, -39, 31, -12, 53, -83, 4, -82, -79, -55, -25, 14, 58, 44, -27, 10, -79, 40, -87, -12, 62, 15, -6, -1, -59, 23, 9, 29, -66, 41, 19, 28, 2, -32, 72, -39, 1, 97, 75, -44, 48, -101, 2, -38, 60, 17, 110, 14, -60, -16, -18, 24, 112, 7, 127, -51, 52, 109, 178, -36, 79, 133, -79, 9, -39, 19, -9, 29, 54, 40, 69, 13, -38, 40, 21, 74, -20, 35, -85, 20, 66, -94, -17, -55, 7, -27, -113, 122, -23, -10, -134, -29, -15, 37, -57, -89, -105, -77, 77, 50, 4, 41, -79, 74, -79, -42, -52, 80, -25, 19, 69, -1, -30, -27, 30, 114, -50, 29, -14, -35, -42, -111, -16, -13, -113, -45, 38, -59, -35, 95, -32, 82, -12, -21, 95, 44, -63, -56, 55, -20, -6, -37, -43, -44, 26, -5, -34, 32, -72, 32, 18, -10, 116, 22, -9, -2, 2, 25, -2, 16, 68, 29, -47, -50, -117, 33, -112, -61]
6725f1J58j01M8p2j0l6Q2r3N4M6r2Q8j01Q3o2K8K3J43j27P5r2m4Q1n0J8O5q3m9
6753h1J89k00J9RQ6Oj8o2J19j43j1N6J8mO9J0p1K9Q2j02J05j83Q0M0p9K9%N3j64
6782a19M6R1r7J0J01j57J19qn0j3L6J27p4Qo3J6K6rJ41j35pOQ9j63J04r8K5J33
6810H5q4L1j06Q1K9j15O6N6n0l7J09jl5O3k05k7J34k0j28P2O7J10j37N3Rl2lN2
6838C7k14R2j2R9O6p3n5J03p3j2O5N8m8l5J4Oq5J3m7P3o5O7l9M7J4N7Jk3p5N7
6868A3P0p7j8O5m0m7o4R3R5n2K1j6j36J46n8M8O0o2j21K5R6j04Lj33J81n2P5P0
6896H1o6jq3L5p5J03K4L0po6L6p9O4P8j15N9l0RK9m7R5q7P6k5j28k9J42l5L5k
6926B1j12L8J3J12l0j6j35J84p1l4kR9j11J54k54J11l5l7O9J8M4o0J27m5j1j11
$$ y = [-61, 97, -4, 44, -28, -38, -74, 8, -85, -31, 15, -77, 11, -90, -7, -69, -41, -18, 125, -2, 73, -19, -63, 18, -32, -14, 51, -32, -81, 108, -92, -73, -64, 22, 28, 10, -52, 67, -76, -87, -31, -13, -17, 52, 62, -9, 20, 102, 0, 105, -78, 2, 42, -37, -8, -8, 45, -119, -73, 18, -79, -69, 32, -125, -6, -14, -64, -77, -41, 86, 12, 20, -43, -27, -1, -10, 131, -4, -11, -5, 84, -79, 25, -73, -48, 85, 1, 32, -74, 7, 36, -79, -13, 43, -7, -44, 65, 64, 29, 92, -113, -140, -6, -26, -154, -82, -15, 95, -42, 11, 20, -12, -15, 37, -177, -85, -97, 2, 68, -5, -60, 43, -30, -42, 23, 81, 33, -2, 12, 18, -67, -54, -101, -28, -93, -26, -65, -18, -4, 53, 54, 31, -44, 13, 83, 6, -12, 53, 13, -34, -98, -5, 90, 38, 59, 43, -93, 53, -5, 43, 103, 41, -80, -55, 41, -63, -60, -193, -12, -64, 11, 81, 15, 14, -69, -34, -109, -6, 18, 48, 41, -25, 11, -68, -4, 74, -41, 18, -12, -3, 26, -21, 74, -13, 63, 38, -90, -119, 23, -12, 23, 21, -91, -53, -40, 72, 42, 26, -109, 75, 4, -30, -32, 67, -44, 110, -144, -33, -68, -105, -36, -18, 26, -34, 93, 48, 37, -74]
6952g4J74j26m9K4J18l2j43J47P2j25m5K47k07j4j14J05J7MK4M3m6k1O9j01K9
6977b4Q4r8L4L6j79J57K1j6Q3j7Qj43J29j37J63j15Q2p6J9M0n1r3L5J01q4l6J04
7004B7m0n5L2n5J46k03K40n9n8R6r4J6LO3o1j3R1r8q4J21p5K3K9m9P0k4j35J18
7032b8J08o7r1J19P1j26r0J15o4O5Jl5J4J23j75J03N5j05N5O4j05n7J10o7l1m1
7058g9N4n2O3P5r0Rq2J00l8J7M9M7K0r8q1J44n4l9K1m9P7Nl9N5j46J08K6J6Pl3
7088A3L8J7p3k2j8J68j13o8k9J04n3L5l0K1R1j15M3n5O6P1L1r8M1r3rJ25k47N3
7116a06J09j5N7j2j6O4q2o2J26m1l2P4p0j20J11M3k2k4qP7k6q6R5J1l5k5m2R4
7144C7q2O0K1j04J26jp2Nj55J45jK6k5Q3j65J72j04oQ3Q1j45K7j50J25j78J94
$$ y = [-74, 100, -26, -75, -51, 67, 35, -108, 39, 111, -14, -59, 188, -19, -33, -147, -42, -25, -21, 3, 46, 0, -21, 48, -53, -24, 60, -38, -4, 32, -147, 10, 31, 15, 98, 81, 89, -54, 75, -62, 101, -14, 68, -8, 11, 51, 0, -93, -58, 43, -41, -77, 27, -13, -68, -36, -91, 55, -148, 92, 33, -25, 71, -23, -7, -4, 59, -2, -15, 76, -22, -106, 15, -60, -37, -8, -57, 13, -11, -146, -28, 80, 13, -78, 41, 112, -14, -104, 11, -53, 12, 13, -22, -8, 115, -60, 43, 98, -7, 48, 112, 7, -50, 60, -7, -38, -79, -25, -77, -14, 61, -29, -20, -102, -2, -40, -23, 26, 73, 93, -5, -86, 58, 4, -35, -14, -63, 14, 19, -20, 35, -111, -3, 23, 39, 46, 13, 51, 68, -5, -27, -45, 123, 10, -58, -87, 17, -36, -1, -31, -10, 81, -34, 9, -46, 20, 91, 122, 24, 65, -28, -37, 88, -159, -106, 3, -12, 45, 33, 17, 81, -1, -63, 63, 22, -10, 64, -6, -126, -15, 28, 6, -18, -26, 51, 25, -61, 34, 45, 10, -15, -57, 37, -45, 15, 36, -68, 58, 57, -15, -10, -165, -20, -21, 5, -20, 63, -102, 70, -34, -40, 43, 124, -21, 6, -144, -19, -197, -3]
7170cp4P3N7J2j08J2KP5r4J13r2l0P5Mq5Lqr5J92P0r0j23J17j00K5O5O7j34K6
7199d8k4R5o2R7j8J0o8Ok0R6o1M4L4j31J6J08o0p5MJL1J02n6o0J48j71m1J11O
7228A4o7J55j14M5p9j2R5J0Ln6p1J15oL6j06m1J19K3j07K3J4O2n9Q1o0j5j0J2
7256Dn6l3o4J62K7j4n3N0r3P5RK4K9k09J62j5q7Rj5L2J4Olj08M2L4R6mP1p8N4
7287F8n1lr0M0J6k1L7L0k4k4j6K5j29L01k09l9J59j36J48r6m6p1J93j29N8n8J34
7314F7j40P3J22lp7l7l6J12j10O3j08M8R6j11L2L3L3m0k3q8pK0N3J11j24m2J26
7341D3r9K9N8K9j04j5Mk4Q5qKK4j68J70p3J02p6J03j9q5lJ03j41J2k0N9j9j3K0
7370b4lm4%R0n8J98k05K6K2Qj43J10kJ8L3r8P0P8j06MJ39j40J5l0J15j77J26l1
$$ y = [-3, -77, -4, 53, 65, -43, -31, -29, 46, -48, 65, -27, -57, 18, 22, -63, -60, -68, -163, 29, 99, 9, -114, 3, -97, -72, -7, 60, -74, -48, -72, 23, -39, 58, 40, 50, -18, -12, -32, 64, 3, 47, 81, -50, -34, 74, 14, -61, -57, -56, -25, 77, 21, -39, 109, -62, -103, 8, 14, -53, 102, -12, 33, -46, -58, 37, 47, 50, -6, -77, 38, 32, 68, -38, -79, 40, 63, -44, -21, -7, 55, -4, 77, 17, 2, -8, 4, -52, -85, -149, 13, 40, 26, -27, 23, -70, 5, 14, 38, 67, -142, 20, 5, -82, -73, -88, -56, -42, -36, -39, -147, -105, -71, 25, 21, 92, 14, 68, 17, 14, -76, -36, -20, -41, -4, 26, 2, -22, -38, -13, -142, 159, -50, -89, 70, -66, 82, -14, -60, -131, 62, -67, -9, -67, 67, -73, 0, 122, 119, 42, 5, -31, 81, -29, 34, -74, -26, 70, -41, -9, 24, 57, 17, -6, -94, -101, -81, -28, 83, -41, -83, 43, -56, -27, 31, 60, -44, -59, -55, -79, 6, -2, 0, 24, -144, 26, -47, 55, -21, 82, 63, -22, -25, 78, -63, -51, -71, -12, -31, -44, -24, -27, -71, -71, 19, -39, 159, -46, -20, 2, 10, -133, -23, -25, -7, 26, -72, -2, 76, -30, -26, 113, -27, -12, -42, 73, -104, 22, -9]
7398iK6J84j98l0N1N2m1J4%q7J7M2m4N9nk2l8j0RkK8k2J88j84N3j5j13J47j14
7427f4M2K3j64J56rO3k1m6L3m0N1PK0l6J03o6o0l3R1j28k3R7ql4L3J11j47o3J3
7456i9L2K7L1J12k30o3J73o0R5rk0Q1j39J26l5q2J22K2r8n8O3j2N1k3p6N3n5J29
7484E8p0j4J9ql2J5N2o0JM2K7q1J28q6p1J14O1p5Nq0J6M7n3J03j06P2pP9n7J7
7514E6mq9K9n1R0O8n9m6j5o8J7J01k5M8j1j15R7n0K8N0m5J7K3j17m1J33j7O9q6
7543a3J60j32o5L4J2M7j8L0M8o7l0Q1j57l1R7J33j62l6qJ18r0J30m0n9%m6R2o2
7571c4KJ44J4n0j45L9n5P2L6K4O1j09N5m6j36J29p4P0J5k8p1J09n6J5m6k1J10
7598B4j03J9Q8K1n8l7M9L5o7j1J8oJ5R7o1n3j2r1R1J9L3Q7j37J00k4j17J48ll
$$ y = [-9, 17, 201, 3, -27, 24, 76, 35, 49, 49, -38, -21, 21, -23, 36, 31, 9, -29, -39, -30, -32, -4, -26, 162, -22, 31, 16, -97, 50, -64, -22, 1, -163, -7, -16, 47, 26, -20, 13, -27, 24, 31, 51, 15, 118, 52, -8, -41, 50, -78, -101, -4, -12, -46, -13, 98, -49, -112, -99, -67, -40, -9, 103, -127, -190, -17, -77, 18, 9, -11, 70, -69, 57, 22, -60, 62, 84, -14, -72, -9, -21, 30, 7, -69, -16, -71, 58, -12, -26, -7, -15, -47, -32, 20, -40, -39, 3, 30, -51, 77, -9, -80, 34, 95, 20, 25, -55, -39, 8, -45, 58, -48, 24, 17, 96, 39, 56, 52, -37, -8, -59, 31, 99, 40, -6, -21, -89, -72, 29, 4, 52, 41, -74, 23, -27, 1, 51, 6, 23, 46, -71, -112, 21, 4, 73, -13, 147, 15, -50, -16, -4, 43, 25, 55, 103, 36, 6, 87, -70, -101, -4, 129, -33, -69, -77, 41, -49, 81, 41, -18, -18, -64, 28, -34, -32, 112, 126, 76, -69, -30, -85, -13, 23, 47, 108, -1, 54, 8, -128, 1, -73, -3, 12, -16, -87, 22, -34, -19, -65, -86, 24, -79, -60, 28, 49, -9, -46, 3, 38, -29, -40, -22, -28, -13, 84, 23, -30, -42, -133, -42, -23, 10, 97, -40, 60, 36, -81, 67, 64, 61]
7627F1j22J48n0k2r7J2j2O2O6r7nQ6NJ6q2J3L4r5P0m5J35l8l4m2q6j4J48r4K20
7656A41q2j2r9J39j09j9O6p9j03Q0O0L0K0k0O6j11Q1K0K0j39R5L2q6J1J1n3R7
7683E7m2j9oJ02j63L3R9p0n1k7Q3K2r7M7j2R1m9k1j7m7J07M5Lqn8l7O5L5J0r8
7713b3M1o0Nk4M2n5N4P0j19K7OQ1p6J05j97J43l0r3M5P6M1j18M7m9J52j22p4o3
7741a68J65r1N7M2j6K9M5j05l3l1J48q6J06K5j17N6r6L1m9K40k26J46j26J30j52
7766g6J40j22L1QJ7j7K4P5j18L9k2L3Ln8P6j4mq1N1Pj28J78q4N0p3J00K8j09N4
7795Hm0N0m6J05j75J30p7NM8j27O2l4J15pk1K6qk3O9q4J7L7m6j6P4J02j05M8j28
7824d1J8k7R2j27J03k6r8J94q6l4o2K1M4J47q5q7NP6q0qL4m8J47k64J08N7J5O1
$$ y = [61, -61, 87, 37, 15, -82, -70, -82, -20, 46, -51, -56, 30, 35, 51, -31, -18, 16, -79, -9, -54, 81, 43, 9, -33, -119, -133, 15, -79, 141, 59, 47, -52, 87, -22, -41, 25, -54, -157, -77, -17, 13, 33, 13, 79, -32, 49, 69, 89, -50, 45, 77, -9, 2, 13, -40, 57, 15, -4, -10, 92, -71, -38, 61, -9, -60, -87, -4, 18, -79, -32, -44, 47, -2, -23, -40, -87, 20, 65, 68, 60, 2, -35, 30, 65, 75, -23, 18, -42, -37, -61, -19, -74, -20, 50, -69, -42, -36, 45, -31, 74, -123, 20, -10, -103, -58, 18, 59, -59, -12, -61, 91, -31, -105, -168, -3, -94, -37, 5, -11, 18, 63, -42, -75, -106, 42, -44, 62, 87, -30, 26, -70, -39, -88, 152, -74, 72, -54, 76, -76, 64, -58, -27, -19, -2, -19, 5, 80, -38, 1, -21, 12, 15, -43, 33, 19, 15, -66, -15, -8, -136, 42, -42, 8, -65, 35, 63, -46, 8, -32, 18, -28, 77, -98, 32, -45, -40, 8, -119, -57, -91, 24, 17, -4, 22, 14, -9, 60, -24, -7, 30, -16, -32, 42, 144, 39, 87, -41, -23, -50, 42, -85, 18, -8, -106, 88, 2, -32, -94, -73, -29, 118, 33, -54, -49, 27, -53, -61, -27, -75, 72, -192, -84, -27, -12, 49]
7852D9m9J04l8pJj55J45k0p2J28r0Q0j47K9J4M4j2K0Q8k25N2J19J33m9j36J16
7878A22p3n2N2k2l4K3Q8j25l9l7N9O6r6K13j54m7N7K8r7J35j5k6j34J39o9K0L7
7905A9jPk1L2j55K4%M6M2Jn1J31j93J34L9j8MQ3j41r0J11%j33J24L2R6m8j79J05
7934@K1m4Nk1J57j94J32j32P4k2P6mj7Mj40R6j73L8K8J97mj22l6N2j26J36Q0o1
7962@K6No2m3L6j5J9M3L3J0j20LOk5J73o3n5Q4r5J36j11M0p3o9R2j9j1P4L0r1
7992d2L6Q0j80J23J10n7p3L1K4l4k6j6l0J12o5K5j2O7p6L9j81J60N5l9j14J79
8018I6j75K1M1j08J07N0q0pq2P6J43k8j8L6j14N1j2o1N8R1k6p9j01J22K3j3mQ8
8046I5n0m0J08j10J1j07J7K5J45j07N3Ko3J5k1o1RQ7O9rp2r9J00k4L9P3%n6Q1
$$ y = [49, 0, 104, 66, 59, 60, -95, 50, 30, -42, 86, -4, 76, -71, -42, -28, 16, 4, 24, 112, -113, -61, 58, 191, 142, 6, 122, 49, -3, 49, 27, -7, 16, 104, -21, -60, -97, -38, 28, -68, 145, -9, -56, 1, 29, -68, 67, 52, 26, -108, 31, -38, -18, 19, 18, 25, 4, 36, -119, -95, -95, -49, -7, -6, -57, 74, -119, 15, 54, 36, 40, 123, -18, -108, 3, 3, -130, -6, 26, 122, 74, -105, 0, 21, -23, -18, -39, 118, -76, 56, -76, -2, -24, 52, 48, 31, 35, -105, -9, -182, -144, -116, 81, 77, -45, -81, -29, -155, -19, 61, 0, 26, 31, -31, -74, -38, -53, -34, 9, 42, 52, -68, -65, -59, -84, 89, 26, -29, 55, -40, 96, -15, 25, -48, -117, -25, -44, -55, 19, 49, -42, -6, 74, -106, 17, 127, 70, -3, 28, 52, 18, -8, -24, -54, 58, -7, 18, 6, 73, -3, 36, -145, 15, 70, 31, -83, 96, -79, -58, -17, -125, -18, 32, -48, -55, -137, -61, 82, 54, 36, 72, -42, 9, -3, -64, -6, 85, 59, -20, -121, 1, 24, 11, 7, 95, 45, 5, 113, 3, 14, -93, -76, -51, 94, -13, 40, 42, -21, -6, -27, -88, -79, 8, 77, 68, -4, -103, -3, -27, 12, 85, 85, 29, 110]
8075A10o3n1m2n1jR4M1o7R3m5K4k%o2LR9k6k8KJj87K20l1L0r4M0r4J1P5K8Jl0
8107bn0J2N2llJ1k7k7L6r4N7J9j7q2R8N9j49M3M0J06q3q1K6O8j3J9L0p6mK2k3
8138c6M9n4J29k8j14m2J08m%P6j51J41j54O2N6o6K7P9k5L1l5j3nlMn5M7j7L6K1
8168F4O3k00J2Q8RL1m4o7M0KN6q5qk2lL8%K3q4oN5J2M
$$ y = [110, 47, -4, -46, -97, -98, -4, 37, -30, 63, 18, 42, 40, 40, -22, -19, 80, 54, 26, 28, 29, -158, 62, 31, 61, -33, 7, -87, -76, -1, 27, 28, -2, -52, -40, 12, 9, 6, 17, -10, -37, -1, -95, -38, -19, -36, -118, -20, 39, -110, -67, -27, 79, -4, -85, -59, 9, -4, 15, 45, -31, -35, -13, -36, 13, -41, 88, 60, -54, -96, 12, 8, 8, 84, -67, 74, -80, -18, 38, -28, -1, 78, 53, 84, 49, 36, 31, 28, 32, -23, 24, 7, 43, 64, 127, -73, -61, 27, 36, 67, 23, -44, -4, -2, 54, -31, -39, -61, -64, -26, -26, -3, -87, -93, -38, -26, -22]
8191b2
$$ Imaginary data points
##PAGE= N=2
##DATA TABLE= (X++(I..I)), XYDATA
0@%%%%%%%%%%%%%%pJ5j6J6j6J6k4L2l2M0m8N6o8P6q8J04j20J36j52J71j95K22
36A18k47K74l08L46l86M27m74N27n84O45p11P83q62R50j046J153j271J402j551
55h15J718j904K118k368K660l010L436l969M658n587O913q976J2648k1116P7276
70F3682J2908j41235J0317M7002K1953j4728P734m68j6141q22K5122j1125j4979
83a0780Q239R148l654j0444p805K1168P824j2103l14q65n115J072o75Q706o12
98C790q301Q094n9j1744N783P389O92l787r364N029P565q765J395O832k607k01
114A741l522Q06N027p754J729O306q579M26N644l14L317n120n499O835N01k184
130f40o34j746P461n36r604O448K510o167L733p00j563L771k992Q98J79l490N869
$$ y = [0, 0, 0, 0, 0, 0, 0, 0, 0, 0, 0, 0, 0, 0, 0, -7, 8, -8, 8, -8, 8, -16, 16, -16, 24, -24, 32, -36, 40, -48, 56, -64, 72, -80, 91, -104, 118, -129, 145, -163, 183, -203, 224, -250, 277, -307, 338, -373, 410, -452, 498, -548, 605, -666, 736, -815, 903, -1001, 1117, -1251, 1409, -1601, 1835, -2134, 2524, -3063, 3850, -5126, 7522, -13594, 63682, 76590, -64645, -54328, -7326, 14627, -101, 7633, 7165, -8976, -9798, 15324, 4199, -10780, -2541, 6607, 2953, -7491, -15296, 5872, 13696, 1593, 1279, 414, -4701, -3629, -4304, 4402, 3790, -4511, 3583, 3524, -8220, -2437, 4952, 5644, 1857, -7507, -2478, 5087, -3678, -2283, 4549, 1942, 1741, -1781, -975, 4052, -3702, -1973, 4333, -4246, -3820, 1824, 1510, 4827, -293, -5792, 1043, 1544, -640, -1274, -3020, 4441, 3905, -5699, 749, 3259, -2908, 825, 125, -1438, 2333, -659, 239, 418, -3072, 2797]
147B797m89n556M152o94l74K929o111J395M923m843J966K179l696K798j251k049
163a924K665l049K031K749m832L185J115m029M266k190l461N756j711k247K742
178A066j266J274p54k451M808k657l165N981l071j827M666l719k40L089k375J552
194I11j000j242L393l846j39M592m276Q65L041m143K378J280l411J874r62k00
210h85K927l519J422K217m087K903O63m149L468m87k083L214k048j13K310l350
226a597J885Q36k872L123j459k114M037k128p46K652k960J695J345l717K615J45
242G40k272K719k004n3L222l339Q00J814l163K425k63k628L247j301r80K940k707
259h03O28J765l425K278N25k886K918j047j040K816k650N51K011l293J855P72
$$ y = [2797, 2308, -3248, 904, 210, -164, 2765, -3346, -1951, 2972, -1871, 95, 2274, -1422, 1376, 125, -1924, 741, -2308, -277, 2472, -2360, 825, 1940, -2089, 2177, -13, -3474, 2282, 571, -1676, 1066, -200, 1074, 320, -2131, 2677, 20, -3145, 2836, -235, -2062, 2604, -1115, -1355, 1734, -641, 911, -89, -1331, 2062, -1784, -1923, 2669, -1607, -742, 2299, -1844, 534, 1814, -1597, 277, -685, -885, 2042, -1477, -55, 2162, -1925, 978, 1641, -2508, 960, 473, -1610, 1604, -444, -557, 1753, -1597, 288, 1124, -1748, 1375, -84, -2198, 1839, -289, -1035, 1617, -1343, 352, 1697, -2020, 595, 740, -1532, 1187, -817, -870, 2352, -987, -187, 1627, -1536, 889, 626, -2002, 1245, -56, -1036, 1904, -803, -175, 1590, -1835, 443, 968, -1918, 1000, -47, -1087, 1729, -921, -370, 1641, -1652, 203, 975]
275I75k718K691o99j663K935j991j7J981k657J381P97k804K778n59k052K936j323
292in90K165k626Q90J346k660J982j41j583K746j856q60K922k357J54J540k360
309a297J765N1j928K642j220r24K387k449N33J968k850J358Q15k082K162q54r09
326h32K342k243J78K070k771J280Q71k323K318n40j387K248j424l26J581k272
342a230J314Q43k417K214k13j769K450j437n37J930j975N03J120j847J728l95
358B82j392K508j426r43K255j809J22J404k014J336K78j679K050j071o76J933
374A158k050M22J763k408J271O32j834J851o01j130J903j405n7J467j960J213
390B35N64k083K040k82j649K005j087k57J537j912J005P60j912J596k10j332J960
$$ y = [975, -1743, 948, 249, -1414, 1521, -470, -487, 1494, -1163, 218, 1015, -1789, 989, 430, -1622, 1314, -9, -599, 1566, -1060, -170, 1176, -1484, 498, 357, -1226, 1520, -336, -1196, 1726, -631, -477, 1063, -1297, 468, 519, -1409, 1233, 13, -911, 1476, -973, -440, 1528, -1322, 36, 851, -1231, 931, 77, -832, 1510, -733, -555, 1515, -1256, 24, 895, -1428, 890, 350, -1037, 1211, -213, -539, 1042, -1230, 84, 927, -1490, 724, 511, -1258, 1192, -245, -782, 1148, -827, -324, 796, -1051, 677, 282, -1110, 1398, -28, -971, 1284, -525, -403, 1001, -1013, 323, 601, -1078, 972, -99, -775, 1158, -892, -470, 1293, -1115, 156, 788, -1046, 805, 204, -926, 977, -428, -485, 982, -978, 235, 799, -1284, 756, 474, -1175, 830, -257, -514, 1023, -889, 116, 876, -1036, 560, 350, -982, 978]
407I78j199o63J990j651L42R75j603J396j26j389J893r30q45J951j679L14J161
424I15j824J145M26j477J460p57o04J868j820K84J323j811J106L75j588J569l52
441B38j118J715j182OJ182j688J091N78j789J495k38j165J654r82l56J403j583
458g39Q23N83j458J322m63r90J728r93n23J476j222M07O84j506J311m5j254J362
476E03o60m27J470j356K55J057j542Q64L18j350J564q02n92J565j277J81J000
493G71j408Q10M52j534J459l56q73J305r03J49R36j488P19P06j440J043j5j019
511f86J301p80j00J021j278N43M74j318J310j83j123J373o26m79J240j077K98
528i0O04j091Q28O6r58J226p28m08J380j148R0R06j252O50L10j041J194n14m81
$$ y = [978, -221, -884, 1106, -545, -203, 772, -831, 565, 439, -950, 943, 13, -832, 1119, -560, -246, 915, -909, 236, 662, -815, 645, -112, -716, 1152, -668, -384, 939, -872, 234, 609, -979, 590, 238, -880, 835, -347, -341, 841, -847, 244, 822, -967, 528, 290, -875, 779, -203, -559, 844, -739, 84, 667, -791, 531, 68, -922, 806, -187, -710, 766, -456, -49, 635, -871, 440, 395, -859, 503, -157, -584, 886, -470, -215, 842, -700, 164, 482, -868, 696, -106, -698, 867, -410, -229, 771, -637, 173, 625, -909, 550, 194, -679, 626, -277, -128, 808, -680, 39, 745, -695, 348, 333, -686, 615, -165, -265, 756, -522, 21, 495, -823, 487, 304, -819, 554, -72, -551, 689, -388, -90, 514, -577, 251, 317, -641, 585, -143, -551, 829, -319, -229, 677, -575, 75, 385, -656, 538, 24, -457]
547d57J275j164K07Q36j310P41N22j363R35K8p35R93p30L5Q27j263P45M17j242
566g03J035j03j063J407o17l68R09p18J62L95r89R04j28p41J193o53l91J233j202
585d38K04R43j238N89J88o91R65o59l37J070j023J18P37r99O56L88j089J011k27
604A68o47J055p86M9O81j230Q40L56j065Q17j65o87J173o94j54Q38r10L35M05
623C79r84R19j81o04J019o31k40Q59r27L58M35r36Q70j40o24Q43n47k45R73j066
643d70L73M53p98N50L4n66Q52m02n91J013p09J56M74p11N05J53p09P44l65l02
663c16P52p10RP88j014M81L88q63P29j66m10O52m97n9O35p31M27K16o61O39j16
684A73o67R31n28j37N83o65L02K17o68P37n2n62P07m52j95P96p46J75L91p63N90
$$ y = [-457, 818, -346, -139, 697, -613, 128, 650, -713, 222, 250, -485, 508, -222, -187, 640, -623, 122, 539, -703, 332, 229, -834, 573, -44, -412, 497, -221, -59, 336, -653, 251, 123, -618, 575, -78, -469, 764, -438, -234, 709, -529, 60, 248, -443, 522, -137, -474, 596, -427, -309, 428, -571, 85, 473, -616, 395, 168, -479, 576, -210, -161, 520, -710, 130, 486, -579, 238, 73, -614, 559, -135, -289, 549, -361, -26, 379, -605, 314, 133, -471, 548, -83, -323, 536, -391, -33, 402, -534, 336, 196, -428, 415, -132, -377, 596, -470, -97, 356, -442, 108, 142, -424, 428, 26, -565, 448, -261, -105, 369, -342, 163, 316, -393, 351, -14, -316, 436, -274, -265, 523, -491, -10, 378, -485, 244, 78, -332, 320, -177, -236, 399, -332, 95, 311, -350, 289, 173, -494, 437, -91, -228, 355, -310, -8, 209, -459, 278, 226, -336, 371, -81, -276, 520, -226, -51, 340, -423, 167]
705A67Q8n78O45m22k01P16p42K32N69p82L22L33p11N60j86k69O91p81N8O04p09
726c96M89J90o94O47j44m87P94m65j11M80l82J73J72p17O91j50m32P09m10j00
746a43N18n23J0M48o52M91j85l24P07l66k12N92o30K23L45n80L91N4m05N15l10
767c6k15O80n88M7M39n80K88J91m96M54r7l11N67m98L2M83o88M28J84n82N20r2
789A30l81N46l95n4M66o61L80K20n84M40k4k85M69l14r1M63n27J66K21n42N32
810A75n3l78N51l01l22O81o30K72K62n37K74K96n95N53k58j65M98n05J55K65l99
831a61K89J44n58L45N8l96O18l56j14M14n81L42J72l98L28Ol96N26m41l9M98m46
853a46J56J81n22M71k4m37O12l83j42N24n17L33J28n19L38R5m37N63m51j12M97
$$ y = [167, 255, -323, 322, -100, -301, 415, -327, -95, 474, -308, 14, 347, -364, 196, 10, -259, 432, -349, -291, 313, -396, 93, 283, -411, 236, 92, -395, 399, -66, -177, 303, -79, 94, 266, -451, 240, 90, -342, 367, -43, -143, 375, -148, -138, 310, -342, 149, -36, -360, 347, -19, -231, 361, -269, -46, 299, -281, 110, 164, -241, 274, -36, -251, 429, -159, -112, 327, -253, 35, 226, -270, 184, 87, -224, 343, -155, -123, 360, -328, 100, 284, -298, 222, 130, -251, 295, -100, -154, 312, -349, 31, 251, -333, 107, 83, -202, 267, -47, -138, 325, -202, -36, 185, -357, 175, 122, -256, 295, -6, -328, 353, -277, -5, 257, -280, -6, 290, -305, 248, -10, -175, 323, -182, -27, 238, -161, 128, 272, -286, 59, 117, -279, 339, -17, -131, 283, -298, 44, 216, -182, 146, 152, -244, 282, -159, -198, 300, -146, 10, 191, -331, 140, 116, -321, 291, -92, -234, 290, -227, 106, 234, -285, 53, 148, -289, 274, -177, -289, 208]
874B08l98K33K13n29K75J87l84M08l60K8L36l81R0K36m99L89J15m46M94j93j85
895a63L44l42M6K83l88K03K33l85K57o8j70M67m23rL45m16L03J7k85K67m2l46
917b72N85l61j10L54n30M02J51m39K53J77l56M64l00j33L24m26K73J74m53N27
937C04k89j74M30l05j40N13n02P0M51n65K89j2l55M84j58n4L03k66l0K60l87J34
959AR9l26L75n0l26M43k76j18L08l02J71J71n49O55k46j46L04k38j43L62k79M4
981f6J09k52K71j34j35L90k95KK90l47O5J84k75K73r0j72M35k71j89M45m67J96
1003c3P6k79K58J33k78K42o1j39J98l15J50J72l05K79J06l99K08M3k23K56j18
1024b9l7L81l90Q2J68l52J59K32l40K63r7j96L42m11K40K36l66K38j64q5K93j22
$$ y = [208, -190, 43, 256, -273, 2, 189, -195, 213, -147, -119, 217, -164, -74, 162, -337, 52, 167, -279, 215, 22, -163, 181, -161, -115, 168, -220, -17, 216, -169, 88, 20, -150, 317, -106, -115, 230, -186, 117, 134, -151, 116, 74, -272, 313, -48, -158, 196, -334, 68, 219, -220, 33, 210, -146, 318, 18, -115, 209, -217, 56, 230, -223, 304, 15, -159, 271, -34, -174, 339, -163, -93, 358, -207, 82, 70, -285, 199, 41, -13, 290, 24, -6, 254, -133, 1, 100, -226, 149, 99, -227, 216, -60, -178, 130, -172, -1, 170, -379, 276, 30, -116, 188, -50, -193, 169, -110, -66, 43, -209, 62, -72, -207, 183, -112, -110, 180, -167, -102, 82, -193, 80, -10, -182, 253, -18, -207, 238, -229, -33, 43, -236, 22, 155, -123, 119, 58, -81, 117, -198, -48, 124, -181, 98, 204, -195, 13, 56, -167, 89, -29, -66, 315, -75, 7, 175, -177, -18, 214, -126, 137, 40, -156, 186, -225, 15, 251, -115, 123, -41, -126, 167, 45]
1046D5j94L03j64k8J99l05J96%k04L08j53j13K60k84kK85k09N6J89k97K72p1j55
1069f6K18k80Q8J82k39M1J46l48M08k10j40M62k83r4K11j52J01J06k24J61q2p0
1091f4J95k46jK46k28J49Jk94K45jo1N8k4r2K99k22N3J26k90J08J79k20J37m2
1115A1p3K45k10M5J07j47M9L1j60K61j76j09J48j15N2J25l23K10K11m07K92pj13
1138e3J97j25k8K58k91j6J47l86L67p5j38L19k90J27R7k70J92j00n7K44j23j13
1160a17K71k00K3R2j56M2J48k31J48R7k15K01J5k10K35k52J15Q2j71K38p4j49
1182f8K08j47m3K81l93K57R6l05K62j01j85K23k2k09K67q1n1O6j33J09J46l03
1204a26J61P5j94J42r2J40j31k9J22j05m4J83j16RM5l1p9K26k13Q2K5j30J43l6
$$ y = [45, -149, 154, -10, -38, 161, -144, 52, 52, -152, 156, 3, -110, 150, -134, -136, 149, -60, -4, 185, -112, 160, 89, -66, 152, -128, -40, 142, -97, -56, 90, -258, 150, -60, -200, 262, -21, -115, 96, -56, 45, 151, -73, 88, 6, -64, 131, -115, -116, 130, -98, 51, 52, -242, 3, 2, -59, -1, -25, -117, 182, -40, 13, 139, -151, -43, 136, -84, 53, 11, -62, 183, -27, 18, 125, -22, 27, 58, -102, 159, -17, -126, 22, -93, -41, 84, -239, -29, 182, -225, 67, 60, -53, 144, 19, -9, 249, -42, -58, 89, -297, 70, -5, -143, 176, -114, 13, 110, -160, 32, -68, -125, 119, -4, -117, 154, -46, -23, 69, -87, -45, 103, -128, 20, 117, -98, 103, 118, -92, 143, -109, 6, 88, -83, 155, 81, -68, 140, -7, -50, 231, -162, 95, 191, -114, 148, 47, -138, 85, 63, -146, 121, 40, -11, 55, -78, 31, 177, -126, 35, 110, -84, 58, -34, 106, -25, -54, 68, -37, -81, 102, -14, -5, 40, 9, -70, 156, -57, 25, 50, -80, 63, 27]
1228B7j32J63ro6J12j74P7J2n7N9p4mJ56j3j44J43j48oJ24p5O8q2n0J62j24k1
1254g6J05j7J9L4j76R5K7n3M6Q0k92K77j37R6J30k23nO0J2J58j59j12K47j78k5
1279f7J53q8p2K65l03M9J61k02N9L7j13K08j11oR2p9K7L6L9k4p0k6J6L3m5L1o4
1306f4L7J53j07J46k35J33Mj12J53j15j0J25j7j06q9J35j43R8R0j2Mj2o8J12j64
1331f4O1J54k76K95k28J47j0j22J8Or0K03l0r5M9p4O7K36k56j2Q2j47M4N4o7J78
1357A23k17o0J06M0R3r0N9m7qk7J22L6j79K8j18K10M5o0P3j25n6J20o2q5J24j50
1383a05J07r4P7Q2J50j91k2K8J3J1n9j18K05j15NJ81k51Q4jQK4k5q5K21j81K0
1409c1J57k06P9K1q8K2J05r4K6k7M2l2j0M0p4n2K21p6m3J09r2o6J08j00J11K5
$$ y = [27, -105, 58, 49, -17, 95, -79, -2, 10, -47, 12, -62, -66, 90, 77, -67, 76, -72, -78, 46, -29, 39, -43, -93, 69, -55, -76, 29, 12, 31, 65, -111, -16, 11, -42, 4, 84, -208, 69, -68, 28, 158, -65, -70, -10, 2, 160, 1, -111, 136, -42, -67, 86, -2, -74, 191, -112, -63, 98, -104, -45, -8, -121, 87, -24, -30, 62, -17, 10, 46, 85, 61, -9, -35, -19, 14, -31, 0, -64, -27, 126, 19, 165, -70, 63, 67, -45, 108, -7, -17, 108, 91, -15, -104, 31, -112, -14, 76, 64, 68, 56, -12, 100, -64, -3, 151, -125, 170, -58, 89, 79, -43, -25, -19, -109, 94, 64, -31, 18, -56, 11, 247, -9, -21, 61, -86, -42, 12, -55, 123, -94, -154, -48, -8, 85, -5, 54, 7, -1, -28, 94, 130, -49, -21, -139, 71, 116, 56, 129, 4, -52, 68, 6, -79, 45, -105, 2, -92, -15, 67, 217, 26, 4, 32, 45, 56, -3, -121, 84, -31, -26, 155, -96, -12, -13, -5, 19, -6, -91, 130, -51, -31, 126, -80, -1, 20, -68, -46, 59, -35, -9, -36, 6, -26, -36, 4, -70, -122, 99, 23, -20, 89, -3, -69, 39, -61, 50, 75]
1435G5o6k2j40J48p7J42%r1K7L0N1j81J5J08q1Q3R1r3J11k25Q4K1K7JR6j25m4
1462c5o9N7P6j05R9n4N6o9J4q2L8J18j06OJ15p2J58j65kN9r7J18j83J36O5j1j33
1489f8J42p8m1L4rkK4n6J47p9K5J45k46J30l9l8L2k5r2J52j53R2O7q3mm6p1Q7
1517e3j00J62kR8k24R3P5Kk3k18K22l1r4O7L5n8K2L8L8J9q3R3k47L2K77j74K1
1544a3O9o2q6P2j3j9L3l4P1k3p9R0m1p7J30r3K30j47q3J44l9j03P4p0O0R0j14
1571c3J8P0j16P7j23J04L5n7k3j1L2j5J00p1n2N0p4R0J19k48J74p3l9R2j17J16
1597B5N1p0j51K01j60Q6j8O0K9j01J82q1j38K35j56L5N5j13m7N1l7Q9o1j1R2j04
1623e7K9R1q2K7q4L6L0Nq7J55m8k6k3r0J86j16N7j42O2J17j9j12L0J21p9L2J6
$$ y = [75, 9, -13, -153, -5, -82, 60, 60, -31, -4, 26, 77, -104, -89, 19, -62, 21, 112, 19, 130, -95, -11, 10, 37, 38, 134, 9, -35, -104, -47, 29, -76, 23, -31, 25, -44, -30, -112, -74, 44, -62, -56, 59, -13, 145, -20, -22, 37, -60, 58, -125, 11, 76, 65, -68, 74, -4, -45, -11, -20, -22, 2, -54, 93, 14, 39, 184, -62, 68, 29, -9, 23, -2, -94, 58, -95, -3, 64, -19, -23, -69, -140, -53, -153, 9, 7, 105, -119, -26, 49, 51, 28, -190, 32, 1, -93, -26, 9, -49, -27, 11, 49, 68, -15, 78, -169, -137, 140, -34, -13, 56, -6, -92, -20, -33, -52, -19, -53, 18, -5, -84, 6, -35, -112, 18, -75, 155, 8, -75, 69, 30, -73, 1, -69, -9, 81, -33, -15, 55, -61, 16, -107, -3, 32, -25, -48, -59, -27, -42, 58, -13, -65, -15, -89, 1, 120, -128, 46, -27, -66, 26, -91, 25, 76, 6, -145, 56, -104, -18, -36, 24, 53, -48, 134, 53, -85, 150, -6, 29, 84, -29, -76, -25, -62, 27, -34, -45, 47, -57, -28, 63, -19, 8, -76, -40, -10, -5, -92, 63, 15, -11, -34, -124, 62, -54, 3, -139, -77, 40, 21, -91, -61, 60, -19, 13, 29]
1650B9n1j7o8J64jj5m9n9J25q3Q0j25P6O3p8n9L8K1Rj8jM0j22P3Q9j46K8P1p3
1679e9J55j89J44k8l7j5j9j5O3rk4J76j46M5j28N1J71j24j03pQ3n3J1Q0JQJk20
1707a87J45J57r5j05J18Kj51J04N4L2l4j4m8KN2Pn7O1o7J02r5P1j3j22O8l6O5
1734A6n6K1o2K19j85J12q0L3j09J73r1o6J53j92J03J38j99J03j14Q3q1N0J05j07
1758c3L7m9J04n5k5l5Q9l5JnL6k9R8k9J7m4p1RL3l7R8Jp3J1L2m7P3Nj21J6RR1
1790G2q0qo0J09j66J01n9P2P2p3j4J99j19q2K6M3k2j04J31NK7k03J34Roj1l8M3
1818bnNj4p7k4J76p6j4J16k21K46j23L9K0q7m5P6m3P8m5K9PONM8j08J9mk1Q0J15
1849A56r4j47P5m2Q0j02J31j84J78O5r1j44J66m6K2l8M9o7K8J05j06m0p1J44P
$$ y = [29, -22, -39, -107, 57, 56, 41, -8, -67, 58, -25, 55, -70, 6, 69, -9, -68, -30, -9, 0, -18, -19, 21, -101, -28, 61, -85, -57, 14, -59, 96, -93, 51, 23, -14, -29, -48, -63, 0, -9, -33, 143, -3, 42, -86, -35, 136, 12, -91, -98, -15, -68, -57, 23, 24, 32, 33, -187, -42, 115, 20, -85, 33, 35, -116, -12, 42, 74, 40, 26, -22, -20, 32, 39, -18, 43, -24, 78, -17, 54, 41, -81, -13, -49, 16, -40, -19, -81, 138, -47, 65, -15, 18, -91, 82, -9, -75, 78, -114, -11, 127, -72, 31, -83, 0, -81, -31, 74, -33, 4, -45, 59, 4, -21, -56, 33, -2, -1, -6, 30, 1, 99, 70, 87, 43, -28, -19, 14, -23, 75, 76, 3, 14, 46, -1, 72, 77, -44, -28, -19, 72, -8, -16, -76, 33, -133, -32, -91, -19, 53, -20, -34, 165, 46, -36, -10, 33, 11, -93, 38, 43, 70, -133, 1, 10, 4, -7, -45, -2, -7, -2, -16, -93, -117, 59, -17, -31, 85, -136, 110, -13, 26, 46, -41, -86, -10, -53, 25, -20, 9, 16, 22, 27, 75, -33, -14, -18, -39, 41, 156, 62, -85, -10, -52, 28, -74, 57, -127, 51, 116, 25, -119, 47, 1, 23, -15, 34, -33, -5, 100, -6, -46, -117, 27, 34]
1874C4r4J11p6qJ13K7o5l5K6j04P7N8j0r9K7M5jm2Q2J03j07l0j5Jp3Q5kK2l2o7
1904d9L9L6OJ3j28J71p5q3J38j60P9J27j32J03l5j2j9j24J46n6M4J07j76k04K43
1929aj7MJ27r5R8j57J37j22j2M5M6j9J17j89m3K5RJ03j9M9n0oj6L4JK6j19M9L8
1958D3m6k5p8J14J18j00k7j05Q3LR8J6j29L3k9rj2l3J11k9JNr9J27j3Pq5L9j6
1987c7ml0J91j55K0k3J21j36J16j8j05P5o9k8J16K5lp1N9Jjj02o3J41j09M3K8
2014a8n4k3O0Q0j72R3J27j22R9J1j25Q5r8jJ38j49L5n7N3N7j58J97K9j00J7n3
2040d9k5J86j0j55p0J31l3O0J23j36L1l7J11j87M2J18l5m9N3j48R4R1l5l9j22
2065i0J00J5n8N0p8O8j4K3P6n9j52J39ql3N3o8J05R1j01j30J28k7q4N4p5J9L6
$$ y = [34, -60, 51, -25, -33, 80, 107, 42, 7, 33, -71, 6, 64, 54, -45, -18, 27, 26, -16, 66, 169, 62, 32, 17, 18, -55, 30, 28, 50, 18, -49, -10, 26, 32, 45, -83, 88, 13, -70, 68, -92, -13, 114, -18, 85, 50, 38, 19, -105, 41, -15, 29, 136, -40, -244, -1, -18, -14, 113, 18, 116, -41, 96, -26, -38, 7, 53, 34, 151, -38, -81, -56, -47, 56, 37, 86, 36, 30, 14, 48, 49, 75, -44, 5, 43, -3, -28, -106, 8, 126, 26, -1, -106, -23, -20, 78, 94, -35, -2, -31, -40, -52, -85, 26, -3, -2, 3, -96, 31, 18, 25, -60, -21, -37, -41, -71, 120, -35, -15, -38, 83, -53, 63, 45, -60, 15, -54, -82, 34, 59, 56, -15, 44, 45, 44, -58, -121, 20, -89, -46, -18, -72, -95, -35, 45, -127, -34, 93, -29, 70, 81, -44, 41, -57, -58, 80, -69, -34, -91, -38, 19, -139, 58, 87, -13, 4, -49, -74, 112, 102, -53, -123, 8, -25, 35, 158, 22, 53, 16, 127, -60, -18, 100, 65, 16, 69, -79, 15, 106, 71, 32, -90, 10, 25, -33, 17, -61, 7, -7, 16, 92, 33, -119, 20, 12, -21, 32, -36, 69, 160, 59, -71, 57, 30, -54, 0, -75, -56, -20]
2092b0j1N4j8n9Q6k4q3j6L6M5J4jj7l4MN4M1m1l4J23p4L3m0L1r5O5r4Q1K0n8p5
2123a07L3R3p7O1J1j6k8N4k7m0J12pj26qJ02o1o5R3k6L4rK1rM5N9p0n8k2p0R9
2153iJ42j39l1J02j28j6Q4n7J05j10O7Q3o4o2L0J6J1k4J34k55J29J42j69l0R8
2178D9o2m0q0l0J86oJ5q4N8n7k0K1J84k04P5k8k6Q9p2j00J12K1L4Jn8M5j31Q9
2206a9L7R1j17Q2j61n3J17pP0n9l1Q0K2k8Qn1L2J9j31Q5k3O3J9p9J01Lm9j28R5
2235a2q5J51j09n1J49k4k3R7j51R2pm6j2%J21j97P0N0J8j24K04j65l7J12N2j6
2261E7j50J39p5J10j47l7Q4J7l1PR5j37l9R4K0l0L3n7qL9k0J6j21K25r8J0M8m2
2289BL9o3o2R2LL9j59N7L6j3P7p8K7j1Jo0R3j44N4L9l9K2M3J9m5K0L3l6r2J49
$$ y = [-20, -31, 23, 5, -54, 32, 8, -75, -91, -55, -10, 4, 3, -14, -48, -44, 10, 51, 10, -24, 99, 25, 58, 18, 49, -46, 19, -75, 6, 26, -32, -107, -74, 19, -58, 3, 14, -2, -30, 24, -3, -43, 69, 62, -64, -72, 30, -31, -96, -3, -29, 5, -4, 17, 8, 53, 112, 42, -16, -38, -108, -9, 133, -6, -37, 65, -63, -79, 5, -52, 53, -57, 10, 93, 29, -33, -3, 13, 24, 0, 134, -121, 8, 150, -19, -49, 49, -13, -53, -133, -163, 23, 17, 32, -52, 6, -51, -71, -50, 134, -70, 5, -23, -49, 40, -32, -132, -20, 1, 35, 36, -22, 23, -108, -19, 18, 109, -8, 74, -87, -140, -23, -30, 40, -19, -50, 30, 52, 24, 32, -19, 13, 32, -99, -14, -37, 26, 45, -34, 67, 70, 21, -107, -12, -97, 54, -55, -106, 43, 19, -4, 93, -58, 34, 27, -19, -31, -31, 90, -107, -37, 13, 31, -93, 111, -54, -91, 21, 73, 57, -93, 46, -29, 81, -66, -103, -19, -2, -33, -26, 69, -68, -107, -13, 7, -23, 10, -47, -55, -16, -36, -20, -141, 84, -14, -4, 44, 2, 41, -22, -84, 8, 11, 50, -109, -52, -16, -29, 48, -30, -3, -14, -13, -73, 20, -124, -70, -31, -70, -48, -5, 14, -31, -11, 22, -14, -106, 43]
2319D3N7j45Q6r1N8K4r3J53l7o9m2O4k3M3m0L8j2j05R8l4j2K7kk2k6J74r3j35
2347a16K15j23N0K6K5k12J55r0N7O4j15k2M5O7m8j5P5R4o5j06J21j07j0P2q5Q5
2373C7q5J02k9j54J49k2n6J7J14j66Q5pNJ04r3M3n3mN3q6QM4m0J0Q9N6j36k4J44
2402A05l07J06k1O7P0l8n6J38j42P8l8MPJ1j9Q5j15Q3k9Nom0LN6n1L9O4j18J44
2431H5p2j4J03j74J01J20j94K4K9n5N3p1J05J1j25J19p0rk2L5L7k4k09K48n5J53
2457A29j25o5NQ4n5Q0o4LJ9P5m3l1Op2R1M9r6m9J09R7p7n8q9J82m1k3j13N8k8
2486d2k5%K9J36j77M5O1J3n6N3j6n4P8r8O3J1n1O5j29O6K0j6L7r1O6J28p9j00
2514f3P5K3r6Q4N1j4rj26l1N8L1k0j2M9r2J59r7R6M5o2k7K5j51R7L8p5K4L8j2
$$ y = [43, 100, -45, 41, -50, 8, 32, -61, 92, 55, -14, -56, 8, -15, 28, -12, 26, 14, -91, 7, -27, -39, -12, -14, -36, -62, 112, 19, -116, 99, -24, 26, 52, 77, -135, 20, -70, -13, 51, -64, -86, -41, 26, -22, -37, 38, 132, 67, -39, 82, -25, -35, 37, -48, 37, -48, 54, 25, -129, 20, -2, -58, -41, 73, -93, -8, -15, -10, 94, 1, 44, -9, -13, 40, -46, -38, 6, -34, -24, 65, 121, -15, -39, 105, -202, -96, -117, -50, 20, -18, -74, 64, -78, 0, -38, -34, -27, -16, -35, 50, -65, 18, -11, -6, -12, -52, -49, 7, -44, -5, 59, -59, 85, 13, -1, 102, -72, 29, 149, -45, -21, 8, -47, 6, -65, 40, 51, -74, 45, -25, -34, -56, -21, 16, -8, -217, 31, -24, 129, 4, -61, -56, 28, -27, 53, -11, -8, 11, 86, 43, 12, 18, -54, 37, 86, -10, -59, 50, 147, 70, 12, -77, 105, 64, 41, -72, -14, -42, -67, -67, -38, 98, -79, -34, 27, 40, -16, 37, 21, -33, 45, -53, 10, 21, -30, 35, -94, -28, -8, -24, 13, -78, -12, 116, 37, -63, 12, 35, -61, 23, 74, 60, 51, -75, -106, -48, -17, -37, -49, 0, -92, 67, -30, 66, 111, 49, 22, 47, -104, -7, 31, -44, -20, 18, 6]
2543Fj80J48L0P0j50R7j3O9o7k0M6k3J5m2Q7n7Pr5J14j07MJ06k5P1j54J44j48
2570f7J09p7l5J28L5j01QK6k1l6p0J35j4j5j1jm4L4n9J84j57J03m0p2K5LP4O5
2598A09q8l3M3l6M6k8K9p0Q9j52m9J08O5q1J2J28o7Q6r1n1N1p0L0L8p0J15p5%
2626a2q3O7j0n0J10j7J29j72%K6M3Oj17nK7N8N3r7K9j3Ln3J55k5m0o1J07rj15
2655f6R0j09J75mm6Kl3q9RJ71n9n6j05J85j52L6R5j1j35J50l7l4R2l7J7j15L0
2682c6P6o2L9j36K4J63ko3O1p9N1l7lj3Q7k4r3M1o0J3mR2j05M6on8K9K2R3n0J14
2713A20l7o7j27M2K2K9P3j45N5Q9o7Q3j49J07K8j45M7l3P1%o0p8J25PJ9j21J45
2740C3o5LJ9n8Q0pj8p5O4Q5q9q4O2N0K1L5j03j6J40r1J8J4J0j5k6q5M4k1K1L1
$$ y = [6, -174, -26, 4, 74, -76, 21, 8, 77, 10, -10, 36, 13, 28, -14, 73, 16, 23, -72, 42, -65, -61, 45, 20, 91, -63, 81, -67, 42, -35, -70, 58, 93, -8, 0, 26, 5, -31, -101, 34, 20, 5, -6, -7, -51, -17, -76, 108, -49, 54, 14, -58, -33, -30, 44, 109, 21, -12, 31, -5, 41, 13, 42, -28, 61, -91, -140, -32, 33, -48, -36, 92, 25, 111, 20, -31, 20, -50, -20, 18, -52, 63, -12, -12, -95, -28, -38, -88, 22, 5, 134, -38, -38, -12, 31, 37, -80, -85, -58, 0, 53, -44, -15, -28, -25, -78, 77, 52, 12, -49, 58, 49, -66, 24, -85, 90, 86, 40, 42, 9, -80, -71, 100, 41, -15, -120, 65, -87, -51, 44, 33, -102, 48, 11, -23, 69, 32, 49, -66, -36, 40, -22, 17, -119, -95, 68, 66, 3, 64, -15, 36, -1, -4, -17, 70, 46, -47, -6, -66, -53, -57, 35, -70, -24, -30, -88, -59, -37, 56, 6, 120, 83, 16, -111, -69, -47, -18, 55, -90, -35, 54, -13, 70, -79, 28, 56, -89, -42, -75, -4, -4, -64, -142, -17, -10, 9, -112, 33, -32, -29, -10, -68, 12, 5, -13, -88, -24, 61, -28, -112, -50, 0, 21, 56, -47, -63, 77, -14, 4, 18, 28, 13, -13, -98, -54, -75, -54, -23]
2770b3N0NOrQk9j80K27n2N2l4q3L0M0p6Pm9R4O9j45J80n1L3l3m9j9j3N8m3L1k8
2801b6jJ83j92kQ6m8Km7J7J22j22L8rP9k50J58Q0n9J2l8J3l7P1o7L4k8Q9L3J1
2830A02j03p6%J58p0r9J54J2j86P9R9p4j08P7n9M2K0M8m0opK3O0l5j1m0O0k4k
2859fj02J64j15R7m4q2P6L1o3J70n1j01J05j23OK7q4L8Q8L2n5l2K1J21j03M6j2
2886D9J1m2J00j71R3J9p2oR6j68P1k1K8R0j75J15K0j00K8r2P3J22k5J4mp1L8k9
2914ip1K2J55j6k1k9l9k6J2q8M4J34n6q1P0j29L3J20o2Q8p1P0l9o0Q5K6o6Kj41
2943a43J87o6J8%K1j30N1L9J2K4n9k3J41n1R0j77J08j1r2P0k5R5k1K4k05J17L
2970cm8O7N8l6j7Qr0K1P7r0J47j31N7j23J33j56R1K0l1J96j39j42P6Q9q6R3JM0
$$ y = [-23, 27, 32, 38, 29, 37, 8, -172, 55, 3, 55, 21, -62, -32, 8, -68, -61, -110, -16, 53, -92, 88, 37, 70, 37, -12, -31, -44, 14, -29, 2, -26, -27, 156, -36, -38, 48, 0, 2, -45, -28, 94, -28, 10, 1, 80, -170, -12, 68, 9, 21, -17, -4, -41, 30, -37, -3, -31, 58, 91, 102, -1, -77, -77, 81, 11, -88, 66, 78, -108, -29, 70, -4, -112, -35, -94, -52, -32, 16, -24, -30, -37, -14, 46, 11, 0, -40, 20, -4, -6, -108, 56, -59, 38, -6, -88, -12, 19, -44, 126, 75, -26, 79, -44, -38, -11, -95, -57, 31, 63, 8, -24, -3, 118, 15, 61, 49, 60, 18, 118, -53, 40, 59, -13, -19, 77, -91, -20, -41, -13, 77, -98, 17, 37, -63, -35, -127, -54, 68, 43, 57, 53, -18, 20, -9, -80, -58, 97, 81, 60, 31, -8, -34, -22, -110, -66, 68, 12, -69, 1, -128, -95, 25, -37, 51, -20, 50, 11, -49, 36, 62, -4, -2, -143, 44, -22, -4, -4, 17, -113, -62, -23, -11, 13, -46, -69, 72, 21, 111, -66, 42, 31, -61, 9, -16, 79, 58, 82, -123, -6, -3, -51, 16, 74, 38, 21, 29, -61, -40, 37, -53, 94, -37, 20, -103, 30, -126, -35, -15, -46, 150, 11, -131, -55, 34, -52, 41, 42, 82]
2998H2qo3K4k9K0j00J23j22P8m3o2J23j3k7R7j01k3J05n6j3p2R2j1KL2o4q8J25
3026HO8q1L0p8R1j25P4l4J81j70P2r8O2j1N3o4R5m2p8R7J0j20Pm4O5M9l7J10j57
3055f7R8j34Q7nJ22o6q1J22o8L8o1l8J12j68Q0K6M1%jo1m9J85j22j28J14lL5K4
3083C2LL0l6J6q3Q5j56J19j1M9o5O3q9O6o0J9q2J95n5j26R2MkN6m7r6O2J18r9
3112Bn2j4J0J13l5J8j67J50j27J37k5Q1n5k0q1J17l9O0r4k9K6L6L7j52J55n3o
3139gj79K28j59M7J22m3K6J00j35j2L4n9O6Lj21J30p4J90q8j19N7o9K5P9o9Ok
3166b3L4J6L3j57R2J71k57L4L8J06m8J3kj07O9N9o3PJ0j93K06l8mJ3j3L5m3k8
3194d0M5O5j61J15m1P4n5J17p6pK6l3n9Q0k09J36N3o5J29l6n4M1j10J29q0k2p
$$ y = [82, 74, 11, 35, 6, 26, -74, 49, -73, 5, -38, -100, 23, 10, -17, 80, -21, -44, 61, 5, -8, -80, 12, 1, 3, 35, -29, -117, 8, 76, -5, 25, -53, 38, -87, -13, -47, 134, -36, 36, -62, 0, -11, 42, -22, 73, 31, -47, 50, 60, -60, -53, -97, -32, 17, -20, 90, -67, 31, -103, -16, -21, 101, 35, -46, 76, 8, 46, -15, -53, 59, -109, -29, -3, 38, 38, 37, -24, -73, 112, -10, -138, -24, -27, 8, 32, 35, 65, 29, 45, -38, 47, -109, 10, -1, 48, -17, 46, -43, 23, -37, -18, -100, 95, 40, -86, 6, 10, 8, 64, 17, -79, -17, 101, 2, -50, -64, -54, 59, 24, 42, -125, 25, -102, 35, 10, 91, 36, 16, -65, 52, 13, 73, -21, -50, -24, 12, 49, -103, 52, -1, -7, -186, 42, -117, -70, 52, 9, 35, 135, 0, -12, 22, -37, 29, 32, -89, 41, -33, 157, 69, -50, 7, -62, -37, 42, -27, -21, -23, 11, 27, 60, -97, -5, 166, -91, -57, -19, 87, 39, 52, 50, -57, 12, 71, 8, 15, 25, -168, 38, 0, -4, 9, -4, 31, -12, -40, 5, 70, -91, 24, -17, 57, 2, 119, 43, 36, 62, 29, -30, 50, -159, -23, 30, -35, 94, 58, 4, 45, -65, 64, -16, -38, -45]
3221d5L0l1M3jL4lj00P7p1M1K0L9o0P5o8K8J26q1%k7l2o8K02r4k3J37j30j46N9
3250f9K10j47R2l0n2JK4k1J0p1o0P7J6L2%j14J04m0qM3nM0p8K1O4j3n7PRRl8J78
3282A34k07O8N1Rj8r1oL3N5n0N1o6N3m3J9j01%J11J9o1OK9N1l7m3pL7M1q1M1R9
3313I6m9M8q0Q4l2l6j13O7QR3p8Q1j16k2J27j62J94j84K7L7Nl0l4K5J32q7Q5j74
3341h8O6J4j1l0M3Q4j18m4M2M3M3p2l9Q3QN0Kj27R6m4o7P4O5j30J45j09mN6jP
3371C7j6o3J13j08Q3j23J18q9M7O0n3N5q9R2r3J8Q9j22N3Q5j09j9M9N3J4j36P
3398d7R9k5m0K3O4JQ6j78j05N6O4j43K20O8k24N8l3m7J77j43R2m4j2k1N5J3k0
3425fM4K0qp9O4N1l8kj37R0j23J65N7l0k0K1ko0K6j09J71k07J32r2pQ2m2K0l8
$$ y = [-45, -15, -46, -3, -4, 30, 27, -73, 4, -67, -26, -6, 33, -27, 48, -20, 8, 134, 53, 53, 26, -6, -74, 128, 34, 11, 148, 18, -128, -69, 141, -6, 86, 56, 4, 5, 29, 8, 18, -53, -113, -36, -20, 12, 12, -102, 2, -38, -46, -3, -8, 32, -46, -25, 39, 26, -31, -24, -15, -6, -44, 134, -73, -5, 46, 55, 37, -54, -60, -27, 28, -22, 29, -37, 16, -27, -8, -109, -109, 2, 21, -40, -34, -5, 46, 9, -34, -41, -4, 37, -44, -3, 96, 47, 95, 15, 99, 67, 31, -82, -15, -7, 86, 8, 89, -27, -49, 78, -84, 110, -74, -47, -10, -5, -35, -69, -44, 88, 1, 86, -88, -22, -8, -19, -49, -6, 78, -40, -84, -42, 1, 44, -28, -67, 16, 24, 74, 76, -51, 45, 1, -66, 8, 73, -57, 88, -21, -25, 31, 30, 37, 21, -42, 71, -37, 46, -77, 41, -48, -1, 59, 6, 61, -28, 64, -29, -11, 78, -44, 9, 94, -15, -34, 15, 68, 82, -54, -47, 52, 27, -13, 10, 74, 75, 161, -17, -122, -66, -2, -145, 75, 143, -81, -23, -56, -103, 74, -69, 23, -21, -33, -54, 1, 14, -6, 38, 58, 50, -29, 35, 86, 48, 46, -91, -1, -124, 41, 98, 68, 48, 69, 67, 7, 33, -76, 95, -112, 20, -72, -79, 3, -39, -19, -57]
3454e7J17r6M8M6p1J18j60J38j74n5J55q0L6O6p1j6j5R0j01J64o7K2mm4P5q2j5
3481c3K6q2J07mj09M1O6j54J08J7l2L7j29J92m7kq1J53k0oj24Q1l4r5J96RK3j07
3509cQ7j01lj7o5L5RK2m2K7J6L2p6R9kM4M6j09o6N0l9l9J61N9r8j25J98j26l8
3538f4J42p8n5Q5j19J39q8N9R2M1j56N5o4n1J13r2Kj3N5o8J74j02J6l8K5N8q2
3565a4N1M4j20J5P7k7n9J1P8j84JN2P4J4J7j12J51q5N7K6j75J57j02P3J17j46
3591irP3r7njK4Q6k8j7m3l8M8J1J22j37K0J2J2L1o5O9o5M6L7j22P2k7o6q4K03
3621E3l3j8lp8J09j1p5L3N7k0k2o5J74q4N5nj04K8J49j55R6n7j4k5k5Q8k8nM4
3650E9r6l3J55j29M6m7j6R1R9k51L6J03p2M5%N2k5m3J06r5j6lJ61r9Qn6J09L2
$$ y = [-57, 60, -36, 12, 58, -13, 105, -55, 83, -91, -146, 9, -71, -35, 31, -40, -56, -71, 19, -82, 82, 15, 37, 33, -11, 64, -18, -33, -7, -89, 18, 14, -95, -54, 12, -142, -34, -17, -49, -12, -141, 51, 4, 2, -79, 74, 54, 48, -76, 5, -29, -124, 72, 81, 104, -3, 84, -17, -20, -37, -102, -67, -58, -36, -78, -51, -35, -3, -79, 20, 18, 62, 108, -1, -67, -17, -56, -95, 66, 125, 27, -98, 100, -26, -64, 78, 0, -55, 30, -89, 50, -38, 21, 113, 154, -2, 53, -11, -62, 51, -41, -39, -52, 3, -65, 109, 7, 23, -15, 10, 68, -14, 37, 81, -39, -24, 53, 26, -33, -22, 56, -128, -127, -75, -1, 13, 30, -82, 69, -16, 41, 67, -108, 49, -53, 20, 137, -9, -18, 55, -42, -47, -48, -24, 62, 34, 17, -26, -64, -16, -5, 117, -20, 0, 12, 24, 55, -10, 59, -6, 40, 77, -45, 27, 0, -66, -150, 53, 20, 2, -1, -79, 30, 19, -56, -23, 34, 14, -8, -73, 101, 17, 72, 67, -37, -9, 140, -15, 81, 24, 10, -15, -40, 48, 20, 15, 59, -37, -70, 85, -44, 2, -45, -61, 30, 129, -122, -86, 17, -55, -10, -10, 42, 17, -26, 80, -15, -31, -34, 127, 28, 36, -20, 89, 121]
3678A21m2k5j14lR2j01J75j49%mK1n0j3L6j1J3p8J44m9L5j48K41j56Q1Kq1K27
3705A64j70j24J88j03J94k19MJ32m2p4M8p1Q1k2k3J70j07O6l2k9j39P3P4o1k0
3730d2M3m7J26o1NL3n9n8Q8jm5j09J60j03J01m8L5k6l4J04j6j6j50NJ00n1J14
3757D8J5J9q8j61L1J40K4p3O5p5K1O0j1q5j6J43R1k49J11m0nJ8j8J5L0j9P6j61
3785i4Q9n8JN6J0jll8j10J76M0r2o3J75j37J06n4J9j5qJ7j22N5J16n4J2j32J92
3813H3j75J89q1q4R8J9n8n6Q5kO3n5m2q1L4j4K2Q2P5r9K3o4m0j2J01rK5oK7Lj24
3844g3Q7j60R1O9O0j42N4P6n7o5Q3k0N5q2p6O3K6P1j35m1J16O5J5j46PJ45p1R
3872B4po1m7JJ06P2j64J93j21mJ03j25m0N5K9O5p3N1O4k5k1pj33J39j77Q7J16
$$ y = [121, 79, 54, -60, -63, 29, -72, 103, -46, -46, -50, -29, -79, -92, -56, -67, -54, -132, 12, -37, -2, -150, 91, -65, 16, 18, -63, 164, -6, -130, 58, -45, 149, -70, -66, 66, 24, -50, -2, -73, 8, -14, -37, 133, 26, 92, 60, 31, -108, -35, 39, -22, -42, 1, -46, 80, 19, 24, 57, -2, -60, 28, 27, -18, -127, 33, -70, 31, -17, 18, -8, -42, 62, 46, 30, -120, -115, -15, -66, 48, 63, 82, -6, -167, -136, 4, 28, -45, 20, -55, -34, 26, 15, -70, -86, 57, 148, -101, 10, -30, -35, -17, -35, -20, 10, -9, 67, -94, -5, -63, -62, -6, 4, 3, 0, -38, -148, 28, 68, -24, -87, 88, -49, 57, 3, 22, 7, -1, 16, -106, -51, 65, 11, 23, -109, 83, -92, 97, 16, -68, 30, 49, -9, -65, 20, 18, 81, 26, -16, -97, -63, -77, -55, 27, 102, 3, 26, -38, -78, -90, 11, 2, 27, 21, 48, 51, -73, 14, -146, -55, 14, 74, -68, -14, 62, 5, -60, 23, 3, 58, -24, -100, -37, -11, 60, -75, -116, 0, 65, 80, -66, -59, 86, 15, 24, 17, -44, -91, -90, 16, 88, -76, 117, -4, -8, 95, -30, -70, -15, 14, 79, 6, 57, 121, 96, 75, 68, -65, 74, -103, -16, 100]
3899A00j0j87J51p2KnJJO2o9LJ83j53J00j80J03o9J8J8rJ05j82j4J34L6p4Mr7
3927a00K8NpK0P4k8j13N4J16q5J05l3J0n8qk5ON1ok3R1p4Q4j20J00l1L3q9j4N
3957c2J8L4m3K6P0o0p2k0R6k6J0K0n8J49k13J53Q1j60P7N0o5rk3j16P1J15q8l3
3985d8pJ0L7K2l8KK1jMj08J77m6K7m8j7J01j32N1Q8m6q8O0RJ29j63j2N1m2N0n6
4015a3J09r0P0j08J10p3lJ1l0L2k2J5m8M1K1j03J4J15m5L5j7o2K5o2J44m3k6l6
4043c9K5l0m9J43rP9o8k1Mk9j01k2J60n3j2R4j07n6K3L9J07r4N7M8n9j7kk0O2
4072E3j03M8O5n3l1kN5j4oj8P5mj93K50j64J04q7L1l6J93r3k7O5j38J81l9q2K1
4100E1J61k40R8l5K0j51N7n2P2L6q9J07o0K9r9J45j21Q6rp2O1J9k1K1m8M0N7j51
$$ y = [100, 90, -97, 54, -18, -16, -21, -20, -19, 43, -26, -23, 160, 7, 107, -73, 30, -39, -21, -3, -12, 93, -89, -103, 31, 67, -7, -3, -100, -72, -67, -74, -54, 20, -8, -121, -67, 49, -36, 69, 36, 46, -12, -20, -45, -39, 12, 6, -17, 74, 0, 84, -36, 64, 33, 66, -23, -37, -32, -14, 20, -23, 3, 73, 13, -59, -79, 17, -9, 1, 21, -37, 112, -101, 52, 133, -27, 50, 100, 35, 26, 3, -113, -42, 73, -15, -48, -55, -45, -8, 14, -24, -22, -1, -2, 2, -106, 71, 25, 52, 4, -13, 88, -44, 7, 95, 49, -39, 21, 30, 159, -4, -16, 35, -7, 43, -13, 96, 6, 76, -32, 78, 5, 2, 13, -17, 15, -7, 8, -40, 1, 22, -81, -67, 48, 3, 38, 21, -41, -16, -78, 66, 23, -3, -39, -14, -44, -93, 50, 41, 120, 52, 31, 35, 6, -95, -117, 43, -10, -22, 72, -35, -91, -68, -29, 78, -16, 41, 89, 30, 13, 11, -9, 53, -50, -2, 63, 10, -21, -23, 32, 18, 12, -6, 69, 65, -128, 122, -42, 62, -25, 6, -30, 163, 70, 43, 108, -30, 151, 112, 30, 51, 212, -28, 70, 35, 55, -96, -39, -91, -19, 17, -72, 35, -25, 4, -95, 50, -71, 15, 6, -66, -5, 14, -7, 14, -34, 6, 63, -88]
4128h8P4ok4N2o3%L6L6N9j05P3m6q2J1K15j70N1j03O1q2R0N2O0m7l0p6j16J32
4156c6k8N2Ll4R8L7k23J42M6j56Q3p8J07j08qJ00j1m2P1o2P9m9m4l6R8K9J00j85
4184e5N3M4n7j53K87j81J0L8oK9j41J79j8j8K6p0K9L0J9k9M9rn1KJ9j40J9J78
4212H3k86J80P2N7k06L8P3m4L4O8j54P0J42k26k8J04J9M4k9j28J01m8L3L5o3L4
4238b5q7J22OO2j29O0PmR9j12k6l1N9m2M3Ll4J17q1k8j4n5J52p6rJ03m0j03Q0
4267A7PL9j67J25o2J33j20P0Lk2j8O4k9j47J46J02j47M2j00q2O7j5J46p9P4j16
4293f9j2N2J4J22j09N3N4j14RKLP8j35L7RO7r2J7J6P0J3q8n5p6R7J05M0j05L8
4322D1K1j48N8j02J90j24R5j35N0J4M0K7j8L8j45K5RJ00j53J09M8J06j58k1mN8
$$ y = [-88, -14, -20, -44, 8, -55, -55, -19, 17, 76, -29, 44, -2, -84, -73, 142, -28, 23, -80, -19, -101, -11, 41, 101, 54, 24, -52, -168, -36, -64, -12, -9, -43, 55, 92, -131, 11, 57, -99, -16, -94, 13, -95, -103, -3, -14, -56, 15, -47, 32, -17, -61, -97, 1, 30, 130, -55, -2, 42, -15, -168, 119, -62, -52, -14, -20, 9, -132, 47, 29, 11, 37, -33, -4, 26, 45, 16, 65, 56, 5, 7, 26, -114, -95, 83, -203, -23, 49, 106, -100, -62, 11, -33, 1, 69, -85, -15, 127, -99, -127, -23, -4, 40, 11, -117, -16, -64, -31, 4, -59, -25, -112, 10, 16, 78, -51, 9, 16, 12, 111, -1, -27, -58, 1, -41, 2, 5, -29, 88, 7, -21, -35, -90, 62, -14, -23, 80, 40, -63, 17, 24, 63, -104, 21, -41, 92, -28, 42, 45, 23, 5, 69, 40, -107, 39, 141, -6, 36, -64, -146, -79, -94, 52, -27, 47, -69, -81, -29, -15, 107, -2, 51, 105, -9, 0, 2, 5, 83, -52, -15, -6, 61, -31, -14, 2, 72, 85, -3, -58, -134, -37, 68, 108, 3, 41, 62, -86, -28, -130, 60, -64, 31, -104, -54, -40, 0, 27, 9, 47, -98, -73, -64, 36, -117, -8, 40, 146, -12, -33, -37, 21]
4348B1j28P1M3j26Q0J38q1k7J1j5L5l1pqo6N1J23o2J03j43r5J53l7M7l7J02r7
4375A8M5j11J09j29J10Nj9k0o4N3P8k3%K6j42l6J8J88o0q1Q8j50Q8O6m8J3j2Q0
4403I0j65Q8rl6j9N5j7k2oN3n4K6j00J64r6l4%J48j79J51o5NK8o1M7L6J48j60
4431A6q9J18On5O8K5k4k09J57Q3k1k6K0J25k03J9Jk2K2j07N5k3Q3p4J00j37J14
4458B2L9o6j02J07n3n0J13N4j77K13q6L6n1J06p6L3m2j26J10M3j52J55q8p9K67
4483A50j32mp6L8J47j11M7M2j54j6K4Q1K0m7n6L3O5J8J5j53Q1o2J02m6q7J35Q4
4510A38j85m2L5N8P6j61J14n5J62k08J3P3q2n1Q3L2RLl5K1j19O1K2m2R5J4j6L1
4538D4j73J15k6N5l5K0j43J08J03o2N5or3J47p1l6o8O7R9p1qrK8p8L1M6Q7j08
$$ y = [21, -107, -36, 7, -119, -39, 99, 18, -9, 2, -13, 22, -9, -16, -24, -90, -39, 84, 22, 125, -18, -113, 40, 3, 50, 13, 115, 18, 63, -48, 61, -68, 42, 47, 28, 8, -56, -3, 75, 52, 52, 78, -64, -100, -82, 106, 46, -35, 53, -97, -9, 57, 9, 22, 10, 90, -75, 13, 4, -32, -51, 4, -13, -35, -41, 12, -42, -16, -116, 48, -48, -82, -82, 66, -113, 38, -27, -22, 6, -55, -8, 28, 176, 16, -73, 45, 51, -4, 64, 89, 65, -144, 13, 96, 75, 49, 69, 194, -9, 10, 11, -11, 11, -96, -41, -64, 19, -55, 45, -92, 22, 61, -5, -107, 0, -53, -103, 10, 64, -113, 100, 14, 50, -1, 105, 29, 62, 20, -106, 4, 47, -105, 50, -38, -117, 150, 18, 14, -62, -24, 123, 12, 59, 101, -53, -69, -45, 36, 56, 9, -47, -14, 51, 69, 84, -69, 12, -50, 52, 6, -81, 54, 138, -47, -89, -54, 4, 80, -81, 33, -22, 140, -68, -55, 18, -64, -115, -32, 0, 9, 12, -23, -2, -121, -60, -38, -80, 15, 29, 13, 44, -129, -14, -40, 15, -20, 0, -143, -35, 68, 6, 61, 55, -38, 109, 38, 2, -66, 1, 100, 29, 21, 12, 40, -38, -7, 39, 126, 18]
4566A8L5n0K6O6m7q8K0n5M9q4J13NOo0J45j14J9k1m9P9j19J44N1j4j13O8j74J91
4594D7L4p3J39j36J8K1j20O7Q7q0M1pk9n8r5K94q1p8Q2q7J6n6N1k7J00N2q6j27
4622i1n8J55m6Q4pk6N6j36J14o5j7j3J06q0m9J12o9rKL2O7j16M2J3r0O0M5J06
4650A22r7j9j2jN8J6m8l0nO8p3O3o3q4J13q0RK4K3qMJ62j45l9J11j53R0p1O6q0
4680g9N2j13J75q0J26j01q3J62p4Q6o6l5P5j3Q7j55M0J14q1o0N9Q6q1j44P2k9
4706f0J2o4J42o2o9o9J79n0O1J6qj4j25O1Q3rk8J7K7j33k4J01J6jj2K04j56qr0
4735f3N7M7n1J51j62J30o7m4n3J49J7l0r4Q2j23L4m9m1R4JN1r4Q8p4o8m3J74P2
4763I1j33L8Q7m9qj7M6O3j80M6N9j8J1O1p7NP6j96J32j98J17l3K7O5o5L1q0J28
$$ y = [18, 53, 3, 29, 95, 48, -40, -20, -75, -26, -110, 3, 8, 14, -46, 99, -15, 4, -17, -66, 13, -106, 38, 89, 75, -38, 30, -144, 47, 81, 8, 147, 11, 29, 50, -70, -3, 84, 4, 45, 38, 9, -49, -144, 150, 69, -9, 73, -14, 2, -54, -3, -30, 70, 122, 36, -91, -149, 6, -40, 44, 37, 11, 67, -69, 45, -20, -37, -50, 56, -24, -73, 39, -30, -39, -37, -5, 62, -54, -12, 1, -89, -29, 16, 122, 25, 6, -6, -7, 51, 67, 19, -11, -16, 52, -21, 42, -21, -105, 8, -72, -63, -39, -16, -24, -20, 142, -3, -42, 69, -84, 6, -65, 1, -79, -27, -140, 35, -45, 81, -20, -103, 59, -15, 71, 5, -30, 45, 32, 119, -36, 4, 118, 37, -23, 36, 122, 41, -103, -31, -60, -48, -112, 30, -32, -101, -170, 9, -41, 20, 36, 28, 14, -111, -50, 33, 24, -4, 13, 40, -93, -117, -16, 0, -1, -13, 191, 35, 27, -63, -6, 41, -10, 141, -21, 109, 42, -2, -55, 94, 111, 81, -13, 69, -54, -20, -69, -110, -16, -15, 36, -58, 30, -44, -112, -155, 19, 91, -42, -4, 83, 34, 26, 9, 55, 118, -62, -16, 43, 25, 36, 97, 20, 25, 101, -95, 37, -161, -44, -77, -50, 15, -50, -19, -99, 29]
4791B9nm8M0M2r7J3PN0m3K7rq9R2M1K1m1Lp3Q1j05M5m3j4K23j00q2J3L2n2Mq4
4822a22N8K5n8J02L4J1m3K1M2j35j5J28L0j87J11PJ26k14J7J6O5Mr7N5J11q7N9
4849F4q6kK7O1o3K7j17O3P9r2R6r3M3l2o1O7K3Q7o2k7N1j1l3l7M1L0n1PoJ33j30
4880dn9nJ61j69K3k6O4N9k7n6j5l0k8R7k9O1p6k0j7J32o2O1j6J3n4J10r0k4O8
4909D2k%p6LN3r9Q6m3J22N7j33m0J6l9O8P5j00J09q7j51N8L4j05K73j18k1k6q
4937e2J02J6l9M8q6k2J03j25J37j28p1L0Q0m1n4J33J4%r8J5K8K6M4o6J5J1nj07
4965i2J21L7o8O6j16M1K5n2PM1J2K4n8P5r1N5l3J2j8j9Rj7J68j56N7j61N1R7q7
4994g0J56n6R5j45m0lP8j03J28j45L2J28n6K1j37Q4J2O3jo2N4m9R3j11J00j20
$$ y = [29, 24, -24, 16, 58, -39, -26, -19, 31, -12, 15, 6, -83, 9, 50, 71, 30, 33, -40, 41, -64, -19, -62, -76, 147, 47, -35, -22, 10, -42, -38, -122, -64, -39, -97, 5, 39, 50, 7, 28, 70, -65, -80, 48, 78, -109, 2, 9, 135, -79, -62, -46, 19, 23, -74, -19, 92, 5, 64, -22, -24, 3, 64, 1, 28, -89, -26, 53, -39, 57, -36, 7, -25, -86, -19, 4, 91, 29, 2, 53, 42, 9, -28, 13, 43, -8, -1, -7, 126, -4, -63, -68, 93, -76, -53, -79, -15, 44, 17, -39, -54, -84, -112, -15, -44, 17, -59, -79, -96, 36, -26, 35, 19, 32, -22, 88, -2, -26, 42, 40, 40, -36, -33, 20, -79, 7, -36, 86, 143, 10, -30, -14, -53, 15, 90, -10, 99, 12, -139, -81, -47, -152, 121, 3, -18, -44, -52, 50, 66, 27, 75, -11, -33, 70, -55, 82, -46, -117, -87, -7, -48, -102, 31, 45, 45, -53, -38, -10, 16, 60, -6, 9, 20, 15, -92, 29, 66, -2, 64, -52, -11, 14, -38, -31, 10, 22, 46, -12, 63, -28, 27, -6, 6, -12, -31, -22, -39, 129, -27, 30, -131, -80, 17, -70, 86, 30, 125, -20, -60, -63, 15, -88, 40, -105, -73, 55, -1, 20, -117, -33, -21, 42, 41, -21, 33, -16, 77, -34, 66, -54]
5020e4k3LL4J48Rj11k7O6lr9p4K12p6j7R0n1J6L7m1L1j11n7R9j20J77j20M8O1
5048D7J2l9Nj5M8m0p3n4J8L2L5L3j14O7l8J4M2K6N4L0j57J02o3J1j4p2J29m7O0
5077C9j3j91J79N9l3O4j40j1r9K39r3M3L9q3N3l3m2o2P0o1N4j1J24k20J27M0%
5104C8K3j15P5J4j9%m8J01j82O2j0N8p8J88n5m8q9Q9n1N0K4j9Lm1N7n8r5J11Q3
5133F8j49R8r5M5NK8n3N2N9q0J50j39R9j44K0k7K3P9kj19J18Jo8M1m0J09j60Q2
5161AP6l8%m1n7J03r6J72j91R8rrm3K6M2P3j29M3m2N7PK0j14q9J09p0J25j32J65
5190E7j23J76j13L2p2K8nL2L2q8K2L5O0o6r5J9L0r1J92j18P0j19N9Q2Or5J25n9
5218A3o2O6q8M2k6M6MO8n9N1L5j04r4O2M1r1J62jr4o5Q0p1O7j10K23j27J62j66
$$ y = [-54, -77, -74, -40, 108, 117, 6, -21, 45, 42, -57, -131, 81, 5, -12, 78, 27, 43, 80, 39, 70, -41, -98, 1, -119, 58, -62, -14, 47, 59, 20, 25, 10, 58, 18, -55, -109, -91, -59, -24, 9, -105, -38, -76, -62, -20, 6, 60, 90, -67, 35, -28, -17, -31, -103, 26, -21, 39, 26, -165, 14, 73, 40, 104, -36, -47, -146, 93, 0, 43, 82, -1, 52, 19, -23, -85, -15, -76, -22, -33, 91, -129, -2, 38, 38, 61, -54, 21, 35, 16, 16, -32, 69, -113, -51, -61, -3, -81, 107, 52, 4, -85, 4, -47, 3, 27, 8, 11, -30, 27, -31, -126, -15, 68, -81, 17, -78, -33, -28, 0, -53, -1, 58, -22, 128, -11, 88, -56, -36, -63, -40, 39, 37, -82, 36, 37, -31, 10, -30, 79, -81, 1, 77, 39, 39, -2, -59, 44, -52, 120, -71, 27, 18, 9, -34, -8, 34, 107, -22, 21, -21, 36, 43, 63, -51, -140, -31, -101, 24, -108, 57, -66, 110, -3, 29, -43, -15, -20, 12, 44, -44, -22, 13, 73, 7, -88, -69, -39, -130, 62, -56, 14, -105, -46, 36, 42, -53, 72, 13, -49, 17, -71, -29, -55, -9, -5, 63, 4, 55, 90, -14, -108, -46, -5, -96, 66, 65, -29, -94, -14, -85, -18, -128, 95, -32, 130, -36]
5246c6P3j10r8K66l5pm6K8Qj3j2l7J7J02r0L7J2j55K0j3J9KO4r6K6Q3M9M2j72
5275g2J49l6r5M3j30K04n3j1J35j0j63M1r2Q4K2n2J05Lj9n2R4j49K7K8J05j56
5301e0L9N3j0o2J46n9K0j06Kk7R6n5R0ol0J%j3m6M2j15K03J2j11%M2q3J01l4n0
5331a0O6q7m4J38p5L4n0N2j7r2J25km6%J02r2K6m5N3l5L9j5q8l1J00Nm1M2j45
5360a33J44p5qM5l0QO0J4o9m2J37j4j8o1J4l4J8M7p2R5Jn8k9J06l9l1l1M6l0K
5390c7j6L9K1K8J32j43j82J52r3R2j09J55j7Jq5M0R2J5j66O6n9Q6J6M0p4q3P8
5417a1M0L2j20J25j77R2n6R5k6Q1k30J28J16j42LM9n2N9M2Jr6o8J80r1m4J02J14
5444A46p5j22J19j6n9J0j8p6J08q6J48j29Q3m6n6L7MM6q5J39m5j7J82k12J07j55
$$ y = [-36, 37, -73, -171, 95, 60, 53, 7, 35, 43, 30, 18, -19, -2, 100, 10, 47, 59, -96, -76, -89, -70, -68, -4, -100, -74, 9, 58, 100, -72, 77, 41, -54, -11, -141, 63, 10, -1, 134, 124, -39, 2, -90, -6, 16, -36, 69, 72, 53, 1, 95, -54, -27, 1, 106, -50, -11, 42, 32, -30, 116, 57, 77, -29, -27, -54, 42, -13, 77, 71, 41, 42, 42, 29, -17, 25, -90, 113, 125, 14, 14, 56, -27, 74, 40, -10, 56, -31, -75, 63, -12, 22, -28, 24, 7, -85, 40, 38, -8, -8, 94, 2, 28, -17, 36, 1, 40, 25, -63, -94, 6, 11, -30, 12, -133, 11, -64, -72, -27, -57, -49, 11, 25, -44, -86, 51, 37, 19, -42, -28, -62, -44, 3, -69, 26, 27, -31, -60, 46, 7, -24, -55, -9, -39, -37, -53, -14, 7, 35, 167, 24, -158, -6, -99, -7, -116, 39, 22, 23, -62, -22, 70, 85, -81, -15, -74, 12, 28, 68, -6, -89, -11, 29, 61, -59, 66, -111, -19, -75, 20, -6, 75, -155, -27, 89, -53, -50, -1, -53, 6, 48, 49, -47, -115, 65, -26, -70, 32, 146, 71, -51, 68, 52, -7, 3, -15, -91, 17, -69, 79, -50, 33, -13, -69, -32, -28, 18, -67, 72, 27, 10, 192, -20, 87, -68]
5470f8J08M9j96J26m2L4J1j43J37q6P2j9n3O0J7O0k45J62J21p9l3J8Q4k2j08l5
5496g0R7lq6J45p8k4OK9m7J55n3l4M3j78J43J0q7j3K0J9k8P1L4k27J03M9k4R5
5524F7o8N7j03J3Q0m5m2l2O4j3L6q4O8k5kJ20no0q1J17Rp5J36j85%%P9K9j8j56
5554a19K54j39o8K1N4R9j10o3Q1LJ25j33l7p0J17k9J5M8q7N3o8R4o8K8q0M3j02
5581a38J81K5p1M7J2m6K7NR0j15J8n9Q1l6l2J13r6k2n2P2Q6o2n2J06k24J69n4
5608b7o5J02m8J15j54oJ98p2l3n8Q4p0r3O0P4j07P0O1L6jj18M4J8J0n2L8Q3m4
5636D5K2l6r4j20J58m4Q9n6M3l4n4K2R2J4r9J04l8m0m2Q7Nl4J64j70J27q9Qp9
5664d9J01j3k8N3j65N0L5j5J38r7M3j02L9P8J8N8q4J9j92R6N9R2r6o8q1J06n1
$$ y = [-68, 40, 89, -107, 19, -23, 11, 22, -121, 16, -70, 2, -17, -70, -10, 7, 67, -178, -16, 105, 26, -7, 11, 95, 73, -35, -70, 27, 24, -62, 83, 5, -19, -13, 16, -31, 124, 71, 37, 80, -98, 45, 55, -32, -45, -25, -6, -34, 37, 71, -156, -53, -4, -28, 67, -1, 56, -47, -34, 46, 1, -41, -73, -9, -22, 14, -70, -2, -27, -29, 91, 86, 26, -55, 62, 71, -4, 132, -53, -53, -53, 26, 55, 37, -119, 135, -4, -72, -51, 3, 102, -8, -71, 10, 13, 138, 5, -32, -102, 15, -14, 1, 49, -38, 15, -53, 41, -27, 1, -79, -36, -138, 43, 68, -3, 44, 56, 10, 37, 42, 132, 17, 35, -24, 57, 21, -11, 102, 6, -16, -68, 4, 90, 28, -24, 82, -142, 27, -27, -92, 10, -38, 77, -77, -83, 115, 43, 10, -48, 36, -34, -127, -67, 7, -100, -30, 31, 67, 66, -52, -8, 10, 20, -32, 6, 89, 45, 67, 31, -63, -183, -25, -69, 20, -36, 7, -27, -81, -59, 33, 47, -52, 52, 14, -26, -68, 19, 24, -10, 154, -16, 111, 22, 30, -49, 52, 39, 11, 64, -101, -51, -16, -31, 107, 10, 53, -49, -10, 68, 86, 144, 60, 79, -113, -17, 42, 134, 38, -30, -111, -5, -56]
5691e6J78r5j24J34j15P1O1p8m2P4j14L5O5M0mq6O9q5K0j3J23m6Ln5Q0j4o6J59
5719A19j96Q3l9P0r3P0m4J0p6Q8L6m8O2n9L2M7m9m1R3l2p9j1P6j7J5l8q1J58l1
5748B5M5jn4j15j6J10J25j35n1k6J06N0n7l6nO3N8J8j55J02j3q3J12n5j7N3J12
5775A60j0m4o4r4N7o2M4jK1j24J38j19J12jl5MrjQ9q7R0K7j24OM7L5l3J0r9N4
5805a3M4P0k48J63K1j7k9O9j15J04m1P4L4j09J05l8l9N2j23N9r5J0op4L19j14
5831F3j27J23j0o6K8O4j10N5J4n8Q8j3r7J65p6o5J47o2j00J17j39Q2M1j07k6R1
5857B2Nn7P0K7j4r2R2j5p9N6K9p1J41k06LL6O9l9ok7J37r8N7o9M3M2p0l4OL5l
5888a0nJ8rN6j7m3K5O6l1j31P4l6J31p1N2j1J9j16O4j4L9m5J5K4j26n3M2K1J20
$$ y = [-56, 122, 27, -97, 37, -78, -7, 54, -24, -66, 8, -106, -71, -6, 34, 30, -56, 13, -72, -52, -65, 58, 12, 15, -40, 40, 26, -40, 119, -77, 6, -33, 37, -56, 14, -30, -20, -96, -8, 28, -20, 42, -17, 15, 62, 13, -28, 65, 33, -46, -57, 19, 2, 17, -21, -102, 56, 25, 70, 69, 15, -100, -116, -6, 119, -16, -67, -93, 13, 63, 6, -30, -35, 28, 86, 104, -51, 51, 38, -45, 67, 12, -5, 48, 160, 150, 106, 42, -52, 5, -57, -13, -14, 7, -117, 21, -98, 14, 13, -22, -18, -27, -28, 61, -26, 64, 91, -33, -27, 20, 55, 22, 32, -67, -13, 31, 101, -147, 16, 37, 20, -9, 60, -55, 49, 8, 82, 116, 7, 112, 74, 35, 87, -36, 23, -72, -62, -68, -142, 177, 63, -64, 59, 49, -17, 11, 75, -35, 20, 34, -24, 64, 51, -46, 119, 43, -22, 125, 63, -37, 80, -59, 23, 64, -43, -69, 22, 27, -30, 40, 67, 53, -39, 53, 38, -41, 15, 44, -27, 114, -92, -89, -53, 16, -23, -29, -56, 81, -17, 40, -29, 14, 56, -14, -48, -42, -7, -10, -15, 3, -6, 50, 33, -10, 15, 81, 50, -81, -7, -43, 88, 17, 69, 58, 77, -39, 25, 11, 50, 5, 20, 44, -82, -135, -93, -72, 48]
5917D8k8O2r9l5J00j72J67L5o5N8j35J06j76J13K8j8j8p3J48j19j4J33j51M9N7
5942Ao3J20j8l5j7L2Qo3m4O1N1r1L7K5L3M7j0k82K78q7LK6n4K9M8K3Mj11J21k0
5972E2J6l8o4n4M4O6p6Q6P1j63LK08l9j07r0L3rM8N9m1K7j1pm0rJ0l7K1l0J71
6002A00j50L4R2r6k7P6K9j42Q1L4k3l2M4N1j37n2J13Lnp7R2j18O7QO0RJ2K4k6
6031D4J2k03K05j39M6R1l7n5o1L5Q3o2J24om4j42J45n8P5j5k9k2J10k9l0PL8j2
6059G1J3j17n8J0L8q5J00R3q2J01m6j01J52j46j7J18k9Q6r8k8R2p2K4O6q5k6J15
6086H9j87J07nn9L1mm8M9J28N6j25j8J3p9NK6J05p6%pM2q8P5L6p9L9q4O3p4R7
6116B8L4l2o4R0r6J3M8P4j73J37j22K2M5k7N6k5O0J7rk06J51k2j33P7N6j0P4k7
$$ y = [48, 20, 82, -17, -52, 48, -124, 43, 78, 13, 71, -64, 42, -134, -21, 7, -11, -29, -102, 46, -73, -87, 46, -105, -56, 1, -62, 58, 40, 5, -12, 20, 28, -35, -79, -18, 33, -58, -21, 4, 37, 84, 74, -208, 70, -17, -14, 12, -42, -13, 35, 58, 62, -49, 72, 52, 68, 30, -34, -88, -44, 22, -54, 32, 103, -60, -57, 151, 112, 5, -85, -52, -61, -13, 46, 5, 32, 21, 14, -26, -35, -25, -62, -41, -71, 100, -50, -16, 76, -20, -47, 29, 58, -84, -3, 31, 8, -24, 20, 71, -66, -118, -5, -2, -7, -84, 8, -110, -43, -35, 25, 34, 46, 70, 44, 56, -147, 58, -81, -35, 56, 19, -36, -97, -62, 21, -41, 83, 77, 33, -109, 36, -22, 53, 38, 9, -13, 97, 68, 38, 45, 83, 71, 84, -33, -91, -81, -43, -128, -28, 65, -17, 84, 38, -63, 89, -57, -74, 44, 15, 101, 3, -25, 67, -5, 19, 85, 0, -26, 89, -98, 9, 4, -55, -24, -28, -76, -27, 101, 157, 32, 14, 27, -52, -47, -21, 84, 8, 8, 1, 43, -45, 30, 66, -13, 26, -58, 5, -69, 28, 62, 30, -34, 56, -40, -27, 21, 95, -78, 59, -63, -41, 4, -23, 33, 8, 68, 85, 76, -130, 21, -1, -134, -57, -1, -11, 63, 36]
6144C6m9O2p6O3n5J16p0L3j10l7J15j06M2Q0J3j60K0K35j17j03J52j89J53n2J1
6169Gk0k6Q4j94K68j25M2Jj38J16M8j79NJ54j11J48j30P3k8K7O3j15k3kJ22j2
6195E5k0N0o4L1MJ00k53O0L6M8n9M9r4n7J17M9q8NO3o7J23k9j17P5Q7p1K4q7j5
6224d5J9J01o7p9m3N9J00p4K2Q6p4L5k02J95K1n8J23m0Pj00N7o3n4R1J3l2m3R1
6252D6N1j44P8n2l9J0o0L5N8M6J5m5Nj7M9r5Q8m5N0r3L1r8J21N1j17J48l7Oj0
6281C6o0k9J6J40n8p9P8j09P5k7m1J22n6q6k7P6N2j42N8k6OK19j58K6j1j32J99
6308F2j22K2pk3L1J37j71J19m3j4p9J10K9J27j71kOM8j56J7J28j07QM3R6m9n9
6335b0L5N1r6J08j53O6J9o2R7n4M7p9P8p6j7rR0L6rlo4J3P%L6O4j67PL4K7M2K6
$$ y = [36, -13, 49, -27, 36, -19, 97, 27, 60, -50, -87, 28, -78, -36, 44, 57, -103, -83, 152, 35, -68, 84, -105, 48, -4, 7, -13, -39, 45, -149, 119, -6, 36, 37, -101, 15, 63, -116, -111, 43, -68, 80, -50, 23, -5, 22, 85, -30, -53, -55, 67, 55, 35, 85, 21, 52, 56, 156, -97, -37, -1, 47, -12, 37, -57, -114, 3, 52, -36, -31, 32, -35, 88, 59, -58, 17, 104, 33, 57, -30, -45, -26, 75, 8, -71, -114, -55, 45, -29, -7, 79, 5, 40, -162, 33, 54, -4, 119, 79, 86, -14, 43, -20, -74, 17, 30, -2, -45, 46, 97, -47, 31, -21, -60, -50, -110, -75, -17, 29, 44, -1, 4, -13, 36, -59, 29, -16, 34, -59, -28, -126, -5, 46, -71, 77, 40, 46, 36, -24, -53, -37, 103, 45, -34, 44, -65, 10, -17, -58, 64, 8, -78, -105, -29, 23, -119, -61, -87, -81, 138, -20, 6, -5, -137, 62, -60, -38, -45, -68, -37, 100, -71, 48, 5, -9, -88, 22, 51, 178, 7, 5, 11, 59, -97, -80, 48, -59, -51, -8, 88, 39, -20, 15, 66, -30, 78, -75, -9, 10, -52, 45, -9, 38, -41, 37, -39, -56, -65, 25, 61, 52, 49, -15, -2, 5, 5, 41, 105, -62, -55, -21, 6, 48, 74]
6367G4K1o7p9j5Q3N4n2n5N3q0R9l0J9J1Mj7J3r4K4P2j2r3N3n0Mm1J32j9Rr2N2
6398a9O3N2j65O8k3N7o1%P2M5q1nO9lkp4O0q7N8q3j3J10j19M6j1MO8j5Oq0N5n
6430a3pM2l1n8NQ6J0L5n9q5j1K1N0O5N0j07O3j17K4K1n3J22l8J1l7k4M1rL9o2
6460b6q1P9j4Q9j6m3O4j78J18Mj2ok9N5j6k3Q6j54P5R8j14J01p6l6j3J20Mj10
6488e4K0Q3j45J81l7j5j5p6N1rO3J7k24K72j80J63q5p0J30m1q2P7Q4k12J57n4
6514ao3Q8m9J2KK1n1n4J24L6q6J04j20QJ36j92P9o2p6J77pN6L2j52M9L1j4N0l4
6543D4r8M8P0j23m5J17Rp4n9R3L5K8n7j7J03r2P4J02r0j05J8K9l4J18j71N5J40
6570A18Jk48R5j21J25r8K70j40o8J26j07J09j03J8qP7J8m2P4j12J16j55M4OJ19
$$ y = [74, 95, 28, -51, -66, 17, 71, 19, -36, 17, -63, 36, 6, 25, 36, 40, 23, 36, -58, -34, 38, 26, -67, -14, -64, -60, -101, 31, 12, 21, -71, -19, 44, 96, -69, -1, -24, 33, -28, -28, 44, 89, 8, 3, 72, 69, 67, -7, 53, -34, 24, -59, -72, 38, -81, -35, -46, -42, 26, 11, 17, -63, -8, -13, -20, 22, -9, -67, -62, 24, 34, 69, 10, -75, -86, -65, -15, 50, 100, -7, 56, -61, -37, -16, -69, 53, 15, 26, -11, -35, 6, -3, 36, -26, -107, -28, -42, 47, 31, -12, 52, -126, -8, -4, -16, -22, -51, 4, -12, -35, 51, -103, -28, 70, -44, 57, -19, -55, -68, 52, 56, -54, -34, 49, -96, 85, 48, 33, 18, -58, -7, -16, 47, 64, -160, 112, -68, 95, 10, -60, 70, 29, -53, 24, 108, -104, 53, -1, -64, 24, -25, -13, -11, 10, -41, -95, 29, 65, -21, 83, -37, -29, 107, -85, -6, -68, -144, 33, 26, 82, 114, -38, 11, 42, 28, 78, 44, -54, -6, 64, -59, -104, 13, 22, -52, -111, -18, 17, 45, -12, -29, 74, -18, 56, 158, 68, -37, -19, 10, -24, 94, -77, -22, 118, 119, -129, -34, -155, -30, -128, 142, 2, -66, 60, -47, 62, -41, -23, -31, 46, 64, 22, 96, -16, 100, -55, -11, -5, 114]
6595A14m3j49P6L3LK8l5o0P0%k5j5jM1L7n9K3k6J00j10l9K5r5J10M8p8M8m1P4
6624E4n1l7J06j29Q6k8o8P9J6m1Q2j0J7j04K2J18j39o9M3M3M6l8J8r0N2K9j6q
6652a7l0k4k3J34j05J5J29K7M3r5o2m5O7J2O9j78J86o2l9j8P0N7k56J37M0m7p3
6679h8J18J36k27R4oo5K3M3k7j6jRR8j35K05p8O0k01J05l6j04L5P6j4q5N3K3K5
6707B0k3L2j46R8J60j72kQ1k1j3J9Lnj27J45r6R0r7J02o7l3J11j11M1p0N2N9J0
6735D0j9l7L7Q6j22m7R8j1K5r0J76k35J33j6J04p5R3r6j42l0R7l9J32l8n9P0j47
6762a12J10l2P2j5J8l1o4L4lk3Q9j09N0M7l1rj48J39R6j24J6L8o5O3Jo6J04j74
6790a29K18p4M4q4q0J17O5r1J59j41l0P5K5k20K35nQj83J48j19O5o5j3K00j13
$$ y = [114, 71, -78, -2, 31, 34, 62, 27, -33, 37, 37, 12, -3, -4, 37, 74, 15, 38, 12, 112, 2, -37, -12, -107, 3, 51, -27, 21, -20, 54, 3, -34, 72, -57, 29, 1, -67, 12, 28, -13, 69, 59, 76, -28, -6, 112, -27, -96, -53, -10, 36, -2, 16, -74, -22, 7, -9, -17, -47, -71, -94, 40, -65, -50, 79, 106, 149, 54, -8, -53, 14, 26, 95, -83, 103, 41, 2, -16, 54, 111, -145, -8, 32, -15, -88, 30, 166, -61, 33, 27, -38, -15, 28, 1, -15, -16, -7, 91, -44, 161, 83, 143, -58, 47, 11, -93, -58, 18, 4, -81, -28, -5, 20, -3, 29, -117, -19, 141, -31, -33, 48, 27, 14, 33, 36, 31, -96, 49, -47, 43, -54, 48, -19, -52, 59, -52, -11, -81, -29, 30, 40, 21, -16, 21, 107, -15, -62, 36, 25, 50, -40, 136, -99, 34, 18, 122, 47, 140, 44, -98, -128, -31, -70, 62, 24, -35, 35, -112, -2, -34, 38, 23, 41, 10, -54, -20, -23, -46, 43, -66, -16, 31, 0, -9, -157, -18, 78, -46, -30, 8, -57, 6, 7, -59, 45, -129, 89, 15, 59, -25, -105, 12, 77, -14, 145, 4, -26, 49, 74, -146, 89, 84, 92, -91, 57, -62, 3, -62, -75, 125, 12]
6815A2L7m6p6J14M5l9m8P3k1L9j22P2m1k6J78j82K4N3m0j22J06NM7j12J01%Q1
6842A12o3j54J08J3Q3k04Q6L7q0rJ05p7l5M6k3OM2k1R9r7j2R7j9p2R0r3O9j26
6870i2J70p9M4j9o0N5m9m4Q4K8K6p3J59k53K39j09J7Nj06J35l1O7j12R7j93J15
6896B1n2K9l8J11j63J01Rj61J41L9j04J6N7j24J76p6k4L6m9l9Q8Q4N7j50lJ3L9
6923C4l1k8J43m2j10O3j10J45r5j01J94o0q7R3J00j16m8l1M5j4O4%K0pn8Q9j02
6950e0j8M7M7q5J47J7n9k9PJ6m6J01o7Mp2P6j2J8QJ0j03mJ2J6j2k4J4Q2K4j07
6980d2L7j6J0L5R5n1j43R1J2n9J87j70j11J38o3J25j29O6k3K2M0l9J08p3o8L5
7006A4m4j7P8n5N8KOk5j3l3J2J0J3n1j8M3j0%L7j22J73j52Q0K4l1M7NQp4OMK3
$$ y = [12, 49, 3, -73, 41, 86, 47, -1, 72, 51, 90, -32, 40, -1, -27, 151, -31, -7, 46, 6, -116, -10, -5, 42, -70, 31, 31, 112, 49, -105, 3, 16, 99, -105, -19, 18, -62, -71, 34, -43, -78, -32, -55, -49, -7, -28, 71, -26, -38, 59, 40, -32, 58, -35, 34, -92, 78, -1, 43, 24, -36, 19, -30, -74, 10, 38, 64, -9, 150, -103, 136, 27, 44, 49, -57, 78, 47, 114, 2, 99, -94, 21, -31, -2, -40, 71, -92, 9, 18, -143, -2, 37, -67, -51, 6, -118, 58, -18, -42, -6, -55, -94, -6, 78, 135, -15, -18, -5, 34, 3, -25, 118, 76, -34, 29, -81, 64, -31, -132, 62, 2, -85, 8, 108, -8, -56, -87, -42, -56, 8, 8, 28, 21, -37, 52, -50, -68, -21, 26, -59, 88, 105, 46, 17, 24, 40, -6, 95, 28, 32, -40, 36, 24, 42, 50, 60, -43, -47, -35, -19, -31, -55, -41, 41, 65, -42, -5, -21, -11, 24, 119, 68, -75, 16, 28, -31, 156, -14, -125, 13, -50, 75, -54, 12, -11, 11, 51, 12, 120, 47, -21, 14, -30, -47, 31, -24, 34, 36, 42, 17, 4, -29, -17, -7, 6, -45, -63, -20, -30, -30, 7, -115, 58, -94, -14, 10, -21, 26, 31, 39, -35, -29, -25, -2]
7038bo5O2J6Mj8J8%j4n1O4M0o3P5k3Rm6k5k5J09j06m6M7J33J1o4j14K8m4J29j37
7068i8K00l12J43J02k0%p3J05j14J12j71Q1J03j27N2Rp6l1J37L0p9K1j34P1R5
7093B6K1k8n4J3J02j11N4o4R1M4j34K2J9j8J03j10K2j14P3J15r9R5j54J18p4L8
7119dP7j02P2o2q3J23j10O0N2j00M1R0r5R3L4n9J5k5k1J26o0j6j49Q3J67k08R6
7146C5l7O1j36O5J6Nk7L3Q9j28k6O5k4j1l7j3M6O1MJ0lp6J04j19k5K5R1k8K6L6
7176H2l3j57KQQ7m5Q0o1L3R4j30Q6j20k1J11rL7N9k10M5N6Om8k1n1J18J2j0K2
7205B2k4P8J9j29N0j00J28l5l3J28j32%l4Q0q0m2P8j0M6o9J56o6k8P3l1q4O0j6
$$ y = [-2, -67, -5, 11, 15, -3, 15, 15, 1, -50, 14, 54, -9, 66, 43, 52, 6, -19, -44, 65, -41, -87, -40, 93, 104, 40, -74, -46, -90, 39, -98, 102, -210, -67, 35, 15, 15, -58, 47, -67, 45, -126, -45, 58, -69, -17, -8, -84, -115, 22, 52, -27, -6, -140, -69, 26, 47, 19, -35, -22, 80, -31, 23, -41, 50, 94, -40, -18, 1, -17, 86, -24, -2, -116, -43, 72, -27, 68, -86, 32, -42, -4, 73, -29, 43, -19, -102, 21, -89, -29, 23, -77, -36, 54, -41, 52, 86, 27, 42, 17, -4, 122, 62, 46, -103, -20, 147, -61, 35, -2, 59, -77, -12, 4, 9, -18, 15, 104, -24, -50, 15, -9, -20, -57, -70, -24, 37, 41, 51, 48, -28, 76, -43, -68, -43, 48, 20, 46, 82, 49, -108, -106, -98, -11, -56, 24, -37, -4, 90, -40, 46, -74, -95, 16, 7, 44, 103, -107, -62, -6, 0, -48, -69, -120, -2, 10, 0, 22, -2, 76, 95, -34, 16, -84, 44, 9, -24, 104, -28, -28, -62, 18, -62, -104, -26, -36, 10, -59, 97, 31, 3, 76, 45, -39, 21, 5]
$$ [...]
8191d9
##END NTUPLES=NMR FID
##END=
