##TITLE=1H_DE-80H_X3
 200.13MHz, d2o
 8 sc
 
 19ns.26.2.2025
##JCAMPDX= 6.0         $$ Bruker NMR JCAMP-DX V2.0
##DATA TYPE= NMR FID
##DATA CLASS= NTUPLES
##ORIGIN= UXNMR, Bruker Analytische Messtechnik GmbH
##OWNER= pz
$$ XWIN-NMR		Version 3.5
$$ Fri Dec 19 10:17:55 2025 Russian Standard Time (UT+4h)  Yarkov@DPX200
##.OBSERVE FREQUENCY= 200.1313
##.OBSERVE NUCLEUS= ^1H
##.DELAY= (6, 6)
##.ACQUISITION MODE= SIMULTANEOUS
##.ACQUISITION SCHEME= undefined
##.AVERAGES= 8
##.DIGITISER RES= 18
##SPECTROMETER/DATA SYSTEM= spect
##.PULSE SEQUENCE= zg30
##.SOLVENT NAME= DMSO
##.SHIFT REFERENCE= (INTERNAL, DMSO, 0, 14.3821)
##AUDIT TRAIL= $$ (NUMBER, WHEN, WHO, WHERE, WHAT)
$$ ##TITLE= Audit trail, XWIN-NMR		Version 3.5
$$ ##JCAMPDX= 5.01
$$ ##ORIGIN= Bruker BioSpin GmbH
$$ ##OWNER= Yarkov
$$ C:/Bruker/XWIN-NMR/data/yarkov2/nmr/H-C/1/audita.txt
$$ ##AUDIT TRAIL=  $$ (NUMBER, WHEN, WHO, WHERE, WHAT)
(   1,<2025-12-19 10:16:08.59 +0400>,<Yarkov>,<DPX200>,
      <created by zg, POWCHK disabled, PULCHK disabled
       configuration hash MD5:
       00 E9 B6 7A A2 85 ED C7 34 08 36 98 17 FE 4E 26
       data hash MD5: 16K
       29 CA 7A 03 47 3F 0D DF FA 81 F4 8E 0B 0B 6F 40>)
$$ ##END=
$$ 
$$ hash MD5
$$ 85 3A 53 2F 07 64 71 A9 A3 E9 07 FE EB 2E A6 87
##$RELAX= 
##$RELAX= 
##$RELAX= 
##$RELAX= 
##$RELAX= 
##$RELAX= 
$$ Bruker specific parameters
$$ --------------------------
##$DU= <C:/Bruker/XWIN-NMR>
##$EXPNO= 1
##$NAME= <H-C>
##$PROCNO= 1
##$TYPE= <nmr>
##$USER= <yarkov2>
##$AMP= (0..31)
100 100 100 100 100 100 100 100 100 100 100 100 100 100 100 100 100 100 
100 100 100 100 100 100 100 100 100 100 100 100 100 100 
##$AQSEQ= 0
##$AQ_mod= 1
##$AUNM= <au_zg>
##$AUTOPOS= <>
##$BF1= 200.13
##$BF2= 200.13
##$BF3= 200.13
##$BF4= 200.13
##$BF5= 200.13
##$BF6= 200.13
##$BF7= 200.13
##$BF8= 200.13
##$BYTORDA= 1
##$CFDGTYP= 0
##$CFRGTYP= 5
##$CHEMSTR= <none>
##$CNST= (0..31)
1 1 145 1 1 1 1 1 1 1 1 1 1 1 1 1 1 1 1 1 1 1 1 1 1 1 1 1 1 1 1 1 
##$CPDPRG= <>
##$CPDPRG1= <>
##$CPDPRG2= <>
##$CPDPRG3= <>
##$CPDPRG4= <mlev>
##$CPDPRG5= <mlev>
##$CPDPRG6= <mlev>
##$CPDPRG7= <mlev>
##$CPDPRG8= <mlev>
##$CPDPRGB= <>
##$CPDPRGT= <>
##$D= (0..31)
0 0.7 0 0 0 0 0 0 0 0 0 0.03 0 0 0 0 0 0 0 0 0 0 0 0 0 0 0 0 0 0 0 0 
##$DATE= 1766124968
##$DBL= (0..7)
120 120 120 120 120 120 120 120 
##$DBP= (0..7)
150 150 150 150 150 150 150 150 
##$DBP07= 0
##$DBPNAM0= <>
##$DBPNAM1= <>
##$DBPNAM2= <>
##$DBPNAM3= <>
##$DBPNAM4= <>
##$DBPNAM5= <>
##$DBPNAM6= <>
##$DBPNAM7= <>
##$DBPOAL= (0..7)
0.5 0.5 0.5 0.5 0.5 0.5 0.5 0.5 
##$DBPOFFS= (0..7)
0 0 0 0 0 0 0 0 
##$DE= 6
##$DECBNUC= <off>
##$DECIM= 32
##$DECNUC= <off>
##$DECSTAT= 4
##$DIGMOD= 1
##$DIGTYP= 9
##$DL= (0..7)
0 120 120 120 120 120 120 120 
##$DP= (0..7)
150 150 150 150 150 150 150 150 
##$DP07= 0
##$DPNAME0= <>
##$DPNAME1= <>
##$DPNAME2= <>
##$DPNAME3= <>
##$DPNAME4= <>
##$DPNAME5= <>
##$DPNAME6= <>
##$DPNAME7= <>
##$DPOAL= (0..7)
0.5 0.5 0.5 0.5 0.5 0.5 0.5 0.5 
##$DPOFFS= (0..7)
0 0 0 0 0 0 0 0 
##$DQDMODE= 0
##$DR= 18
##$DS= 0
$$ [...]
##$SUBNAM2= <"">
##$SUBNAM3= <"">
##$SUBNAM4= <"">
##$SUBNAM5= <"">
##$SUBNAM6= <"">
##$SUBNAM7= <"">
##$SUBNAM8= <"">
##$SUBNAM9= <"">
##$SW= 18.0517328524113
##$SWIBOX= (0..15)
0 0 2 0 0 0 0 0 0 0 0 0 0 0 0 0 
##$SW_h= 3612.71676300578
##$TD= 16384
##$TD0= 1
##$TE= 0
##$TE2= 300
##$TE3= 300
##$TEG= 300
##$TL= (0..7)
0 120 120 120 120 120 120 120 
##$TP= (0..7)
150 150 150 150 150 150 150 150 
##$TP07= 0
##$TPNAME0= <>
##$TPNAME1= <>
##$TPNAME2= <>
##$TPNAME3= <>
##$TPNAME4= <>
##$TPNAME5= <>
##$TPNAME6= <>
##$TPNAME7= <>
##$TPOAL= (0..7)
0.5 0.5 0.5 0.5 0.5 0.5 0.5 0.5 
##$TPOFFS= (0..7)
0 0 0 0 0 0 0 0 
##$TUNHIN= 0
##$TUNHOUT= 0
##$TUNXOUT= 0
##$USERA1= <user>
##$USERA2= <user>
##$USERA3= <user>
##$USERA4= <user>
##$USERA5= <user>
##$V9= 5
##$VALIST= <valist>
##$VCLIST= <CCCCCCCCCCCCCCC>
##$VD= 0
##$VDLIST= <DDDDDDDDDDDDDDD>
##$VPLIST= <PPPPPPPPPPPPPPP>
##$VTLIST= <TTTTTTTTTTTTTTT>
##$WBST= 1024
##$WBSW= 4
##$XGAIN= (0..3)
0 0 0 0 
##$XL= 0
##$YL= 0
##$YMAX_a= 107983
##$YMIN_a= -83902
##$ZGOPTNS= <>
##$ZL1= 120
##$ZL2= 120
##$ZL3= 120
##$ZL4= 120
##$ABSF1= 10
##$ABSF2= 0
##$ABSG= 5
##$ABSL= 3
##$ALPHA= 0
##$AQORDER= 0
##$ASSFAC= 0
##$ASSFACI= 0
##$ASSFACX= 0
##$ASSWID= 0
##$AUNMP= <proc_1d>
##$AZFE= 0.1
##$AZFW= 0.1
##$BCFW= 1
##$BC_mod= 2
##$BYTORDP= 1
##$COROFFS= 0
##$CY= 83.5205535888672
##$DATMOD= 1
##$DC= 2
##$DFILT= <>
##$DTYPP= 0
##$F1P= 10.8118882576601
##$F2P= -7.23987719738617
##$FCOR= 0.5
##$FTSIZE= 0
##$FT_mod= 4
##$GAMMA= 1
##$GB= 0.15
##$INTBC= 1
##$INTSCL= 1
##$ISEN= 128
##$LB= 0.25
##$LEV0= 0
##$LPBIN= 0
##$MAXI= 10000
##$MC2= 0
##$MEAN= 0
##$ME_mod= 0
##$MI= 1.114404
##$NCOEF= 0
##$NC_proc= 0
##$NLEV= 6
##$NOISF1= 3.799351
##$NOISF2= 2.8
##$NSP= 1
##$NTH_PI= 0
##$NZP= 0
##$OFFSET= 14.38212
##$PC= 1
##$PHC0= -5305.955
##$PHC1= 10.82193
##$PH_mod= 1
##$PKNL= yes
##$PPARMOD= 0
##$PSCAL= 0
##$PSIGN= 0
##$REVERSE= no
##$SF= 200.129724274929
##$SI= 16384
##$SIGF1= 3
##$SIGF2= 2
##$SINO= 400
##$SIOLD= 16384
##$SREGLST= <1H.CDCl3>
##$SSB= 0
##$STSI= 0
##$STSR= 0
##$SW_p= 3205.1282051282
##$SYMM= 0
##$S_DEV= 0
##$TDeff= 0
##$TDoff= 0
##$TI= <>
##$TILT= no
##$TM1= 0
##$TM2= 0
##$TOPLEV= 0
##$USERP1= <user>
##$USERP2= <user>
##$USERP3= <user>
##$USERP4= <user>
##$USERP5= <user>
##$WDW= 1
##$XDIM= 8192
##$YMAX_p= 0
##$YMIN_p= 0
$$ End of Bruker specific parameters
$$ ---------------------------------
##NTUPLES= NMR FID
##VAR_NAME=  TIME,          FID/REAL,        FID/IMAG
##SYMBOL=    X,             R,               I
##VAR_TYPE=  INDEPENDENT,   DEPENDENT,       DEPENDENT
##VAR_FORM=  AFFN,          ASDF,            ASDF
##VAR_DIM=   8192,          8192,            8192
##UNITS=     SECONDS,       ARBITRARY UNITS, ARBITRARY UNITS
##FACTOR=    0.0002768,     1,               1
##FIRST=     0,             0,               0
##LAST=      2.2672688,     0,               0
##MIN=       0,             -83902,          0
##MAX=       2.2672688,     107983,          0
$$ Real data points
##PAGE= N=1
##DATA TABLE= (X++(R..R)), XYDATA
$$ [...]
1349A364j646j20J360j959M41P49j306J873J16j710J697o76n60J139j801O5K106
$$ 1364 -282 -402 958 -1001 -560 189 -1117 756 872 -838 859 183 -377 762 -1039 -974 1132
1366A132j831J494O01k166J209K40j758J696j207n87K080j371P89R53k028Q19
$$ 1132 -699 795 1396 -770 439 679 -1079 617 -590 -1177 903 -468 321 1274 -754 65
1382F5L77j410J574j048q63K388q69p1R62j813Q78O04j921J128q7r83K170p44
$$ 65 442 -968 606 -442 -1305 1083 214 143 1105 -708 170 774 -1147 -19 -106 -1089 1081 337
1400C37n37J483j661j85R27j473J209L54j751J908j1q07J344j756l44J857j605
$$ 337 -200 1283 -378 -563 364 -1109 100 454 -1297 611 600 -207 1137 -619 -963 894 -711
1417g11L24Q57j369J810K29j773J338q97q29J599j373J17J656j570Q15R78j688
$$ -711 -387 470 -899 911 1140 -633 705 -192 -1021 578 -795 -678 978 -592 223 1201 -487
1434d87J055p59j379J908l49m78J288j361P60J355k118N28J05j247J697m50r15
$$ -487 568 -191 -1570 338 -11 -489 799 -562 198 1553 -565 -37 68 -1179 518 68 -847
1451h47J877r35j95J238j718L78N25j710J445L98j006J421p36o74J797j494n57
$$ -847 1030 95 -100 1138 -580 -202 323 -1387 58 456 -550 871 135 -539 1258 -236 -793
1468g93R67j293J260P37j663J412Jj089J244j217n60J557j298L60J287j145Q55
$$ -793 174 -1119 141 878 -785 627 628 -461 783 -434 -994 563 -735 -375 912 -233 622
1485F22m4j614J510j95j177J012q60N17J715j561K7O49j216J055l86j569J872
$$ 622 578 -1036 474 279 -898 114 -746 -229 1486 -75 -48 601 -615 440 54 -1515 357
1502C57j56m59J293j171M5R67j720N71N07j155J389k76p28J638p45p63R57j347
$$ 357 201 -258 1035 -136 -91 876 -844 -273 234 -921 468 192 -536 1102 357 -406 551 -796
1520g96M48R39j501Q45O35q33J323p03j211J433r85k91J197j269P59P47j178J156
$$ -796 -348 591 -910 -65 570 -263 1060 357 -854 579 -406 -697 500 -769 -10 737 -441 715
1538G15Pj415Q86o36l27J613j249j93J458r01O04o8j703J397L0j106J103n32L1
$$ 715 722 -693 193 -443 -770 843 -406 -599 859 -42 562 494 -1209 188 218 -888 215 -317 -286
1557b86J508j325j26Q02j388P56O9j058J474K40j004R82q01J37J071j854J95P70
$$ -286 1222 -103 -229 573 -815 -59 10 -1048 426 666 -338 644 -157 -20 1051 -803 -608 162
1575A62q25J258j18j139J465m88p36R20j322K41J161j078O71N79j215J013j17
$$ 162 -663 595 477 -662 803 315 -421 499 -823 -582 579 -499 172 751 -464 549 432
1592D32j162J277j088l55J528p59J91O87j301J043J64j449P64l11m29J552j053
$$ 432 -730 547 -541 -896 632 -127 64 751 -550 493 657 -792 -28 -339 -768 784 -269
1609b69n2J351j147K58K39j487J240J52j143J265l04k8J198j549l74J106r43M10
$$ -269 -321 1030 -117 141 380 -1107 133 285 -858 407 103 75 1273 -276 -650 456 -487 -77
1627g7J59j110J562L49j076Q17j007j43J183j301p3R90q28J156K54j419J145m17
$$ -77 82 -1028 534 883 -193 624 -383 -526 657 -644 -717 273 -555 601 855 -564 581 164
1645A64r19J011q42L6J214j083O90N42j170N41M0j079J129o05k70J354q41R9Q99
$$ 164 -755 256 -586 -550 664 -419 271 813 -357 184 224 -855 274 -331 -601 753 -88 11 910
1664I10j433O73J56j329J028K8n77J435q86l91J450j129j93L30j180J196M93j134
$$ 910 -523 150 306 -1023 5 33 -544 891 5 -386 1064 -65 -258 72 -1108 88 581 -553
1682e53R02j77k05J122j539l77J030q18N04O05j258J308K05j051P30p18l04J129
$$ -553 349 172 -33 1089 -450 -827 203 -615 -111 494 -764 544 749 -302 428 -290 -594 535
1700E35j099M8J164q29O09K25j292R58o8j030J022p61P3J338r55O6P24j254N71
$$ 535 -564 -516 648 -181 428 653 -639 319 251 -779 243 -518 -445 893 -62 4 728 -526 45
1719D5J25j108J050k00l40J286o72l38P43j063M88M22j553J016K51l07J194j009
$$ 45 170 -938 112 -88 -428 858 186 -152 591 -472 16 438 -1115 -99 152 -155 1039 30
1737C0n85J131p21j39N39j140R05P33j229R53j98n26R31r46n59J080p01M39N43
$$ 30 -555 576 -145 -284 255 -885 20 753 -476 477 279 -247 684 -262 -821 259 -442 -3 540
1756E40j048Q94L77j281P51n44l08J226q81k67J177p27M17J94j233O58K19q21
$$ 540 -508 386 763 -518 233 -311 -619 607 -274 -541 636 -91 326 520 -713 -55 164 -657
1774f57R03l75k97J204p38l3O18j331N13L97r24R83j43o02J232n12l94P42j148
$$ -657 246 -129 -426 778 40 7 625 -706 -193 204 -720 263 120 -482 750 238 -156 586 -562
1793e62K79O75j012O75K88o40J056o00p17R64p14l2N56q46P55P14j264N70R1o14
$$ -562 -283 392 -620 55 343 -297 759 159 -558 406 -308 -340 216 -630 125 839 -425 145 236 -378
1813c78R18q55o04J292n06J31N28j086P92N58j338N45l57j28J036m81m07J076
$$ -378 540 -315 -919 373 -133 -2 526 -560 232 790 -548 -3 -360 -488 548 67 -340 736
1831G36p19J03K84j215O51K89p47R42j04m67J017q72k83R04r75K15M39q38J088
$$ 736 17 120 404 -811 -160 129 -618 324 220 -247 770 -102 -385 519 -456 -241 198 -640 448
1850D48l0p50J012n78n03P42r92K87P94j061P37M03p00O72l94q89J107n05l92
$$ 448 418 -332 680 102 -401 341 -651 -364 430 -631 106 509 -191 481 87 -802 305 -200 -592
1869e92R63p23N70P22j302L18J13n82P27m56m01R87k24p9O34j032L17M24j204
$$ -592 371 -352 218 940 -362 -44 69 -513 214 -242 -643 344 120 41 675 -357 -40 384 -820
1888h20Q01m4l26R22m31m12J047p56k15M57q51O10L15q58Q19J12n71R04q49l03
$$ -820 -19 -63 -389 533 102 -310 737 -19 -234 223 -628 -18 297 -561 258 370 -201 703 -146 -449
1908d49O88o75K40O81r36P74J77q89Q81l76n80P42p72K72Q64r42L93N46j000O35
$$ -449 239 -436 -196 485 -451 323 500 -389 492 116 -464 278 -494 -222 642 -300 93 639 -361 274
1928B74j87r93J082k70k25P49n92J82P78j152K97K59q33R08l25n03J243n04k77
$$ 274 87 -906 176 -94 -319 430 -162 20 798 -354 -57 202 -631 277 -48 -551 692 188 -89
1947h9O06r67M48L01r87N80K46m06Q41n07m29R97p26k86O32q88O08N55r55O65
$$ -89 517 -450 -2 299 -688 -108 138 -268 573 66 -363 634 -92 -378 254 -634 -26 529 -426 239
1967B39J54o61O79n46m54R63o96J51O48o55N78R0r98O94j06o57Q71p32J13J029
$$ 239 393 -268 411 -135 -589 374 -322 -171 477 -178 400 490 -508 186 80 -577 294 -438 -325 704
1987G04p54RO33j038O04j64p22J025j84l92Q77o26nP06j177J82M70p13O96j65
$$ 704 -50 -41 592 -446 158 -6 -728 297 113 -279 598 -28 -33 673 -504 -322 148 -565 131 -34
2007c4n81J269l74l65O01r64K84M58r21N45N73o57N71k00n49Q56p09l56P44n87
$$ -34 -615 654 280 -85 516 -448 -164 294 -627 -82 491 -166 405 205 -344 512 -197 -553 191 -396
2027c96O06L43r37N64K56p16N34m72m93J095n96rO93o40N91k3j056P27p0n87Q20
$$ -396 210 553 -384 180 436 -280 254 -218 -711 384 -212 -221 472 -168 423 400 -656 71 1 -586 234
2048B34l33r1R23p92L0M26q59L55J47p05J043j06n93Q23m93j90O67j092L57N69
$$ 234 -99 -190 733 -59 -29 397 -462 -107 40 -665 378 272 -321 502 9 -181 486 -606 -249 320
2068C20o93M67J53n32R08m32o06P99o90o8O82q07N60N12p29N83k69o17P86n53
$$ 320 -373 94 247 -285 623 191 -415 384 -306 -374 308 -499 61 573 -156 427 158 -459 327 -226
2088b26l56P18l18K05N83q85M87J13q75O70l60k63R93n59j25O64n21J55K18q74
$$ -226 -582 136 -182 23 606 -279 208 321 -554 116 -244 -507 486 -73 -198 466 -55 100 318 -556
2108e56N31L39p99Q39l28j45Q45p95j58N89q36L84K19o05P45M7n78P56n62j06
$$ -556 -25 314 -485 354 26 -119 726 -69 -227 362 -474 -90 129 -476 269 316 -262 494 -68 -174
2128a74M74p60K18N05o24N31M3m56P37l85o57P95m62PO28q10M38N56p85K81L9
$$ -174 300 -460 -242 263 -361 170 213 -243 494 109 -548 247 -215 -208 420 -390 48 604 -181 100 139
2149A39o58P93n06l26Q50m22J83M17p18M00J81q99N74j32l45R08l60l30P91o96
$$ 139 -519 274 -232 -558 292 -130 53 470 -248 152 333 -566 8 -124 -469 439 79 -251 540 -156
2169a56R8M03r82N52M14p59P67k60k26P50p21k50N81n80K30L18m36O36Jp10P41
$$ -156 -58 345 -637 -85 329 -430 337 77 -149 601 -120 -370 211 -369 -139 179 -257 379 380 -330 411
2190D11l85l60N67p27J74Q63q02L79L16p47N86j86p23P51l23J5O42n76J60N42
$$ 411 26 -334 233 -494 -320 543 -259 120 436 -311 275 89 -634 117 -206 -191 451 -125 35 577
2210E77q81J71K29n46O69k79l39Q39k60k05M70p67K81L62q84N78Q5m37Q29m23
$$ 577 -304 -133 96 -450 219 -60 -399 440 180 -25 445 -322 -41 321 -563 15 100 -337 492 69
2230F9l88Q50p38p1N57q00N10K62n58O16M2o52O88o44k5N11o25K67N49o28M89
$$ 69 -319 531 -207 -278 279 -521 -11 251 -307 309 351 -301 387 -257 -282 229 -396 -129 420 -208 281
2251B81Q7p34M62j64l68N97m50K7Q04o58K49K60o20L33o8p01Q96j39k67O61n28
$$ 281 368 -366 96 -68 -436 161 -289 -262 542 -116 133 393 -227 106 38 -663 233 94 -173 488 -40
2272d0M2M46p47J11L31o43P44k26k64P44l04m02N95p14K25K76n93N19J00l24L81
$$ -40 2 448 -299 -188 143 -500 244 18 -246 498 194 -208 387 -327 -102 174 -419 100 200 -124 257
2293B57n2m30O57o23j84O02n50L10M18o79M51J81o92M53k21k84P98o66J86N62
$$ 257 205 -225 432 -191 -375 227 -323 -13 405 -274 177 358 -334 119 -102 -386 412 -254 -68 494
2313D94o61L80O4o07M07l0n16P37k96j36P07o55K01L27p47L20Q1n00N93O5m45
$$ 494 -167 213 277 -330 77 47 -469 268 -28 -164 543 -112 89 416 -331 -11 70 -430 163 228 -217
2334b17O59n19p1O12p17M8L92n49O09ln16P98m15l99M40l63k3M05n88N90L38o69
$$ -217 442 -77 -148 464 -253 -205 187 -362 247 244 -272 526 111 -288 152 -211 -234 171 -417 173 511 -158
2356a58L64j52m02O13l98l70P77n54L31L42o74L70J28o53M54k32j11O24m58J17
$$ -158 206 54 -348 265 -133 -503 274 -280 51 393 -281 89 217 -436 18 -214 -325 299 -159 -42
2376d2M94o46K51J27n94M28L2m49O80k18k14O52o91J41K91o56L36K51n35O06q4
$$ -42 452 -194 57 184 -410 18 50 -399 281 63 -151 501 -190 -49 242 -414 -78 173 -362 244 160
2397A60l79N76k98k48L75m82J00M30n06M20M3l08M89m57j91M83n00J14M89n63
$$ 160 -219 357 59 -189 186 -296 -196 234 -272 148 191 -117 372 -85 -276 207 -293 -179 310 -253
2417b53M90J75o38L05M9m75N76l80k39P50m38J90K77o01J81J27m92N00p8k93N83
$$ -253 237 412 -226 79 128 -347 229 -151 -390 360 -78 112 389 -212 -31 96 -396 104 26 -267 316
2438C16l33m6M51o12J73J45m60L53N7l29O19j41l08M39m34j69N64o29L01K49m31
$$ 316 -17 -63 388 -224 -51 94 -366 -13 44 -285 334 193 -115 324 -110 -279 285 -344 -43 206 -225
2459b25M69n8l89M61k77l16M88n00K89L25m41K60J71m81M49l23l31N74k07o7M44
$$ -225 244 186 -203 258 -19 -335 153 -347 -58 267 -174 86 257 -224 225 -98 -429 145 -62 -129 315
2480C15m48K11L67o80K42R9m85N62l39k10P13l52k9M58o51K19J06n05M26M0l22
$$ 315 -133 78 445 -235 7 106 -379 183 -156 -366 347 -5 -34 424 -227 -8 98 -407 19 59 -263
2501b63O01l11j73M64n12k3L76m05K15J63l55M38j12l12N06m17o7L42n64L24L93
$$ -263 338 27 -146 318 -194 -217 159 -246 -31 132 -223 215 103 -209 297 -120 -187 155 -409 -85 308
2522C08m90L24J86o65M40j06l10M34k71J65M41o03K65J10n08M95l14k60O21l45
$$ 308 -182 142 328 -337 103 -3 -313 121 -150 15 456 -147 118 228 -280 215 -99 -359 262 -83
2542h3q9N66l21l4K92o66K34J19l96N45j61j94N89l56o8L15m60O2K28n04M10J80
$$ -83 -172 394 73 39 331 -335 -101 18 -378 167 6 -188 401 45 -23 292 -168 -106 122 -382 28 208
2564B08l96N78l39j45M13n19L0L98n86M47J58m42M79j03m57L91l14j1L98l95J53
$$ 208 -188 390 51 -94 319 -200 -170 228 -358 89 247 -195 284 181 -276 115 -199 -210 188 -207 -54
2585e4L67m03K57%n45N94k21l32M64j83L7M07m90J84J96n92K48Q2l05N68k02q1
$$ -54 313 -90 167 167 -378 216 -5 -337 127 -56 -19 388 -102 82 278 -314 -66 16 -289 279 77 -4
2607dL42l74lL40n09J16J49l63L45N8k50N27k19l09L44n67J28M62m33L54J46l82
$$ -4 338 -36 -39 301 -208 -92 57 -306 39 97 -153 374 155 -154 190 -377 -249 213 -220 134 280 -102
2629a02K82j05l78M73l56q9N53m56K14K52m36M08j25m29L73j49n1L40l80J51L31
$$ -102 180 75 -303 170 -186 -275 278 -178 36 288 -148 260 135 -294 79 -70 -121 219 -161 -10 321
2650C21m12O2K22m22K42k1k35M67j48r8M34m97J23J64m74K45L7k96M80L1k70J54
$$ 321 -91 -29 193 -229 13 -8 -243 224 76 -22 412 -85 38 202 -272 -27 10 -286 194 225 -45 109
2672A09j09j22K42m41J20M01l23K13j2j71M44l20k89M64m45J05K98l49K91K05
$$ 109 0 -122 120 -321 -201 200 -123 90 78 -93 351 31 -258 206 -239 -134 164 -185 106 311
2692C11m39K46m1l72L94k49qM58l28O6K43m39K54J15n77M55n1j68L74j60r6L47
$$ 311 -128 118 77 -295 99 -150 -158 300 -28 38 281 -158 96 211 -366 89 38 -130 244 84 -12 335
2714C35n11J92k0l48M04K8l32N11j50j55K78l97N1K31l95K34K23l34K89N4l16
$$ 335 -176 16 -4 -352 52 80 -252 259 109 -46 232 -165 -114 117 -278 -44 179 -155 134 188 -128
2735a28K35j28k89M72n09J75L39k63K37M9l36L42l14j56L81l12J30K50k44J45
$$ -128 107 -21 -310 162 -347 -172 167 -96 141 190 -146 196 -118 -274 107 -205 -75 175 -69 76
2755G6K07n16K31O9k65K63j57j92O18l39k8O9j95J5K46l72K56N3j86L64o8k68
$$ 76 283 -233 -2 67 -198 65 -92 -284 334 -5 -33 36 -159 -144 102 -270 -14 39 -147 217 149 -119
2777a19M31m30K2K21l96L65N1k10L25j22l98N03l92r2K82k43K37L00m35J60J00
$$ -119 312 -118 -96 125 -271 94 145 -65 260 138 -260 243 -149 -241 41 -202 35 335 -100 60 160
2798A60k72K69l13j16L16j32l3L79m33K65L7m18K52j6j08K12J3j02K36j86J15
$$ 160 -112 157 -156 -272 44 -88 -121 258 -175 90 127 -291 -39 -55 -163 49 62 -40 196 10 125
2819A25O1m40K16R1j90K18N4j52K10k62J8K42l64L4L08m92M82l2k65L55r1k84
$$ 125 186 -254 -38 53 -137 81 135 -17 193 -69 -51 191 -173 -139 169 -323 159 127 -138 217 126 -158
2841a58K93k30k7K87l95K32K01k47J79r5j67L03l23j14M61k88M6K75m69M07l7
$$ -158 135 -95 -122 165 -230 2 203 -44 135 40 -127 176 -147 -261 200 -88 -42 233 -236 171 134
2862A34m06M31k53j7L09k55Q7K35l10J63Pm61L39P8m39M62o8j07K99k64l4J97
$$ 134 -272 159 -94 -111 198 -57 30 265 -45 118 125 -336 3 81 -358 104 36 -71 228 -36 -70 127
2884A27l52J34J05j17J22J05j64J91j25j25L16l82P3J75j83J42K0k30L01m7k50
$$ 127 -225 -91 14 -103 19 124 -40 151 26 -99 217 -165 -92 83 -100 42 62 -168 133 86 -164
2905a64K69k37n8L62k54J42J05k90L14j98j03J15j86QL60k47J16K15l35M5O5k38
$$ -164 105 -132 -190 172 -82 60 165 -125 189 -9 -112 3 -183 -175 185 -62 54 269 -66 -21 44 -194
2927a94K35j1k45L56k19P4K41l35O3J29k53J04J03k00L39j18k04L09j63r6K49
$$ -194 41 30 -215 141 -78 -4 237 -98 -35 94 -159 -55 48 -152 187 69 -135 174 11 -85 164
2948A64l81K65j5k02L55Rk12J38j66r9K20k68N6J83j33J52R8k75J64m3j46J48
$$ 164 -217 48 33 -169 186 195 -17 121 -45 -144 76 -192 -136 47 -86 66 164 -111 53 10 -136 12
2970A2j8j26L17k23N5R9k58P2P7k79L34p4k27L60j91J02J74l56J08R9l77K81m
$$ 12 -6 -132 185 -38 17 116 -142 -70 7 -272 62 -12 -239 121 -70 32 206 -150 -42 57 -320 -39 -43
2993d3j31L65j44j68L82l37n3L11l64J69Q4k55K64Pj62K57k78J16J22k85O4L38
$$ -43 -174 191 47 -121 261 -76 -129 182 -182 -13 71 -184 80 87 -75 182 -96 20 142 -143 -79 259
3015B59m85L14K6k91L98l63K6J93k53J66K03l25J48K03l30K39Pl18K71j52j35
$$ 259 -226 88 114 -177 221 -142 -116 77 -176 -10 193 -132 16 219 -111 128 135 -183 88 -64 -199
3036a99M92k61LJ48k55k9J30k13K64j08p8L30k90M3J90k75N5P1k52J64K40l56
$$ -199 293 32 35 183 -72 -101 29 -184 80 -28 -106 224 -66 -23 167 -108 -53 18 -234 -70 170 -186
3058a86L03n1j11J89k67k1K07k14J73Q6k41K34ok26J91j18n8K83k65R0K14k11
$$ -186 117 66 -45 144 -123 -144 63 -151 22 108 -133 101 95 -131 60 -58 -116 167 -98 -8 206 -5
3080eJ14P7l49K36j51M6N4j35J16K42l07R3Pj93J54Kj49K77o7k83M74l46K4K76
$$ -5 109 186 -163 73 -78 -32 22 -113 3 245 -62 31 38 -155 -1 1 -148 129 62 -221 253 -93 -69 207
3104B07m17J73R3j44J07oq6K07j44p5K30k57J5J30j75K75N1k21K47k49m7K14k76
$$ 207 -210 -37 56 -88 19 13 -73 134 -10 -85 145 -112 -97 33 -142 133 184 -37 210 -39 -86 128 -148
3127a48K8J70j10N6J80k48K19lk85K38j94m5K58j40j07L44l20J07P8k14J32K5
$$ -148 -120 50 -60 -4 176 -72 147 144 -141 97 -97 -142 116 -24 -131 213 -107 0 78 -136 -4 21
3149B1j65L04j98j3K97l38J02J70l05J19p2j01L19P8j92J83k39l8J63k43O8J20
$$ 21 -144 160 -38 -51 246 -92 10 180 -125 -6 -78 -179 140 218 26 209 -30 -68 95 -148 -80 40
3171D0k71L98K3k56K28j21q2J26k49L7K86l13K23j3o0J6n2j69J91p3r5L12k04
$$ 40 -231 167 190 -66 162 41 -41 85 -164 -127 159 -154 69 56 -4 12 -40 -209 -18 -91 -186 126 -78
3194g8Q7K39l73J39r5j51K51l7q9K67o7j36J65k49J83n1j46K06j39l4K72j12j15
$$ -78 9 248 -125 14 -81 -232 19 -18 -107 160 93 -43 122 -127 56 5 -141 65 -74 -108 164 52 -63
3217f3J63j85J8K09l45J50j9r2L09j5j90L09k62q5J63k51L8K64k37L40o6j55J55
$$ -63 100 -85 -67 142 -203 -53 -72 -164 145 130 -60 249 -13 -98 65 -186 -148 116 -121 219 153 -2 153
3240A53k09L1R9j75K4J93j77J84l8j76K10j51j86K57j07O7J91j39j00J23k53J99
$$ 153 -56 -25 74 -101 -77 116 -61 123 85 -91 119 -32 -218 39 -68 -1 190 51 -49 74 -179 20
3262B0J33l69L05n6j29K17%j83K08k31K08j4k28K17q6j85L15o2q6K93l98lJ87
$$ 20 153 -216 89 33 -96 121 121 -62 146 -85 123 109 -119 98 12 -173 142 80 -6 287 -111 -114 73
3285G3k74J74J19j93K44n2j74K60j76j37J75j85P3K05k97R6J55j37Q9p6j60J75
$$ 73 -201 -27 92 -101 143 91 -83 177 1 -136 39 -146 -73 132 -165 -69 86 -51 38 -38 -198 -23
3307b3m9j3K21r7j16J95k16J04n7j1R9l2j05K19n9p7K65m28M1K49k34L5K26k26
$$ -23 -72 -85 136 39 -77 118 -98 6 -51 -62 37 5 -100 119 60 -17 248 -180 -139 110 -124 -89 137 -89
3331h9K50k34l9J78n2K2N9k10J95k2m0J04l8k20J72j57J64J10k93R5K47k28J83
$$ -89 161 -73 -112 66 14 36 95 -115 80 58 18 122 84 -136 36 -121 43 153 -140 -45 202 -26 157
3354A57k4k73K53m2j01J74k09rJ29q1P0J69l61O9J05k68L52j13%K02k55P0J31
$$ 157 133 -140 113 71 -30 144 -65 -74 55 -26 44 213 -148 -79 26 -242 110 -3 -3 199 -56 14 145
3377A45k60J47P3k16J46p1N5K10k12rJ21k94J98O2k82K46N5k36J52oj98L46j71
$$ 145 -115 32 105 -111 35 -36 19 229 17 8 129 -165 33 95 -187 59 114 -122 30 24 -174 172 1
3400Aj27J97j00R5Nr2M8M9j27J26k61J47J71j26J9J10k75J21O1r4J24j06l1P7
$$ 1 -126 71 -29 66 71 -21 27 76 -51 75 -186 -39 132 6 25 135 -140 -19 42 -52 72 -34 -65 12
3424A2j15M7K96k64K4O6j68M5Q7j72K70j62R0J35j83k9J94l70J33O5o9J72P1k98
$$ 12 -103 -56 240 -24 0 66 -102 -57 30 -142 128 -34 56 191 8 -21 173 -197 -64 1 -68 104 175 -123
3448a23J78nj79K26j34j2J71o4j30J23kN1j65m2J92j68K2R8j66J23J20k26J51
$$ -123 55 50 -129 97 -37 -49 122 58 -72 51 49 100 -65 -107 85 -83 -61 37 -129 -6 114 -112 39
3471C9J10k83K83k25j5K21j07l0K96l91Q8J15j57M1k4l8J84j28oK08k91K5J82
$$ 39 149 -134 149 -76 -91 130 23 -7 289 -102 -14 101 -56 -15 -39 -77 107 -21 -27 181 -110 -85 97
3494I7j60K0N3k07L03L0k17J84j05r8J16r4J28m1j23K85j16j76J52n2j6J20j38
$$ 97 -63 -43 10 -197 106 136 -81 103 -2 -100 16 -78 50 9 -114 171 55 -121 31 -21 -37 83 -55
3517e5L8J25r7k0J27r5K0P0j39l1R6r1J25j3k9j8k00J63Q7p1m5J03l1K5l4j4J09
$$ -55 -17 108 11 -9 118 23 43 113 -26 -57 39 -52 73 60 31 13 -187 -24 63 -8 -53 50 19 44 10 -4 105
3544A05j77J43kk78L44j13o4J98j21j15J44k54J55J18j58P0J04j18J15Jj86K57
$$ 105 -72 71 69 -209 135 22 -42 156 35 -80 64 -190 -35 83 -75 -5 99 -19 96 97 -89 168
3566A68k64kK19j93R1J42k21J86k17M2Q5r3j17L11j54n1J35j36J1R8j24N7l2n4
$$ 168 -96 -98 121 -72 19 161 -60 126 -91 -49 36 -57 -174 137 -17 -68 67 -69 -58 40 -84 -27 -59 -113
3590a13K42j83p1K91j11pJ27l36K20r6j67J63R9J9R7j72m0M9q6R2R4k50J21M4
$$ -113 129 -54 -125 166 55 48 175 -161 59 -37 -204 -41 58 77 174 2 -38 11 -75 17 111 -139 -18 26
3614B6j19K28j44j08K51k20L5K01j63n2J34l7O4j27j04J36L6r3J20j84PJ46j3
$$ 26 -93 135 -9 -117 134 -86 -51 150 -13 -65 69 32 96 -31 -135 1 37 -56 64 -120 -113 33 20
3637B0l0N1k30K21p0JL5N0N5q0l5n7J08r8k5l7R2p4J41j33J31o5k2Q0k03P2L6
$$ 20 -10 41 -189 32 -38 -37 -2 48 103 23 -12 -69 39 -59 -84 -121 -29 -103 38 -95 36 -29 -51 29 -174 -102 -66
3664f6n0J85k6n2M6j17j6Q4j64J29Q3k28K89r4q1M5l3p3J63p3K8K4r4Q3J0j05
$$ -66 -116 69 43 -9 37 -80 -96 -12 -176 -47 36 -192 97 3 -78 -33 -66 -139 24 -49 -21 3 -91 -8 2 -103
3690a03J74l1r0J03o4r8J95m3j30J39r4J58j31m3L4j12P5O2j35J72M9po8m5j6
$$ -103 71 40 -50 53 -11 -109 86 43 -87 52 -42 116 -15 -58 -24 -136 -61 1 -134 38 87 80 12 -33 -49
3715d9j8M7pK9M7j24K22q7r1R2k27N9J29r9J02J72j50k9jo5K9J6q6K34j56Q0o5
$$ -49 -67 -20 -27 2 49 -75 147 60 -31 61 -166 -107 22 -77 25 197 47 18 17 -48 -19 -3 -89 145 -11 69 4
3742Dk6j0Q6j85J76j8q4K18j84j9N8oMn3j54K17n9KjO3j05P0P3j45N5j16J38R1
$$ 4 -22 -32 54 -131 45 27 -57 161 -23 -42 16 10 14 -39 -193 24 -35 -33 -34 29 -76 -6 67 -78 -23 -139 -1 90
3770I0p6J30j29m0M9K2j05R7j90P0J25M6k3K6r6%j52J6N0nN8Q7j53K08j29lm0
$$ 90 14 144 15 -25 24 46 -59 38 -152 -82 43 89 66 92 -4 -4 -156 -140 -90 -95 -37 50 -103 105 -24 -27 -67
3797f7L7nK9n0K3N8Q7o5R1j47k8Pm6N9O6pJ05j17lL6P2j48n0M5Q6l4j02J73j55
$$ -67 -30 -35 -6 -56 -33 25 112 47 138 -9 -37 -30 -76 -17 49 42 147 30 27 63 135 -13 -63 -18 68 34 -68 105 -50
3826e0J09L4O8k06P8m7k0J5p6Q0M8l1J41k59J03J08j31J8Q3j43R6P8j40J6k4p1
$$ -50 59 93 161 -45 33 -14 -34 -19 -95 -15 33 2 143 -116 -13 95 -36 -18 65 -78 18 96 -44 -28 -52 -123
3852a23J91o0kJ26j37L0J00j96J31L8j04j0qn0J44k3mO5j50N2J0o4J2o3lJ54j20
$$ -123 68 8 6 132 -5 25 125 -71 60 98 -6 -16 -24 -74 70 47 43 108 -42 10 20 -44 -32 -95 -98 56 -64
3879f4J30M6j82R0n0K8o2J97k60J81M4j42O5r3j9J59j21L9P2o2L2p1R7J0j49O5
$$ -64 66 112 -70 20 -30 -2 -64 133 -127 54 98 -44 21 -72 -91 68 -53 -14 58 -4 28 -43 54 64 -85 -20
3905b0P4p9K8m5M4j7K1o9J31j23j8J25r6n2J77j46O6O0qnj63J16l4lM0O3q3pJ68
$$ -20 54 -25 3 -42 2 -15 6 -63 68 -55 -73 52 -44 -96 81 -65 1 61 53 48 -115 1 -33 -36 4 67 -16 -23 145
3934A45k24Q3j1k1O0O5j09Pl0k4J6l2l2Q8M1M4j22K4K2J9j90J95j18N4N5PL9R7
$$ 145 -79 4 -7 -28 32 97 -12 -5 -35 -59 -43 -75 -107 -19 22 66 -56 -32 -10 9 -181 14 -104 -50 5 12 51 148
3962A48j79O1M9j50J70j75Q5o0L2P3N4k5q8M5j8kq7KO1m2P6Nk4p9J29l1q7J09
$$ 148 -31 30 79 -71 99 -76 9 -51 -19 54 108 83 -5 40 22 20 -67 -65 -4 -46 30 35 11 -68 61 30 -57 52
3990E2j16L2M7p9P1r1k5Qj0K17j23j59K15l1q8jo6K2J40k9O3j42k2J12l1j5J98
$$ 52 -64 -32 15 -64 7 -84 -109 -101 -111 106 -17 -176 39 8 -80 -81 -147 -125 15 -14 49 -93 -115 -3 -34 -49 149
4017A49j10j63J32l8m9K03j60n2M7K9O2r6K6J42j26J23L0k99J10M6K7j02J52j04
$$ 149 39 -124 8 -30 -79 124 -36 -88 -41 -12 50 -46 -20 122 -4 119 149 -150 -40 6 33 -69 83 -21
4041b1P7j36N5n9J63n5r3K50k97R7l7n0R3J28m8q9j03K67j50p5J41j33L8l0k0
$$ -21 56 -80 -25 -84 79 24 -69 181 -116 -19 -56 -106 -13 115 67 -22 -125 142 -8 -83 58 -75 -37 -67 -87
4066h7P2P1o2PQ1j85P0J4K9J6qk4pN1q0J03l1kj46Q0J33m3mo1j8j3ml4J33J6j11
$$ -87 -15 56 -6 1 82 -103 -33 -19 10 26 18 -6 -13 38 -42 61 30 28 -118 -38 95 52 48 -13 -31 -44 -48 -82 51 67 -44
4097d4J61j55Q6Oj26J21J8j23l7J52o8J26j79j6J4P4j4m3M2O6Om6N9n9p4J52j07
$$ -44 117 -38 48 54 -72 49 67 -56 -93 59 -9 117 -62 -78 -64 10 -4 -47 -5 61 67 21 80 21 -53 99 -8
4124hn2l0N1J5O8m6J10q2m7j2O6m0M6K7q4J8R0N8j95J38k00J51j51R9j2mJ07K4
$$ -8 -60 -90 -39 -24 44 -2 108 26 -21 -33 33 -7 39 66 -18 0 90 148 -47 91 -109 42 -109 -10 -22 -26 81 105
4152A05n3J8q3J2NN0j07O7nO4j38Q6O3pl1k91Q2M30k88J70L1j13j12Q6j75p3j15
$$ 105 52 70 -13 -1 4 54 -53 14 9 73 -65 21 84 77 46 -245 -163 267 -21 149 180 67 -45 41 -134 -207 -322
4179c22N54l08N69q60L39L25n28K89J18K67k29j81l65Q48j230P29Q0k96J70j27
$$ -322 232 -76 493 -367 -28 297 -231 58 176 443 214 33 -332 516 -714 15 95 -201 -31 -158
4199a58K73J40l44j9j5J75K54k41k27J7r1M65j31K1m4p4j38J24K04K75m82K7J68
$$ -158 115 255 -89 -108 -123 52 306 65 -162 -145 -236 229 98 119 75 1 -137 -13 191 466 -16 11 179
4222A79n8l72P41m12j69m93R67M8p73K03K28j14m6O66j84q13m03Q22O0M14p65
$$ 179 121 -251 490 78 -91 -584 383 431 -342 -139 89 -25 -71 595 411 -402 -805 17 77 491 -274
4243b74M02l70M90l05L49m71M04m15q4J061k03K52p79L44o23J91K49K27q02P01
$$ -274 128 -242 248 -57 292 -179 225 -190 -274 787 584 836 57 401 -222 -31 218 445 -357 344
4263C44J44L4m79n9J06J17m60N23K3j014K43Q81m33n36O67o02O61l72P9j75L30
$$ 344 488 522 43 -16 90 207 -253 270 293 -721 -478 403 -30 -566 101 -501 160 -212 -133 -308 22
4284B2%o4M6P8j44J57r9lQ3j44J06m9j7L0K5r3N9m2L9Qm0L3P2m5n9j2K4N1l3N2
$$ 22 22 -42 4 82 -62 95 -4 -7 76 -68 38 -11 -28 2 27 -66 -7 -49 -10 -2 -42 -9 63 18 -41 -53 -29 22 -11 41
4314D1ok1l2N8o3O5K8r9l4O9l7M8k4QP4M1j83K6J6MK7P8r1J3O1k8J3n4kn1l1J0
$$ 41 35 14 -18 40 -23 42 70 -29 -63 6 -31 17 -7 1 75 116 -67 -41 -25 -21 6 84 -7 6 67 39 52 -2 -4 -55 -86 -76
4346g6J66j08J03j08J5j0m0J14M8k21J02Nk6K4L3J5j1q8L4M6K0o6QN4k1r8J23
$$ -76 90 -18 85 -23 -8 -18 -58 56 104 -117 -15 -10 -36 -12 21 36 25 -63 -29 17 37 -29 -21 33 12 -86 37
4373C7l3m0P8n0L4O7n6j06R9R6k10l1J06q4R3Kq9J02j1Q6r4n2P2m5R1l4p5K9L4
$$ 37 4 -36 42 -8 26 93 37 -69 30 126 -84 -115 -9 -93 0 2 -87 15 4 90 -4 -56 16 -29 62 28 -47 -18 16
4402A6K3oJL4N3p9J0q9n1N0J15o0j4lr4J10No9J26q9N8J8p6j7l4R0j1l0m5N5m6
$$ 16 39 33 34 68 121 42 52 -37 -88 -38 77 17 3 0 -94 16 21 -48 78 -11 47 65 -11 -28 -62 28 17 -13 -58 -3 -49
4433d9j1J23j17J50j7o7p7J02j45N4K8K2L1jN0o9l1M8lr5J83j07l0Mj00J10O3
$$ -49 -60 63 -54 96 79 12 -65 37 -108 -54 -26 -4 27 26 76 7 -24 24 21 -74 109 2 -28 -24 -124 -14 49
4460D9j38K6J53%j03O5j17N7L9q6J73p2J3r8M2j12J26j28K1Q3j7LM0j26J13o0
$$ 49 -89 -63 90 90 -13 52 -65 -8 31 -55 118 46 59 -39 3 -109 17 -111 -90 -7 -24 -21 19 -107 6 -54
4486e4N0lnK6q2J21P4l2j26j9M5j6OJ31j42k0q1J01O2n8o7J69j75P4O1KR0j21
$$ -54 -4 -7 -12 14 -68 53 127 95 -31 -50 -5 -21 -15 116 -26 -46 -127 -26 36 -22 -89 80 -95 -21 40 42 132 11
4514A1O5j6k5l9MljJ8mP3l0l5R0j87n5p2K89p3j3Op4P6j09J75j05J01k1j7m4p4
$$ 11 76 60 35 -4 0 -3 -4 14 10 83 53 18 108 -79 -134 -206 83 10 -3 3 -71 5 -104 71 -34 67 46 29 -15 -89
4544h9K49j13k1j86R0J73j20lj0q0J64N5k31J68j14n7J93k6j02P6l5N4j2l4p5
$$ -89 160 47 26 -160 -70 103 -17 -20 -30 -110 54 109 -122 46 -68 -125 68 42 -60 16 -19 35 23 -11 -86
4569h6K15j74N5L1o0j0L0n4P0q4J45K2j3j06p8J35l4l2K9k8J14n8k0q7M3M8q0
$$ -86 129 -45 10 41 -19 -29 1 -53 17 -67 78 100 87 -19 -97 38 4 -28 1 -27 87 29 9 -78 -35 13 -67
4596f7R9m0J2K6p0J31j38K05k12J6J6J18r5j00J71p5M7N6m8n2R2o4j13J53l8q6
$$ -67 32 -8 4 30 -40 91 -47 158 -54 -38 -22 96 1 -99 72 -3 44 100 52 0 92 28 -85 68 30 -56
4622e6K5l9J10o1M8p4J03m5r2J21l0j61R0J25j91P6RL0j9j2MO9n8pJ02m2k6l5
$$ -56 -31 -70 40 -21 27 -47 56 11 -81 40 10 -151 -61 64 -127 -51 -42 -12 -31 -43 -39 30 -28 -35 67 25 -1 -36
4650c6J44k19j4P5Rk1op5J25L2Mq6M5N6q0N0j1l8J2j6K8KLJ04j25J06l9J1n6R
$$ -36 108 -111 -125 -50 -41 -62 -68 -143 -18 14 18 -68 -23 33 -47 3 -8 -46 -34 -50 -22 -20 -17 87 -38 68 29 40 -16 -7
4680gk9R2j08O5q7J26r4R7k2rj31P1O1N7j14K6P5o3q9O5j3O2k4p1M4m7O1J46r0
$$ -7 -36 56 -52 13 -74 52 -42 55 33 24 -107 -36 25 82 -32 -6 69 6 -83 -18 -31 31 7 -64 -20 -67 -6 140 50
4709E0m2J00j05k1J2L0m5O4j43Q4Q1j47J50j16R2q3J66p5j2m8o2J02k8M0lj5j58
$$ 50 8 108 3 -18 -6 24 -21 43 -100 -16 65 -82 68 -48 44 -39 127 52 40 -8 -70 32 4 44 41 26 -132
4736a32R0P7r5J00j7l5o6R5m2P4k8J10j80P3lJ5q3P1J6k0O8l5p9J8Q8k26l7J81
$$ -132 -42 35 -60 40 23 -12 -78 17 -25 49 21 131 -49 24 21 36 -47 24 40 20 88 53 -26 -8 80 -146 -183 -2
4764bl2J19j49N7R3n0o8M8m0lO3k3l8L2P8q7j18M2K21p7o0l3Q2k3m5R8j19M0q4
$$ -2 -34 85 -64 -7 86 36 -32 16 -24 -27 36 13 -25 7 85 -2 -120 -78 143 66 6 -27 55 32 -13 85 -34 6 -78
4793g8P2L9q7J10mj59J70n9JK6q5M4N3k4LR7j58J27n4pk5P7n6p7O1j0J5jn4K9
$$ -78 -6 33 -54 56 52 -107 63 4 5 31 -54 -10 43 19 22 119 -39 88 34 27 2 79 23 -54 7 -3 12 11 -43 -14
4823a4j6N5K0o2J3rJ01j00qJ20k25K48j04mQ0j06o5J01j5o6N2JN8j46Q1j44J72
$$ -14 -30 25 45 -17 -4 -13 88 -12 -20 100 -125 123 19 15 95 -11 -76 25 10 -56 -4 -3 55 -91 -10 -154 18
4850A8n4OM0K0Ln1L8m2J9P4N3j75MPJ84j34K2j06o4J57j25Q5L9p9P7o1l6N5K0
$$ 18 -36 -30 10 30 33 -18 20 -22 -3 71 124 -51 -47 -40 144 10 32 -74 -138 19 -106 -21 18 -61 16 -45 -81 -26 -6
4879fr9Q2O7PJ0k1J6j32J01r7O0rJ03k7J4On5m1nM7j6j7KJ00j86J09j12J25ko5
$$ -6 -105 -23 44 51 61 40 56 -76 25 -72 -12 -21 82 55 69 75 20 -21 -26 21 5 -12 -10 90 -96 13 -99 26 24 -41
4909d1J03k9n2l4QM1M8j39J15J00j0o6j02N8j5l9j8R6l4j9J96l2j71N7J61k14
$$ -41 62 33 -19 -53 -45 -4 44 -95 20 120 110 44 -58 0 -15 -54 -72 24 -10 -29 167 135 -36 21 182 -32
4935c2O0N3Pl7R7p6o7L3m8K4j58J52N4o9j02J88q2N7j00k2J26l5K7Nr2K4m5J11
$$ -32 28 81 88 51 148 72 5 38 -10 14 -144 8 62 -7 -109 79 -3 54 -46 -68 58 23 50 55 -37 -13 -58 53
4963E3n7Q8o3n2R8l6M8j71R4J0q1O8l0O2p7o5O4J60k20M9L8O4j00kmM6m2O7q7
$$ 53 -4 84 21 -31 67 31 79 -92 2 12 -69 -1 -31 31 -46 -111 -47 113 -107 -58 -20 44 -56 -58 -62 -16 -58 9 -78
4992g8Q5M9n6J3j63J98p9K1N0l2R8q4k6RL6r1K1Kp8J09J4k3j0op5n5K15m5m5n8
$$ -78 7 56 0 13 -150 48 -31 -10 40 8 106 22 -4 5 41 -50 -29 -27 -105 4 18 -5 -15 -21 -96 -151 64 19 -26 -84
5022h4J16p1M9Ok3N0n6Q0j47J04k0o8J52p0j70J48r7K6J90j58LJ03j30J39k3O
$$ -84 32 -39 10 16 -7 43 -13 67 -80 24 4 -64 88 18 -152 -4 -101 -75 115 -43 -40 63 -67 72 49 55
5048E5L2j30N7r4J73M9j62J02n9K8J4n7J07%j91R0j02Q4j52K40o4KMK4J6p4L1
$$ 55 87 -43 14 -80 93 142 -20 82 23 51 65 8 115 115 -76 14 -88 -4 -156 84 20 22 26 50 66 -8 23
5075B3L6j2o0j8JnP7j0j41J68j39N4J32l2q7oJ2M8qM7o4M5o0L9mK0J0m2l3l7J09
$$ 23 59 47 -13 -31 -30 -35 42 32 -109 59 -80 -26 106 74 -13 -19 -7 41 33 80 16 61 1 40 36 56 66 24 -9 -46 63
5106F3j12J6M4pM0L0j43O5jm5K6j10J08n8J39m0n9l2O7M8l1qn0M2L1m9j4K1o7
$$ 63 -49 -33 11 4 44 74 -69 -4 -5 -50 -24 -134 -26 -84 55 15 -44 -76 -9 39 8 0 -50 -8 23 -26 -40 -19 -86
5135h6R2o7j7Kn9Q9N7p6J48k7j8r2R6l7N2j9L6n4n6O9p7m6p7Q3J35O7q4j42J80
$$ -86 6 -61 -78 -76 -135 -46 11 -65 83 56 38 -54 42 5 57 38 74 20 -36 33 -44 -90 -167 -84 51 118 34 -108 72
5164G2n4J6l3j2L9M6j19M8%M5j22J45l5j53O5Q8j27J17l0L0m5q3P3L8J8p6R4K8
$$ 72 18 34 1 -11 28 74 -45 3 3 48 -74 71 36 -117 -52 36 -91 26 -4 26 -19 -102 -29 9 27 -49 45 73
5192G3q5K6k4n4J4Q3q9P5L5n2k0QM7l7K5p9L6N1l2P7j37R6L4Qj19o9j2J89l0N5
$$ 73 -12 14 -10 -64 -50 33 -56 19 54 2 -18 -10 37 0 25 -54 -18 33 1 78 -59 37 71 79 -40 -109 -121 68 38 93
5222I3r0o4N1O7j14L4L7%Ql7K8j9k4KK3L0o7M9j1m9M0n5Q0M1k8j25J13n4N8K1
$$ 93 3 -61 -10 57 -57 -23 14 14 22 -15 13 -6 -30 -28 -5 25 -42 7 -4 -53 -13 -68 12 53 25 -100 13 -41 17 38
5252C8n6K7K8j4p2M2J3J2Q0j83M1J17j9q2Mk8oJ25j11L9P3p2Q7j03M3K4pO2j09
$$ 38 -18 9 37 23 -49 -7 6 18 98 -85 -44 73 54 -28 -24 -52 -58 67 -44 -5 68 -4 83 -20 23 47 40 102 -7
5281gO8o7R0p6o1P5KN5k16P6P2n5j4M2j5O4j9QK7Nj81Q7J40j76N5PP0j71K23j86
$$ -7 61 -6 84 8 -53 22 24 79 -137 -61 11 -44 -58 -16 -31 33 14 22 49 54 -127 -40 100 -76 -21 -14 56 -115 108 -78
5311g8K1Q7l8N7JK1j21J12m0Rr9N5K3L8m9q6J23M8p8K0M7q6pm7m6Q7k4R9n3j4
$$ -78 -57 30 -8 49 50 71 -50 62 22 31 -68 -13 10 48 -1 -87 36 84 6 26 73 -13 -20 -67 -113 -26 -50 49 -4 -18
5341a8rjn9N0N9k7L1q3J62j26r0M7J24m1j4q6P4J08j27O7q9J73j56N5O4j28L8
$$ -18 -27 -28 -87 -37 22 -5 26 -57 105 -21 -111 -64 60 19 5 -81 -7 101 -26 41 -48 125 -31 24 88 -40 -2
5368bj1L4j26qN8M2P4m1PK2q2L5J5N5j94K09j21kN2q6PO9L3oM1l3K6l4m6Nl0O2
$$ -2 -13 21 -105 -113 -55 -13 61 20 27 49 -33 2 17 72 -122 87 -34 -36 16 -70 -63 6 39 33 74 41 67 33 -13 -8 -38 24
5400B4j5j12R6Lj58M7P4O9K0r7J3L3n5J54q0J7n0J0p9P9O5p9O5n2N3n2J2M0n4
$$ 24 9 -103 -7 -4 -162 -115 -41 28 48 -49 -36 -3 -58 96 16 33 -17 -7 -86 -7 58 -21 44 -8 45 -7 5 45 -9
5429ij17J00J9j4P3l0o3L7j35J12l1P2j2N2r3K5j1JJ00j28M3k1j00R1n9lJ20J2
$$ -9 -126 -26 -7 -21 52 22 -41 -4 -139 -27 -58 14 2 54 -39 -14 -25 -24 76 -52 -9 -30 -130 -39 -98 -101 19 31
5457C1Q9L5j13r2J45j78M5Q8n3p7J7J50r1L7n4K7Nm5O5p8J62j75%OnJ54j34Pq0
$$ 31 120 155 42 -50 95 -83 -38 50 -3 -80 -63 87 -4 33 -21 6 11 -34 31 -47 115 -60 -60 -54 -59 95 -39 -32 -112
5486a12R1K3j23J75k9q9R0n5l6N2p2J2R6n9J19pNk26J77l7k6m1J8J4J58j22O7
$$ -112 -21 2 -121 54 25 -64 26 -29 -65 -13 -85 -73 23 -36 83 76 81 -145 32 -5 -31 -72 -54 -40 118 -4 63
5513F3j35J10n6r0O7p2J10L9m2k6qOL1O2o2J2j6J31j47j56J51R3n5K4%j39Q3l
$$ 63 -72 38 -18 -108 -41 -113 -3 36 -6 -32 -40 -34 -3 59 -3 9 -7 124 -23 -179 -28 65 10 34 34 -105 -22 -25
5541b5J7O2l9P6j68J85M3k04lL1N9J9k01RO0P1N5j30Pl4N9Q2j50Q8O5k1M3rq4
$$ -25 -8 54 15 91 -77 108 151 -53 -56 -25 34 53 -148 -139 -79 -8 47 -83 -76 -110 -51 31 -119 -31 34 13 56 47 -37
5570c7M7k9R2j29Q4J27j8k5q7m4M4k3o1R5j1K2l6q2L6m6k4N3l2J55o3O2k2J3p5
$$ -37 10 -19 73 -56 28 155 137 112 25 -19 25 2 -59 36 25 47 11 -71 -35 -81 -105 -52 -84 71 8 70 48 61 -14
5599a4o9R2n1K2P7k2o7M4k1k9j9P3n3J07l4l2%m4J33j20M6No4K0j3k5O1lq6M8
$$ -14 -83 9 -42 -20 57 35 -32 12 -9 -38 -57 16 -37 70 36 4 4 -40 93 -27 19 24 -40 -20 -33 -58 3 0 -86 -38
5629c8M8QN5m2q5Q2r4N8j13M6J42n8Q2j40R4m1M9m6m0l7Q2l8J14l4l4K1n3%J3
$$ -38 10 18 73 31 -54 28 -66 -8 -121 -75 67 9 91 -49 45 4 53 7 -33 -70 12 -26 88 54 20 41 -12 -12 1
5658Aq7O0l8J33q5k6l1R9J9l6L4j82M5P7P0O4r6r4Q5m8M5l4J1o8R1K9k7Jp8K4
$$ 1 -86 -26 -64 69 -16 -42 -73 26 45 9 43 -139 -94 -17 53 117 21 -73 12 -36 9 -25 -14 -82 9 38 11 12 -66 -42
5688d2R2p8Kq5J75M6j28m6N6o4R6j07O9N1mn8L4p4J0M6J0m0o7J85J3j20lpM4L7
$$ -42 50 -28 -26 -111 64 110 -18 -64 -8 -72 24 -83 -14 37 33 -25 9 -65 -55 -9 1 -39 -106 79 92 -28 -31 -38 6 43
5718D3l7l6R3k9j10J2J00j16K03j03L8m4j15J05J05k19l2R4M0J2j09nJ84j40K8
$$ 43 6 -30 63 34 -76 -64 36 -80 123 20 58 14 -101 4 109 -110 -142 -48 -8 4 -105 -110 74 -66 -38
5743c8M7j46J43o8M2Qo9N9O5p4R2j2j12P2K6l0R1n9j26J00l5J24mj08qN9p7L1
$$ -38 9 -137 6 -62 -20 -12 -81 -22 43 -31 61 49 -63 9 35 5 96 37 -89 11 -24 100 96 -12 -20 39 -38 -7
5771go2R2n2m7P7M8Lj96J07k3J33N3j47J26j57Q0l0l1m0J08p0Q9J4j24N3J7p0
$$ -7 -69 23 -29 -76 1 49 52 -144 -37 -60 73 126 -21 105 -52 28 -2 -33 -73 35 -35 54 68 -56 -3 14 -56
5798e6Q6q6J18o2L5p6J8L9N0o9j23J25j6N7j8j1r7R6%m2l7J21J1j13O7r1K5J9
$$ -56 30 -56 62 0 35 -41 -23 16 66 -3 -126 -1 -17 40 22 11 -86 10 10 -32 -69 52 63 -50 17 -74 -49 -30
5826c0M4n2n2J53l7k9L1Oj72J41k7P7oj39M2J7M9q6NL8kP8J2n4k0k4P0M9j8j52
$$ -30 14 -38 -90 63 26 -3 28 34 -138 3 -24 53 47 -92 -50 -33 16 -70 -65 -27 -29 49 61 7 -13 -37 33 82 64 -88
5856h8Q8o0J1N2P7j9L5j10K3k5pJ65n6m6n7M7l2k7J03p2r0Q4m9MO4j9J30j46j14
$$ -88 0 -60 -49 3 80 61 96 -14 9 -16 -23 142 86 40 -17 30 -2 -29 74 2 -88 -4 -53 -49 15 -4 126 -20 -134
5885a34J31O1j28N1J4j9m4M6O1m5j5J36j84O8L9rj20N8o5J29j23KK15j04Qj00
$$ -134 -3 58 -70 -19 -5 -24 -68 -22 39 -6 -21 115 -69 -1 38 29 -91 -33 -98 31 -92 -90 125 21 29 -71
5911g1p2K02k7ml0o3QJ2nj50K68j46M4J10J3j78J11R6m1j27J16n0J3p5N4N8r1
$$ -71 -143 59 32 28 -2 -65 -57 -45 -50 -200 68 -78 -34 76 89 -89 22 118 77 -50 66 16 29 -46 8 66 -25
5938b5N9l4RL8O2m3n7p2M4L1O2o8N6p8pJ8l7J09lr5J5Q7j66mJ89o4K4o5J3QO1
$$ -25 34 0 9 47 109 66 9 -63 -19 12 74 6 62 -16 -23 -5 -42 67 64 -31 -16 71 -95 -99 90 26 50 -15 -2 6 67
5969F7o5K5Oj3n8j11J00J08qo7k1j8K3N0qo0k9Q9m3nPn0QL0N9k6O3p7K6J10P7
$$ 67 2 27 33 20 -38 -149 -49 59 51 -16 -37 -55 -32 18 10 -50 -79 10 -33 -38 -31 -81 -73 -43 16 -10 53 -24 2 112 189
6000A89k09L8K0o3Q0kj28P2p0M6n1J0M7jM3Oj7q2L4m4rJ19o1N8m0o4J37q0M3N5
$$ 189 -20 18 38 -25 55 53 -75 -3 -73 -27 -78 -68 -21 -22 21 27 10 -72 -38 -82 -91 28 -33 25 -15 -79 58 -22 21 76
6030G6pmNq6K5L2m0n0KJ93k56J75Lj11O5N5j45R8Jl1Q2q2l2J4N0J27j62j31J85
$$ 76 69 65 70 -16 9 41 1 -49 -47 146 -110 65 68 -43 22 77 -68 30 31 0 82 0 -32 -18 32 159 -3 -134 51
6059E1j8Pk5L9j48J02L8K6j72J49n2n5O8K3l8M7n6pJ3j03M9J42k6r5JJ42j51M7
$$ 51 33 40 15 54 -94 8 46 72 -100 49 -3 -58 10 33 -5 42 -14 -21 -8 -111 -62 80 54 -41 -40 102 -49 -2
6087bk0K9n0J5NJ8k0N6J4j3Q9o0m9nK3K8k3l8l7kn3L9o9J01k5O5j31J67%j04P3
$$ -2 -22 7 -43 -28 -23 -5 -25 31 45 32 121 61 12 7 30 58 35 -3 -40 -42 -95 -56 -125 -24 -49 16 -115 52 52 -52 21
6118B1nL7j5r6O0O0o9O2Nl9J4J4N0j43o5O6R7j52J13p1m3J04qM2m0k6l5N1N8m
$$ 21 16 53 38 -58 2 62 -7 55 60 21 35 49 99 -44 -109 -43 54 -98 15 -56 -99 5 -3 39 -1 -27 -62 -11 47 43
6148D3Jm2L6L1j26J13J1r8Q4Kj2l6m1oj2P5P3Pj07o7R3k2J47k06J26j38rL4J1
$$ 43 44 2 38 69 -57 56 67 -31 53 55 43 7 -34 -40 -52 23 96 103 -4 -71 22 0 147 -59 67 -71 -80 -46 -35
6177c5j28J36P1j13k7P5m1J3N3L3j02J7k3J19K7j23R0lk0j29Q0L6R6n6qL8r0O2
$$ -35 -163 -27 44 -69 -96 -21 -62 -49 4 37 -65 -48 -71 48 75 -48 42 39 19 -110 -30 6 102 46 38 76 -14 48
6205D8q1l5J02K1j67J1Q4O7j8j20K4J85j61K8n8m0J30O8n3n6Q4rn5k3m4m1J58
$$ 48 -33 -68 34 55 -112 -101 -17 50 32 -88 -64 121 -40 -12 -70 -110 20 88 35 -21 63 54 -1 -24 -68 -109 49
6232D9pL0p9op1J37%N5j05R6j71K3Q1r3k9K8M9Jm8O3KJ3q9J56j11l6k8J05Q0j11
$$ 49 42 72 -7 -13 -84 53 53 108 3 99 -72 -49 32 -61 -90 -62 -13 -12 -60 3 5 18 -71 85 -26 -62 -90 15 95 -16
6262a6j8K2K8j2Q7j11k6J08j14J03K3kr2J0J21j38k3o6L9nQJ31%j2n3L6K6r2J02
$$ -16 -34 -12 16 4 91 -20 -46 62 -52 51 74 72 -20 -10 111 -27 -50 -116 -77 -82 -74 57 57 45 -8 28 54 -38 64
6291F4p1r5P4M7p2l9M5Q0k5J18r0p6R5q7k2j2O1O7m5Nm8p1J62Qr5j9j9K8o4m3
$$ 64 -7 -102 -28 19 -53 -92 -47 33 8 126 36 -40 55 -32 -54 -66 -5 62 17 22 -26 -97 65 73 -22 -41 -60 -32 -96 -139
6321a39P3N1j5O6n0l9O3q8J14P8j25j01J31mJ06m9n6j1l8n3N0R9j10O9j42J06
$$ -139 -66 -15 -30 36 -14 -53 10 -78 36 114 -11 -112 19 15 121 72 16 5 -33 -86 -36 63 -47 22 -120 -14
6347a4J51j39R3j33O0M4p6q4O6P6Nj1j4m5j1l3L4p3Q3m1O5mk8k6L1J74k68J05
$$ -14 137 -2 91 -42 18 62 -14 -98 -32 44 49 38 24 -21 -32 -65 -31 -104 -21 -62 3 -1 -29 -55 -24 150 -118 -13
6375a3J11q0N3q2N6r4q2K03j35J02n3k6k8P7pJ9j2m4J39j38nm1M1J01r1p4K11
$$ -13 98 18 71 -11 45 -49 -131 72 -63 39 -14 -40 -68 9 2 21 9 -35 104 -34 -39 -80 -39 62 -29 -103 108
6402A08jj18j06J75j12L8j7KL9o0K7m5N1j3l9P9K7k7L2q7K1K4J9n0kN7lk3q5J91
$$ 108 107 -11 -117 58 -54 -16 -33 -31 8 -52 -25 -70 -19 -32 -71 8 35 8 40 -47 -26 -2 17 -33 -35 22 19 -4 -89 102
6432A02j66P3j7r1MN8m3j8J3J49j11rJ0L9r9O0R5l0l2m8L5j4J8M1M5j36ML2r2
$$ 102 -64 9 -8 -99 -95 -37 -80 -98 -85 64 -47 -56 -46 -7 -106 -46 49 19 -13 -61 -26 -40 -22 19 64 -72 -68 -36 -128
6461a28J44M2p0L5j09jN7Q3j7L5l4j9%Mj44K24p2K7J7j77J35o9pO4o5k9J24p0
$$ -128 16 58 -12 23 -86 -87 -30 53 36 71 37 18 18 22 -122 102 30 57 74 -103 32 -37 -44 20 -45 -74 50 -20
6489b0J43j01q0k9O9O0j5P6j67O4O0J2K4j44Q7L1Qj52K2L5o9J52j40J7Q5q8J62
$$ -20 123 22 -58 -87 -18 42 27 103 -64 0 60 72 96 -48 39 70 78 -74 -52 -17 -86 66 -74 -57 28 -60 102
6516A02n5Pm5pk6q4Q9q4M1P8L9o3j04J32J7j20O8J64k12P5noJ8M3j90K14j97J44
$$ 102 47 54 9 2 -24 -108 -19 -103 -62 16 55 -8 -112 20 37 -83 -15 149 -63 12 7 1 19 62 -128 86 -111 33
6544C3K7o7m4N9L8r1NM0l4M6M4j47K3J49k3j52R0J63k29r1J68p4J07j01J45j5
$$ 33 60 -7 -51 8 46 -45 -40 0 -34 12 56 -91 -68 81 58 -94 -4 159 -70 -161 7 -67 40 -61 84 69
6570F9r6L4P6q8j18J14k9m9N6O0n9J5J0k1j44J09LJ06p5nl4Nj9J03L1n6J5j2n8
$$ 69 -27 7 83 -5 -123 -9 -38 -87 -31 29 -30 -15 -5 -26 -170 -61 -58 48 -27 -32 -66 -61 -80 23 54 -2 13 1 -57
6599e7J17R3j26J3K9j59LJ07j26J72k0N0q5k7M7j19k8N2K5j6m5R3J09o4m2O2o9
$$ -57 60 153 27 40 69 -90 -87 20 -106 66 46 96 11 -16 31 -88 -116 -64 -39 -55 -100 -7 102 38 -4 58 -11
6626a1J56m0j6r8k6J1LO2j8n5pO1j39K07j29J04k2m8l7M8l0R2q7mk6J43J7j10
$$ -11 145 105 89 -9 -35 -24 -21 41 23 -32 -39 22 -117 90 -39 65 43 -5 -42 6 -24 68 -19 -23 -49 94 111 1
6654AqoP7o1L1j26N4Q7m5q3R1K2N7j18N0n3K2jrJ2L6q4J81r8o8O4j60K43j62R0
$$ 1 -7 -13 64 3 34 -92 -38 49 4 -79 12 34 91 -27 23 -30 -8 -9 -18 -6 30 -54 127 29 -39 25 -135 108 -54 36
6684C6l8m0M1l3R2o9R3j42N5q4M1J37j24J19j15J15o0L5q1O8j08On6K1K3L8n3
$$ 36 -2 -42 -1 -34 58 -11 82 -60 -5 -89 -48 89 -35 84 -31 84 24 59 -22 46 -62 -56 -112 -91 -68 -30 -83
6711h3M2J93l31K05q8N0M7R6p4n3k3QJ7j11R4k9J9N8l5oOK4k7Pq3O2L8j5O4J7
$$ -83 -41 152 -179 26 -62 -12 35 131 57 4 -19 -11 6 -105 -11 -40 -21 37 2 -4 2 26 -1 6 -77 -15 23 8 72 89
6741H9j22O0J6m9L8n9Q0L4j82J77r5J01j26n8L2P9n1j28J15j2j3P7K2m3N0j43
$$ 89 -33 27 43 -6 32 -27 53 87 -95 82 -13 88 -38 -96 -64 15 -36 -164 -49 -61 -74 3 25 -18 32 -111
6767a11M2Q6Ql6R3k16K44j26R1J3j35K8ol5J0K0k9P5J0L1o2k1k5Q1j78K12j48
$$ -111 -69 17 25 -11 82 -134 110 -16 75 88 -47 -19 -25 -60 -50 -30 -59 16 26 57 -5 -26 -51 30 -148 64 -84
6794h4Q3M3r2R4j20Q8k1K3j9k9m3L5J22k25J59K5l7K2k6o3L5j7j2J17r4M5P8r2
$$ -84 -1 42 -50 44 -76 12 -9 14 -5 -34 -77 -42 80 -145 14 39 2 24 -2 -65 -30 -47 -59 58 -36 9 87 -5
6822eR5p3j0K0j08Q2Jpm3J01j25J02k0o6J33l7o1mK4m2Qo1M6N6N8l8l9n7J38j30
$$ -5 90 17 7 27 -81 1 2 -5 -48 53 -72 30 10 -56 77 40 -21 -25 -1 -43 -35 -96 -50 6 64 26 -13 -70 68 -62
6852f2K3M9k3r6J49k0m5J15j67N4n8J28q3J29j67J19j05J03j08J47q7m4R3n3n
$$ -62 -39 10 -13 -109 40 20 -25 90 -77 -23 -81 47 -36 93 -74 45 -60 43 -65 82 -5 -49 44 -9 -14
6877a4rk9J06j52J76j05M2j23J56m0j07J09L7M8j53J23j06P7J7j6m7L9m7Q3pj23
$$ -14 -23 -52 54 -98 78 -27 15 -108 48 8 -99 10 47 95 -58 65 -41 36 53 37 -10 29 -18 65 58 -65
6903f5O5N2m2JO3j50J38k29K40p1K4k5l1qj7L6M4o7L3J2M7q7RO2m8J03l0q8o1
$$ -65 0 52 10 11 74 -76 62 -167 73 2 26 1 -30 -38 -55 -19 25 -42 -9 3 50 -37 -28 34 -14 89 59 -29 -90
6932i0J83n9j27oK1N4n5O4m3jO2Ll6N5k4k6Q6j05K9kL3roj0j0N2R7k7q6o8O5p6
$$ -90 93 34 -93 -99 -78 -24 -79 -15 -58 -59 3 6 -30 25 1 -25 61 -44 -15 -17 16 7 1 -9 -19 33 130 103 17 -51 14 -62
6964f2O3oJ8p0J6M3nq5N0n0ML6J6J12j24P0n9Ml6J0N9L6r2N6LJ4m3P6l4K4o5q6
$$ -62 1 -5 13 -57 -41 2 -3 -88 -38 -88 -84 -48 -32 80 -44 26 -33 -29 -65 -55 4 40 -52 4 7 21 -22 54 20 44 -21 -107
6996a07J34p1J32q8k1K5k7P3q9O3L2o0L0J5l6P6j85N3Q6p9p8K2R0k4Jj5J17j7
$$ -107 27 -44 88 0 -21 4 -23 50 -39 24 56 -4 26 41 5 81 -104 -51 35 -44 -122 -100 -10 -34 -33 -48 69 52
7024E2j04M2qn2N8P9l5m0JKn3K4P2k09J45L0l4m9J59nn1j05JPJ67j06j1j4J5m6
$$ 52 -52 -10 -18 -70 -12 67 32 -8 -7 -5 -58 -34 38 -171 -26 4 -30 -79 80 75 24 -81 -80 -73 94 -12 -23 -37 -22 -68
7054f8n3J50p7l6K0P7l4N7m5P3o9o7N3oj4M6K2lpOo9JP4p9J14m2n4J1J7J15r8
$$ -68 -121 29 -48 -84 -64 13 -21 36 -9 64 -5 -72 -19 -25 -39 7 29 26 19 25 -44 -43 31 -48 66 24 -30 -19 -2 113 15
7085A5Q4j02o8l7J1J09K1l9Q9r2j3PM4p4R2j60R7l8J26j86J40P4j67K4m0J1k5
$$ 15 99 -3 -71 -108 -97 12 33 -6 83 -9 -22 -15 29 -45 47 -113 -16 -54 72 -114 26 100 -67 -43 -83 -72 -97
7112i7J01j12K29j85J68q2nj8j8O2M3j06J10j18%J13m8r2pJ52p3mn4JP9l4l6p6
$$ -97 4 -108 121 -64 104 22 17 -1 -19 43 86 -20 90 -28 -28 85 37 -55 -62 90 17 13 -41 -40 39 5 -31 -107
7140a07N0O7q0O9J6j08R4n6J57k09R2o3J22j24J45o0r9J27Ok4J2m2j0k8j7J16
$$ -107 -57 10 -70 -1 15 -93 1 -55 102 -107 -15 -78 44 -80 65 5 -94 33 39 15 27 -15 -25 -53 -70 46
7166D6o7J4R0L2j06J5k8j6l1J07o9O3j2o0J00q8J6R5k05J25o0P4k8J38j21j20
$$ 46 -21 -7 83 115 9 24 -4 -20 -51 56 -13 50 38 -22 78 -10 6 101 -104 21 -39 35 7 145 24 -96
7192i6J28K6o6o6M3O6j16N2j09J73o0J08j09M6j4q1N3J5o7P7j9L4j07K5K0J7N4
$$ -96 32 58 -8 -74 -31 35 -81 -29 -138 35 -25 83 -26 20 6 -75 -22 -7 -74 3 -16 18 -89 -64 -44 -27 27
7219B7n4O0K3Q2k44K8MM2K9p2J46M1n8j83M2J02j63J55K6p9J23r5KrknON4l9n
$$ 27 -27 33 56 138 -106 -78 -74 -32 -3 -75 71 112 54 -129 -87 15 -148 7 33 -46 77 -18 -16 -25 -27 -32 -26 28 -11 -16
7249a6J7M2o8O1K5j33j4P5K4m7m4J32j76J32Q9k70J68J44k22J18r0L5R1j35j7
$$ -16 1 43 -25 36 61 -72 -86 -11 13 -34 -78 54 -122 10 99 -171 -3 141 -81 37 -53 -18 73 -62 -79
7274g9L3M4kM4mq3M5Q0o3K8l1n0M3j11K07j26j1P6J1K6j5q5R2o8O2q5M3pJ14j41
$$ -79 -46 -2 -4 40 36 -47 -2 78 15 43 12 -38 5 -106 101 -25 -36 40 51 77 62 -23 69 1 63 -22 21 14 128 -13
7304a3J33j75m2J34k2K6j16n4J01P8J9J3k13J14m3N8L2M1Np9P0q8OJ58j67No2
$$ -13 120 -55 -97 37 15 41 -75 -129 -28 50 69 82 -131 -17 -60 -2 30 71 76 -3 67 -21 -15 143 -24 -19 -81
7331h1Q8L0m4k0n%j0J03j32K07j66Q0j14N0P2q6r7J03Q2m4K1J07k28J33j0J7N9
$$ -81 7 37 -7 -27 -32 -32 -42 61 -71 136 -30 50 -64 -14 58 -28 -125 -22 60 16 37 144 -84 49 39 56 115
7358A15j18k3%k0J05p7j5P4Nn7j17M6P0K7k6q3J48k6n7P3m8n5K3Qq0R2L6j44O3
$$ 115 -3 -26 -26 -46 59 -18 -33 41 46 -11 -128 -82 -12 15 -11 -94 54 28 -29 44 -4 -59 -36 -28 -108 -16 20 -124 -61
7387f1J05j08O7j12O7L1P9j95R5J3L7j3O5j41Q1pK8L2j45J95q8n9k4K5k0k9J42
$$ -61 44 -64 3 -109 -42 -11 68 -127 -32 -19 18 5 70 -71 10 3 31 63 -82 113 25 -34 -58 -33 -53 -82 60
7414F0m2j19J20k7M8q5J1L9K2k2Q8j38N6l8Q1Oln5K2o3n5J03K3r1N2l4J3J17j42
$$ 60 18 -101 19 -8 40 -45 -34 5 27 5 93 -45 11 -27 54 60 57 2 24 -39 -94 9 32 -59 -7 -41 -28 89 -53
7443e3n7O3p7J15N3N8k67J69J03j65k3J16m0K4K4q8P5p8j4J2R8k3K4j54J4N8q8
$$ -53 -110 -47 -124 -9 44 102 -165 4 107 -58 -81 35 -5 19 43 -45 30 -48 -62 -50 48 25 49 -105 -91 -33 -121
7470a21K30o3j04L9j2N1j04P7l2M9J5P2q3l4N9L5m8j8l2q6L7J10l8p8M3M7K6r
$$ -121 109 46 -58 -19 -31 20 -84 -7 -39 10 25 97 14 -20 39 74 26 8 -24 -110 -73 37 -1 -79 -36 11 37 28
7498B8j13L1K8L1R2o8j37J03L7n2J35r9J1o0j7j3J09l7p1J13k7M1r4L8N6j71J18
$$ 28 -85 -54 -26 5 97 29 -108 -5 32 -20 115 16 27 -33 -50 -63 46 9 -62 51 24 65 -29 9 65 -106 12
7525A2j2J2P7j10K8L3j29R2QM1j33J49j39r9J26K5P0j6r3O6j3J4M0p8K6oj8j5
$$ 12 0 12 89 -21 7 40 -89 3 11 52 -81 68 -71 -170 -44 -19 51 35 -58 8 -5 9 49 -29 -3 -9 -27 -42
7553d2O6Pj35L4P9l6q3J21L6rK2k9q4J9NP0o9rJ06j08k8K5jM3J1n1J19j72J1J81
$$ -42 24 31 -104 -70 9 -27 -110 11 47 38 60 31 -53 -34 -29 41 -28 -37 69 -39 -67 -42 -43 0 11 -40 79 -93 -82 99
7583I9j14K2N9j67L2J4oN3n4N0o6J8P1L1j27R2l7K4l0M9l3J1J15j60N2J04j85
$$ 99 -15 7 66 -101 -69 -55 -61 -8 -62 -12 -78 -60 11 42 -85 7 -30 -6 -36 13 -20 -9 106 -54 -2 102 -83
7610h3k2L6J03n3n0J5N3j41J10J17o4p0N8rm0rJ57j31N5m5K1O0J3m5j18N7k9J02
$$ -83 -105 -69 34 -19 -69 -54 -1 -142 -32 85 21 -49 9 0 -40 -49 108 -23 32 -13 8 68 81 36 -82 -25 -54 48
7638D8M0q3P3j04L4K5m3Klk6J31r2o4J4k8N1Q5j03Oj0o5J35K1k6l3J3j15J18l0
$$ 48 88 5 78 -26 8 33 -10 -8 -11 -37 94 2 -62 -48 -76 -25 60 -43 -37 -47 -112 23 44 18 -15 -2 -117 1 -29
7667b9n3J97k03J42p8J2M5p6J12k07K12j09j4N6J1qR2j16p5J55m9J1j6K3m4n6
$$ -29 -82 115 -88 54 -24 -12 33 -43 69 -138 74 -35 -49 7 18 10 102 -14 -89 66 17 28 12 35 -9 -65
7693f5J20j66J15k7L0k8o5K38j83K9ql2M4o6oJ33q3l3K6O5q5m6j7J67m1q0Q1K5
$$ -65 55 -111 4 -23 7 -21 -86 152 -31 -2 -10 -42 2 -64 -70 63 -20 -53 -27 38 -47 -93 -110 57 16 -64 17 42
7721D2n3L5p7J18l9l2L7l5l8N1k3r3K59j62o6P8j8K7J06k20J30k8o5M8J20l8j13
$$ 42 -11 24 -53 65 26 -6 31 -4 -42 9 -14 -107 152 -10 -76 2 -16 11 117 -103 27 -1 -66 -18 102 64 -49
7748d9Q0n7j8k0J0J8L2J69p2j22ro3J23Mj4k7k1KM6k0j19K38j42L5k8K9j4N3j23
$$ -49 31 -26 -44 -64 -54 -36 -4 165 93 -29 -38 -101 22 26 12 -15 -36 -34 12 -8 -127 111 -31 4 -24 5 -9 44 -79
7777g9J69j78OO0K7l0j9N1m0J53k15K24o5j87J10o7L7O4p4J35j12K04j08p3Qr6
$$ -79 90 -88 -82 -22 5 -25 -44 7 -33 120 -95 129 64 -123 -13 -80 -43 21 -53 82 -30 174 66 -7 1 -95
7803i5P5m6J8J38Lj51O6P0n6o7P4J8j00J25m8j50J02P0r5j4P8r5K13k12m3J90
$$ -95 -20 -66 -48 90 93 -58 8 78 22 -45 29 47 -53 72 24 -126 -24 46 -49 -63 15 -80 133 -79 -122 68
7829F8j0j03Q0l1o2l9L2M7j6O8P0k27K03J0J6m3j27J22j8l4k3p9P8J07K8j71k5
$$ 68 58 -45 35 4 -58 -97 -65 -18 -34 34 104 -123 80 90 106 63 -64 58 40 6 -17 -96 -18 89 117 -54 -79
7856g9nP2l5P6n3KQ5j3j8p6J38q4j19J64m1mo0P8j4O1j18M0k6lM0k1J9L6N8j00
$$ -79 -84 -12 -47 29 -24 -22 63 50 32 -44 94 10 -109 55 14 10 -50 28 14 75 -43 -3 -29 -32 8 -13 6 42 100 0
7886@Mq4K1j8O3J7%k5K6l5j7M9Kn9J23n4J0o8%J04m0j17N1q4J24O9j15J60j01
$$ 0 4 -80 -59 -77 -14 3 3 -22 4 -31 -48 1 3 -56 67 13 23 -45 -45 59 19 -98 -47 -131 -7 62 -53 107 6
7915FL9o8K1J0o6P8j9l0l3L1j9r2R4J35j91J73j29l1Q1m5J4j2Q2N6Po0j74J13
$$ 6 45 -23 -2 8 -58 20 1 -29 -62 -31 -50 -142 -48 87 -104 69 -60 -91 -10 -55 -41 -53 29 85 92 32 -142 -29
7943b9k2R2r6K9l8R2m2K5k7j50L35j77r0P4lMQ1p5PL8q6j4j1O3J54j73OK1q4J24
$$ -29 -51 41 -55 -26 -64 28 -14 11 -16 -166 169 -8 -98 -24 -27 -23 58 -17 -10 28 -58 -72 -83 -20 134 -39 -33 -12 -96 28
7973B8O2j69J59n9j8q8L1n2K08j19n3J37o6q9J12P8j59n3J09l2P0J2j7L1Rk6j20
$$ 28 90 -79 80 21 3 -85 -54 -106 102 -17 -70 67 1 -88 24 102 -57 -110 -1 -33 37 49 32 63 72 46 -74
8000g4J28J4l7L0l7q7P2K3j63J22m6Q7K1j17R3j07J04kk2R8j78K4J16o4J2mL6
$$ -74 54 68 31 61 24 -63 9 32 -131 -9 -55 32 53 -64 29 -78 26 24 2 100 -78 -54 62 -2 10 6 42
8027D2m1K6r9J1KO8k6q1N7M9M6m3rJ59k67N3mR9j03L2L4N2j09J10L3j22qJ4o6
$$ 42 1 27 -72 -61 -59 9 -17 -98 -41 8 54 11 2 161 -106 -53 -57 42 -61 -29 5 57 -52 58 91 -31 -39 -25 -91
8056i1O2r7J13O7j3m4k8N6p7J28n9M3nq5J8%N7q5M6m7j07R3J19r5M1L5J7m8q9
$$ -91 -29 -126 -13 54 41 -3 -31 25 -52 76 17 60 55 -30 -12 -12 45 -40 6 -41 -148 -55 64 -31 10 45 62 14 -75
8085g5R2l3J95j70k5NJ47j07L0l8N9j11m4Q6j09J82m1n0m4M3L6m6OO8j04N0K2
$$ -75 17 -16 179 9 -16 -11 136 29 59 21 80 -31 -75 11 -98 84 43 -7 -51 -8 28 -18 -12 56 -48 2 24
8112B4M9n6j9J68j32K4mn6l5JR5J4o0q3J7J30j01o1K5P9nq0nK01j14r1m3R7J03
$$ 24 73 17 -2 166 34 58 54 -2 -37 -36 59 73 13 -70 -53 77 -24 -85 -60 19 14 -66 -71 130 16 -75 -118 -21 82
8141H2k2lk8j04J92k8k3q8L1m5J07J1j03K3kn1K9lL7k0N1k1q4N0L3j26K9R2L2
$$ 82 60 57 29 -75 117 89 66 -22 9 -36 71 82 -21 2 0 -51 -22 -25 12 -8 43 22 -62 -12 21 -105 -76 16 48
8170D8j15K1J2p7K6J23P0n3p2j40J77n7K8N2J1j50l2K11l5l4M3
$$ 48 -67 -46 -34 -111 -85 38 108 55 -17 -157 20 -37 -9 43 54 -96 -128 83 48 14 57
8191E7
$$ Imaginary data points
##PAGE= N=2
##DATA TABLE= (X++(I..I)), XYDATA
0@%%%%%%%%%%%%%%qJ6j6J6j6K4l2L2m0M8n6P2q1Q9j04J20j39J63j84K08k37K64
$$ 0 0 0 0 0 0 0 0 0 0 0 0 0 0 0 -8 8 -8 8 -8 16 -16 16 -24 24 -32 40 -41 48 -56 64 -75 88 -96 112 -125 139
36A39k98L36l74M16m62N16n74O35p04P80q60R46j043J150j267J397j539J696j874
$$ 139 -159 177 -197 219 -243 273 -301 334 -370 410 -450 496 -547 603 -664 733 -806 890 -984
55i84K074k300K559k859L213l634M144m783N609o722Q310j0781J5183k5373R3463
$$ -984 1090 -1210 1349 -1510 1703 -1931 2213 -2570 3039 -3683 4627 -6154 9029 -16344 77119
70G7119L0864j80828j1057P7783N7393m9363l9618J4476K4125N195L0706j1332
$$ 77119 107983 -72845 -83902 -6119 51274 1911 -37707 -23231 894 6089 36795 25463
82B5463m1877j3168L1291K9054j1281l8871J382P146r49K2845J1716k9085j8982
$$ 25463 -16414 -29582 1709 30763 19482 -19389 -18007 -10861 -11810 11035 22751 -6334 -25316
95b5316J3504L5129J899l6378m404J9999m932L214J0562j0517k2956j0930K8472
$$ -25316 -11812 23317 25216 -11162 -15566 4433 -499 2715 13277 2760 -20196 -31126 -2654
108b654L5399j5370k1732l13m998J0165K0075r907l3735j9667M2656N8691l3162
$$ -2654 32745 17375 -4357 -4670 -9668 497 20572 10665 -23070 -42737 -81 58610 25448
121B5448p1690R314O1720K2889m6300m4298K5889L4956m677o827r198j2226O828
$$ 25448 -46242 -36928 24792 47681 1381 -42917 -17028 17928 13251 6424 -2774 -15000 -8172
134h172J4104J2822q313k9813O67K2141O715M175r823k0309L159J6708J3095q622
$$ -8172 5932 18754 10441 -19372 -18705 3436 10151 14326 4503 -15806 -12647 4061 17156 8534
148H534l1622K462L4219O314j3030j2836n458R575K638J833Q265j4730j2502J4865
$$ 8534 -23088 -20626 13593 19907 6877 -5959 -11417 -1842 796 2629 10894 -3836 -16338 -1473
162a473J1581K459q038j7679J72J0789J3605J1596k5819l0247J9732L5195O794
$$ -1473 10108 12567 4529 -13150 -12978 -2189 11416 23012 -2807 -33054 -13322 21873 28667
175B8667k8693l0410J7911L0524m266j2732j0784l719J4376Q417J403m810k0102
$$ 28667 -26 -30436 -12525 17999 13733 1001 -9783 -13502 874 9291 10694 5884 -14218
188a4218m10K0270N810k857j2865j4550J3293J8961L801j1066k6291k14L0080
$$ -14218 -14628 5642 11452 8595 -4270 -18820 -5527 13434 17235 6169 -20122 -20336 9744
201I744Q108j2566j4983o016J7291J1753o883m700j0548l000J6434M236n969p248
$$ 9744 17852 5286 -9697 -15713 1578 13331 6448 1748 -8800 -11800 4634 8870 2901 -4347
215d347q168J1793J3940m726n866j1384o573J6818J0049o241j0150q662J4477
$$ -4347 -12515 -722 13218 8492 2626 -8758 -15331 1487 11536 5295 -4855 -13517 960
228I60J6898j1708j3013l686K181J3838K894p280r15o447K461J2428l443o287
$$ 960 17858 6150 -6863 -10549 -8368 5470 8364 1084 169 -6278 -3817 8611 5168 -1119
242a119m402m995J1968R005o881n307q137M379J9967k335j6881r840J197J9916
$$ -1119 -5521 -10516 1452 10457 3576 -1731 -9868 -5489 14478 12143 -4738 -14578 -13381 6535
256F535R828j4953p101K99N063J1949p013j4548o99M065J4263P929j4312p412
$$ 6535 16363 1410 -5691 -5392 -329 11620 4607 -9941 -10640 -6575 7688 15617 1305 -6107
270f107R24K094J0565k100j1598j003J212J0673J0696j2606j1318K070N093J0409
$$ -6107 -5183 -3089 7476 5376 -6222 -7225 -6013 4660 15356 2750 -8568 -6498 -1405 9004
284I004l540j3920J385M045O540R496r223j0212J198J157Q543J667j1511k81L211
$$ 9004 5464 -8456 -7071 -3026 3514 13010 3787 -6425 -5227 -4070 4473 6140 -5371 -5652 -2441
299b441M642J0891o769j3896j693K976J2121N065j5484m536P714O718O760r818
$$ -2441 2201 13092 6323 -7573 -9266 -6290 5831 10896 -4588 -9124 -1410 5308 12068 2250
313B250j3566M586N503O334K414j2454j820Q725K242L327n862j0899L341L722
$$ 2250 -11316 -6730 -1227 5107 7521 -4933 -6753 1972 4214 7541 1679 -9220 -5879 -2157
327b157N203O925j0012p698N656M285O351m472j4438K895Q401L788L003r761n858
$$ -2157 3046 9971 -41 -7739 -2083 2202 8553 4081 -10357 -7462 939 4727 7730 -2031 -7889
342g889Q672L230J440l637j1665L666Q948J038K846o761p536O465L626K571p78
$$ -7889 783 4013 5453 1816 -9849 -6183 2765 3803 6649 -112 -7648 -1183 2443 5014 4236
357D236j3099J32J1522L667J206q754r117R090O217j243j711r708J234J0549j72
$$ 4236 -8863 -8731 2791 6458 7664 -1090 -10207 -1117 5100 3857 2146 -7562 -6328 4221 4049
372D049n82l917o715O928M319k204R33p809k948R834L005J163m372j1084N467
$$ 4049 3467 -450 -7165 -237 4082 1878 2811 -4998 -7946 1888 4893 6056 1684 -9400 -3933
387c933R522r61j974r084k644J2570L458l024l754q036M995Q670l098k038n082
$$ -3933 5589 4628 2654 -6430 -9074 3496 6954 3930 176 -7860 -2865 5805 2707 669 -4413
402d413k773J0347K997l193j626q188K340R666j442k975n121l737J1213N425n900
$$ -4413 -7186 3161 6158 2965 1339 -6849 -4509 5157 3715 740 -4381 -8118 3095 8520 2620
417B620l232o029K598J0037l389m478r60k473Q338L884n929o94l686j848P837
$$ 2620 -612 -6641 -4043 5994 2605 -1873 -2833 -5306 3032 6916 987 293 -3393 -5241 2596
432B596j81k827k22m877N549Q975o147l947m138j630J1662J02n420p86l731N976
$$ 2596 2415 -412 -634 -5511 38 9013 2866 -1081 -5219 -6849 4813 4915 -505 -1291 -5022 954
448I54P090n821m815k332j420J0431J408o679m87k238L621Q437o359n894K96k384
$$ 954 8044 2223 -2592 -4924 -6344 4087 5495 -1184 -1671 -3909 -288 8149 1790 -4104 -3808 -6192
464f192R069L621o769o13j724L267P045p247n922M92J996P661J705q396o12J938
$$ -6192 2877 6498 -271 -884 -2608 659 7704 457 -5465 -4973 -2977 4684 6389 -2007 -2619 -681
480f81M3M531k676m556J332k104N059O678o002m102L55P57O748l154p277J533
$$ -681 -638 3893 1217 -3339 -2007 -4111 948 7626 1624 -2478 -2123 -1366 5382 2228 -5049 -3516
496c516M60M861O096o814k996N53j457O798k52q870P71K797M655N930q165o121
$$ -3516 -3056 1805 7901 1087 -1909 -1356 -2813 3985 3733 -5137 -4366 -1569 3086 9016 851 -5270
512e270K759N13N254Q32q140Q78K630K020N437o001o703L305K013M367k93r151
$$ -5270 -2511 -1998 3256 4088 -4052 -3174 -544 1476 6913 912 -5791 -2486 -473 3894 3601 -5550
528e550J708O168Q7J928l964m282L753o90nL972n046r26M045L65L480l440q169
$$ -5550 -3842 2326 2413 4341 377 -3905 -152 -842 -847 3125 -1921 -2847 1198 1563 5043 1603 -6566
545f566L878L091J077K619n530j957M481r92L017o14p225J912L259N95K991o098
$$ -6566 -2688 403 1480 4099 -1431 -3388 1093 101 3118 2504 -4721 -2809 450 1045 4036 -2062
561b062l233O489J651J089k006p317K269M752m51J327m041j540M758P43j6j082
$$ -2062 -5295 1194 2845 3934 1928 -5389 -3120 1632 1181 2508 -1533 -3073 1685 2428 2412 1330
577A330p537K594P496r50j042l360l432O729O39k493J394m640P82M795j965J346
$$ 1330 -6207 -3613 3883 2933 1891 -1469 -4901 1828 2467 -26 1368 -3272 -2490 2305 340 1686
593A686j512m281N194K424k993M32m295k20P329k221j589J358m868L324L101k754
$$ 1686 174 -4107 1087 3511 518 950 -3345 -3565 3764 1543 -46 1312 -3556 -232 2869 115
609A15m49k100j877O992J66j572n61m705L380M507l728n72k018j882O810R52k861
$$ 115 -334 -2434 -4311 2681 2847 1275 714 -3991 -611 3896 168 -404 -2422 -4304 2506 3458 597
626E97L25m375K088N616l958j647r76j332O819R54m767P60k470J050N379m066
$$ 597 922 -3453 -1365 4251 293 -1354 -2330 -3662 3157 4111 -656 104 -2366 -1316 4063 -3
642ck500J020j604N495K840n554K11j485k57N043l378k651K435j032L399K282
$$ -3 -2503 -1483 -3087 2408 5248 -306 -95 -1580 -1837 3206 -172 -2823 -388 -1420 1979 4261
658D261m572j96q76j868N030o39k653J749k220K971L836n122j618M95r35M912
$$ 4261 -311 -507 -1383 -3251 1779 1140 -1513 236 -1984 987 4823 -299 -1917 -1422 -2357 2555
674B555l76m930J955m15K265M142n300k755J536j005M188J102o238L494P19N98
$$ 2555 2179 -2751 -796 -1211 1054 5196 -104 -2859 -1323 -2328 1860 2962 -3276 218 937 1535
690A535L896o306l943L640p05L640J346n273J600J768j130K526l731k505M051
$$ 1535 5431 -875 -4818 -1178 -1883 1757 3103 -2170 -570 1198 68 2594 -1137 -3642 409
705D09p23J052J867m677J229K148j847L082j821m172K845l46J079L523m301q03
$$ 409 -314 738 2605 -2072 -843 1305 -542 2540 719 -3453 -608 -954 125 3648 -653 -1456
721a456K333r91K884j857n854L077K403R48K591m932j865L557q49J287o58m817
$$ -1456 877 -114 2770 913 -4941 -1864 539 1487 4078 -854 -2719 838 -11 1276 618 -4199
737d199L515K703r76J521m006j456M738r79l57M74m696K492K699q96K131l347
$$ -4199 -684 2019 1043 2564 -1442 -2898 1840 861 504 978 -3718 -1226 1473 577 2708 -639
753f39k476M740j048j345J634l398J074L372j142J940j395m569K756N20m40K481
$$ -639 -3115 1625 577 -768 866 -2532 -1458 1914 772 2712 1317 -3252 -496 24 -416 2065
769B065l780l69M135j132P46r95m777L797K585k005N41l487N9N822j314j293l53
$$ 2065 -1715 -2084 2051 919 1665 670 -4107 -310 2275 270 811 -2676 -2617 3205 1891 598 245
786B45l601L377K544l374N77j221m53N358j552k284J061l369J626K859l051J742
$$ 245 -3356 21 2565 -809 -232 -1453 -1906 3452 1900 -384 677 -2692 -1066 1793 -1258 484
802D84m5k343L855m70k198J742k940R6L654k330P23M19l311L817J502k785N74
$$ 484 439 -1904 1951 1481 -717 1025 -1915 -1819 1835 -495 228 647 -2664 1153 2655 -130 444
819D44k961j26N093j813r32O96k545L781J777m287k02j167J08N155k043k330J876
$$ 444 -2517 -2643 2450 637 -295 401 -2144 1637 3414 -873 -1075 -2242 -2134 3021 978 -1352 524
836E24j433K199J512m913P68O74r61L813j359k279K872j635J04J978l506Q02J130
$$ 524 -909 1290 2802 -2111 -1343 -669 -1630 2183 824 -1455 1417 -218 -114 1864 -1642 -840 290
853B90k317L166M81k267K039k081n66L618k794r96Q68j956L976J724l882O73o40
$$ 290 -2027 1139 1620 -647 1392 -689 -1255 2363 -431 -1427 -559 -2515 1461 3185 -697 -24 -664
870f64k40L762l475k368K706n94K820J130m614Q24J077j232K565k496k072L555
$$ -664 -904 2858 -617 -2985 -279 -873 1947 3077 -1537 -713 364 -868 1697 -799 -2871 684
886F84m95Q39J510m008P57J564k219K203q25k216L250o87l77K594l315r9J671
$$ 684 189 1028 2538 -1470 -713 851 -1368 835 10 -2206 1044 357 -20 2574 -741 -840 831
903H31k703J934R47k920K414k11n78L378k985k279J955j252K361J066m389J770
$$ 831 -1872 62 1009 -1911 503 292 -286 3092 107 -2172 -217 -1469 892 1958 -2431 -661
919f61J828o44K150l411k551L833m64J77R15l538K193K540k486J268j647j884
$$ -661 1167 523 2673 -738 -3289 544 80 257 1172 -2366 -173 2367 -119 1149 -498 -2382
935b382L423j264r79K409j943P70K023k791J417m4l082K493o5r04K997k230p11
$$ -2382 1041 -223 -1202 1207 -736 34 2057 -734 683 639 -2443 50 -15 -919 2078 -152 -863
952h63K477k014O54N06l527K254J240j279K762k117j848L257j251m3O17m020K182
$$ -863 1614 -400 254 760 -2767 -513 727 -552 2210 93 -1755 1502 251 208 825 -3195 -1013
969a013L054j923J047j781j213M120j292k284R66k049K117K829l160R30J84j643
$$ -1013 2041 118 1165 -616 -1829 2291 999 -1285 -319 -2368 -251 2578 -582 348 532 -1111
985a111K965j637k298K683j305l9K354k220J482J021l541J505N21j698K206j901
$$ -1111 1854 217 -2081 602 -703 -742 1612 -608 874 1895 -1646 -141 380 -1318 888 -1013
1001a013p08L633j117m84O34k932J873J513k791J428o89q45L949j191j524R24
$$ -1013 -1721 1912 795 311 945 -1987 -114 1399 -1392 36 -653 -1498 2451 1260 -264 660
1017F60k699J342K596k886L84L36r22L706j031k806J692j491O65J965l266R99
$$ 660 -2039 -697 1899 -987 -603 -267 -1189 2517 1486 -1320 372 -1119 -454 1511 -1755 -756
1033g56J786j582K120o44k665K506j053j084K230j853O37J932k764J737J235k655
$$ -756 1030 -552 1568 924 -1741 765 -288 -1372 858 -995 -358 1574 -1190 547 1782 -873
1049h73J102j292j091L843j054j399J535j664J724J584l807N86N09j314L031r86
$$ -873 229 -1063 -2154 1689 635 -764 771 -893 831 2415 -1392 -806 -297 -1611 1420 434
1065D34j695K513j073J6J643l388K66J428j371K462l70k449K532n63m98J764l049
$$ 434 -1261 1252 179 195 1838 -1550 -1284 144 -1227 1235 865 -1584 948 385 -113 1651 -1398
1082a398j67K169j672J745N61k425K228k30j855K120j976n62K392j991J275J770
$$ -1398 -1565 604 -1068 677 1238 -1187 1041 811 -1044 1076 -900 -1462 930 -1061 214 1984
1098A984k646R48L6j576K475j396j982K547o88J006J542l480O30J702j806J417
$$ 1984 -662 286 322 -1254 1221 -175 -2157 390 -298 708 2250 -1230 -600 1102 -704 713
1114G13j042k206L209j54m81J841k484J9J817k411J064M37k317K517L07j039K015
$$ 713 -329 -2535 674 520 39 1880 -604 -585 1232 -1179 -115 322 -1995 522 829 -210 1805
1131A805k082j030K282j839O28Q77k273J998R44j663J748j339j412K191j562M3
$$ 1805 -277 -1307 975 -864 -236 641 -1632 366 1310 -353 1395 56 -1356 835 -727 -684
1147f84J732k354J292J544j734J640j200k341K415n29m48J756k051P88K262k190
$$ -684 1048 -1306 -14 1530 -204 1436 236 -2105 310 -219 -667 1089 -962 -174 2088 -102
1163a02M47l99k151K562Q4j499K054j515J9K409k229L29O00k427J709O19j493
$$ -102 345 -54 -2205 357 441 -1058 996 -519 -500 1909 -320 9 609 -1818 -109 510 -983
1180i83K053r25j035K606j546o13J050k547J452J595j816J535k04j401K370j432
$$ -983 1070 145 -890 1716 170 -443 607 -1940 -488 1107 -709 826 622 -779 1591 159
1196A59j353J508j735Q17K067k044J182K35j987K249o26j684J656j510K55K508
$$ 159 -1194 314 -1421 -604 1463 -581 601 836 -1151 1098 472 -1212 444 -1066 -811 1697
1212A697j959M78Q82k037J570N6k230J634p06m07K653j370k45J070k154J183O88
$$ 1697 -262 216 1098 -939 631 687 -1543 91 -615 -1022 1631 261 16 1086 -1068 115 803
1229H03k305J584j85r14K710j162j127J629j877N04J442k265P53P35j274K382
$$ 803 -1502 82 -103 -1017 1693 531 -596 1033 -844 -340 1102 -1163 -410 325 -949 1433
1245A433o11j537J563j400k55J905k154L74J429j598K054n0k052J422r88o98K005
$$ 1433 822 -715 848 -552 -807 1098 -1056 -682 747 -851 1203 1153 -899 523 -465 -1163 842
1262H42j580M0J829j692J293O88k503J286l12j332K356r43q46J927j400P76J176
$$ 842 -738 -698 1131 -561 732 1420 -1083 203 -109 -1441 915 -28 -874 1053 -347 429 1605
1279A605k649O88N27j447K039q00j170K460j025j24J224k396N05J066j813J676
$$ 1605 -1044 -356 171 -1276 763 -37 -1207 1253 228 104 1328 -1068 -563 503 -1310 366
1295C66N0j347K009o75o87J483j954k93J330j271J311P78k060J651p3j232J538
$$ 366 416 -931 1078 403 -284 1199 -755 -1048 282 -989 322 1100 -960 691 618 -614 924
1312I24j554p24K084j373O54J296j895J180K57j802J563q50j188J924p37J78J508
$$ 924 -630 -1354 730 -643 11 1307 -588 592 849 -953 610 -240 -1428 496 -241 -63 1445
1329A445k055N61J149j768J023n21j601K354k34o42J659j683P6J421k088P29M14
$$ 1445 -610 -49 1100 -668 355 -166 -1767 587 353 -289 1370 -313 -237 1184 -904 -175 239
1346B39j551J796P6q79J728j316p83J457j656N98P45j741J554Q24j334J214j047
$$ 239 -1312 484 560 -319 1409 93 -690 767 -889 -291 454 -1287 267 1091 -243 971 -76
1363g6q27J741j330M69Q41j856J251Q82j433P34k44j259J519q71n03J845j494
$$ -76 -903 838 -492 -23 818 -1038 213 1095 -338 396 152 -1107 412 -459 -962 883 -611
1380f11M24J636j624N62p1j874J841r3j223J518o86O3J664j802n9Q55j709J248
$$ -611 -187 1449 -175 387 316 -1558 283 190 -1033 485 -201 -138 1526 -276 -335 520 -1189 59
1398E9K43j443J862m69q77J860j239k81R82k036Q56J154j416J261k01r98K095
$$ 59 302 -1141 721 252 -625 1235 -4 -285 697 -1339 -483 671 -745 516 315 -683 1412
1415A412j184j214J295j221N52J334j831J119N99j364J273p68j048J585j199k15
$$ 1412 228 -986 309 -912 -360 974 -857 262 861 -503 770 2 -1046 539 -660 -875
1431h75J865j277M64P21j699J317L25k022J158n02l60K046j130l43J255j396O38
$$ -875 990 -287 177 898 -801 516 841 -1181 -23 -525 -885 1161 31 -312 943 -453 185
1448A85K78j891J417J73j085J835o98n52J321j448J08J010j703P06O06r90J822
$$ 185 463 -1428 -11 162 -923 912 214 -338 983 -465 -357 653 -1050 -344 262 -728 1094
1465A094m07j285J268q84k06J161j910P20J191j132J053p8j277J591q74j018J501
$$ 1094 687 -598 670 -214 -420 741 -1169 -449 742 -390 663 585 -692 899 25 -993 508
1482E08j095J15J213j381R93Q78j878P11k0q64J505j020p87J919o97L76M77j915
$$ 508 -587 -472 741 -640 353 1231 -647 64 44 -820 685 -335 -1122 797 100 476 953 -962
1500i62Q95O45j517J065k67o38J880r42m49J249j308P5N88j419J322K55j223J395
$$ -962 -67 578 -939 126 -141 -779 1101 159 -290 959 -349 -274 314 -1105 217 472 -751 644
1518F44k56n35J231j669l10J308j000O52M77j279J444m7j246J295r50n87J205
$$ 644 388 -147 1084 -585 -895 413 -587 65 542 -737 707 660 -586 709 -241 -828 377
1535C77j038M77J218j353N04N76j232J031p87j116J796m40j80R95j386Q57Q06
$$ 377 -661 -184 1034 -319 185 761 -471 560 -227 -1343 453 13 -167 828 -558 299 1105
1552A105j748M53M7p82J624p28o40J635o99k57P23j505O60O08j641J058L22m13
$$ 1105 -643 -190 -143 -925 699 -29 -669 966 267 10 733 -772 -112 496 -1145 -87 235 -178
1570a78J414j221n31J283j058m3N08j308J318P80j269J026m76q56J290j093l50
$$ -178 1236 15 -516 767 -291 -334 174 -1134 184 964 -305 721 245 -611 679 -414 -764
1587g64J205j144P29J009j333Q35j01j319J374o16p15J157q65M41J278j433J49
$$ -764 441 -703 26 1035 -298 537 436 -883 491 -125 -840 317 -548 -107 1171 -262 -113
1604a13N39j062Q64m28q61J626o10l9Q84r99K82P41j661N18M43p08J172m79p10
$$ -113 426 -636 228 -200 -1061 565 -45 -84 800 -199 83 824 -837 -319 124 -584 588 109 -601
1623f01J658o21p14O31j342P78R31j508P34L90n30J363j058j061J245p73J76Q69
$$ -601 1057 436 -278 353 -989 -211 720 -788 -54 336 -194 1169 111 -950 295 -478 -302 567
1641E67j282Q12O80j159Q61k04j044J145p25k77J235r33K23R51j075N84K0j330
$$ 567 -715 97 777 -382 479 275 -769 376 -349 -626 609 -324 -101 850 -225 359 379 -951
1659i51J074k70o75J433o41N7Q96j236L56N09j190N57j00o53J552j36p88P89r24
$$ -951 123 -147 -822 611 -30 27 923 -313 43 552 -638 -81 -181 -834 718 582 -206 583 -341
1678c41K50R96j790K89Q10o30J199m90r76J359l39o36N49j154M72J220j267N83
$$ -341 -91 905 -885 -596 214 -416 783 293 -683 676 337 -299 250 -904 -432 788 -479 104
1696A04M94r61J081o53r79J190n20j78R80r90P01P18j291O60k82q76J096l93n91
$$ 104 598 -363 718 65 -914 276 -244 -422 558 -432 269 987 -304 356 74 -802 294 -99 -690
1715f90J298q01K61P62j174L49L17j182J033j90o67J255m23k86J125j494J14P84
$$ -690 608 -193 68 830 -344 5 322 -860 173 -17 -684 571 148 -138 987 -507 -393 391
1733C91r52N12P1q96J518n7q02O45r48K95Q65j316K83Q18o44P86j66r95J067m47
$$ 391 -561 -49 22 -874 644 587 -215 430 -518 -223 642 -674 -391 427 -217 569 403 -592 475 28
1753B8n48P72j018M22J146j229N68M97r46P35m25j058J179j82k06R25j046N47
$$ 28 -520 252 -766 -344 802 -427 141 638 -308 427 2 -1056 123 -59 -265 660 -386 161
1771A61Q03j247K85N1j020J352k61p11J161m76k07Q62j099J98K24r16R48K31o43
$$ 161 964 -283 2 53 -967 385 124 -587 574 98 -109 753 -346 -148 76 -840 108 339 -304
1790c04R06m26n24J030j000j37P14q49P14J38p80J081M2j004P29o42k77J040j070
$$ -304 602 176 -348 682 -318 -455 259 -590 124 262 -518 563 605 -399 330 -312 -589 451 -619
1809f19L63Q94p24O13j89j049R63q6o75N71n47K61J200j164R7M48q42P83k58q62
$$ -619 -256 638 -86 527 338 -711 252 166 -509 62 -485 -224 976 -188 -91 357 -485 298 40 -822
1829h22J149j47m79R53q69J09P55r80K11K67q36R31j58m91J186o36l88O93j010
$$ -822 327 180 -299 654 -215 -106 649 -331 -120 147 -689 242 84 -407 779 143 -245 448 -562
1848e62K80N86j023Q52M34q27P32k74o71R70q88k31J059p95N32K59r08R71N1j105
$$ -562 -282 304 -719 133 567 -260 472 198 -473 497 -391 -622 437 -358 174 433 -475 496 547 -558
1868e58P42m63j69R40p89J0Q44n48N15k78j040R74j04o11P58m23K6J145j112O9
$$ -558 184 -279 -448 492 -297 -287 557 9 524 246 -794 180 76 -535 223 -200 -174 971 -141 -72
1888g2N13r51O16j24p28J243k03n47P82n58K5N33j175L81N89p73P86j77o34J105
$$ -72 441 -510 106 -18 -746 497 294 -253 529 -29 -4 529 -646 -265 324 -449 337 160 -474 631
1908F31n02n34O47p40K58O29p95O14L69q67O73k80o76R52o71l50J056o82M57K88
$$ 631 129 -405 242 -498 -240 389 -406 208 577 -290 383 103 -573 379 -292 -642 414 -268 189 477
1928D77q83O47J75r38M91k55j60R97o77o0Q08p85J82K30j031Q44R6r14J090l10
$$ 477 -406 241 416 -522 -31 -286 -446 551 -126 -186 622 -163 19 249 -782 62 158 -756 334 24
1948B4j03Q76j026j88P76p86L64J60o77R87J7o79Q64p02j85O53r07K42O43p92
$$ 24 -79 797 -229 -417 359 -427 -63 97 -580 407 424 -255 609 -93 -278 375 -532 -290 353 -439
1968d39P05K10q32R48m53q42Q76m67O8P13r21O14N37j012M17j2o42R16n52l74
$$ -439 266 476 -356 592 139 -703 173 -294 -226 487 -434 180 717 -295 122 110 -532 384 -168 -542
1988e42J017m42kO18j135N00L38r64O35r6l44J033o16j91Q37p88k3L33q60P31
$$ -542 475 33 31 649 -486 14 352 -612 23 -73 -417 616 0 -191 646 -142 -165 168 -692 39
2008C9J78p09Q71j34l95P64p63k45P27q40M17L67n48P68j06p55P02m26k73O38
$$ 39 217 -492 379 245 -150 614 -149 -394 333 -507 -90 277 -271 497 391 -364 338 -88 -361 277
2028B77p78L61P69q45M49R2o72P42l62p70Q20k54p1P99p61K84N56r66L58j77m47
$$ 277 -501 -140 629 -216 233 325 -347 395 33 -737 83 -171 -242 557 -204 80 636 -330 28 -149 -596
2049e96R17m06l07J116o26j58M89q61K83L25r28P29J36m37R44m88m66Q91p99j0
$$ -596 321 -85 -392 724 98 -60 429 -432 -149 176 -752 -23 113 -324 620 132 -334 557 -242 -252
2069b52L83q03Q12K21p56Q10o5o32O94q15j54R33p27J60N20o85Q67j74p42N76
$$ -252 131 -672 140 361 -395 415 350 -282 412 -403 -557 376 -351 -191 329 -356 511 337 -405 171
2089A71k84l19P37o57J30Q63p44K69K96q01M86j3p10Q64k82j61O40o13K21L92
$$ 171 -113 -432 305 -352 -222 641 -103 166 462 -339 147 134 -576 288 6 -155 485 -128 93 485
2109D85r93K05L97o33P40j44n15J060n75p5N10j011L14N20r15O23K86m65O08m14
$$ 485 -508 -303 94 -539 201 57 -458 602 27 -48 462 -549 -235 285 -630 -7 279 -186 422 8
2129Hl48Q13q08j13O30n38N79J49q39O83J82o73N43o46q8Q51o14M8O33p09N23
$$ 8 -340 473 -335 -448 182 -356 223 372 -467 216 398 -275 268 -378 -466 385 -229 -181 452 -257 266
2150B66K1q25O84j44l73O71m23M3P40q28J97K87p65N02N7q49J009p7l66O48n93
$$ 266 287 -538 146 2 -371 300 -123 -80 660 -168 29 316 -449 53 110 -739 270 193 -173 475 -118
2171a18N8M01q25J74M69n98O87n4m18P71n04k61L92m95J47M38o09M67M02q08P53
$$ -118 -60 341 -484 -310 159 -439 248 194 -224 547 43 -218 174 -321 -174 264 -345 122 524 -284 469
2192D69m44l98O47m79k19O90m36L05K54p29N49L6p35N56k90k11R73p00J45N48
$$ 469 25 -373 274 -205 -424 266 -170 135 389 -340 209 245 -490 66 -224 -435 538 -162 -17 531
2212E31p31L13L3p62O63Q0o04Q23l21j18P68q72O9L88p52M04K51n72P90j06m99
$$ 531 -200 113 146 -616 47 127 -477 346 25 -93 675 -197 -128 260 -492 -88 163 -409 381 275 -224
2233b24O33m75k15N94p70L45L70n89N97o8m86P05l21n39N96m57J00N54n39M06
$$ -224 409 -66 -281 313 -457 -112 258 -331 266 198 -288 417 96 -443 153 -304 -204 350 -189 217
2253B17J72o37M95j98o17Q24m94q9Q07n75J27M45q19N47N8q01N74p9k67Q33n60
$$ 217 389 -248 247 49 -568 256 -238 -327 480 -95 32 477 -342 205 263 -538 36 -43 -310 523 -37
2274c7j37P21o99J57J30p70P37O8n95P45j19l60N99n73j46M84n90L65J96m43N83
$$ -37 -174 547 -152 5 135 -635 102 170 -425 320 201 -159 440 -133 -279 205 -385 -20 176 -267 316
2295C16L7o46N88l31k82N47n62J61N56o68M76J20o12O45l12n78O34k68N0M69n60
$$ 316 353 -293 295 -36 -318 229 -333 -172 384 -284 192 312 -300 345 33 -545 89 -179 -129 340 -220
2316b20M38K13p78N22j89l66N88k59k82R57p01P6M19p35K61K52o20M72J24m21
$$ -220 218 431 -347 175 -14 -380 208 -51 -333 624 -77 -1 418 -317 -56 196 -424 48 172 -249
2336b49P88m61k48O69p41P7K74o30N82J59m61O49k14m34N58m94j11O23o63K90
$$ -249 539 78 -170 499 -242 -165 109 -521 61 220 -241 408 194 -240 318 -176 -287 336 -327 -37
2356c7L23n11N08P1p49O77l29l86P50n58K19N55o87K54L11p43M62k03m86P74k62
$$ -37 286 -225 283 354 -395 282 -47 -433 317 -241 -22 533 -154 100 411 -332 130 -73 -559 215 -47
2377d7j5M46l76j8L34o15J79J41n58P52j06k77P06o29j26N54o83J87K53n70O25
$$ -47 -62 384 8 -10 324 -291 -112 29 -529 223 117 -160 546 -83 -209 345 -338 -151 102 -468 157
2398A57J03m40M11k29k60O18q04J53N87o03M67J82n72N13m6n25M37k67j92N27
$$ 157 260 -180 231 2 -258 360 -444 -291 296 -307 160 342 -230 283 237 -288 149 -118 -310 217
2418B17n01J89N28n00K72N0o69O50j53m40N61l75J55N34n85O2L01o99M82q4l10
$$ 217 -284 -95 433 -67 205 255 -414 236 83 -357 204 -171 -16 518 -67 -5 296 -403 79 -5 -315
2439c15O92k85j67M72m73K7K24n00K37K02m29N76p7l43N51m59qL05n03N2M46m42
$$ -315 377 92 -75 397 -76 -49 175 -325 -88 114 -315 261 184 -159 392 -67 -75 230 -273 -221 225 -217
2461b17L80Q7l72L15q2l42M30m87p2O75m36J62J28l55N12j71n74M47k02n1M59
$$ -217 163 250 -122 193 111 -231 199 -288 -360 315 -121 41 169 -186 326 155 -419 28 -174 -225 234
2482B34l66K2N28n70K40J52n71L59J9k76N14k96rM43o46J57J36n19M99L5k86M71
$$ 234 -132 -110 418 -152 88 240 -331 28 47 -229 285 -11 -20 423 -223 -66 70 -449 50 85 -201 270
2504B70r1m02N46l91j29L61m85J85L77l62K88%l10L61m13r6M16m58J57M00m58
$$ 270 179 -223 323 -68 -197 164 -321 -136 241 -121 167 167 -143 218 -195 -291 125 -333 -176 224 -234
2525b34L54J99o22M21j22k72M06k90j29O19l75J32K66o13L92Q2o04N62k61o6N43
$$ -234 120 319 -303 118 -4 -276 130 -160 -289 330 -45 87 353 -260 132 214 -390 172 -89 -155 388
2546C88m56RM04n83J32K15m59L11K31l64M81k27j56N05n73L0J55m11L11L15n26
$$ 388 -68 -59 345 -238 -106 109 -350 -39 192 -172 309 82 -74 431 -142 -112 43 -368 -57 258 -268
2567b68N65j31m05N34l35k58N07m94J63M26n52M83M6n34N52m15j74M99l86m9N20
$$ -268 297 166 -239 295 -40 -298 209 -285 -122 304 -248 235 281 -253 299 -116 -290 209 -177 -226 294
2588B94m66L19J17m34K06q3k91M12k09%M61m12P5K37m79K72J81o05N07P0l33M47
$$ 294 -172 147 264 -170 36 -47 -338 74 -135 -135 326 -86 -11 226 -253 19 200 -405 102 172 -161 286
2610B86k93o2K60k96j8K82n41L64J88l22L50k13j02K53k80j0L60n25L45L01n08
$$ 286 -7 -69 191 -105 -123 159 -382 -18 170 -152 198 -15 -117 136 -144 -154 206 -319 26 327 -181
2631a81L47Kn37N25k49j46L84l69J66L95n88L75P4m89L49k08k14M82j76j51M18
$$ -181 166 168 -369 156 -93 -239 145 -224 -58 337 -251 124 198 -291 58 -150 -364 118 -58 -209 209
2652B09j86R8J78n61K28J16m38N84k16j25N28m14j72L66m22R9L01m68M02J6j81
$$ 209 23 121 299 -262 -34 82 -356 228 12 -113 415 1 -171 195 -227 -128 173 -295 107 123 -58
2673e8L56k85k37N03m73J32K64n23M47R3l08K50N2j96J50k85j46M02m26L75K97
$$ -58 298 13 -224 279 -194 -62 202 -321 126 219 -89 161 213 17 167 -118 -264 138 -288 87 384
2694C84n66L44n8l78K66r4j89M49j71M1K71m53K47Q7m50K43J12l83M82j88r4M86
$$ 384 -182 162 104 -274 -8 -102 -291 158 -13 28 299 -154 93 180 -270 -27 85 -298 184 -4 -98 388
2716C88n30J11J38l81L62l8l48N11q3k14M01l26k27M62m49K04J97m31M95j91k05
$$ 388 -142 -31 107 -274 88 50 -298 213 130 -84 317 -9 -236 226 -223 -19 178 -253 242 51 -154
2737a54L66k18k15L56l59J3L70k54J33L29n01K01P5m97M17j41j68M31k73J32K93
$$ -154 212 -6 -221 135 -224 -211 159 -95 38 367 -134 67 142 -355 62 -79 -247 184 -89 43 336
2758C36n07K61k5m15M40k23k12N74j08j78M40n32J37J81m92L29Q5k80M16j25k36
$$ 336 -171 90 65 -350 90 -133 -345 229 121 -57 383 -149 -12 169 -323 6 91 -189 227 102 -134
2779a34L50l03J5K09l91L12Q3k89L40p4k60K66j89j35L95l85R6L29m18J97K23
$$ -134 216 -87 -72 137 -254 58 141 -148 192 118 -142 124 -65 -200 195 -190 -94 235 -183 14 237
2800B37m06L35j25k49L11k86LM06k89K27P4k54J07N7m01K78j15m5K37o0j08J97
$$ 237 -169 166 41 -208 103 -183 -180 226 -63 164 238 -16 91 148 -253 25 -90 -135 102 42 -66 131
2822A31k20j4K30n11M70j05k8K67j91k05N10n26Q3Q8k31J83J96l20L14o0k46L56
$$ 131 -89 -103 127 -384 86 -19 -47 220 29 -176 334 -192 -109 -21 -252 -69 127 -193 121 61 -185 171
2844A71k71j03M54m36J58K68l61L11l4l16L29k78r7K37j55J34L61m74K90j2l88
$$ 171 -100 -203 251 -185 -27 241 -120 191 157 -159 170 -108 -205 32 -123 11 372 -102 188 176 -212
2865b12K48j19j63L93j40j72L81k30J1K19m42J10J84m15L96m3j31L84k12j42K29
$$ -212 36 -83 -246 147 7 -165 216 -14 -3 216 -226 -116 68 -347 49 6 -125 259 47 -95 134
2886A34l46J47J32m27M19J0k84M47j70j43K86l57q3K31j85K06J77k70J73J2k19
$$ 134 -212 -65 67 -360 59 69 -215 232 62 -81 205 -152 -235 -4 -189 17 194 -76 97 109 -110
2907a10K26k48m0K66k58j1M34l15J76Q7m57L53k18j15L32j87J24J71k08N4J98
$$ -110 116 -132 -172 94 -164 -175 259 -56 120 207 -250 103 -115 -230 102 -85 39 210 2 56 254
2928B54m17J92mk94M58j01k73L89j50k44L20l90P3K18k06L46j15p2K67j72j15
$$ 254 -163 29 25 -269 189 88 -185 204 54 -190 130 -260 -187 31 -175 171 56 -16 251 79 -36
2949c6K26l56J05J56k83J61J99l14L41k62r0M52l87o3K49j01Q4R8l63L19o0k03
$$ -36 190 -166 -61 95 -188 -27 172 -142 199 -63 -153 299 -88 -151 98 -3 81 179 -184 135 75 -128
2971a28K78k39o1K13j92ML46k80J48j8k74K62o8k78K92j74J29J84j61Q5R0l41
$$ -128 150 -89 -150 63 -129 -125 221 -59 89 71 -203 59 -9 -287 5 -169 -40 144 -17 68 158 -183
2993a83J86j9j97M43j67j34J59j02k01L38l53K21N1k04K79Rl11K97j16j34J59
$$ -183 3 -16 -213 230 63 -71 88 -14 -215 123 -230 -9 42 -162 117 126 -185 112 -4 -138 21
3014B1j45R3K78m13J73K11l16K42k53o1K98k06o8K79j99N2K59k82R8N8l48L68
$$ 21 -124 -31 247 -166 7 218 -98 144 -109 -170 128 -78 -146 133 -66 -14 245 -37 61 119 -229 139
3036A39j65j62M10l38N3K26k01L5J06m27L58l2r3K78j88j2K33l04N0J74l66K38
$$ 139 -26 -188 222 -116 -63 163 -38 -3 103 -324 34 2 -91 187 -1 -13 220 -84 -34 140 -226 12
3058A2J9j05K94j35j12K52k61j56K41l33K29J92l18K67K7k25J43j33j14L28j45
$$ 12 31 -74 220 85 -27 225 -36 -192 49 -284 -55 137 -181 86 113 -112 31 -102 -216 112 -33
3079c3k3K03j35k0K40l91J32pj37L27j68k15M25j95M5Q8k91J53k6k42K29J01j91
$$ -33 -56 147 12 -8 232 -159 -27 -34 -171 156 -12 -227 198 3 48 136 -155 -2 -28 -270 -41 60 -131
3102a31K85j07p9J52k79K43pl47K68j8r3K70o2j92K78l08m7J66j50Q0J46r6Q0
$$ -131 154 47 -32 120 -159 84 77 -270 -2 -20 -113 157 95 -97 181 -127 -174 -8 -158 -78 68 -28 52
3125E2Q0k86K56m6j50J36j67J59J73k06J46j53j46K61j46j69K68j48O0J34j37
$$ 52 132 -154 102 56 -94 42 -125 34 207 1 147 -6 -152 109 -37 -206 62 -86 -26 108 -29
3146b9Q1J01l75J41J17k13L54j88K8J17j93L3J49l31K78kl43K59Q0p6R2m6j84
$$ -29 52 153 -222 -81 36 -177 177 -11 17 134 -59 -26 123 -208 70 68 -275 -16 64 -12 80 34 -150
3169a50K61k25O2R4j99K48P3k23K05r7k77L34k28j23L79k39L8K60k75K58j15k36
$$ -150 111 -114 -52 42 -157 91 164 -59 146 49 -228 106 -122 -245 134 -105 -67 193 -82 176 61 -175
3191a75K00j83rK41j76M3K10j94Q3J10m31J90j5K1K40j34j25K88k31%J23k59K03
$$ -175 25 -158 -167 74 -102 -59 151 -43 40 150 -281 -91 -106 -85 155 21 -104 184 -47 -47 76 -183 20
3214B0Qk44M32j26j83L25j86j16J96l24Q7K27l54K89R3l28L63k20p3K97j74j96
$$ 20 28 -216 216 90 -93 232 46 -70 126 -198 -111 116 -238 51 144 -184 179 -41 -114 183 9 -187
3236a87L64m11M09k5k98J44P7n2J18k49K3K89l44J65K04k37JJ33k52J88q0k07
$$ -187 177 -234 175 150 -148 -4 73 21 139 -110 -87 202 -142 23 227 -10 -9 124 -128 60 -20 -227
3258b27L12j43J14J83k55l3J97k72P3j8J0K45j95j6K1j01J08J63k49Q1J50k07
$$ -227 85 -58 56 239 -16 -49 148 -124 -51 -69 -59 186 -9 -25 -4 -105 3 166 -83 -2 148 -59
3280e9J65p1o9J87j85j68J98j49N3K34k80K18P1p1J0j29o4K84k89K7K04j48M8
$$ -59 106 35 -34 153 -32 -200 -2 -151 -98 136 -144 74 145 74 84 -45 -109 175 -114 -87 117 -31 17
3303A7K19l75J75Q5l47K44j7j00L46j53k15K21j37J48j38j27J30J0j02K77q5j00
$$ 17 236 -139 36 121 -226 18 1 -99 247 94 -121 100 -37 111 -27 -154 -24 -14 -116 161 76 -24
3325b4J58k06QJ46k42J74J35j59P9M7k02K61j70j23K86k82%J23j72K03n7n1K17
$$ -24 134 -72 -64 82 -160 14 149 -10 69 116 -86 175 5 -118 168 -114 -114 9 -163 40 -17 -68 149
3348A49j79rJ05k00R1K99l36K03q8j60K07j87o0J79o9o2L19k94Q1J24k92J77L2
$$ 149 -30 -39 66 -134 -43 256 -80 123 35 -125 82 -105 -165 14 -55 -117 202 -92 -11 113 -179 -2 30
3371C0l08L05L1j66K26m6l4J02l15K08J2k00J52M2k45L19j17m3J93j76n8J16j33
$$ 30 -278 27 58 -108 118 72 38 140 -175 33 45 -155 -3 39 -206 113 -4 -47 146 -30 -88 28 -105
3394a05PK24k57J94N2k95K82j31M9P0r9J1J24j83K04q5j27J92r4k21J73M8rK1
$$ -105 -98 126 -131 63 115 -180 102 -29 20 90 -9 2 126 -57 147 62 -65 127 33 -188 -15 33 24 45
3418D5j00J70rj71K6K0r6J79j81Q8J60k07J35K5j26l1J90l56L03L8k01J86n6r5
$$ 45 -55 115 106 -65 -39 -19 -115 64 -117 -29 131 -76 59 84 -42 -73 117 -239 64 102 -99 87 31 -64
3442f4O7k02J73L2o8J00k8j11K19j26j31K89k40rK54k04Q6N6j51K79q0k45J46
$$ -64 3 -199 -26 6 -62 38 10 -101 118 -8 -139 150 -90 -99 155 -49 37 93 -58 221 141 -104 42
3465D2r0L4J37k55J85J10l13K33R3j33J0q2l6J70j25j27K90n4j42J33o1n1Q9j82
$$ 42 -48 -14 123 -132 53 163 -150 83 176 43 53 -29 -65 105 -20 -147 143 89 -53 80 19 -32 57 -125
3489a25J32P3j95K28k79J45J02k07J04O0j30J26l4l2R2qj52K44k20M5J37k52J95
$$ -125 7 80 -115 113 -166 -21 81 -126 -22 38 -92 34 0 -32 60 52 -100 144 -76 -31 106 -146 49
3512D9%r5R1o3j09J97j05j8J97j14r6K92l40J49j4n9l8J14k23K14r4N4O1j30K09
$$ 49 49 -46 45 -18 -127 70 -35 -53 144 30 -66 226 -114 35 21 -38 -76 38 -185 29 -65 -11 50 -80 129
3537A29j37n2K8qq0J16j0j79K37j77N3K22k20Q1p6m8J44k3j70L18k05k2K07j48
$$ 129 -8 -60 -32 -40 -120 -4 -14 -193 44 -133 -80 142 -78 3 -73 -121 23 0 -170 148 -57 -79 128 -20
3561b0lJ29k01J59L6k11K49q8j87J45j43mK62k00P4L8n3O9J9k14K27j82NL63m09
$$ -20 -23 106 -95 64 100 -111 138 50 -137 8 -135 -139 123 -77 -3 35 -18 51 70 -144 83 -99 -94 269 -140
3586a40J90N5k60J26Ro8J31k6r2K41k40m5J27r4P1K8j78J90L0k25K82q3j57K51
$$ -140 50 105 -155 -29 -20 -88 43 17 -75 166 -74 -119 8 -86 -15 13 -165 25 55 -170 112 29 -128 123
3610A23j43p5J81j55J7K0j06J27R3r9J31j31l4k8N4j1O8j16O6O5p2P1q9lJ11j46
$$ 123 -20 -95 86 -69 -52 -32 -138 -11 82 -17 114 -17 -51 -79 -25 -36 32 -84 -18 47 -25 46 -43 -46 65 -81
3636h1j1K09k18Q0K8j55J72o7r6J63J12k08K30k93J66k5o8K14k17O2R1Mj70K35
$$ -81 -92 117 -101 -21 7 -148 24 -43 -139 24 136 -72 158 -135 31 6 -62 152 -65 -3 88 92 -78 157
3660A57j82n3J93j69M2j02J6K10o6j21Q7L5p9K02k38qJ98k18J60J0j94J80j00
$$ 157 -25 -78 115 -54 -12 -114 -98 112 46 -75 12 47 -32 170 -68 -76 122 -96 64 74 -120 60 -40
3683d0oO9l0j60J67M9j30J94j13l5J04j34R7q5k0P8J3M7O0k28J48P2k82J88m5
$$ -40 -46 23 -7 -167 0 49 -81 113 0 -35 69 -65 32 -53 -73 5 18 65 125 -103 45 117 -165 23 -22
3708b2N3O0K4j90J41p0l2K16j24%p5o6J26n6M7Oq4J00nl7j36K55j67J16J5k48
$$ -22 31 91 115 -75 66 -4 -36 180 56 56 -19 -85 41 -15 32 38 -46 54 49 12 -124 131 -36 80 95 -153
3734a53J81R7q7M6l8j3Kj48J53k4j91J17P5m2O0r9J07M6j21nM0m0O9m2j34R2P6
$$ -153 28 125 38 84 46 33 35 -113 40 16 -175 -58 17 -25 35 -64 43 89 -32 -37 3 -37 32 -10 -144 -52 24
3761B4j99K70o1JK9o9m6J84k37QJ52j35R9n8K1R4j5j0L8k37P6J58m6m4k4P4Q5
$$ 24 -175 95 34 35 64 -5 -51 133 -104 -96 56 -79 20 -38 -17 77 62 52 90 -147 -71 87 41 -3 -27 47 132
3788A32j33l9K01j56q6J31l9j5J06j91O3J58j70J04m3r2J91p1OP1r1o9J08L0J3
$$ 132 -1 -40 161 5 -81 50 11 -4 102 -89 -26 132 -38 66 23 -69 122 51 57 128 37 -32 76 106 119
3813A19j79N9Q4o8O0j11J0qJ50j72J55m2j44J50Po1J55o6j64J41j13N7J8k9qR3
$$ 119 -60 -1 83 15 75 -36 -26 -34 116 -56 99 57 -87 63 70 9 164 98 -66 75 -38 19 37 8 0 93
3839I3j33J17j73mM9Oj0P1m6J08j41R3l0M8j29j0J47j12R7J9m9P8j42J4J09j45
$$ 93 -40 77 -96 -100 -51 -45 -55 16 -30 78 -63 30 0 48 -81 -91 56 -56 41 60 11 89 -53 -39 70 -75
3865g5L5o3J45j13J17L1p6r1J70j01o0K5k8N3J03n1m1P1j18J42p4p9J62n3o0K3
$$ -75 -40 -103 42 -71 46 77 1 -90 80 -21 -81 -56 -84 -31 72 21 -20 51 -67 75 1 -78 84 31 -29 -6
3891fK2j1j56Q7J15m2o2j0R3J3oo0J9k8N2o2P1m1j14J31K9J6k3j35J53m4j26J19
$$ -6 16 5 -151 -64 51 9 -53 -63 30 43 37 -23 -4 -32 20 -42 29 -12 -126 5 34 50 27 -108 45 1 -125 -6
3919fj13J76J5j00pj2O5j22Q4j80J83k6p4J03k4j31K33p8M1K1j25Q6L2k0m7j9
$$ -6 -119 57 72 -28 -35 -47 18 -104 -20 -200 -17 -43 -117 -14 -38 -169 64 -14 27 48 -77 9 41 21 -26 -45
3945d5J08l3l9m2J32j22N5K7q2P5L5q6j9L8O0p4k5J21L7j66J11o7j79K19k1N2
$$ -45 63 30 -9 -51 81 -41 14 41 -41 34 69 -17 -36 2 62 -12 -37 84 121 -45 66 -1 -180 39 18 70
3971G0j5n7J13L0k01k3J62m8k6p4L6Q2J8j9R1k82R5P7J7NJ7p7J82k01K7kN7j78
$$ 70 55 -2 111 141 -60 -83 79 31 5 -69 -33 49 67 48 139 -143 -48 29 46 51 68 -9 173 -28 -1 -3 54 -124
3999a24J63K7j45P6l0L5l6p5J74m9j01Q4L0j44Q2P1J9N9j89P1Q2n7p9K3Q1m0j
$$ -124 39 66 -79 -3 -33 2 -34 -109 65 16 -85 -1 29 -115 -33 38 57 116 -73 -2 80 23 -56 -33 48 8 7
4026GRN2N4j9r7l92L98m5PM9K6pj1J2n1N8j23l5J26m6J7j0MN5o1R3j27j3J3J6
$$ 7 16 68 122 103 6 -386 12 -33 -26 23 49 42 31 43 -8 50 -73 -108 18 -28 -11 -21 -17 38 -23 70 -57 -70 -57 -41
4056d1NP9j8k6J64j74%O0p8rP8m0J27l7j40J43%j71J07r3K0J54n8n9O5o3K5p3
$$ -41 -36 43 25 -1 163 -11 -11 49 -29 -38 40 0 127 90 -50 93 93 -78 29 -64 -44 110 52 -7 58 -5 20 -53
4084e3p9N6m0O6R6q9j0J49r4p3N7L4m0m7l1J43p7N9q4k6Q6l3J11k7M6r5M1k1j44
$$ -53 -132 -76 -116 -50 46 -43 -53 96 2 -71 -14 20 -20 -67 -98 45 -32 27 -57 -83 3 -30 81 54 100 5 46 25 -119
4113a19O7oL5Q0n6N7p9m9P4N4o4N2r6l1J34j35J79j15K9j16J26l1J3n5j8j9J0
$$ -119 -52 -58 -23 57 1 58 -21 -70 4 58 -6 46 -50 -81 53 -82 97 -18 11 -105 21 -10 3 -52 -70 -89 -79
4140g9J21p3rK0J62j54O3j10P8m0k6J02Rn5J6j10P5r1R2j04O4l5R9M7j17J54k93
$$ -79 42 -31 -40 -20 142 -12 51 -59 19 -21 -47 55 64 9 25 -85 -10 -101 -9 -113 -49 -84 15 62 -55 99 -194
4167a94K03P0j4j07O3J51k72M03J5n37K62p1Kj27K27j59M06j41K0K29j62K46k45
$$ -194 9 79 65 -42 21 172 -100 303 318 -219 43 -28 -26 -153 74 -85 321 180 200 429 267 513 268
4190B68j1k35M78n82j62M23m5L14o62K18K92n27K83k19J2O6J38j48R6l1K45j71
$$ 268 257 22 500 -82 -244 179 134 448 -214 4 296 -231 52 -167 -155 -89 49 -99 -3 -34 211 40
4212D0pr2k6j26L96K58l67k14q4MN7JP16o8n14QQ7j8o31L32o3N99m45M9L41p05
$$ 40 33 -59 -85 -211 185 443 76 -138 -222 -218 -161 -160 556 488 -26 -18 69 51 -580 -248 -311 288 -157 -108 233 -472
4238d72M61j94J13L1q7L2J81q1j24K43j94Q9l18QJ0K4J61k76O89l29K6J3j93J66
$$ -472 -11 -205 -92 -61 -148 -116 65 -16 -140 103 -91 -2 -320 -312 -302 -278 -117 -393 296 -33 -7 6 -187 -21
4262b1l38P73j47j00mj13m69L46L76l45K11l9o22J126j306J352o90N15k8n45M
$$ -21 -359 414 267 167 163 50 -419 -73 303 -42 169 130 -492 634 -672 680 -10 505 477 -68 -64
4283f4%N6lR5j51J40L1k6o6l9J1j7q5J13P7r3o6J93j08N2p4prR6j45N5J45k09
$$ -64 -64 -8 -11 84 -67 73 104 78 12 -27 -16 -33 -118 -5 72 -21 -87 106 -2 50 -24 -31 -40 56 -89 -34 111 -98
4311i8J32k9k4K6P7j0r1j3J1L1k3M0n6jP5o0L6o8N1Ll7Qn5N4m2L2K8pp9J41k7
$$ -98 34 5 -19 7 84 74 -17 -30 -19 12 -11 29 -27 -28 47 -13 23 -45 6 9 -28 -20 -75 -21 -63 -31 -3 -10 -89 52 25
4342B5n4P0r6K9k4J46j27J0N3q4M6l4R0p9K1j8k5R5K6q7P6q3OO5j10m9R2L3N3
$$ 25 -29 41 -55 -26 -50 96 -31 -21 32 -52 -6 -40 50 -29 -8 -26 -51 44 70 -17 59 -24 -18 47 -63 -112 -20 13 66
4371F6j07N4mn0Q3j5r9J13k4mJ7p1K2J14j03j9J10j72J10o2M7M7j14P0K2j39J73
$$ 66 -41 13 9 -41 42 27 -72 41 17 13 30 -41 -19 95 -8 -27 83 -89 21 -41 6 53 -61 9 31 -108 65
4398F5k4p2J21j09k5J18j30J45j40J38k31K13l6j46J05O6K8q9J3j2j63J89o4J5
$$ 65 41 -31 90 -19 -44 74 -56 89 -51 87 -144 69 33 -113 -8 58 86 -3 10 -2 -165 24 -40 -25
4422b5kO4r3Q2RM3pm8o9J32j16M2l9n2M5L1Nn1LJ9O9k6L4p4Q0j83J29n1K5O9k9
$$ -25 -27 37 -56 26 35 78 71 23 -46 86 -30 12 -27 -79 -34 -3 2 -49 -46 -27 42 16 50 -24 56 -127 2 -49 -24 45 16
4453A6J8l4N5l9MQj7m3Q5q8J09j05Q3LL8j28OoM6qq6J21Nn1n2J94j7j16k1R8j38
$$ 16 34 0 55 16 20 28 11 -32 53 -35 74 -31 52 55 93 -35 -29 -35 11 3 -83 38 43 -8 -60 134 117 1 -20 78 -60
4484f0oL3k3L2M2J05j32O2l4r6J09m1pK6o1L2J12r8L6j3m2jkj07J30Qq2K4l6J25
$$ -60 -66 -33 -56 -24 18 123 -9 53 19 -77 32 -9 -16 10 -51 -19 93 -5 31 18 -24 -25 -27 -134 -4 4 -78 -54 -90 35
4514C5l4J03j36L9K4r7J09l6M3J2oj13k1j8o7J54O6j44K06p7q2p2J74n2j55K04
$$ 35 1 104 -32 7 31 -66 43 7 50 62 56 -57 -78 -96 -163 -9 57 -87 119 42 -40 -112 62 10 -145 59
4540E9m6jj8j2q1K54j37L9j63k7J24L1q9L7k3K4Q7m7J2r8O7K0J5n5k8M2k3M5p1
$$ 59 13 12 -6 -18 -99 155 18 57 -106 -133 -9 22 -67 -30 -53 -29 58 11 23 -75 -8 12 27 -28 -56 -14 -37 8 -63
4569f3M7J46k09K0N2Jj2K5l6%L1M9J6o3k8N5q3J04j18J04R9j16q4M5K1m8P3j18
$$ -63 -16 130 -79 -59 -7 -6 -18 7 -29 -29 2 51 67 4 -24 31 -52 52 -66 38 137 21 -63 -18 3 -45 28 -90
4597i0J19j2j14J52K4o2M4r7o0K8K2L0M9J6O4p9n6N5j6lO9n3n0N6k6q3Q7no6N5
$$ -90 29 17 -97 55 79 17 61 -36 -96 -68 -46 -16 33 49 113 34 -22 33 17 14 83 30 -20 36 10 -73 14 9 -57 -2
4627bn8J35p9p7J48q2O6n3QP1n9J5q1j2J17k0j08Q9n8n1J66mOp0J49k19M3j03
$$ -2 -60 75 -4 -81 67 -15 51 -2 6 77 18 33 -48 -60 57 37 -71 18 -40 -91 75 71 77 7 156 -63 -20 -123
4655a23R1n1L4j6k7M0L3NK3O0j68N5J31p2l3N7q3P6K8l7O6q2rJ8J07k24J03k3
$$ -123 -32 -83 -49 -65 -92 -52 -19 -14 9 69 -99 -44 87 15 -18 39 -44 32 60 23 89 7 -2 16 123 -101 2 -21
4683b1K7K5k0j42J74p4K5o5J0L9j8M0l4n7J1L2J31j55Q8k5k0O0o6J96j48j12J39
$$ -21 6 31 11 -131 43 -31 -6 -71 -61 -22 -40 0 -34 -91 -80 -48 83 -72 16 -9 -29 31 -35 161 13 -99 40
4710D0K4j7j09J7L5O9j36O5Q5r4m4N7l5J22o8J0on7J01q7L0q9P4L7K2n7k9J35
$$ 40 64 47 -62 -45 -10 59 -77 -12 73 -21 -65 -8 -43 79 11 21 15 -42 59 -28 2 -87 -13 24 46 -11 -40 95
4738I5j22J31k13RP6o2M5MJ59k09J01j21J27J13k02J8Q3L6L2q1o3J66K8r5m6p2
$$ 95 -27 104 -109 -100 -24 -86 -41 -37 122 -87 14 -107 20 133 -69 -51 32 68 100 19 -44 122 150 55 9 -63
4764f3L6p8P8O6j09%L5R6r7M9Kl1J30nj25M8j43K4L6Q7On3j29R6M6k5J61k46R7
$$ -63 -27 -105 -27 39 -70 -70 -35 61 -36 13 15 -16 114 109 -16 32 -111 -87 -51 36 42 -11 -140 -44 2 -23 138 -108 -11
4793a1Pn5OJ43j50J96j78M4l1P5j03n9P4Q6m5N5jK9m6M6j75J54n9j22K10j72J38
$$ -11 -4 -59 -53 90 -60 136 -42 2 -29 46 -57 -116 -42 44 -1 54 53 82 36 82 -93 61 2 -120 90 -82 56
4820E6o2n0J42r3l4OL1K3POn3O9r2Q5K4m3o3k5J07j30J03o3J22P1r6jj6Oj1pk4
$$ 56 -6 -56 86 -7 -41 -35 -4 19 26 32 -21 48 -44 41 65 22 -41 -66 41 -89 14 -49 73 144 48 47 31 37 26 19 -5
4851eL0j0m2P5j02Q9m7o5J16kjr7K0O9m6R2j20M0m2k1J09o9Q6jJ2j00J03j65J06
$$ -5 25 15 -27 48 -54 35 -12 -77 39 37 36 -61 -41 28 -18 74 -46 -6 -48 -69 40 -29 57 56 68 -32 71 -94 12
4880A2o4o5J71p3R8j00J8jQ0k6m5N2j75K31j00p6Q5M7j08l3Ln3J05O3j27K6mJ6
$$ 12 -52 -117 54 -19 79 -21 -3 -4 76 50 5 57 -118 113 13 -63 22 69 -39 -72 -69 -122 -17 46 -81 -55 -59 -43
4908d3p3P2M9N9p2o6M0o8J63j8J1N7r3pm8K6k5J11k2j7pl5P5l9o7O3K4r9P2j2
$$ -43 -116 -44 5 64 -8 -74 -34 -102 61 43 54 111 18 11 -37 -11 -36 75 53 36 29 -6 69 30 -37 26 50 -49 23 11
4938A1M2J7j49J03m8q3O6Q3r3K7R4r3R3k4P3k17J99o4j12O5N0m0r9J18m0j7L2
$$ 11 53 70 -79 24 -24 -107 -41 42 -51 -24 70 -23 70 46 119 -98 101 37 -75 -10 40 0 -99 19 -21 -38 -6
4965fJ7P6p3l3qj3mJ01m2r6J34m1j11J54j23J48ln5l0j05J81o1rJ32j64R9q1o9
$$ -6 11 87 14 -19 -27 -40 -44 57 15 -81 53 12 -99 55 -68 80 77 22 -8 -113 68 7 -2 130 -34 65 -16 -85
4993h5mJ4N7J0M2l9nJ06q8j43P8J09r0Q8J5O4j90oK7J03n2k8M3k2l9J4M4O4j09
$$ -85 -89 -75 -18 -8 34 -5 -10 96 8 -135 -57 52 -38 50 65 129 -61 -67 -40 63 11 -17 26 4 -35 -21 23 87 -22
5022b2pL7o0j21O8J30P4q0l8m5J12j32K4nJ15j22K8N0L0Oj27O8J9K4o3j7K6R8
$$ -22 -29 8 -52 -173 -105 25 99 19 -19 -64 48 -84 -60 -65 50 -72 -44 6 36 42 -85 -17 2 26 -37 -54 -28 70
5050G0j2j29M6j01J59L4j12l2J01p5M7M9j8j10MJ10j75J64J4j11Q1l5P4k7oL5
$$ 70 58 -71 -25 -126 33 67 -45 -77 24 -51 -4 45 27 -83 -79 31 -144 20 34 -77 4 -31 43 16 10 45
5076D5j09N6M8n3L9o8N1p0R6r0k7J05J01j27ljP8j09J8L4p3M9O8n8o7R0o8N2N
$$ 45 -64 -8 40 -13 26 -42 9 -61 35 -55 -82 23 124 -3 -6 -7 71 -38 -20 14 -59 -10 58 0 -67 23 -45 7 12
5105A2O3j60P2lMP9K8j06j03J39k6J4nJ4j54L5qM6P9kL9p7j24O5K4R0P5j73L1
$$ 12 75 -85 -13 -16 -12 67 95 -11 -114 25 -1 13 8 22 -132 -97 -105 -59 20 18 57 -20 -144 -79 -55 35 110 -63 -32
5134c2M5o3N4M8q5K6K1J0l8J84j63k1M6jp2kM2k0K4Lr4J1Q8p%k4j5q0J27m5R2
$$ -32 13 -50 4 52 -33 -7 14 24 -14 170 7 -14 32 31 -41 -43 -1 -21 3 6 -88 -77 11 4 4 -20 -35 -115 12 -33 59
5165E9mj04Q0om6oO2J07k20J47K2pn9KK5j15R6r2M4L7L6j43L6J10j8O2o6J4lq
$$ 59 55 -49 31 25 -21 -27 35 142 -78 69 91 84 25 27 52 -63 33 -59 -15 22 58 -85 -49 61 43 105 39 53 50 42
5195D2n2Q8m8k3JoQ3k9r9M9M6j67K55j19O8m7k5k9M2L2l3m0M3p1J55q6j43J07
$$ 42 -10 78 30 7 8 2 85 56 -43 6 52 -115 140 21 89 42 17 -12 30 62 29 -11 32 -39 116 30 -113 -6
5223fJ2J30k5k00K02j37j3O9l0R9j43M0L0P7j18K1j24J47O8j90O7M0j6j9nj1P3
$$ -6 6 136 111 -89 113 -24 -37 32 2 101 -42 -2 28 105 -13 8 -116 31 99 -91 -24 16 0 -19 -24 -35 38
5250C8j21J39j09k1J37O0j69n9PJ32j9J02j01pq9O9J03m0o3lrq6J58k5n1RP3j22
$$ 38 -83 56 -53 -74 63 123 -46 -105 -98 34 15 117 16 9 -80 -11 92 52 -11 -14 -23 -109 49 24 -27 -18 55 -67
5278f7J39j06l4l7J42j76N3J43n7j0Q9L0p0Lp0Ol3J9l4J67p8kj5J25j33n2K5J07
$$ -67 72 -34 -68 -105 37 -139 -86 57 0 -10 79 109 39 42 -28 -22 -55 -36 -70 97 19 17 2 127 -6 -58 -33 74
5306G4J9j44K00j03n1n8O1q7M5J8M4j4l4j6NP0o3qK6r0K3N9R6L1q6j21M7J26n9
$$ 74 93 -51 149 46 -5 -63 -2 -89 -44 -26 18 4 -30 -46 -41 29 -34 -42 -16 -106 -83 -24 72 103 17 -104 -57 69 10
5335A0q5R6L5p5J60j69k3J20m6KMQ0q9K4j29J36j05K2J7J05p6Jn9R2l5p3O1p8
$$ 10 -75 21 56 -19 141 -28 -51 69 23 25 29 109 20 44 -85 51 -54 -32 -15 90 14 15 -44 48 13 -60 1 -77
5363g7R1LM1j45M0O1R4q9j62J68o1P2n5j27J64%o7L6O8m8J9N2j17N6J9p7PN0j37
$$ -77 14 17 58 -87 -47 14 108 19 -143 25 -36 36 -19 -146 18 18 -49 -13 55 7 26 78 -39 17 36 -41 -34 16 -121
5392a21k8K19qk9q1J11k2j9K5j59J74J5k36J60M2o3O2k6L7k5r3l9J17j9J2m8K
$$ -121 -149 70 62 33 -48 63 41 22 47 -112 62 77 -159 1 43 -20 42 16 53 28 -65 -104 13 -6 6 -42 -40
5419d0M1J0q7kJ05q2J05p4O4k6k2m6rj0R2J1k2j15O7k7J42j14k6N6j0R0o7Pj01
$$ -40 1 11 -76 -78 27 -55 50 -24 40 14 -8 -54 -63 -73 19 30 8 -107 -40 -67 75 -39 -65 -9 -19 71 4 11 -90
5448i0R8k0N9K4j64P3P4j15J59k6o6k4Rr7MOJ18O8p2n8K8oK5J8m6J3Q9j20k0P1
$$ -90 8 -12 47 71 -93 -20 54 -61 98 72 6 -18 -9 -106 -102 -96 22 90 18 -40 -12 -18 7 25 -21 -8 81 -39 -59 12
5478A2l0K0J30j80J37n6nN6p2Oj04O3j8m3M9OJ1O8m6n1R2n8m9o7J68m7K9o3J31
$$ 12 -18 2 132 -48 89 33 28 84 12 18 -86 -23 -41 -84 -35 -29 -18 50 4 -47 45 -13 -62 -129 39 -8 21 -42 89
5507H9l5n5k3L7J22j03Q4o1o7k2N9j01k1J43j26J85j50J12j03N7k8p5J92k48K15
$$ 89 54 -1 -24 13 135 32 116 55 -12 -34 25 -76 -97 46 -80 105 -45 67 -36 21 -7 -82 110 -138 77
5532G7j17M8J8j01R4L3k00K28p1J2J2l9jK9q5M2P0Q9j09M7j67J10M7oJ6j21M5
$$ 77 -40 8 26 -75 19 52 -148 80 9 21 33 -6 -7 22 -63 -21 49 138 29 76 -91 19 66 60 76 -45 0
5559@k5R0q5m5K6K27j08q7Pj00J57j64N5P0%j01J26q2Q7p0O3j21L3K4K4L6o6Q9
$$ 0 -25 65 -20 -65 -39 188 80 -7 0 -100 57 -107 -52 18 18 -83 43 -39 48 -22 41 -80 -47 -23 1 37 -29 60
5587F0j34R9j4l1J66n0j0j12j7J08j18K3N6m2o9J0J11n3l7O6j2m1N9J8n8O7n5
$$ 60 -74 25 11 -20 146 96 86 -26 -43 65 -53 -30 26 -16 -85 -75 36 -17 -54 12 0 -41 18 36 -22 45 -10
5614a0M3o9O9K3mj4j4k0pm0m4J17o1Ql7NP8q5l8O1L1K3l7m4J17j7p0MO2l0KJ2
$$ -10 33 -36 33 56 52 38 24 4 -3 -43 -87 30 -31 -23 -60 -55 23 -62 -100 -39 -8 15 -22 -66 51 34 -36 -32 30 0 2 14
5646A4q0N7j37J13L4q5k4J30Mm4j8J10o5n5n6P7J4mJ18n0j05K7m3k4R3j68K13
$$ 14 -66 -9 -146 -33 1 -84 -108 22 26 -18 -36 74 9 -46 -102 -25 -11 -15 103 53 -52 -25 -68 -92 1 -167 46
5673D6j26J09m4k5K7K4j1j21J44q5L7M1K2p3k3J15J9j6j43J06O5j09N3no8l4J4
$$ 46 -80 29 -15 -40 -13 11 0 -121 23 -62 -25 16 38 -35 -58 57 76 60 -83 23 88 -21 32 27 -41 -75 -61
5700f1L1L6j8R9k18J33R2q7n1K4J2N1pm4m6k0R3R5j87N2R1q6J12o8Oo2O2j33J52
$$ -61 -30 6 -12 87 -131 2 94 7 -44 -20 -8 43 36 -8 -54 -74 19 114 -73 -21 70 -16 96 28 34 -28 34 -99 53
5729E3l3o6J17j30k1R6j57R3L0O1J17n0q4K4mr2pN5p7N6k3p6O5O3L1o0O2l1N3
$$ 53 20 -46 71 -59 -80 16 -141 -48 -18 43 160 110 26 50 46 -46 -53 2 -75 -19 -42 -118 -53 10 41 -19 43 12 65
5758F5km1j4J7N1j74O8L0rj02O6QR3l1p3J15o4l9rJ26n6O6L8j20o6O0j11P6QK
$$ 65 63 22 8 25 76 -98 -30 0 -9 -111 -45 -37 56 25 -48 67 3 -36 -45 81 25 91 129 9 -57 3 -108 -32 -24 -22
5788b2M6N3r3L4m0K7n8K9K2l2O3j16O2j40J44jl7L7P0M5j76P7l0J78j85Q1l0M6
$$ -22 24 77 -16 18 -22 5 -53 -24 -2 -34 29 -87 -25 -165 -21 -22 -59 -22 48 93 -83 -6 -36 142 -43 38 8 54
5816E4k1O8o2j4K4Oj3Lj02P8N6k0J5j26O2J5%m8J13j03O9j0j8l4l1L7o4k9R1M4
$$ 54 33 101 39 25 49 55 42 45 -57 21 77 57 72 -54 8 23 23 -25 88 -15 54 44 26 -8 -39 -2 -66 -95 -4 40
5846D0j34O7J00j33M4O7rj2o9r8J95m4K5j11L7m4Q2j3j6p2J25m5j2n4J81j61N5
$$ 40 -94 -27 73 -60 -16 51 42 30 -39 -137 58 14 39 -72 -35 -79 3 -10 -26 -98 27 -18 -30 -84 97 -64 -9
5873io8J23q2k3j9O7N1J2j4l5q1J42l7m6J07j47QM3l4k4R3pO4o4L9j00J23j13
$$ -9 -77 46 -36 -59 -78 -11 40 52 38 3 -78 64 27 -19 88 -59 -51 -8 -42 -66 27 20 84 20 59 -41 82 -31
5901c1k0O2o5R9p0R5m0L2q7KN8m1m6N4J0l6k4N7k3q3J86j33N1n2J6L4n0j1P2j3
$$ -31 -51 11 -54 45 -25 70 30 62 -25 -23 35 -6 -52 2 12 -24 -48 9 -14 -97 89 -44 7 -45 -29 5 -45 -56 16 3
5931CJN3p1N0O0j09l3l2R1l3Q%M5j08J05M2lm5K7q4m3O9J29j37Q4O2j52l7p1J68
$$ 3 4 57 -14 36 96 -13 -46 -78 13 -20 -12 -12 33 -75 30 72 69 24 51 -33 -76 -7 122 -15 69 131 -21 -58 -129 39
5961C9n1O9k1q1L5j16J34o0R3j10L9J1qJ9k2M1j9k5O2j00L3J19k3q3K9p2M1K0
$$ 39 -12 57 36 -45 -10 -126 8 -52 41 -69 -30 -19 -27 -8 -30 11 -8 -33 29 -71 -38 81 58 -25 4 -68 -27 -7
5989gP6J9j7k4m0K1qNj12K7P9L4m0j2J04j80O6PR6o3pr4J10p9JP8j12R4l6k1R9
$$ -7 69 88 71 47 7 28 20 25 -87 -60 19 53 13 1 105 -75 -9 -2 94 31 24 -70 40 -39 -38 40 -72 22 -14 -35 64
6020F4M3j84LJ24j07k7P0l3o7N1k6MK1Q3P8q5j9r8J03Ko1J26p4k1J9N9j07M5L3
$$ 64 107 -77 -74 50 -57 -84 -14 -47 -114 -63 -89 -85 -64 19 97 12 -7 -105 -2 0 -61 65 -9 -30 -11 48 -59 -14 19
6049A9L3j41O3M5K5o1jJ1k4M5r5P6O3j23N2J1o4P6R2r3j4J01j0Qj06rP3j77J09
$$ 19 52 -89 -26 19 44 -17 -18 -7 -31 14 -81 -5 58 -65 -13 -2 -66 10 102 9 -5 96 86 94 -12 -21 52 -125 -16
6078a6K8p3qN1j5R2j3M4p3L7Jj8m8K9n9j2j2J4N9j9n5MJ56k44J52oK9O9q9r2J7
$$ -16 12 -61 -69 -18 -33 59 46 90 17 54 55 37 -11 18 -41 -53 -65 -51 8 -11 -66 -62 94 -150 2 -4 25 94 5 -87 -70
6109g0J61k18P2k4J23j19J79k86L00j56k2J92j38K0O1k07J63Rn8J0m1L8k8L0J3
$$ -70 91 -127 -55 -79 44 -75 104 -182 118 -38 -60 132 -6 14 75 -132 31 40 -18 -8 -49 -11 -39 -9 4
$$ [...]
8191a4
##END NTUPLES=NMR FID
##END=
