##TITLE=1H_DE-80H_X3
 200.13MHz, d2o
 8 sc
 
 19ns.26.2.2025
##JCAMPDX= 6.0         $$ Bruker NMR JCAMP-DX V2.0
##DATA TYPE= NMR FID
##DATA CLASS= NTUPLES
##ORIGIN= UXNMR, Bruker Analytische Messtechnik GmbH
##OWNER= pz
$$ XWIN-NMR		Version 3.5
$$ Fri Dec 19 11:03:10 2025 Russian Standard Time (UT+4h)  Yarkov@DPX200
##.OBSERVE FREQUENCY= 200.1313
##.OBSERVE NUCLEUS= ^1H
##.DELAY= (6, 6)
##.ACQUISITION MODE= SIMULTANEOUS
##.ACQUISITION SCHEME= undefined
##.AVERAGES= 8
##.DIGITISER RES= 18
##SPECTROMETER/DATA SYSTEM= spect
##.PULSE SEQUENCE= zg30
##.SOLVENT NAME= DMSO
##.SHIFT REFERENCE= (INTERNAL, DMSO, 0, 14.3821)
##AUDIT TRAIL= $$ (NUMBER, WHEN, WHO, WHERE, WHAT)
$$ ##TITLE= Audit trail, XWIN-NMR		Version 3.5
$$ ##JCAMPDX= 5.01
$$ ##ORIGIN= Bruker BioSpin GmbH
$$ ##OWNER= Yarkov
$$ C:/Bruker/XWIN-NMR/data/yarkov2/nmr/H-C/1/audita.txt
$$ ##AUDIT TRAIL=  $$ (NUMBER, WHEN, WHO, WHERE, WHAT)
(   1,<2025-12-19 11:02:28.73 +0400>,<Yarkov>,<DPX200>,
      <created by zg, POWCHK disabled, PULCHK disabled
       configuration hash MD5:
       00 E9 B6 7A A2 85 ED C7 34 08 36 98 17 FE 4E 26
       data hash MD5: 16K
       FD B6 1C 75 F9 DD 6C ED 90 26 6B AE D6 1A DD 1E>)
$$ ##END=
$$ 
$$ hash MD5
$$ CD D4 CB 72 D8 46 DF 9E C1 D7 B6 97 F1 A9 DE 8B
##$RELAX= 
##$RELAX= 
##$RELAX= 
##$RELAX= 
##$RELAX= 
##$RELAX= 
$$ Bruker specific parameters
$$ --------------------------
##$DU= <C:/Bruker/XWIN-NMR>
##$EXPNO= 1
##$NAME= <H-C>
##$PROCNO= 1
##$TYPE= <nmr>
##$USER= <yarkov2>
##$AMP= (0..31)
100 100 100 100 100 100 100 100 100 100 100 100 100 100 100 100 100 100 
100 100 100 100 100 100 100 100 100 100 100 100 100 100 
##$AQSEQ= 0
##$AQ_mod= 1
##$AUNM= <au_zg>
##$AUTOPOS= <>
##$BF1= 200.13
##$BF2= 200.13
##$BF3= 200.13
##$BF4= 200.13
##$BF5= 200.13
##$BF6= 200.13
##$BF7= 200.13
##$BF8= 200.13
##$BYTORDA= 1
##$CFDGTYP= 0
##$CFRGTYP= 5
##$CHEMSTR= <none>
##$CNST= (0..31)
1 1 145 1 1 1 1 1 1 1 1 1 1 1 1 1 1 1 1 1 1 1 1 1 1 1 1 1 1 1 1 1 
##$CPDPRG= <>
##$CPDPRG1= <>
##$CPDPRG2= <>
##$CPDPRG3= <>
##$CPDPRG4= <mlev>
##$CPDPRG5= <mlev>
##$CPDPRG6= <mlev>
##$CPDPRG7= <mlev>
##$CPDPRG8= <mlev>
##$CPDPRGB= <>
##$CPDPRGT= <>
##$D= (0..31)
0 0.7 0 0 0 0 0 0 0 0 0 0.03 0 0 0 0 0 0 0 0 0 0 0 0 0 0 0 0 0 0 0 0 
##$DATE= 1766127748
##$DBL= (0..7)
120 120 120 120 120 120 120 120 
##$DBP= (0..7)
150 150 150 150 150 150 150 150 
##$DBP07= 0
##$DBPNAM0= <>
##$DBPNAM1= <>
##$DBPNAM2= <>
##$DBPNAM3= <>
##$DBPNAM4= <>
##$DBPNAM5= <>
##$DBPNAM6= <>
##$DBPNAM7= <>
##$DBPOAL= (0..7)
0.5 0.5 0.5 0.5 0.5 0.5 0.5 0.5 
##$DBPOFFS= (0..7)
0 0 0 0 0 0 0 0 
##$DE= 6
##$DECBNUC= <off>
##$DECIM= 32
##$DECNUC= <off>
##$DECSTAT= 4
##$DIGMOD= 1
##$DIGTYP= 9
##$DL= (0..7)
0 120 120 120 120 120 120 120 
##$DP= (0..7)
150 150 150 150 150 150 150 150 
##$DP07= 0
##$DPNAME0= <>
##$DPNAME1= <>
##$DPNAME2= <>
##$DPNAME3= <>
##$DPNAME4= <>
##$DPNAME5= <>
##$DPNAME6= <>
##$DPNAME7= <>
##$DPOAL= (0..7)
0.5 0.5 0.5 0.5 0.5 0.5 0.5 0.5 
##$DPOFFS= (0..7)
0 0 0 0 0 0 0 0 
##$DQDMODE= 0
##$DR= 18
##$DS= 0
$$ [...]
##$SUBNAM2= <"">
##$SUBNAM3= <"">
##$SUBNAM4= <"">
##$SUBNAM5= <"">
##$SUBNAM6= <"">
##$SUBNAM7= <"">
##$SUBNAM8= <"">
##$SUBNAM9= <"">
##$SW= 18.0517328524113
##$SWIBOX= (0..15)
0 0 2 0 0 0 0 0 0 0 0 0 0 0 0 0 
##$SW_h= 3612.71676300578
##$TD= 16384
##$TD0= 1
##$TE= 0
##$TE2= 300
##$TE3= 300
##$TEG= 300
##$TL= (0..7)
0 120 120 120 120 120 120 120 
##$TP= (0..7)
150 150 150 150 150 150 150 150 
##$TP07= 0
##$TPNAME0= <>
##$TPNAME1= <>
##$TPNAME2= <>
##$TPNAME3= <>
##$TPNAME4= <>
##$TPNAME5= <>
##$TPNAME6= <>
##$TPNAME7= <>
##$TPOAL= (0..7)
0.5 0.5 0.5 0.5 0.5 0.5 0.5 0.5 
##$TPOFFS= (0..7)
0 0 0 0 0 0 0 0 
##$TUNHIN= 0
##$TUNHOUT= 0
##$TUNXOUT= 0
##$USERA1= <user>
##$USERA2= <user>
##$USERA3= <user>
##$USERA4= <user>
##$USERA5= <user>
##$V9= 5
##$VALIST= <valist>
##$VCLIST= <CCCCCCCCCCCCCCC>
##$VD= 0
##$VDLIST= <DDDDDDDDDDDDDDD>
##$VPLIST= <PPPPPPPPPPPPPPP>
##$VTLIST= <TTTTTTTTTTTTTTT>
##$WBST= 1024
##$WBSW= 4
##$XGAIN= (0..3)
0 0 0 0 
##$XL= 0
##$YL= 0
##$YMAX_a= 66400
##$YMIN_a= -68363
##$ZGOPTNS= <>
##$ZL1= 120
##$ZL2= 120
##$ZL3= 120
##$ZL4= 120
##$ABSF1= 10
##$ABSF2= 0
##$ABSG= 5
##$ABSL= 3
##$ALPHA= 0
##$AQORDER= 0
##$ASSFAC= 0
##$ASSFACI= 0
##$ASSFACX= 0
##$ASSWID= 0
##$AUNMP= <proc_1d>
##$AZFE= 0.1
##$AZFW= 0.1
##$BCFW= 1
##$BC_mod= 2
##$BYTORDP= 1
##$COROFFS= 0
##$CY= 83.5205535888672
##$DATMOD= 1
##$DC= 2
##$DFILT= <>
##$DTYPP= 0
##$F1P= 10.8118882576601
##$F2P= -7.23987719738617
##$FCOR= 0.5
##$FTSIZE= 0
##$FT_mod= 4
##$GAMMA= 1
##$GB= 0.15
##$INTBC= 1
##$INTSCL= 1
##$ISEN= 128
##$LB= 0.25
##$LEV0= 0
##$LPBIN= 0
##$MAXI= 10000
##$MC2= 0
##$MEAN= 0
##$ME_mod= 0
##$MI= 1.114404
##$NCOEF= 0
##$NC_proc= 0
##$NLEV= 6
##$NOISF1= 3.799351
##$NOISF2= 2.8
##$NSP= 1
##$NTH_PI= 0
##$NZP= 0
##$OFFSET= 14.38212
##$PC= 1
##$PHC0= -5306.755
##$PHC1= 10.82193
##$PH_mod= 1
##$PKNL= yes
##$PPARMOD= 0
##$PSCAL= 0
##$PSIGN= 0
##$REVERSE= no
##$SF= 200.129724274929
##$SI= 16384
##$SIGF1= 3
##$SIGF2= 2
##$SINO= 400
##$SIOLD= 16384
##$SREGLST= <1H.CDCl3>
##$SSB= 0
##$STSI= 0
##$STSR= 0
##$SW_p= 3205.1282051282
##$SYMM= 0
##$S_DEV= 0
##$TDeff= 0
##$TDoff= 0
##$TI= <>
##$TILT= no
##$TM1= 0
##$TM2= 0
##$TOPLEV= 0
##$USERP1= <user>
##$USERP2= <user>
##$USERP3= <user>
##$USERP4= <user>
##$USERP5= <user>
##$WDW= 1
##$XDIM= 8192
##$YMAX_p= 0
##$YMIN_p= 0
$$ End of Bruker specific parameters
$$ ---------------------------------
##NTUPLES= NMR FID
##VAR_NAME=  TIME,          FID/REAL,        FID/IMAG
##SYMBOL=    X,             R,               I
##VAR_TYPE=  INDEPENDENT,   DEPENDENT,       DEPENDENT
##VAR_FORM=  AFFN,          ASDF,            ASDF
##VAR_DIM=   8192,          8192,            8192
##UNITS=     SECONDS,       ARBITRARY UNITS, ARBITRARY UNITS
##FACTOR=    0.0002768,     1,               1
##FIRST=     0,             0,               0
##LAST=      2.2672688,     0,               0
##MIN=       0,             -68363,          0
##MAX=       2.2672688,     66400,           0
$$ Real data points
##PAGE= N=1
##DATA TABLE= (X++(R..R)), XYDATA
$$ [...]
1424i75J948j376k03J787k131Q00J165k109J520K80j811J747m88j081J822j306
$$ -975 973 -403 -606 1181 -950 -150 1015 -1094 426 706 -1105 642 154 -927 895 -411
1440d11k2J473j977J055P27k054J727K1j700K126q48j014J862j397k6J341j789
$$ -411 -433 1040 -937 118 845 -1209 518 539 -1161 965 117 -897 965 -432 -458 883 -906
1457i06R70M82j841K029n79j252K227j373n50J881j694K14J257j816J157L67j581
$$ -906 64 546 -1295 734 155 -1097 1130 -243 -793 1088 -606 -392 865 -951 206 573 -1008
1474a008J790p24q81J851j504l2J664k001O58J152j927J331J01j288J481p64o25
$$ -1008 782 58 -823 1028 -476 -508 1156 -845 -187 965 -962 369 470 -818 663 -101 -726
1491g26J770j635K30J537k158J061O73j739J510o1j399J779q90o02J523j419M00
$$ -726 1044 -591 -361 1176 -982 79 752 -987 523 462 -937 842 -48 -650 873 -546 -146
1508a46J087j912J168M23j685J629l05j292K016j083m73J399j377O02O64j568
$$ -146 941 -971 197 620 -1065 564 259 -1033 983 -100 -573 826 -551 51 715 -853
1524h53J255J4j466J954q88j006K010j324l27J568j584P85N40j505J316j35j266
$$ -853 402 416 -1050 904 16 -990 1020 -304 -631 937 -647 138 678 -827 489 354 -912
1541i12J712j003n39J914j749J16J483j759Q15N52j531J312j96r48J558j252o8
$$ -912 800 -203 -742 1172 -577 -461 1022 -737 78 630 -901 411 215 -733 825 -427 -495
1558d95J612j857N58J096j798J097L99j663J619m49p64J367j157J37J226j844
$$ -495 1117 -740 -182 914 -884 213 612 -1051 568 119 -645 722 -435 -298 928 -916
1574i16R58Q09j752J330L6j412J596o31o66J345j096K27R65j589R27L40j295J434
$$ -916 42 851 -901 429 465 -947 649 18 -648 697 -399 -172 793 -796 131 471 -824 610
1592F10m49j132J827r37p08J660j341L10Q86j370R72N0j279J561o76p90J924j381
$$ 610 161 -971 856 -81 -789 871 -470 -160 726 -644 328 378 -901 660 -16 -806 1118 -263
1610b63l67J531j490M82P10j402J186j6j048J347o63n61J547j560J28J423j652
$$ -263 -630 901 -589 -107 603 -799 387 371 -677 670 7 -554 993 -567 -439 984 -668
1627f68Q05M76j657J409Kj169J297o24k26J205j562M74J106j711J061K75j549
$$ -668 137 613 -1044 365 367 -802 495 -129 -355 850 -712 -238 868 -843 218 493 -1056
1644a056J666l08j156J427p92k07J192j476O93O66j361J114j18j124J672p19j089
$$ -1056 610 302 -854 573 -219 -426 766 -710 -17 649 -712 402 284 -840 832 113 -976
1661i76J789j064q5J060j376O29O15j391J232l82q69J613j000m69J560j355K29
$$ -976 813 -251 -336 724 -652 -23 592 -799 433 51 -818 795 -205 -674 886 -469 -240
1678b40R06j400P60M99j202J026l69n62J381j205n9J422j620N47Q37j544J172
$$ -240 666 -734 26 525 -677 349 -20 -582 799 -406 -465 957 -663 -116 721 -823 349
1695C49K84j409J195k94n49J088j100J32J041j478Q21N58j599J495j16j357J405
$$ 349 633 -776 419 125 -424 664 -436 -304 737 -741 80 638 -961 534 418 -939 466
1712D66m59m24J010j141L44J048j541Q32L00j245J396m54r83J502p74l41J097
$$ 466 7 -417 593 -548 -204 844 -697 135 435 -810 586 132 -851 651 -123 -464 633
1729F33j099L44P61j296Q70N8j008J510q08p18J690j051l66J282j247K88P84j299
$$ 633 -466 -122 639 -657 213 271 -737 773 -35 -753 937 -114 -480 802 -445 -157 627 -672
1747f72Q96N0o98J139q95l31J400j285J28R87j435R20M88j422R52m6n96R65q41
$$ -672 224 274 -424 715 -180 -511 889 -396 -268 719 -716 204 692 -730 222 176 -420 545 -296
1766b96n7J143j400M81O73j283J071N7j275J315j40q73J184p31k38J161j283M67
$$ -296 -353 790 -610 -129 544 -739 332 389 -886 429 289 -584 600 -131 -369 792 -491 -24
1784b4O02j244J163k71j106J593n30p80J137q64J22R80j353N36N04r47J005m34
$$ -24 578 -666 497 226 -880 713 183 -597 540 -324 -202 778 -575 -39 465 -482 523 89
1802H9p96J399p43n85J236j053K19J016j378M78O70j015Q88n35m85J380j061j88
$$ 89 -707 692 -51 -636 600 -453 -234 782 -596 -118 552 -463 425 -110 -595 785 -276 -464
1820d64J197j193L31P40j375Q67N10j062P84m34l48J174j117J71R36j304P61L64
$$ -464 733 -460 -129 611 -764 103 613 -449 335 -99 -447 727 -390 -219 717 -587 174 538
1838E38j371J238%j058R94m66k44R72j062K45Q02j206R47n8j165J418k57r21J129
$$ 538 -833 405 405 -653 341 -125 -369 603 -459 -214 588 -618 329 271 -894 524 267 -654 475
1857D75o08k17J019j256L65Q79j117P11r3r14J512m75r22J362q49j06J004j242
$$ 475 -133 -350 669 -587 -222 657 -460 251 158 -756 756 281 -641 721 -128 -234 770 -472
1875d72K29P91j123Q15k06o29J465j007n47J245q19o5J027j438O98O62j280Q94
$$ -472 -243 548 -575 240 34 -595 870 -137 -684 561 -258 -323 704 -734 -36 626 -654 240
1893B40j71n48J232r47j47J013j046M84L67j197Q53M55j298R40j70l47Q99q58
$$ 240 69 -479 753 -194 -341 672 -374 110 477 -720 133 588 -710 230 60 -287 612 -246
1911b46j47J080j093M50L61j094J179j07j238J249l55m12J065j023K4R14r69M83
$$ -246 -393 687 -406 44 405 -689 490 383 -855 394 39 -373 692 -331 -307 607 -362 121
1929A21J70q43J019l24q94J298m67m21R27r77J32R21j238O29K07q16J174n09o92
$$ 121 291 -552 467 143 -751 547 80 -341 586 -391 -259 662 -576 53 260 -556 618 109 -583
1948e83J111p45m2Q80j067L34P01j063M98K75p05R22o24n21J177p43p3P54j194
$$ -583 528 -217 -259 621 -446 -112 589 -474 24 299 -406 516 -108 -629 548 -195 -268 486 -708
1967g08R70L43j262Q29j4n70P91n09k42J108j000J72M70j030R32K24j296J023
$$ -708 262 605 -657 172 158 -412 379 -130 -372 736 -264 -92 378 -652 280 504 -792 231
1985B31Q5q33R62p60K2Q52q71J51N75r80R43j21j079J215j39p90J079q65O5Q54
$$ 231 316 -517 445 -315 -293 559 -312 -161 414 -566 377 256 -823 392 253 -537 542 -323 -258 596
2005E96r45L08M76q04P23k42q97J358n67m02Q58p60M3Q81j117M48L46p25P05k10
$$ 596 -349 -41 435 -369 354 112 -785 573 6 -396 462 -298 -255 626 -491 -43 303 -422 283 73
2025G3p06J074n45k73J030j097M11O30j236Q05K49q96Q24l68m11J104p09j90O64
$$ 73 -633 441 -104 -377 653 -444 -33 597 -639 166 415 -481 343 -25 -436 668 -41 -231 433
2044D33q88N18M67j170Q99J06r38Q26j77m53R30p25j75P51p21L64J72q61Q99j03
$$ 433 -455 63 530 -640 259 365 -573 253 76 -377 553 -172 -347 404 -317 47 219 -642 257 154
2064A54p09R35n86k75J169j074J46P08q19N13lq10J045k28p51J074o12k37J029
$$ 154 -555 380 -206 -481 688 -386 -240 468 -351 162 159 -651 394 166 -585 489 -123 -360 669
2083F69j063K46P02r74O18k2o62R16m23m80R29p62O9P40j043N38N73j030N81J73
$$ 669 -394 -148 554 -420 198 176 -486 430 7 -473 456 -306 -237 503 -540 -2 571 -459 122 295
2103B95p56Q74n10m15R12o93J93N15q88N25N25j118P81ln76Q47o91j65Q09p06
$$ 295 -461 413 -97 -512 400 -293 -100 415 -473 52 577 -541 240 237 -339 508 -183 -348 461 -245
2123b45K64L37r31Q22M6r04Q84j85n60J090p84j74P16o50L04K61q72R29j55p82
$$ -245 19 356 -575 247 293 -611 273 88 -472 618 -166 -340 376 -274 30 291 -581 348 193 -589
2143e89R54m88j78P78p90n2R10r54L80J95n36Q61m46n06Q70n30j24P96r31J64
$$ -589 365 -123 -301 477 -313 -365 545 -409 -29 166 -370 491 45 -461 409 -121 -245 551 -380 -216
2163b16P88r32M48P6m54O36l14m03P69m82j14O52r56N38N81j143O49J68o29O40
$$ -216 572 -360 88 164 -290 346 32 -371 398 -84 -198 454 -502 36 617 -526 123 291 -338 302
2183C02k01n89P48m39J57L45p92N67L92j085Q67Pp19Q09m85k73R66o86OL41o73
$$ 302 101 -488 260 -179 -22 323 -469 98 490 -595 272 279 -440 369 -116 -389 577 -109 -103 238 -435
2204d35N31K50q88P75j26o10R52n03k65Q62q33J91N65p83M16J12o73Q66m27k69
$$ -435 96 346 -542 233 107 -503 449 -54 -319 543 -290 -99 466 -317 99 211 -462 404 -23 -292
2224b92P01n81n9P81r05K96M47q14N75L8n86P65k72l67N82o02J98N07r42N59M34
$$ -292 409 -172 -231 550 -355 -59 388 -426 149 187 -399 366 94 -273 309 -293 -95 412 -530 29 463
2245D63r46P33j41m59P98m44k72N56o25M00K95q25N77K77q60Q84k57n21Q24n56
$$ 463 -483 250 109 -350 448 4 -268 288 -337 63 358 -467 110 387 -473 411 154 -367 457 -99
2265i9j79N93n94L28L12p83N91N6o24O65l25l37Q39o54O3N81p05M05mo22P89j94
$$ -99 -278 315 -279 49 361 -422 169 225 -399 266 -59 -396 443 -211 -148 433 -272 133 129 -493 296 102
2287A02m37Q00n65l47Q34o14N7O02p36L20J84n58N95j81m26P29n29o0P47q03K98
$$ 102 -335 465 -100 -447 387 -227 -170 432 -304 16 200 -358 237 56 -370 359 -170 -230 517 -286 12
2308A2M16q75N27Q7n08O44k54l78P11o50N8N13o49L56K78p39N37J11o75Q11l69
$$ 12 428 -447 80 167 -341 303 49 -329 382 -268 -210 303 -346 10 288 -451 86 197 -478 333 -36
2329c6l26P07n52J49M23p49M48K89p49O08n0n29O97l80k41O47n01J28L51o31L33
$$ -36 -362 345 -207 -58 365 -384 64 353 -396 212 162 -367 330 -50 -291 356 -145 -17 334 -297 36
2350C6J12m87N57j59l03O87n82q1O62p52K04L40p04O54j3m93M96k44k58P02n65
$$ 36 148 -339 218 59 -244 443 -139 -220 442 -310 -106 234 -470 184 171 -322 174 -70 -328 374 -191
2371a91J4N00n04J44L05o59N94m8o08Q11m40j09M49o15K65M50o25L95J65o47M92
$$ -191 -177 323 -181 -37 268 -391 203 155 -453 358 -82 -191 258 -357 -92 358 -267 128 293 -354 138
2392A38r2l16N29l12o0L88n90L71K76p09N99j10m84O03k32k80N21k67m8L77n47
$$ 138 46 -270 259 -53 -113 275 -315 56 332 -377 222 112 -372 231 -1 -281 240 -27 -75 302 -245
2413b45J99K31n56M95J09n73P07m22k28O31m73n5O58o66J60L06o02N51k10l30
$$ -245 -46 185 -371 124 233 -340 367 -55 -283 348 -125 -180 478 -188 -28 278 -324 227 17 -313
2433c13Q04n73k42O90n95K48K68n05K38K90p57P16j35m03O45m87j03O44p93L36
$$ -313 491 -82 -324 366 -229 19 287 -218 20 310 -447 269 134 -269 376 -111 -214 430 -363 -27
2453b7L37o44M11J23n75N90k24j74M81m54L5M03o30L19K63n30N36l4m27M15k98
$$ -27 310 -334 77 200 -375 215 -9 -183 298 -156 -121 282 -348 -29 234 -296 240 206 -221 194 -104
2474a04j60L86k51O7L43n44L24K37o72O01j99k57O31n14j51N02m51K23J38m03
$$ -104 -264 122 -129 -62 281 -263 61 298 -374 227 28 -229 402 -112 -263 239 -212 11 149 -254
2494b54K02J76l84M72k50j43M50m41N6M95o50K27L74o53L87J15m96O08m15nN16
$$ -254 -52 124 -260 212 -38 -181 269 -172 -116 379 -271 -44 330 -323 64 179 -317 291 -124 -129 387
2515C87o49J47L72m19K42K91o26L80R5n08N40l26L0L82m22Q5K62n65L48J81n45
$$ 387 -262 -115 257 -162 80 371 -255 125 220 -288 252 -74 -44 338 -84 1 263 -302 46 227 -318
2536c18N59j57l53M79k59j47N50n24K54K27n85L61o6l83O00j51l67O06k51j56
$$ -318 241 84 -269 210 -49 -196 354 -170 84 311 -274 87 21 -362 238 87 -280 326 75 -81
2556h1M14n97M07L6m49N12k01k47N40m18j03M62m57J00L48n32K59K47n30N34k23
$$ -81 333 -264 143 179 -270 242 41 -206 334 -84 -187 275 -182 -82 266 -266 -7 240 -290 244 21
2577B1k30M89l43j70O05n77J86L21n92L78j1l52N25l43j14L28k05o1K85l66K84
$$ 21 -209 280 -63 -233 372 -205 -19 302 -290 88 77 -275 250 -93 -207 121 -84 -145 140 -226 58
2598E8J70m73L76J4l54L81k23k39N68l86J03J05k78K07K49m92L98n6l80O00l48
$$ 58 228 -245 131 145 -209 172 -51 -290 278 -108 -5 100 -178 29 278 -214 184 128 -252 348 0
2619@k53N22l94J83Q9n13L50Q9l26M88k52k43N52m26j31N89n53K56J67m84L44
$$ 0 -253 269 -125 58 147 -366 -16 73 -253 235 -17 -260 292 -134 -265 324 -229 27 194 -290 54
2640E4K9l60M99k61k33N71l96J22J50l25L40Om76M65j06k20M27k98m9L32l32K0
$$ 54 83 -277 222 -39 -272 299 -97 25 175 -150 190 196 -280 185 79 -141 286 -12 -61 271 -61 -41
2662d1J79m90M00M8l75L47n3k59M24k32j02L83l10o6L46m42L29Rl63K92J0k38
$$ -41 138 -352 48 96 -279 68 15 -244 180 -52 -154 229 -81 -147 199 -243 86 95 -268 24 34 -204
2684b04L52j79j7K11l12J80J87m10K55j09k39M94j63k87N31l99M0L56n52K63P2
$$ -204 148 -31 -48 163 -149 31 218 -192 63 -46 -285 209 46 -241 290 -109 -69 287 -265 -2 70
2705G0l27K87m9l13N07k72j44N20m93J19L02m51J61K51l15K64M3l91M50k44j32
$$ 70 -257 30 -19 -332 175 -97 -241 279 -214 -95 207 -244 -83 168 -147 117 160 -231 219 -25 -157
2726a57K84l11J88K38l84J22Q0j10J36m6j28L37k68o1K96m11K61N8l21K85l0m08
$$ -157 127 -184 4 242 -142 -20 60 -50 86 40 -88 249 -19 -80 216 -195 66 124 -197 88 58 -350
2748c50L37K5k56M61k76l3K49l46K81N8l39K50j8k79L69j83n3L50l59N8K96m33
$$ -350 -13 12 -244 217 -59 -92 157 -189 92 150 -189 61 43 -236 133 -50 -103 247 -112 -54 242 -191
2770a91J84k8q2L03j91j21K66j59p6K46l89K74J69m28L40j28j68L83j99j43K87
$$ -191 -7 -35 -117 186 -5 -126 140 -19 -95 151 -238 36 205 -223 117 -11 -179 204 5 -138 149
2791A49k87n7M14m26J17J87k89K96j05j30K36j56p0L35l49J4L14l92L04j9k49
$$ 149 -138 -195 219 -207 -90 97 -192 104 -1 -131 105 -51 -121 214 -135 -121 193 -199 105 86 -163
2812a63L50p9l03L80k14r5L16k86kL03m72L72Om19L70j82j06L50k39KK11k65J16
$$ -163 187 108 -195 185 -29 -124 192 -94 -96 207 -265 107 113 -306 64 -118 -224 126 -113 -111 100 -165 -49
2835d9J53k63K15n3j52M17k32k28L93k24l4J11j06L3J43j40N9o1j57L13j53k5
$$ -49 104 -159 56 3 -149 268 36 -192 201 -23 -57 54 -52 -19 124 -16 43 -18 -175 138 -15 -40
2857d0J92k12kJ82j96m2K08l32L88j02j10K74k93J2K03j81Q8L4l05K50J33l31
$$ -40 152 -60 -62 120 -76 -118 90 -242 146 44 -66 208 -85 -73 130 -51 37 71 -234 16 149 -182
2879a82L81k35n0K95m30J34L91m01R9J28k73K67J2l17K74j84l7L64k07q5K38l89
$$ -182 199 -36 -86 209 -221 -87 304 -97 2 130 -143 124 136 -181 93 -91 -128 236 29 -56 182 -207
2901b07J44J55k64L00k0k71L02j45j89L22l00R5J00j00J77l4k36L80l25n1K75
$$ -207 -63 92 -172 128 108 -163 139 -6 -195 127 -173 -78 22 -78 99 65 -171 209 -116 -167 108
2922A08k51KL51l28J04J70l54K60K5k10P8L2j28K68l28J99K89m76K52R7l12K50
$$ 108 -143 -141 210 -118 -14 156 -198 62 87 -123 -45 -13 -141 127 -201 -2 287 -189 63 160 -152 98
2944I8j43m9L39k90k1J15r1N8J22l23L72k22n5J36m9j73L42j46j29K54k00J07
$$ 98 -45 -94 245 -45 -66 49 -42 16 138 -185 187 -35 -90 46 -3 -176 166 20 -109 145 -55 52
2966E2J2j75J44N0k69L19k70J8L00j61j76L51k54n2K12k07K83r3k38K56j82m6
$$ 52 64 -111 33 83 -186 133 -137 -119 181 20 -156 195 -59 -111 101 -106 177 84 -154 102 -80 -126
2988a26K80j64oJ05j23m7K56l18J92p6k4J01k19J93j6o9PK17l71K15R8l02L14
$$ -126 154 -10 -16 89 -34 -81 175 -143 49 -27 -51 50 -169 24 8 -61 -54 163 -208 7 105 -197 117
3011A17o3j65J74j86M6J93k35J33L8j52J16j5j76K45n6j25J42Kl4K61m38J40R3
$$ 117 54 -111 63 -123 -77 116 -119 14 52 -100 16 1 -175 70 14 -111 31 33 -1 260 -178 -38 55
3034E5l51L89m3r8K01j84j6J14j27j5K30k31J40Rk02J91J1j06K14k16k9K08k17
$$ 55 -296 93 50 -48 153 -31 -47 67 -60 -75 155 -76 64 73 -129 62 73 -33 181 -35 -64 144 -73
3057g3K2K78l85J80R5k69K73l9k17J83j43qJ25k05J51J78k55J52J08l03K47o5
$$ -73 -51 227 -158 22 117 -152 121 82 -135 48 -95 -103 22 -183 -32 146 -109 43 151 -152 95 30
3079C0j68L23l00O6K64l23N8R9k44J50L0j47L00l35R6K51j35Q3Rk73J31J04k04
$$ 30 -138 185 -115 -49 215 -108 -50 49 -195 -45 -15 -162 138 -197 -101 150 15 98 107 -166 -35 69 -135
3102a35K03q2J7J76j80r5J43q5J3J29j85K56j40j57J93q6l1K54l35M8K28l53K88
$$ -135 68 -14 3 179 -1 -96 47 -38 -25 104 -81 175 35 -122 71 -15 -46 208 -127 -79 149 -204 84
3125H4Q3l20J62On9J61k45O3K88k71j2J88r1m1J45k46J41p1jJ16j07j06K70k63
$$ 84 167 -153 9 15 -44 117 -128 -65 223 -48 -60 128 37 -4 141 -105 36 -35 -36 80 -27 -133 137 -126
3149a26Q3J45k51J85J08k48K65k8k96K06r7M4Q2j55J68k1k73K39Pj66J13J26k37
$$ -126 -43 102 -149 36 144 -104 161 133 -163 43 -54 -10 72 -83 85 64 -209 30 37 -129 -16 110 -127
3172a27J41J2p0J21j10K3L6j32R6J67l24K70j60n8L50k77O2J27k31P4P5j48J26
$$ -127 14 26 -44 77 -33 -10 26 -106 -10 157 -167 103 -57 -115 235 -42 20 147 -84 -10 65 -83 43
3195D3j26J2J95j19r5J90k13R6K46l15K39r9r9K79k14j67K70n1j85K17j97J5J68
$$ 43 -83 -71 124 5 -90 100 -113 -17 229 -86 153 54 -45 234 20 -147 123 72 -113 104 -93 -78 90
3218I0j06kK9o5J75k49k0K69r5n6J40k18R1J44l13K17n3L0J64r7j25J57j40J13
$$ 90 -16 -18 11 -54 121 -128 -148 121 26 -30 110 -108 -17 127 -186 31 -22 8 172 75 -50 107 -33 80
3242H0l4r9K17p9k17J60Q0j83K21j91Q1P1q6m1L2j28K64j09k34J95q8K6J77j57
$$ 80 46 -53 164 85 -132 28 108 -75 146 -45 36 107 21 -20 12 -116 148 39 -195 0 -88 -62 115 -42
3266d2p1L30l73J17K17l75K61k1j1Pq6j35K65r9j26K17j26NJ05m8k8J34k08M2
$$ -42 -113 217 -156 -39 178 -197 64 43 32 39 -47 -182 83 -16 -142 75 -51 -46 59 11 -17 117 -91 -49
3290d9o0J35O2k24J19L5j08K02m6j74K8J0m6J76j41m8J23PQ3L5j70J23O5k10J20
$$ -49 -109 26 88 -136 -17 18 -90 112 66 -108 -80 -70 -116 60 -81 -129 -6 1 84 119 -51 72 137 -73 47
3315D7n3l0N8q4L0P2j31J09P1j72J71m8j98L73j55o6P0k91J95J75j09J12m0k18
$$ 47 -6 -36 22 -62 -32 40 -91 18 89 -83 88 40 -158 215 60 -6 64 -227 -32 143 34 146 106 -112
3339a12K16k08K7Q6r3j02J91k1l6J94k39J35N5j62J06j01n1K06j65k1K03k45P1
$$ -112 104 -104 -77 9 -84 -186 5 -16 -52 142 -97 38 93 -69 37 -64 -115 91 -74 -95 108 -137 -66
3362f6P0m4K8R2j30J52j70M4J70l17J80O0j68N9P4l17L37l6n6R7j07j02J83j7
$$ -66 4 -40 -12 80 -50 102 -68 -24 146 -171 9 69 -99 -40 34 -283 54 18 -38 59 -48 -150 33 16
3386A6n8R3j82K33k2j94J09l9p7K13r4r9J25k3JQ2j07k9R7k31K01mk22K73j24
$$ 16 -42 51 -131 102 80 -114 -5 -44 -121 92 -2 -101 24 1 2 84 -23 -52 45 -186 15 11 -211 62 -62
3411f2L6J12k31J23J48j94J45j66M6J34j16J14M1j94mJ79k94J66P7o4J37j30j80
$$ -62 -26 86 -145 -22 126 -68 77 -89 -43 91 -25 89 130 -64 -68 111 -183 -17 60 -4 133 3 -177
3434a77K38J08j99Q2k65J19K16k23J51J30j34L8j55R4n9M5j14J19o7KJ94k12N5
$$ -177 61 169 -30 52 -213 -94 122 -101 50 180 46 84 -71 23 -36 9 -105 14 -53 -51 143 -69 -14
3457a4O5j09J75n3j70J58j14kO8o2Pk3K3J34j6j50K69j56q3J60j77m2J76j96K2
$$ -14 51 -58 117 64 -106 52 -62 -64 4 -58 -51 -74 -51 83 67 -83 186 30 -53 107 -70 -112 64 -132 -110
3482a10M9qJ25J4r2J84j10q7J58j92MK27j88J57p1k01K77j45J0P3j42P4P2j20
$$ -110 -61 -69 56 70 -22 162 52 -35 123 -69 -65 162 -26 131 60 -141 136 -9 1 74 -68 6 78 -42
3506d2J4J97k74O7O8j60K04k4j49J91Nk06J90p7o8J88j48O1l4j28J06J12k68J61
$$ -42 -28 169 -105 -38 30 -130 74 50 -99 92 97 -109 81 4 -64 124 -24 37 3 -125 -19 93 -175 -14
3530a4rK2O4j47J73R5k14J04r2l0J58q1j50J94j25JQ6l6O7p5j2j1N2r5K03j43
$$ -14 -23 -1 63 -84 89 184 -30 74 -18 -48 110 29 -121 73 -52 -51 35 -1 66 -9 -21 -32 20 -75 128 -15
3556a5p8J47j7k41L19k60P8Q8r6K38k6k15J27j17J00J9j47L6J69j42L1J3j52R6
$$ -15 -93 54 37 -204 115 -145 -67 21 -75 163 137 -78 49 -68 32 51 -96 -60 109 -33 -2 11 -141 -45
3580d5K3K2R9j40Q2j0j25J32J20k60J07m5j75L22j04Q0R7j83L0M3k72K43J1j09
$$ -45 -22 0 99 -41 41 31 -94 38 158 -102 5 -40 -215 107 3 83 180 -3 27 70 -202 41 52 -57
3604e7L3n0JJ15o0m1J39o5n2Q1j92J10J17j40J6R7j42J75o4q8Q8k3p0J48k30K00
$$ -57 -24 -74 -73 42 -18 -59 80 15 -37 44 -148 -38 79 -61 -45 52 -90 85 21 -67 21 -2 -72 76 -154 46
3630D6p6j6J31k16J12N3q2r6K79j95o0J72o6J15p8j74L40j40m5j5o9J58o9o4q
$$ 46 -30 -46 85 -131 -19 34 -48 -144 135 -60 -120 52 -14 101 23 -151 189 49 4 -11 -80 78 9 -55 -63
3655f3L9o1q0J92k03J93r6P5L8n6j6J93l24K78M6k25K29j04k05K40p2n1J93j79
$$ -63 -24 -85 -165 27 -176 17 -79 -4 34 -22 -38 155 -169 109 155 -70 159 55 -150 90 18 -33 160 -19
3679a9N0O7j94J85m0o9l4J2l9J61j11Km0J1N1Mj84L02o8j25N2qp2J68p3o0M8R
$$ -19 31 98 -96 89 49 -20 -54 -42 -81 80 -31 -29 -69 -58 -7 -3 -187 115 47 -78 -26 -34 -106 62 -11 -71 -23 -14
3707a4l7J56j17P3KOok9j75J45k07J94%o6M2K17l32J94j07o3K11j03R1j00j83
$$ -14 -51 105 -12 61 63 69 63 34 -141 4 -203 -9 -9 -75 -33 184 -148 46 -61 -124 87 -16 75 -25 -208
3732b08J94J15k53J81k2j78K10l2m3J89j08l7P2l1n4L6j62K00J3k15K15p0j58
$$ -208 -14 101 -152 29 7 -171 39 7 -36 153 45 8 80 49 -5 31 -131 69 82 -133 82 12 -146
3755a46K40j54oK23k84K34lj85J20r9r9K60j45m5J88j18p2J84j98J02O7j69K52
$$ -146 94 -60 -66 157 -127 107 104 -81 39 -60 -159 101 -44 -89 99 -19 -91 93 -105 -3 64 -105 147
3778A47k27L4N6P3j56J82l20J71J15p8k2R2J9q5j0q8J19J2k1lp4Q7J31k41K8J30
$$ 147 -80 -46 10 83 -73 109 -211 -40 75 -3 -25 67 86 1 -9 -97 22 34 13 10 -64 23 154 -87 -59 71
3804G1q3N7j09MK04j87P9K3o9LP3k65J94J49j76J46j31l3J04k70K19n7M8p4P2
$$ 71 -12 45 -64 -60 144 -43 36 59 -10 -7 66 -199 -5 144 -32 114 -17 -50 54 -216 3 -54 -6 -80 -8
3829hn4J95n0j25J47j46m4P3n2J34q7l6L5K6p8R9k3J6P6j71Q6O7j65J80Jj48L6
$$ -8 -62 133 83 -42 105 -41 -85 -12 -64 70 -17 -53 -18 8 -70 29 6 22 98 -73 13 80 -85 95 96 -52 -16
3856a6k0P9lj17J56k4j22L1M9j00K3J22r4l0L9p3R1m5l7M1k2N4R0j85K16M5k05
$$ -16 -36 43 40 -77 79 55 -67 -36 13 -87 -64 58 -36 -66 -27 -100 -9 -54 -91 -50 -72 -18 72 -113 103 148 -57
3883e7R8N2j10J55j37o6J91j27J14r6j59N0K13j26J35j15p8J01j83R5J77j29l0
$$ -57 41 93 -17 138 1 -65 126 -1 113 17 -142 -92 121 -5 130 15 -63 38 -145 -50 127 -2 -32
3906c2M1j64K20k5j27K90k25m8J99k22J07Lj15J25J21j60P3j45K3J31nj94J25
$$ -32 9 -155 65 40 -87 203 -22 -70 129 -93 14 17 -98 27 148 -12 61 -84 -61 70 65 -129 -4
3929dr1JJ29j1J01l7k17K41j04j49J35l6K4P5n2O5p4n5K8N5k33K59j8j3J22k42
$$ -4 -95 -94 35 24 125 88 -129 112 8 -141 -6 -42 -18 57 5 70 -4 -59 -31 24 -209 50 32 19 141 -101
3955a01P7Q0j72R1Q8k46K40q1o7R8q7J09J30k42P3K17l75J09J16j15L2O6q4K34
$$ -101 -24 56 -116 -25 63 -183 57 -24 -91 7 -80 29 159 -83 -10 207 -168 -59 57 -58 -26 40 -44 190
3979A90l26J25J08q5N9N5l00K76k9p9N9%j33Q0p1O7O2j27O7J33j29P2p0k0O8j51
$$ 190 -136 -11 97 12 71 126 -174 102 73 -6 53 53 -80 0 -71 -4 58 -69 -2 131 2 74 4 -16 52 -99
4005i9L6J89j94L0N6j00J16J4j16J30o4r8R8j10Q2J03j28L8O9j80O3J56k24K14
$$ -99 -63 126 -68 -38 18 -82 34 48 -68 62 -2 -100 -2 -112 -30 73 -55 -17 52 -128 -65 91 -133 81
4029H1j51M0Q4l6K5N2k08J09L3q7L2R7j06K19j87o4j3K1pL2N9K7j0j01M3J25j14
$$ 81 -70 -30 54 18 43 95 -113 -4 29 -58 -26 71 -35 184 -3 -67 -80 -59 -66 -34 25 52 42 -59 -16 109 -5
4056el7Q1j28Q9j8j00J03l3ML8J9L9J6j33n7j3R0P1j73J31O4j17J26K2k50K77
$$ -5 -42 39 -89 0 -18 -118 -15 -48 -44 -6 13 52 68 -65 -122 -135 -45 26 -147 -16 48 -69 57 79 -171 106
4082A06q3j14J89j64K6R5j54J21j2j38R1O6J4j03O8q7K20j67p0J75l8J1Oj55J77
$$ 106 23 -91 98 -66 -40 55 -99 22 10 -128 -37 29 43 -60 8 -79 141 -26 -96 79 41 52 58 -97 80
4107H0q3n7K76l79P4K70j31q9J50j58M6R7k08J85l7j61J69j70j5K01j53n9K16
$$ 80 -3 -60 216 -163 -89 181 50 -39 111 -47 -1 96 -112 73 36 -125 44 -126 -141 60 -93 -152 64
4130F4j65J35l5n0K8k7L2J92k95J08J51j13P6m6p5J04j36j0K15j19m2O9l9P1K3
$$ 64 -101 34 -1 -51 -23 -50 -18 174 -121 -13 138 25 101 55 -20 84 -52 -62 153 34 -8 61 22 93 116
4155A16l16K38jj88K46J5k58L03k14j3J10k22K68r0r3J21l3r1J69m3j67K21nj07
$$ 116 -200 38 37 -151 95 110 -148 155 -59 -72 38 -184 84 -6 -99 22 -11 -102 67 24 -143 78 73 -34
4179c4J40j28j5J84j93R1L6k35L12j75L6J44j50o8J17j15J02qj56J88q2n4M8j9
$$ -34 106 -22 -37 147 -46 45 81 -154 158 -17 19 163 13 -55 62 -53 49 41 -115 73 -9 -63 -15 -34
4203c4k8P8r2J42m8k4J29j88k6J60j64P4K7o0P2Q6o9P0j16j65J35L6j1N9pq1k
$$ -34 -62 16 -76 66 18 -6 123 -65 -91 69 -95 -21 6 -54 18 104 35 105 -11 -176 -41 -5 -16 43 36 -45 -47
4230d7m7P8j7q3L9J04j48L58k08k9R0l8k7Q0j99N7K28l37J89j14J8N3R1j44J99
$$ -47 -94 -16 -33 -116 -77 27 -121 237 29 0 90 52 25 105 -94 -37 191 -146 43 -71 -53 0 91 -53 146
4255A46j63o4J48j19P7j1j77J62o7k6K37k47R1J54j44q4J52o6L3J1p7J54j58m8
$$ 146 -17 -81 67 -52 25 14 -163 -1 -68 -94 143 -104 -13 141 -3 -87 65 -1 32 43 -34 120 -38 -86
4279h6R1L4j10J00o2p2K43k03P4M9j43N9O4K6Q2j07q6M6j20P1M2o5J30o1j0R0
$$ -86 5 39 -71 29 -33 -105 138 -65 9 58 -85 -26 38 64 146 39 -47 -1 -121 -50 -8 -73 57 -4 -14 76
4305G6k10N1K39k14p1K09j44Q6J20j46M6j50M9J88r1j16J54r9r7J63j82K26R1
$$ 76 -134 -83 156 -58 -129 80 -64 22 142 -4 42 -108 -59 129 38 -78 76 -23 -120 43 -139 87 178
4328A78l04J74LqJ11k70l1K11j06K0O5n0M3n3n0K7n1J3K11j84J8N2r7N4l0kJ03
$$ 178 -126 48 51 43 154 -116 -147 64 -42 -22 43 -7 36 -17 -67 -40 -91 -78 133 -51 -33 19 -78 -24 -54 -56 47
4355D7m1o3J10j02n4J91j29QJ22m4p2Q5j49M1J02MQp5p6J10j0K0L9p7JP5j91J19
$$ 47 6 -57 53 -49 -103 88 -41 -33 89 45 -27 58 -91 -50 52 56 64 -11 -87 23 13 33 72 -5 -4 71 -120 -1
4383am1o4K75l52J15J80Nr1l9r2J25J42k65J60n1j48K22r7j7N0%o0L2r5K25q0
$$ -1 -42 -106 169 -183 -68 112 117 26 -13 -105 20 162 -103 57 6 -142 80 -17 -34 16 16 -44 -12 -107 118 38
4409C8o7O9j13N2N8r3j4K00k10J24k8o2P9N0o5J28k93L1K76k68J01J26k10J49
$$ 38 -29 40 -73 -21 37 -56 -70 130 -80 44 16 -46 33 83 18 146 -147 -116 160 -108 -7 119 -91 58
4433E8j2j19R1j95Q8K40k30K8Q0r5R1J10j85J19Oj38J11j81N1J99k78J33O7m2
$$ 58 46 -73 18 -177 -89 151 -79 -51 29 -66 25 135 -50 69 75 -63 48 -133 -82 117 -161 -28 39 -3
4457cl4O9j93J25N5k0J45k66N1R3j97J24L9K4J53j74m4J84j12j11J31j10mJ75
$$ -3 -37 32 -161 -36 19 -1 144 -122 -71 22 -175 -51 -12 12 165 -9 -53 131 19 -92 39 -71 -75 100
4481A00j18k3Q0k05J90k0j38L79k18j18KO9O8J20k74P9J96k77L6J69q9p8J7q5
$$ 100 -18 -41 39 -166 24 4 -134 245 27 -91 -89 -20 48 168 -106 -27 169 -108 -72 97 8 -70 -53 -138
4505a38K24j62N6R6j08N4O4j98K01j36nL9J2o6kj58K07J36k06N7m2L6J5p7k4J54
$$ -138 86 -76 -20 76 -32 22 86 -112 89 -47 -52 -13 -1 -67 -69 -227 -20 116 -90 -33 -75 -39 -24 -101 -125 29
4531B9q4Q6K3p3L8J8j75K91j33pO8j30o2J37j01P0l5j02J69P9p3O8n4j08J05j54
$$ 29 -55 31 54 -19 19 37 -138 153 20 13 81 -49 -111 26 -75 -5 -40 -142 27 106 33 101 47 -61 44 -110
4557a10J62J21k57J03M2j46O6R2q2J2K3QP2j25O9p6j33K31M4m5j00K4j06J40o6
$$ -110 52 173 -84 19 61 -85 -19 73 -9 3 26 34 106 -19 50 -26 -159 72 116 71 -29 -5 -111 29 -37
4582c7k6J43j16M0M7n5O2J1j24J03n0q4J20k6n9J39j74j9J15j15J9J53j62J36
$$ -37 -63 80 -36 4 51 -4 58 69 -55 48 -2 -86 34 8 -51 88 -86 -105 10 -105 -86 67 -95 41
4606D1j2o4K08k79k1K48j67j8N6%N8r7k6K07n0j55J97r4o4J39j49r2K03k20J18
$$ 41 29 -35 173 -106 -127 121 -46 -64 -8 -8 50 -47 -73 134 84 -71 126 32 -32 107 -42 -134 69 -151 -33
4631c3Q9j53P4pJ4P7j02pK13k90J10J45k08K24k5j90J71l9m7J18j03M1k6q7P7
$$ -33 56 -97 -23 -30 -16 61 -41 -48 165 -125 -15 130 -78 146 121 -69 102 63 16 134 31 72 46 -41 36
4656C6o4rM0Q5q9O0r2%J11r4PJ8kL9o3m3J39l2l2N2r2n9J71k37J51J00j37P4J6
$$ 36 -28 -37 3 88 -1 59 -33 -33 78 -16 -9 9 7 46 -17 -60 79 47 15 67 -25 -84 87 -150 1 101 -36 38 54
4685E4j52J40rk9J3m0O3O4j67J35Nr2N4n1MJ39q5p7J48k85J70%kK0j8j25J33J2
$$ 54 -98 42 33 4 17 -23 40 104 -63 72 77 -15 39 -12 -8 131 46 -31 117 -168 2 2 0 20 2 -123 10 22
4713B2r6J96n7Q2k6j96J53o5j43J15O3j16K11j19j07J44p5j43J77j18J13j5q6
$$ 22 -74 122 65 147 121 -75 78 13 -130 -15 48 -68 143 24 -83 61 -14 -157 20 -98 15 0 -86
4736h6K00o8j30J69j05L9O8n1J3N8k62Q3P7j76J94J6j65N4Q6p5J33r2K5R0j15
$$ -86 114 46 -84 85 -20 19 87 36 49 107 -155 -72 5 -171 23 39 -126 -72 14 -61 72 -20 5 95 -20
4761b0K0Pm7L5J6j14J17m5O6Ln2P3pj03J7K6N9L0j68J12J37j89L4Rn4J69j39j9
$$ -20 0 7 -40 -5 11 -103 14 -31 35 38 -14 59 52 -51 -34 -8 51 81 -87 25 162 -27 7 16 -38 131 -8 -27
4789b7M0k8j09J39r4N8O7j41J55J3j29O0j3Q6j7m2n9j5NJ9J11o5k4J7r3P0l6M
$$ -27 13 -15 -124 15 -79 -21 46 -95 60 73 -56 4 -9 77 60 18 -41 -56 -51 -32 79 14 -10 7 -86 -16 -52 -48
4817d8R6j41l6J06m3N4Q1j57J04O9r8Q0nj01R3j02K3J31j37N9J46j79P8r1j99
$$ -48 48 -93 -129 -23 -66 -12 69 -88 16 85 -13 67 62 -39 54 -48 -25 106 -31 28 174 -5 73 -18 -217
4842b17J71J39r4oLm1J06p6M7J67k54OJ18r1M0n9j0J04j14J4J36j45M8P3j23M7
$$ -217 -46 93 -1 -7 -4 -45 61 -15 32 199 -55 -49 69 -22 18 -41 -51 53 -61 -47 89 -56 -8 65 -58 -11
4868a1L4j4R6q2pR5k87K0L27k71J26P7k07J44ml9R2j43O4Q9j39j4Q3j61O7L1m8
$$ -11 23 9 105 23 16 111 -176 -156 171 -100 26 103 -104 40 36 -3 89 -54 10 99 -40 -54 29 -132 -65 -34 -82
4895h2O7K5K4r3k5J08J07j56P3R7j63M3pj30J43o6o6K29p5k1N6k01P2R9j05L3
$$ -82 -15 10 34 -59 -84 24 131 -25 48 145 -18 25 18 -112 31 -35 -101 128 53 32 88 -113 -41 58 -47 -14
4921a4j4r3J87j32l1J83j4j23J07k17J71R5k54J66p7p0J43j24P9P0q8JK6j03J35
$$ -14 -28 -121 66 -66 -97 86 72 -51 56 -161 10 105 -149 17 -60 -130 13 -111 -32 38 -50 -49 -23 -126 9
4946Iq0n3J34q1p3L60k34j4J35j99M6J22j00J03k2o5J06j67R7N0m9o3K09j86J20
$$ 9 -71 -124 10 -71 -144 216 -18 -32 103 -96 -50 72 -28 75 53 -12 94 -73 24 74 25 -38 171 -15 105
4971A05j83N8J61k63J15P0j36k6R1Kj1j07N3L5L2J4J08j56M6p1N3K3J18j55j2
$$ 105 -78 -20 141 -122 -7 63 -73 -99 -8 -6 -17 -124 -71 -36 -4 10 118 -38 8 -63 -10 13 131 -24 -36
4996c6J05j68J39l7r4K60k04qK5M4j5n1QN5l1J8Rj30Q7R4n8j22O1N5o2J7J7J99
$$ -36 69 -99 40 3 -91 169 -35 -43 -18 26 11 -40 -32 23 -8 10 19 -111 -24 70 12 -110 -49 6 -56 -39 -22 177
5024A77j49r0J51j22q3K29k53M3J37m0P7P1j65M2J5j8N7k38L01m3j77M6J12o2
$$ 177 28 -62 89 -33 -116 113 -140 -97 40 0 77 148 -17 25 40 22 79 -159 142 99 -78 -32 80 18
5048A8k5O4r0OJ5k1O2j55M4L9J13l9K9r5J74j21r4K35j26n6J0P3r1L7j5L4q7N1
$$ 18 -7 57 -33 -27 -12 -33 29 -126 -82 -43 70 31 60 -35 139 18 -76 159 33 -23 -13 60 -31 6 -9 25 -62 -11
5076a1P5P9k88K19r5o9M9J15j55J48l7Lj3kJ6p8O6J31j36m2J79k48N7L7o7M8Q2
$$ -11 64 143 -145 74 -21 -90 -41 74 -81 67 30 33 20 18 34 -44 22 153 17 -25 154 -94 -37 0 -67 -19 63
5103F3k58J53k1M4N4j2o4J71k73R7Q3o8P0K5k31J61J3M1n1l3N0m6N3rJ00j87J23
$$ 63 -195 -42 -63 -19 35 23 -41 130 -143 -46 37 -31 39 64 -167 -6 7 48 -3 -36 14 -32 21 12 112 -75 48
5130D8J9j24R7ol4j1l1J6J38n6jMj76O1J11j33J38l1p7N2P4l3j01K5Q9j06L6R4
$$ 48 67 -57 40 34 0 -11 -42 -26 112 56 55 59 -117 -56 55 -78 60 29 -48 4 78 45 -56 -31 58 -48 -12 82
5158H2j75O7P4l6R1Rk33R3J00j15O5k9j44K31j20j35K57j20L6L0K1L8nj54J20
$$ 82 -93 -26 48 12 103 112 -121 -28 72 -43 22 -7 -151 80 -40 -175 82 -38 -2 28 49 87 82 -72 48
5183D8k6r8J31K4q3M0j08JJ28j53J12l2j38J74K1j28J67j00K4M8m3j5M7n3L9n0
$$ 48 22 -76 55 79 -4 36 -72 -71 57 -96 16 -16 -154 20 41 -87 80 -20 4 52 9 -6 41 -12 27 -23
5209b3j78K89j27K4J85p4j42J55q6rL3k2J52j99Q3%m4m1O5q0J9P0j27O9J21j13
$$ -23 -201 88 -39 -15 170 96 -46 109 23 14 47 25 177 -22 61 61 17 -24 41 -39 -20 50 -77 -8 113 0
5235@O3k8l0J12j25k0J98j42l9R1j36J42q9j5J63r5j12J03l6n8N4n3k5J24o8J71
$$ 0 63 35 5 117 -8 -28 170 28 -11 80 -56 86 -3 -18 145 50 -62 41 5 -53 1 -52 -77 47 -21 150
5261A50j34q3L8oK4J40j55k0J39j00N5n8m6J14j19j8R4m1J18j90K2P3j3m7j3L0
$$ 150 16 -67 -29 -35 -11 129 -26 -46 93 -7 48 -10 -56 58 -61 -79 15 -26 92 -98 -76 -3 -16 -63 -76 -46
5287d6m1K93j87j4R7j35j04J63o0J3KR5l1m6l9R5K7l0J12k58J09J24k00lK31k79
$$ -46 -87 206 19 5 102 -33 -137 26 -34 -21 -19 76 45 -1 -40 55 82 52 164 -94 15 139 -61 -64 167 -112
5313a12J36L6j38L2P8r3J09o3J10L0j49P4j2r0N6k0n6J46r4j49K46m7N1%j45Q2
$$ -112 24 60 -78 -46 32 -61 48 -15 95 125 -24 50 38 -52 4 -16 -72 74 -20 -169 77 30 81 81 -64 18
5339A8N1r8J26n2j31J05P4j02O3m7J02p7k0J2J5j42J18Pp8J67j58J33r8m5O1M0
$$ 18 69 -29 97 45 -86 19 93 -9 54 7 109 32 12 24 39 -103 15 22 -56 111 -47 86 -12 -57 4 44
5365D4j32J41l4j21N8J5m7K64j85o8J90k46N0J30j6n8o9J01M7P3m5o0r3J0O1n3
$$ 44 -88 53 19 -102 -44 -29 -76 188 3 -65 125 -121 -71 59 43 -15 -84 17 64 137 92 32 -61 -51 10 -43
5391d3j2P4j46J98j27P8J4p1L3K6r4N6J8K2Lj6o7L8m6j9J05j77Q1R4j29J27K8
$$ -43 -55 19 -127 71 -56 22 36 -35 -2 24 -70 -14 4 26 29 13 -54 -16 -62 -81 24 -153 -72 22 -107 20 48
5418D8j06RQ5q2Q9j20J07K3o7J52k3j34k3P7l1M6K3k5P3j22Pqj1j1J22j22R1r7
$$ 48 -58 -49 36 -46 43 -77 30 53 -14 138 115 -19 -42 35 4 50 73 48 121 -1 6 -2 -13 -24 98 -24 67 -30
5446c0k1K4J05l3q8J30k34K41k14J12o1l3K03j07n7n0J84p3R5j96m5J43k3k1J72
$$ -30 -51 -27 78 45 -43 87 -147 94 -120 -8 -69 -102 101 -6 -63 -113 71 -2 93 -103 -148 -5 -28 -49 123
5471A23j96J50j50Q1P0j17N3lo8K4J14o3JP9j97R6n4O5L9l5j5Q5k69J45L6j08
$$ 123 -73 77 -73 8 78 -39 14 11 -57 -33 81 18 19 98 -99 -3 -57 8 47 12 -3 82 -187 -42 -6 -114
5497a14K13j82O7N7j65J19J51j97J55j99n6J26J20p8k7q7J4O9j7J0O9p1L1q3l0
$$ -114 99 -83 -16 41 -124 -5 146 -51 104 -95 -151 -25 95 17 -10 -97 -83 -14 -31 -21 48 -23 8 -75 -105
5522a05K05j10q0Q3J4n9J11j56L5J9l6J09p0nQ2q7R0M8j03o9J40j74J09J39r8
$$ -105 100 -10 -90 -7 7 -52 59 -97 -62 -43 -79 30 -40 -45 37 -50 40 88 -15 -84 56 -118 -9 130 32
5547C2j3K2j19J45J4j00J8o2Q2P6n2j31J52j31J21j0j36J61Oj21M8p9L4P8J8o0
$$ 32 19 41 -78 67 81 -19 -1 -63 19 95 43 -88 64 -67 54 44 -92 69 75 -46 2 -77 -43 35 53 -7
5573gm1nN3K3m3M6J01r3M2j82L4R7o0J51j51o6R8m9M1m7J33k01K10k7q3J35k04
$$ -7 -48 -53 0 23 -20 26 127 34 76 -106 -72 25 -35 116 -35 -101 -3 -52 -11 -58 75 -126 84 57 -26 109 -95
5600i5N4K3n0J57j04o0J18k5o3K23k09M9M9n2j0L7j15L5qm8J26j6jL1j50m1J61
$$ -95 -41 -18 -68 89 -15 -75 43 18 -45 178 -31 18 67 15 5 42 -73 -38 -46 -94 32 16 15 46 -104 -145 16
5627A6j7J38j39p8P2k8N9k2L0q4Q3l8R7k2j09L2M6n4J06j66K8J23j56J46j2j01
$$ 16 -1 137 -2 -80 -8 -36 23 1 31 -53 30 -8 89 67 -42 -10 36 -18 88 -78 -50 73 -83 63 51 -50
5653e0J00j1j51J78rj01N0m6m0J91j0r3p2j48K82j23P2J3p0P1k2n9L2J06r4O4
$$ -50 50 39 -112 66 57 -44 6 -40 -80 111 101 8 -64 -212 70 -53 19 32 -38 33 11 -48 -16 90 -4 60
5679F0m7rl4j5JkN4l5Q4j04N5L6o5R6j31J08Nr6M5O3L2j35J56k72N9J85j17K7
$$ 60 13 4 -30 -45 -44 -46 8 -27 57 -47 8 44 -21 75 -56 52 57 -39 6 69 101 -34 122 -150 -91 94 -23 4
5707DN3k47K21k8M4l0n4O8J13m8k10J12mJ37k15j37K67n8J1L7Q8j03J54k25J77
$$ 4 57 -190 31 3 47 17 -37 31 144 96 -114 -2 -6 131 -84 -221 46 -12 -1 36 124 21 175 -50 127
5732A27q7j9O3j31N1K7j36R3J18k5l8K3o8%n1J41j26n0R7k3j1K8J10j67J01oj23
$$ 127 40 21 84 -47 4 31 -105 -12 106 81 43 66 -2 -2 -53 88 -38 -88 9 -14 -25 3 113 -54 47 41 -82
5759h2L9J16r5O4Oj27J37J14k13j4K0l0J26q6J01m2pN4m8j9L8q8m3J12j28J06
$$ -82 -43 73 -22 42 48 -79 58 172 -41 -55 -35 -65 61 -25 76 34 27 81 33 14 52 -36 -79 33 -95 11
5785A1qo7J25q9q4J49j47J48J1r6O6j08JL6L1l1J07j21N7K8l7l5Q2m5Q2o7K6J9
$$ 11 3 -64 61 -28 -112 37 -110 38 49 -47 19 -89 -88 -52 -21 -52 55 -66 -9 19 -18 -53 29 -16 66 -1 25 44
5813D4m0j08Q0R0n6Q1o8o2Q2K2j35J25j16R8LJ0m6K4m3K5j05m6J30OO1n5KN0m3
$$ 44 4 -104 -24 66 10 91 23 -39 43 65 -70 55 -61 37 40 50 4 28 -15 10 -95 -141 -11 -5 56 1 3 53 10
5842A0j60K95j13j14K15j28o4J14p3l0QL1K4k5o8J96n3k2jMq9R7o9RM4q1J28m6
$$ 10 -150 145 32 -82 133 5 -59 55 -18 -48 -40 -9 15 -10 -78 118 65 43 42 46 -43 54 -15 -6 38 -43 85 39
5870C9r3J03j13J67o6j28J28Q8j14Jj07J62%j7j0l2r9J15J09j09L8mj51J10o4
$$ 39 -54 49 -64 103 37 -91 37 125 11 12 -95 67 67 50 40 8 -91 24 133 24 62 58 -93 17 -47
5895d7N2M4j29J7L3NP1m9o9R9q8KP0q9O0P3j11M0jl5J39o5j18J88k31O2J86m8
$$ -47 5 49 -80 -63 -30 -25 46 -3 -72 27 -61 -59 11 -78 -18 55 -56 -16 -17 -52 87 22 -96 92 -139 -77 109 61
5923F1m8N1r9O4J7j01J19j3l9k6j4QJ0p4R4J54j11k4O9k32J40r3O1J22j30M5L
$$ 61 13 64 -35 29 46 -55 64 51 12 -14 -28 -20 -10 -84 10 164 53 29 98 -134 6 -87 -26 96 -34 11 14
5950A4J7qj45l0K36j17M3K7L0m9l0N5j09Q3mj00L9N8J03j82Q8KK5l5l7J33j05
$$ 14 31 23 -122 -152 84 -33 10 37 67 18 -12 43 -66 17 13 -87 -48 10 113 -69 19 21 46 11 -26 107 2
5977Bk9m5J09J2n2j0O4M8o8r0J15j13J41n7l5RnJ04j27j0J31l8Pj28KN8m3M8p4
$$ 2 -27 -72 37 49 -3 -13 51 99 31 -59 56 -57 84 27 -8 1 -4 100 -27 -37 94 56 63 -65 -63 -5 -48 0 -74
6006g4J50p2m1K9l3M8j1k0r4P5K3j25L7J64q5N1O4j47O1j1r2J59q1j12J24M6k9
$$ -74 76 4 -37 -8 -41 7 -4 -24 -118 -43 -20 -145 -108 56 -29 22 86 -61 0 -11 -103 56 -25 -137 -13 33 4
6033DQ1p8L6J0q3J18l5k2P5r0oj5L9k7K4j18L1o6J34L8K4l3Nm2ol7p4P4k8Q5Q8
$$ 4 85 7 43 53 -30 88 53 31 106 16 10 -5 34 7 31 -87 -56 -122 12 50 74 41 46 4 -2 -39 -113 -39 -67 18 106
6064A06j03j00L4K7L8M4J1K3j10k2N4jJ5N1o3M2Qr6L2l0J6r2K16j56O0j4j11L03
$$ 106 3 -97 -63 -36 2 46 57 80 -30 -52 2 1 16 67 4 46 54 -42 -10 -40 -24 -116 100 -56 4 -10 -121 182
6092A82j52m2r5LJ32J1k0Jj3o5J22j0r2J34p4K8l5q8J11k4r1P4R8j34O2j3L6L9
$$ 182 30 -12 -107 -104 28 39 19 20 7 -58 64 54 -38 96 22 50 15 -73 38 14 -77 -3 95 -39 23 10 46 85
6120H5k09J22o5K8q1J16j3p6J05j2n8J30m6Q1j08N6n0j23J28J5p8M1J1PO2j81
$$ 85 -124 -2 -67 -39 -120 -4 -17 -93 12 0 -58 72 26 107 -1 55 5 -118 10 25 -53 -12 -1 6 68 -113
6146a13O5Q1j83K21j14l3n7O0P3J3j7K7k7jk7J53k27J51J9j35OJ38p5j3k4R9P4
$$ -113 -48 33 -150 71 -43 -76 -133 -73 0 13 -4 23 -4 -5 -32 121 -106 45 64 -71 -65 73 -2 -15 -39 60 134
6173A34k85J13m8O0J9K3o3M9j08K6L9p0M2O4J5n0k2O2L4o4L0J2o5m1J05m3QP6
$$ 134 -151 -38 -86 -26 -7 16 -47 2 -106 -80 -41 -111 -69 -5 10 -40 -62 0 34 -30 0 12 -53 -94 11 -32 -24 52
6201E2r4N5m6p7J59n5k2P7o1j5K9kJ9r3j16J08J54p8K8j3m3O0N6q3k3j9N5k2J6
$$ 52 -42 13 -33 -110 49 -6 -28 49 -12 -27 2 0 19 -74 -190 -82 72 -6 22 9 -34 26 82 -1 -24 -43 12 -10 6
6230Fk3M7j1j35J17n7L0M9j08K71k29J00Mq3Qn6P4k8J14p5K3j6p2O1j8k3k8j0
$$ 6 -17 30 19 -116 1 -56 -26 23 -85 186 -43 57 61 -22 -14 -70 4 -24 90 15 38 22 -50 11 -7 -30 -58 -68
6258f8O1NK1l0n0J54o4pp6P7n6l0K07r9Mk12J05J53j59J08p0K4q4l8L8J27m7L6
$$ -68 -7 -2 19 -11 -61 93 29 22 -54 23 -33 -63 144 45 49 -163 -58 95 -64 44 -26 -2 -86 -124 -86 41 -6 30
6286C0j5L3q7J1P6n2O0j61J52j14l0J04J3j17J20%j24J18j9Q4k3j23K9L1j1l3
$$ 30 15 48 -39 -28 48 -4 56 -105 47 -67 -97 7 20 -97 23 23 -101 17 -2 82 59 -64 -35 -4 -15 -48
6312d8P7J7p3m4M2M9j06J04r4Q1%L1o4jj3j1J53k13J22O6m1l1L4p8N6k2m0O3p3
$$ -48 29 46 -27 -71 -29 20 -86 18 -76 5 5 36 -28 -29 -42 -53 100 -113 9 75 34 3 37 -41 15 -7 -47 16 -57
6341e7N9Q3l1j29J80j13P4j36N3N0j02O9rO5Ln3q1J37nj18N4j7l4N4k3j2M2m8
$$ -57 2 85 54 -75 105 -8 66 -70 -17 33 -69 0 -9 56 59 6 -75 62 57 -61 -7 -24 -58 -4 -27 -39 3 -45
6369d5M9nJ01m4j6k6Q6o3JJ0R%M8j30M0p1J19n3Q8j25R5j1j40M4p7K07q0Kj38
$$ -45 4 -1 100 56 40 14 100 37 38 48 57 57 105 -25 15 -56 63 10 98 -27 68 57 -83 -39 -116 91 11 13 -125
6398a25R1n4K12j80J58J8j84P1Qk9NJ00j02k7N2j10O9J05K4j03J9oK0m3m2N1o5
$$ -125 -34 -88 124 -56 102 120 -64 7 15 -14 -9 91 -11 -38 14 -96 -27 78 102 -1 18 12 32 -11 -53 -2 -67
6425f7J6L8LOM2j1Q1j31J1P5j68O1J63j17n7J18Qj00k7LP7j11J36j58J66k09K26
$$ -67 -51 -13 -10 -4 38 27 108 -23 -12 63 -105 -44 119 2 -55 63 71 -29 -56 -53 24 -87 49 -109 57 -152 74
6452G4j52O2qno1M4M6L3j03P8M4q9J01Jn9q7J19n0L9m1N9lL0j32J32p3K3o7O5
$$ 74 -78 -16 -24 -29 -90 -46 0 33 -70 8 52 -37 64 65 6 -81 38 -12 27 -14 45 42 72 -60 72 -1 22 -45 20
6481B0n7kP0k4K0jM1j36N4j72J80j8OM3j7Mn9J0rR6lo2Q6j00Q4l0o4Q4kr8K4l8
$$ 20 -37 -39 31 7 27 26 67 -69 -15 -187 -7 -25 -19 24 7 11 -48 -38 -47 49 46 -16 70 -30 54 24 -40 44 42 -56 -32 -70
6513g0KK0J45j47O4K8P3m1j64m1J65K2m9J45j31J03k22J14k4pL2K1o1L5Q3j79
$$ -70 -68 -48 97 -50 14 42 115 74 -90 -131 34 56 7 152 21 124 -98 16 -8 -15 17 38 -23 12 95 -84
6539h4QJ55J0q9k2J7n4R3J2J24j06J2n9Mj8Q1J1j48K1p1L3M0QJ49j81J49j51Q7
$$ -84 -76 79 89 0 -22 -5 -59 34 46 170 64 76 17 21 3 84 95 -53 -32 -103 -70 -30 -22 127 -54 95 -56 31
6567C1n2O5j14J30j42J98k95K04MM3j28R1j2J1n1J49k32K38q4q8M6L5q1L9mj9
$$ 31 -21 44 -70 60 -82 116 -179 25 29 72 -56 35 23 34 -17 132 -100 138 54 -34 12 47 -34 5 1 -18
6593a8Q4j06K9O6n0o5R2m6lJ9kn6pk7O7l9P6p3n0J01Pk8J20j45K7m3N8k2O1q1
$$ -18 66 -40 -11 55 5 -60 32 -14 -17 2 0 -56 -63 -90 -23 -62 14 -59 -109 -8 -1 -29 91 -54 -27 -70 -12 -34 27 -54
6623e4P5J3L6j75K0R1K4rk1pJ07q5nPL1r7nJ91j54j03J14l2Q8r1J1j02K35j62
$$ -54 21 34 70 -105 -85 6 30 21 0 -7 100 15 10 17 48 -49 -54 137 -17 -120 -6 -38 50 -41 -30 -132 103 -59
6651e9p3J65j00J75r2j4l4K1M7n1O1k2M3r5M7l0p6R0pP3N9k19J05K4k7M1j41%
$$ -59 -132 33 -67 108 16 2 -32 -11 36 -15 46 24 67 -28 19 -11 -87 3 -4 69 128 -91 14 38 11 52 -89 -89
6679h9J58j42k9R4J7rN6j79R1J6r2J63j31N2J9k5j4jJ7Q7k08P9k3R1p0K7J8j6
$$ -89 69 -73 -102 -8 9 0 56 -123 -32 -16 -108 55 -76 -24 -5 -30 -44 -45 -28 59 -149 -70 -93 -2 -72 -45 -27 -43
6707d3j4Q4kJ9o7J18k1j68J33j16J60k22K36o4r1P7n1P1j04Q5m4J02j00j0j09
$$ -43 -57 27 25 44 -23 95 74 -94 39 -77 83 -139 97 33 -58 19 -32 39 -65 20 -24 78 -22 -32 -141
6732a41J24r8J24m1Nj6J39r6o6J54k37L26k23kn1Q0K1J23k24J87o7l8J78j73j8
$$ -141 -17 -115 9 -32 -27 -43 96 0 -66 88 -149 177 -46 -48 -99 -19 2 125 -99 88 21 -17 161 -12 -30
6757c0l4L8N2l9P2q3m9J51p0O0k00J12J3m0M1j7n5Q6q0J39Mj10P3m0m2l6R9j61
$$ -30 -64 -26 26 -13 59 -24 -73 78 8 68 -132 -20 -7 -47 -6 -23 -78 8 -72 67 71 -39 34 -6 -48 -84 15 -146
6785a46J63q8K8M8j8j00J06J2K8q4J47l1j31J83j52k5J57j20R5j86K36q2Lj9j47
$$ -146 17 -71 -43 5 -13 -113 -7 5 33 -51 96 65 -66 117 -35 -60 97 -23 72 -114 122 40 43 24 -123
6810a23K61p6pJj65J38n1r8J60j25L5J30j36L5JnrO3j6q4m4Q3J6L0k1r8L8J04
$$ -123 138 62 55 56 -109 29 -22 -120 40 -85 -50 80 -56 -21 -20 -25 -34 29 13 -71 -115 -32 -16 14 -7 -105 -67 37
6838C7j07J37j44K06q4j36J92j53K1R0J3j17Q4JO9q2Q3n6j70J37L6j48M7r9R7
$$ 37 -70 67 -77 129 45 -91 101 -52 -31 59 72 -45 39 40 109 27 110 54 -116 21 57 -91 -44 -143 -46
6863d6j13J88j9l4j6Lq8K04j15N4Kl3K3j35J86n7K9j06J35q8m2J63j62Q0M9l8
$$ -46 -159 29 10 -24 -40 -37 -125 79 -36 18 20 -13 10 -125 61 4 33 -73 62 -26 -68 95 -67 13 62 24
6889B4r8J55k4j40J07mj08Q2P1j47J55q7L7LJ0p2KM5L0j8n4nN3Mj55N9K1K0l%
$$ 24 -74 81 57 -83 24 20 -88 -6 65 -82 73 -14 23 26 36 -36 -34 11 41 23 -31 -36 17 21 -134 -75 -54 -34 -37 -37
6919c7rM7j15J48M2l0q6J97j50MM4l2J07j16M1m4l1n4J21n0R0q8j2R1M0j15oj0
$$ -37 -46 1 -114 34 76 46 -40 157 7 11 55 23 130 14 55 11 -20 -74 47 -3 87 -1 -13 78 118 3 -3 -13
6947a3j3l3J34Pr0k9O5k2K7j6J9n4l0K9j1Nk7J30j06lm5J36J0QOj17J17l7j31
$$ -13 -26 -59 75 82 -8 -37 28 6 33 17 36 -18 -48 -19 -30 -25 -52 78 -28 -31 -76 60 70 78 84 -33 84 47 -84
6976h4R7j5olJ14j37O5q0L4o6Q2q1N1O8j20K15r6r4K0J30q0lP6j05K6J6ln7L6
$$ -84 13 -2 -8 -11 103 -34 31 -49 -15 -81 1 -80 -29 39 -81 134 38 -56 -36 94 14 11 87 -18 8 24 21 -36 0
7005@n1K2N7N8q1lk8jJ05K4j81Q2N1k1o0K03j18j6l6K0L1j58O3O9n0M7J4j52K25
$$ 0 -51 -29 28 86 5 2 -26 -27 78 102 -79 3 54 33 -27 176 58 42 6 26 57 -101 -38 31 -19 28 42 -110 115
7034A15q0K9r9M5J6N2k7O2j90J6J12m4j3J00j94L1J09K5m7no8M2M7N0j40K8M0
$$ 115 35 64 -35 10 26 78 51 113 -77 -61 51 7 -6 94 -100 -69 40 65 18 13 -55 -13 34 84 -56 -28 12
7061A2j1O1r6K5j7Q4p8P2j02J47j69R0m8L3l8k6j7O4j1k2k4o6J16M6l4n3l7J24
$$ 12 1 62 -34 -9 -26 58 -20 52 -50 97 -72 18 -30 3 -35 -61 -78 -14 -25 -47 -71 -137 -21 25 -9 -62 -99 25
7089B5j13J23j67J15LR5N1p2Jjn4l1M9p7o3L8J26p6%lM5o0R6j15k0J06l6O4lj4
$$ 25 -88 35 -132 -17 -14 81 132 60 61 60 6 -25 24 -53 -116 -78 48 -28 -28 -31 14 -46 50 -65 -85 21 -15 49 46 32
7119C2n4j7j5J14n7L3o2J21j30K5L2o1R3o1j5o7k6RJ67j48J70q6J2M6pj44K43
$$ 32 -22 -39 -54 60 3 36 -26 95 -35 -10 22 -39 54 -7 -22 -89 -115 -106 61 -87 83 -3 9 55 48 -96 147
7146A47j88Q1K3j22J29r3J9J7mK7j06P3Jj42J31L5M9q9R8p9M4l8O7m4o3P5p0q8
$$ 147 -41 40 63 -59 70 -23 -4 13 9 36 -70 3 4 -138 -7 28 77 -12 86 7 51 13 80 36 -27 48 -22 -110
7174a10J55k36K17l7J05K9k23N5N0k5n2K6Q1Q6j88R3p8N3J7qj69K26q3K4k4L5
$$ -110 45 -191 26 -11 94 123 -100 -45 5 -20 -72 -46 35 121 -67 26 -52 1 18 10 -159 67 -16 8 -16 19
7200A9K7q6L4J3kJ60k18L6k2J29j19J02m1m5j12J46j22J24j12M2M5J15L8j33k0
$$ 19 46 -40 -6 7 5 165 -53 -17 -39 90 -29 73 32 -13 -125 21 -101 23 -89 -47 -2 113 151 18 -2
7225bj24J58j19J10L0n1K3q7N3O5j28jK5n0J56p6J0l1L7j0M8q3j3J4O4o6J16K
$$ -2 -126 32 -87 23 53 2 25 -62 -9 56 -72 -73 -48 -98 58 -18 -8 -39 -2 -12 36 -47 -60 -46 18 -48 68 70
7253G0j26P3kj4k8J06j18L8O1j22L7P5m6Q2j32P8l4j08J70K4O8j32J0p3P0m2p1
$$ 70 -56 17 15 1 -27 79 -39 -1 60 -62 -25 50 4 86 -46 32 -2 -110 60 84 152 20 30 -43 27 -15 -86
7280h6K2%K13q0m0o9N4o9P6M5m8j36J01l0n5O6rJ04k02K9J26j00J13n3r2P7M0
$$ -86 -64 -64 149 69 29 -40 14 -55 21 66 18 -118 -17 -47 -102 -36 -45 59 -143 -114 12 -88 25 -28 -120 -43 -3
7307cL6P4m7p5o4R8k7l1K1J00j53J81r1j7J21j27o0K9O6Jp2k7N3l2k5J29j6or
$$ -3 33 107 60 -15 -79 19 -8 -39 -18 82 -71 110 19 2 123 -4 -64 -35 31 32 -40 -67 -14 -46 -71 58 42 36 27
7336B7j23L2K2o5J09J3j8n9J28j39J20n4l0J04j39J63r0P2o2j3j14O0P8n7J03
$$ 27 -96 -64 -42 -107 2 15 -3 -62 66 -73 47 -7 -37 67 -72 91 1 73 11 -2 -116 -56 22 -35 68
7361F8No3o2N8k2O9k4qQ6r0l1m9M3k6Rj6Q1q5on4J49Rn1m2J13o4l2J4q9O9j07
$$ 68 73 10 -52 6 -16 53 29 21 107 17 -14 -63 -20 -46 -37 -53 28 -57 -63 -117 32 41 -10 -52 61 -3 -35 -21 -110 -41 -148
7392a48J64o8r7K23n8q7M4j0P1J2o7l4L8O7p5m4l0P5m8j0O4J15j76N5N4N6m4L
$$ -148 16 -52 -149 74 16 -71 -27 -37 34 46 -21 -55 -17 50 -25 -69 -99 -24 -72 -82 -18 97 -79 -24 30 86 42 45
7420D5l7q7J26j53R0k2n7N1J35o1j14J6J16m8q8O4O4K1j29J00m3Q0n5L7K4j39
$$ 45 8 -79 47 -106 -16 -38 -95 -44 91 30 -84 -68 48 0 -88 -24 40 61 -68 32 -11 69 14 51 75 -64
7446f4J38j41M7PP1l7l7kJ15j6m8j34J25j3j02O1k6K1O9k4k4N1m1j8k4p3J39K2
$$ -64 74 -67 -20 -13 58 21 -16 -18 97 81 33 -101 24 11 -91 -30 -56 -35 34 10 -14 37 -4 -22 -46 -119 20 42
7474D2r7n0p2K00q2N4j3k2l4J38l9k7Ro0M7lO2o8PJ5j71J22N7M0j01Q0m9K9J8
$$ 42 -55 -105 -177 23 -59 -5 -18 -40 -74 64 25 -2 7 -53 -6 -9 53 -15 -8 7 -164 -42 15 55 -46 34 -15 14 32
7503C2N2j44K0K9NqL1k8j2JJ8n9PL7j3N2k1K7N3j09M2K5l2R3j29J00p1P8j78J35
$$ 32 84 -60 -40 -11 -6 -14 17 -11 -23 -22 -4 -63 -56 -19 -32 20 -1 26 79 -30 12 37 5 98 -31 69 -2 76 -102 33
7533C3r5Q1o0nJ46j15m8J33j81L6Q0J7L8r8K5Qok8P9J6Kj5j12j3J49j01O0o3K2
$$ 33 -62 19 -41 -46 100 -15 -63 70 -111 -75 5 22 60 -38 -13 -5 -11 -39 40 56 58 43 -69 -82 67 -34 26 -37 -15
7562a5oL9j1K3j08L6M9o1O0o9R9L8n7JrK6k7L1o4Q4Qk04R5J5K8l0j0N9M2r4k6
$$ -15 -21 18 7 30 -78 -42 7 -54 6 -63 36 74 17 18 9 35 8 39 -25 59 67 -137 -42 -27 1 -29 -39 20 62 -32 -58
7593e8O7J5n4m6R4m6M9j26Q0L8j06%J91j99J05k1NP0J0j13J16L1q8l4k4J36k08
$$ -58 9 24 -30 -76 18 -28 21 -105 -25 13 -93 -93 98 -101 4 -17 -12 58 68 -45 71 102 14 -20 -44 92 -116
7620a16N9R0pj1qkJJ21j66R9k5p5J06r7R6j18J08j95J39M3Rm0n8qk1J16L6k6k2
$$ -116 -57 33 26 15 7 5 6 127 -39 60 35 -40 66 -31 65 -53 55 -140 -1 42 51 11 -47 -55 -76 40 76 50 28
7649B8P2p4n1j97L10r0Q7j75P0P3k3mN0j74N5J60j07mM7M4j26N4o7J11n9m7J00
$$ 28 100 26 -25 -222 88 -2 85 -90 -20 53 30 26 76 -98 -43 117 10 6 53 97 -29 25 -42 69 10 -37 63
7676F3o5j6O5r4jl4J59n7P3r2l5j8p4J91L0Mo7N9j19J1m1O1J3k6J6L4j9m0K6P9
$$ 63 -2 -18 47 -47 -48 -82 77 20 93 1 -34 -52 -126 65 95 99 32 91 -28 -17 -58 3 16 -10 6 40 21 -19 7 86
7706H6k9j10O9k7m6Q5O9L8p0o9j6k2L7O7mj25j0K38k05k3K1J60j24o6R5o4j9Q2
$$ 86 57 -53 16 -11 -57 28 97 135 65 -4 -20 -42 -5 62 58 -67 -77 161 -44 -67 -46 114 -10 -76 19 -45 -64 18
7734A8K8R6k11J1P7J08k55J56oj7J6m4R4j8P6j38N6l0J6p0P0M8j07mPrJ20l4o0
$$ 18 46 142 -69 -58 19 127 -128 28 22 5 21 -23 71 53 129 -9 47 17 33 -37 33 81 -26 -30 -23 -32 88 54 -6
7763fL9L6j15R8j46J43o6l4N2L2j11MR1L7l6r8Q7o2O9l2l0R9j0Q7j15K0j00R7
$$ -6 33 69 -46 52 -94 49 -17 -51 1 33 -78 -74 17 54 18 -80 7 -55 14 -18 -48 51 41 128 13 33 -67 30
7791C0L0j83P9J41j85J20l2N3k9k6j03J06J03j18o0J03J7N6j07K9q6J41j56JN
$$ 30 60 -123 -44 97 -88 32 0 53 24 -2 -105 1 104 -14 -74 29 46 102 -5 24 -62 79 -77 -76 -71
7816g1M7MJ07m9o9ml6J21j00P2j1M1N6k3j31n6R9J4k0J2n5K5L0J3j9J9q3J38p3
$$ -71 -24 -20 87 38 -31 -35 -71 50 -50 22 11 52 108 85 -46 -102 -3 11 -9 3 -52 -27 3 16 -3 16 -67 71 -2
7845bnO6j6o3L6L8j07L3O9j24M0Q6j9r4P8nL1l5n1j9lL8n5J26l2j1kj2m6P2o8
$$ -2 -7 59 43 -20 16 54 -53 -20 49 -75 -35 51 32 -62 16 11 42 7 -44 -63 -66 -28 -83 43 11 0 -2 -14 -60 12 -56
7876e6O5k9m1Q8o6M2O2j14L3k3N6mr3Q7n9L0J6M7rk0o3J33j17nk2R2L6j14J09
$$ -56 9 -20 -61 27 -39 3 65 -49 -16 -39 17 13 -80 7 -52 -22 -6 41 32 12 -51 82 -35 -40 -62 30 66 -48 61
7905F1j38J52p9P7j12l5R2l4j6Q6n8L5j40J36R3n3n8o0M8J62j01o7J13r4%L3p7
$$ 61 -77 75 -4 73 -39 -74 18 -16 -32 54 -4 31 -109 27 120 67 9 -51 -3 159 58 -9 104 10 10 43 -34
7932c4J4k5P4p3K5K3K1r0l4J73j0j06K1J10j32Q4N0o4j2P3j68M5O4o6J8n5qJ87
$$ -34 -20 -45 29 -44 -19 4 25 -65 -99 74 64 -42 -21 89 -43 41 91 27 15 88 -80 -35 29 -37 -19 -74 -82 105
7960A05k8l5q6j4J18j06mQ9m7M0q5N5O2p5J04j8m7M1r9j5N2m5R9q4P9j08K7j1
$$ 105 77 42 -44 -58 60 -46 -50 39 -8 32 -53 2 64 -11 93 75 28 69 -30 -45 7 -38 61 -23 56 -52 -25 -36
7988c6J1J6O3j08R4q3N4O6p2o8J15r8P5j1M3K8q9K2k7O3j9m1q2J20j2K5n5L5M2
$$ -36 -25 -9 54 -54 40 -43 11 77 5 -63 52 -46 29 18 61 89 0 22 -5 58 39 -2 -84 36 24 49 -6 29 71
8017G1o5KQ6j12J12oj80J33k7p9m7K10j78R1O4j21O1Qk5m8J0q2Q2k4P8j4K4K8
$$ 71 6 8 94 -18 94 88 -92 41 14 -65 -112 98 -80 11 75 -46 15 23 -2 -50 -40 -122 -40 -64 14 0 24 52
8045E2o4l1l2O0K1k3K8MP7j27J88j89K04j99j1J07p7K5j06L0n6N2Q0n4o0J83k8
$$ 52 -12 -43 -75 -15 6 -17 11 15 92 -35 153 -36 168 -31 -42 65 -12 13 -93 -63 -119 -67 13 -41 -101 82 54
8072E4j85Q6M8M3NJ4j18R6l5p8nQ2o6J24o1kk8R5k8p8L8P7r4M1j19Q5k4K4j39
$$ 54 -131 -45 3 46 51 65 -53 43 8 -70 -75 7 -59 65 4 2 -26 69 41 -37 1 78 -16 25 -94 -9 -33 -9 -148
8101a48J24O0L5J0k5j50J21KOK5o3n7O3p6J48l0j55J7R4Lj18N5M7mQln9K3J24
$$ -148 -24 36 71 81 56 -94 27 29 35 60 -3 -60 3 -73 75 45 -110 -93 1 4 -114 -59 -12 -16 -8 -11 -70 -47 77
8130G7k7j24J11m1Q4j86J40j01R3j1j13K27j42K5q2R3Q1j37Q7n4J10j12k0K0Q1
$$ 77 50 -74 37 -4 80 -106 34 -67 26 15 -98 129 -13 12 -70 23 104 -33 54 0 110 -2 -22 -2 79
8155G9j09l8J9l8J38j09N4l0M5r1O6r5J31m5p1J01o1K9o9L9L4O8k8q8J23L0l1
$$ 79 -30 -68 -49 -87 51 -58 -4 -34 11 -80 -14 -109 22 -23 -94 7 -54 -25 -94 -55 -21 47 19 -69 54 84 53
8182E3j6P6j50l0K3M6q1J59j78
$$ 53 37 113 -37 -67 -44 2 -79 80 -98
8191i8
$$ Imaginary data points
##PAGE= N=2
##DATA TABLE= (X++(I..I)), XYDATA
0@%%%%%%%%%%%%%%%Qj6J6j6J6j6K4l2L2m0M8n4O2p2Q0q8J04j20J36j52J68j90
$$ 0 0 0 0 0 0 0 0 0 0 0 0 0 0 0 0 8 -8 8 -8 8 -8 16 -16 16 -24 24 -30 32 -40 40 -48 56 -64 72 -80 88 -102
37a02K14k38K64k92L25l61M00m41M86n36N92o51P16p88Q67r56J053j162J286j429
$$ -102 112 -126 138 -154 171 -190 210 -231 255 -281 311 -340 376 -412 455 -501 552 -610 676 -753
57g53J593j782K004k272K602l016L557m292N349p008R980j6887O3400M698j25536
$$ -753 840 -942 1062 -1210 1392 -1624 1933 -2359 2990 -4018 5962 -10925 52475 57173 -68363
72f8363J3193O1959L2668l1534j8980O269r621k610M5634K269m3665j5907K4032
$$ -68363 -55170 6789 39457 7923 -11057 -4788 -14409 -17019 28615 30884 -12781 -28688 -4656
85d656K4052j1581k8113J7813J3122j6026R364J1741j6788r352M148J4569n650
$$ -4656 19396 7815 -20298 -2485 10637 -5389 3975 15716 -1072 -10424 -6276 8293 2643
98B643k2839J8854K2620k3174q940J5009L870p458j1351R816J5542k0682r754
$$ 2643 -20196 -1342 21278 -1896 -10836 4173 8043 585 -10766 -950 14592 -6090 -15844
111a5844J9940L266l723r30l576L610j0017l245K3398n560k2251N969J4169J0419
$$ -15844 4096 7362 3639 2709 -867 2743 -7274 -10519 12879 7319 -14932 -8963 5206 15625
125A5625j0048k1938J3316J6677j3438r063K659J3749P630k6860r341K9951J0453
$$ 15625 5577 -16361 -3045 13632 194 -8869 -6210 7539 15169 -11691 -21032 8919 19372
138A9372j1864j5472j0088J4643J0383k458M639j3449j1630J8083R231m177r025
$$ 19372 7508 -7964 -18052 -3409 6974 4516 9155 -4294 -15924 2159 11390 7213 -1812
151a812j0471J2687P862j1661M219m55r682J1080R291o211j1298o824J8999R438
$$ -1812 -12283 404 8266 -3395 824 369 -9313 1767 11058 4847 -6451 -13275 5724 15162
165A5162k4830k274J8116k94l410n114j37O394q644M212J3884j6093j0920J3603
$$ 15162 -9668 -11942 6174 5880 2470 -2644 -2781 3613 -5031 -819 13065 -3028 -13948 -345
179c45P663j322j1262M05J6502j2207j4648J9774P504j4159p829L611J6577nj7340
$$ -345 7318 5996 -5266 -4861 11641 -566 -15214 4560 12064 -2095 -9924 -6313 10264 10259 -7081
194g081M289L576n365R573n23q126J065k029P481M289j3003M838Q430r628j677
$$ -7081 -2792 784 -4581 4992 4469 -3657 -2592 -4621 2860 7149 -5854 -1016 7414 -2214 -3891
209c891K440J952L950p762K271R238j2477k838J2319j954k471l512l232J0094
$$ -3891 -1451 501 4451 -3311 -1040 8198 -4279 -7117 5202 3248 777 -2735 -5967 4127
223D127j418o300O001l759k38O783o572J19J938n389P529Q70q361O180Q34l635
$$ 4127 2709 -3591 2410 -1349 -1587 5196 -1376 -1257 681 -4708 2821 3691 -4670 1510 2344 -1291
239a291K429n127L798P265r448j352L701j670P287m437p972J0268m31o090L368
$$ -1291 1138 -3989 -191 7074 -2374 -3726 -25 -1695 5592 1155 -6817 3451 3020 -3070 298
254B98k203L059K230q053M725K965n641N889k643o050P240n82j066K576p476L732
$$ 298 -1905 1154 3384 -4669 56 3021 -2620 3269 626 -5424 1816 1234 168 2744 -4732 -1000
270a000N932p824K761L281m820K139k758J102P005r025q96R652n529k013K233
$$ -1000 4932 -2892 -131 3150 -1670 469 -2289 -1187 5818 -3207 -4103 5549 20 -1993 240
285B40k476N223j852m730O518l696k724P838m014k218K495l079O180j112r782
$$ 240 -2236 2987 1135 -3595 2923 -773 -3497 4341 327 -1891 604 -2475 3705 2593 -7189
300g189P785L670o031K368j942R95L924p026K683M766o667L341R36n808O382o27
$$ -7189 596 4266 -1765 603 -1339 -344 3580 -3446 -763 4003 -2664 677 1613 -4195 2187 1560
316A560l660M504m634R27O157p096k5M139k861L336k632l952Q687l426m935O347
$$ 1560 -2100 2404 -2230 -1303 4854 -2242 -2267 1872 -989 2347 -285 -4237 4450 1024 -3911 2436
332B436k878o74L576m981L140J464n492N162n61l735N274l836j287N727n347J374
$$ 2436 -442 -1116 2460 -2521 619 2083 -3409 1753 1192 -2543 2731 -1105 -2392 3335 -2012 -638
348f38M260o743K579L107m281L213k272j485O427n154j667N246m457K575J911
$$ -638 3622 -3121 -542 2565 -1716 1497 -775 -2260 4167 -987 -2654 2592 -1865 710 2621
363B621o884N033K194n551L445j492q23N030n111j76M168m715L380J112o535N992
$$ 2621 -4263 770 2964 -2587 858 -634 -1457 3573 -1538 -1714 2454 -2261 1119 2231 -4304 1688
379A688R06n706M339j600m26M301o163R54N017m700J802n2l747O628k155m777
$$ 1688 2594 -3112 1227 -373 -799 3502 -2661 -1707 3310 -1390 412 360 -3387 3241 1086 -3691
395c691O123k687j645M765m291P78K483m268M152m81m439N780k285l085N632l598
$$ -3691 2432 -255 -1900 2865 -1426 -648 1835 -2433 1719 1238 -3201 2579 294 -2791 2841 -757
411g57k39L613n793L163L464n446K046k03j746N588m028k693N237l410J392K715
$$ -757 -996 2617 -3176 -13 3451 -1995 51 -152 -1898 3690 -338 -3031 2206 -1204 188 2903
427B903o624L478L297n225L088p88j902M814m391j020N701m118L75J371m445O051
$$ 2903 -3721 -243 3054 -2171 917 129 -1773 3041 -1350 -2370 3331 -787 -412 959 -3486 2565
443B565J78o745M524K89j935L674m152Q3M430m674J857J784m487M277r54l930
$$ 2565 2743 -4002 522 811 -1124 2550 -1602 -1519 2911 -1763 94 1878 -2609 1668 714 -3216
459c216N963k221k856M543l761O87L856m665J406J057k937M682k019l652N338
$$ -3216 2747 526 -2330 2213 -1548 -861 2995 -1670 -264 793 -2144 2538 519 -3133 2205
474B205k851q75M798n157O07L926m569K446N67l209M440k650k540N691l031r05
$$ 2205 -646 -1521 3277 -1880 -1273 2653 -1916 530 1097 -2112 2328 -322 -2862 2829 -202 -1107
490a107K952m940L787L166o733K063J818k005L696l587j773N408l723J22K820
$$ -1107 1845 -3095 692 3858 -2875 -812 1006 -999 2697 -890 -2663 2745 -978 -856 1964
505A964m492L516R53n754N328P76m485L002j779L23L847m944N15L065l826L613
$$ 1964 -2528 988 1941 -3813 1515 2291 -2194 808 -971 -648 3199 -1745 -1230 1835 -1991 1622
521A622j35m787M741r18k830N033l021j445L776l628J663J968m243L102m46k903
$$ 1622 1487 -3300 1441 523 -2307 2726 -295 -1740 2036 -1592 71 2039 -2204 898 452 -2451
537b451N270k699k514M580l578K85M534n089O22J978k561M071k190l413N283j963
$$ -2451 2819 120 -2394 2186 -1392 -1107 3427 -1662 -1040 938 -1623 2448 258 -3155 2128 165
553A65j372L490m313J661L096n590K983K332m322K495j298q58M917m271j098M073
$$ 165 -1207 2283 -2030 -369 2727 -2863 120 2452 -1870 625 -673 -1531 3386 -885 -1983 2090
569B090l580K155J379n352M152J333m517L605j306j538L755l611N31L504m379
$$ 2090 -1490 665 2044 -3308 844 2177 -2340 1265 -41 -1579 2176 -1435 -904 2600 -1779
584a779K033Q56l704M629r44m023M712j891j612M040l332K57K510l660K832K68
$$ -1779 254 1110 -2594 2035 1091 -2932 1780 -111 -1723 2317 -1015 -758 1752 -1908 924 1192
600A192l786M268j331k422M620l325q96M332m208R37K984l881K135k0k768M434
$$ 1192 -2594 1674 343 -2079 2541 -784 -1680 2652 -1556 -619 2365 -1516 619 599 -2169 2265
616B265k208k129L998l257R55L365n441J811K912m167K662L5k477L496k702o69
$$ 2265 57 -2072 1926 -1331 -376 2989 -2452 -641 2271 -1896 766 801 -1676 1820 -882 -1551
632a551M366l915L65K331m000L529Q69m965L796Q2k455L489k694q00L530l342
$$ -1551 2815 -1100 -735 1596 -2404 1125 1994 -2971 825 907 -1548 1941 -753 -1553 1977 -1365
648a365J546J603m053L341r1l799M848j194l085M073k486j40K822l725J874J421
$$ -1365 181 1784 -2269 1072 981 -2818 2030 836 -2249 1824 -662 -802 2020 -1705 169 1590
664A590l720L522o73l198M461k105j489M240l842M4L289l739J933J015l368L444
$$ 1590 -2130 1392 719 -2479 1982 -123 -1612 2628 -1214 -1170 2119 -1620 313 1328 -2040 1404
680A404j232k093M150l028o14M068m282J188K844m529K164J346k964L095j632
$$ 1404 172 -1921 2229 -799 -1413 2655 -1627 -439 2405 -2124 40 1386 -1578 1517 -115
695a15j460M052l433k13L290l768J779J721m350L525K59l449L477j324j188L306
$$ -115 -1575 2477 -956 -1169 2121 -1647 132 1853 -2497 1028 1287 -2162 1315 -9 -1197 2109
711B109l250L80K523l761K600Q86l889L919p90l112M134j839j226L292l297R99
$$ 2109 -1141 -761 1762 -1999 601 1487 -2402 1517 727 -2385 1749 -90 -1316 1976 -1321 -322
727c22K135l827K638L97l147M006j744k274M311k818p52L794l630Q98J839l338
$$ -322 1813 -2014 624 1021 -2126 1880 136 -2138 2173 -645 -1397 2397 -1233 -335 1504 -1834
743a834K787k76k619L788k062j367L866l530M01L104m161J849J878l789K618j48
$$ -1834 953 677 -1942 1846 -216 -1583 2283 -1247 -846 2258 -1903 -54 1824 -1965 653 505
759E05j957L354k574o01L541l639J083K275m256K742J230l807L061n40k073L348
$$ 505 -1452 1902 -672 -1273 2268 -1371 -288 1987 -2269 473 1703 -2104 957 417 -1656 1692
775A692k483p1L021l589J313J745l801L321j4l441L979j204k266L480k362j5K516
$$ 1692 -791 -862 2159 -1430 -117 1628 -2173 1148 1134 -2307 1672 468 -1798 1682 -680 -695 1821
792A821l395J887J024l446L343o34k677M282k413j562L855l162L25K651l434K023
$$ 1821 -1574 313 1337 -2109 1234 600 -2077 2205 -208 -1770 2085 -1077 -752 1899 -1535 488
808D88N09k946L374j246k067M019k700p07L416l711J152K451l891K282O61k744
$$ 488 997 -1949 1425 179 -1888 2131 -569 -1276 2140 -1571 -419 2032 -1859 423 1084 -1660
824a660K956j477j127L362l245M05L066m006J829J815l913K638K74k528K932j547
$$ -1660 1296 -181 -1308 2054 -1191 -786 2280 -1726 103 1918 -1995 643 917 -1611 1321 -226
840b26q96L044l348Q83K517l756K196Q59l530L579p53k597L693j843q94K798l137
$$ -226 -1122 1922 -1426 -543 1974 -1782 414 1273 -2257 1322 569 -2028 1665 -178 -1072 1726 -1411
857a411J217J734l497K864Qk986L697j469k028L999k614o35K898l049J246J370
$$ -1411 -194 1540 -1957 907 915 -2071 1626 157 -1871 2128 -486 -1121 1777 -1272 -26 1344
873A344l035K706m67k328L651k279j194L850l251K22K630l496J748J165k984K781
$$ 1344 -1691 1015 548 -1780 1871 -408 -1602 2248 -1003 -781 1849 -1647 101 1266 -1718 1063
889A063o69k086L374k271m91L100l587J215K167l720K432P75l199K940p06j540
$$ 1063 394 -1692 1682 -589 -1080 2020 -1567 -352 1815 -1905 527 1302 -1897 1043 337 -1203
905a203K835k537R1K682l501J648J514l463K780N6k923L454j288j562L122k593
$$ -1203 1632 -905 -814 1868 -1633 15 1529 -1934 846 902 -2021 1433 145 -1417 1705 -888
921h88N07K113l489K169Q43l162L189q43k323L710k081j228L399k672K81J861
$$ -888 -381 1732 -1757 412 1255 -1907 1282 439 -1884 1826 -255 -1483 1916 -756 -475 1386
937A386l057K223K99k705L215j284j661L659k685p26L402l168P41J797l007K065
$$ 1386 -1671 552 851 -1854 1361 77 -1584 2075 -610 -1336 2066 -1102 -361 1436 -1571 494
953D94J53k321L271j825j072L259k941L21K696l566J635J372l299K679j72k254
$$ 494 647 -1674 1597 -228 -1300 1959 -982 -661 2035 -1531 104 1476 -1823 856 684 -1570
969a570K846j627o31K819l205J080K099l711K239Q62l192L200p22k116L049j744
$$ -1570 1276 -351 -982 1837 -1368 -288 1811 -1900 339 1201 -1991 1209 487 -1629 1420 -324
985c24m53K214k859J504J428l465K674J63k643L274j507j693L525k266l59K317
$$ -324 -777 1437 -1422 82 1510 -1955 719 882 -1761 1513 6 -1687 1838 -428 -787 1530
1001A530k746J428R25k872K849o07k294L577k119j064L413k977J52K382k774J458
$$ 1530 -1216 212 1137 -1735 1114 507 -1787 1790 -329 -1393 2020 -957 -805 1577 -1197 261
1017B61P01k429K557q84j521L134k423m06K984l206P85K042l177K019M30k515
$$ 261 962 -1467 1090 206 -1315 1819 -604 -1010 1974 -1232 -447 1595 -1582 437 867 -1648
1033a648K836j109j316K796k534K88K611l568J740J440l371K707l5k618L098j272
$$ -1648 1188 79 -1237 1559 -975 -687 1924 -1644 96 1536 -1835 872 837 -1781 1317 45
1049D5j180K438k267O33J907l373K160P68l053L063o14k336L346j678j081K615
$$ 45 -1135 1303 -964 -331 1576 -1797 363 1131 -1922 1141 527 -1809 1537 -141 -1222 1393
1065A393k277Q02J376k910K215J94k549L025j211j349L172k416n72K817k619P09
$$ 1393 -884 -82 1294 -1616 599 793 -1756 1269 58 -1291 1881 -535 -1107 1710 -909 -200
1081b00J464k554K027k57j943K901j856q20L118k838J19K611l014J216J286k703
$$ -200 1264 -1290 737 480 -1463 1438 -418 -1238 1880 -958 -839 1772 -1242 -26 1260 -1443
1097a443K172l45j718K700j861l96K592k936R19J990l410K191O26k728K592n89
$$ -1443 729 384 -1334 1366 -495 -891 1701 -1235 -316 1674 -1736 455 1081 -1647 945 356
1113C56j831K722j715n5J987k848J490J252l169K596L0k570L039j155j545K837
$$ 356 -1475 1247 -468 -523 1464 -1384 106 1358 -1811 785 815 -1755 1284 129 -1416 1421
1129A421j877j72J917k612J541Q43k719K555l14k095L049j781q97K811k514K22
$$ 1421 -456 -628 1289 -1323 218 1061 -1658 897 583 -1512 1537 -244 -1141 1670 -844 -622
1145f22J973k574J473O02k162K335q00j587K914k231l21K712k721N41J898k854
$$ -622 1351 -1223 250 852 -1310 1025 225 -1362 1552 -679 -1000 1712 -1009 -468 1430 -1424
1161a424J792M55k167K427j139q62K510k486L08K273l064J430J240k956K343p
$$ -1424 368 823 -1344 1083 -56 -918 1592 -894 -586 1687 -1377 53 1293 -1663 680 673
1177F73k141K560j190q29K174k203O41J804k964J710Q31k744K643n40j973K885
$$ 673 -1468 1092 -98 -927 1247 -956 -315 1489 -1475 235 1066 -1678 965 425 -1548 1337
1193A337j418q06K238k283Q84J160k385J848J34k194K689j102j489K938j936l80
$$ 1337 -81 -887 1351 -932 -48 1112 -1273 575 709 -1485 1204 102 -1387 1551 -385 -765
1209g65K083k208R06J022k392K113k71j851K582j547q08K752k562K55K254k687
$$ -765 1318 -890 16 1038 -1354 759 488 -1363 1219 -328 -1136 1616 -946 -691 1563 -1124
1225a124J186J077k434J840n2j596K257j670l34K366k680P84J882k784J625N90
$$ -1124 62 1139 -1295 545 493 -1103 1154 -516 -850 1516 -1164 -380 1502 -1282 343 933
1241I33k342K146l39j460K160j574n0J878k525J217J136k694K092K02k206K489
$$ 933 -1409 737 398 -1062 1098 -476 -526 1352 -1173 44 1180 -1514 578 780 -1426 1063
1257A063r02j312K293j559M9J400k302J613N66k353K371m71j907K715j269j099
$$ 1063 161 -1151 1142 -417 -368 1032 -1270 343 909 -1444 927 456 -1451 1264 -5 -1104
1273a104K566k135L02J544k289J400M28k121K506r76j294K565k040k53K376k421
$$ -1104 1462 -673 -371 1173 -1116 284 712 -1409 1097 121 -1173 1392 -648 -901 1475 -946
1289i46O61J521k462J640K96j784K092j006r16K274k222L89J937k621J104J271
$$ -946 -285 1236 -1226 414 710 -1074 1018 12 -904 1370 -852 -463 1474 -1147 -43 1228
1305A228k477J768P9j692J973j071o01K090k201N70J646k562J621N36k367K177
$$ 1228 -1249 519 598 -1094 879 -192 -793 1297 -904 -334 1312 -1250 371 907 -1460 717
1321G17l39j560K304j286n75J941k066P90J026k238J903K3j954K457r15j467K551
$$ 717 378 -1182 1122 -164 -739 1202 -864 -74 952 -1286 617 640 -1314 1143 228 -1239 1312
1338A312j665l49J892k061R67O87j911J845l05j669K481j442p94K410k061K39
$$ 1312 -353 -702 1190 -871 96 783 -1128 717 412 -1257 1224 -218 -1012 1398 -663 -424
1354d24J788k313J107O23j927J793n88j083K095j570j71K005k150N74J419k417
$$ -424 1364 -949 158 781 -1146 647 59 -1024 1071 -499 -670 1335 -815 -241 1178 -1239
1370a239J508N42j983J868o21r43J899j515R5J667k434J234Q28k246J758J55j744
$$ -1239 269 811 -1172 696 75 -868 1031 -484 -389 1278 -1156 78 906 -1340 418 573 -1171
1387a171K025q12q87J893j666L05J393k156J296O18k166K091l26j708K411j274
$$ -1171 854 42 -845 1048 -618 -313 1080 -1076 220 838 -1328 763 437 -1271 1140 -134
1403a34p75K007j708L03J132j800J494p1j602K080q07j315K402j630l70J980j917
$$ -134 -909 1098 -610 -307 825 -975 519 448 -1154 926 119 -1196 1206 -424 -794 1186 -731
1420g31N44J037j746J366o7j440K030j087q24K180j847pJ852k198R85P51j885
$$ -731 -187 850 -896 470 403 -1037 993 -94 -918 1262 -585 -592 1260 -938 47 798 -1087
1437a087J609o9j360J717r88m02J634j852N65J336k227J315O68k065J802k92j233
$$ -1087 522 453 -907 810 -178 -580 1054 -798 -233 1103 -1124 191 859 -1206 596 304 -929
1454i29J783j208j2J426j869Q49R00k072J700j9j698K030o52j140J932j400j32
$$ -929 854 -354 -366 1060 -809 40 940 -1132 568 549 -1149 881 229 -911 1021 -379 -511
1471e11J488j699P31P96j881J695m38j344K265j273o33J838j500l0J558j905R01
$$ -511 977 -722 9 805 -1076 619 181 -1163 1102 -171 -804 1034 -466 -496 1062 -843 58
1488E8N55j444J478n73j061K105j503l34J889j726L14J293k026J121M74j463J582
$$ 58 613 -831 647 74 -987 1118 -385 -719 1170 -556 -242 1051 -975 146 620 -843 739
1505G39p62o69J719j538J32J495j971P98R84k055J562J48j503J551n96o72J553
$$ 739 -23 -692 1027 -511 -379 1116 -855 -57 927 -1128 434 582 -921 630 34 -638 915
1522I15j411K50J157j787J048N18j728J637j85j343J660p43n21J431j543M93R31
$$ 915 -496 -246 911 -876 172 690 -1038 599 414 -929 731 -12 -533 898 -645 -152 779
1539G79j740J286J68j506J794n67j080J775j188k82J504j597O34Q20j585J124
$$ 779 -961 325 493 -1013 781 214 -866 909 -279 -561 943 -654 -20 800 -785 339
1555C39j07r53J464q33o57J782j524N9J330j755P85P03j416J212l17q77J699j177
$$ 339 232 -721 743 -90 -747 1035 -489 -430 900 -855 -70 633 -783 429 112 -765 934 -243
1573b43l62J503j477L27J111j778J232J84j434J374k85r08J583j170p4J411j702
$$ -243 -605 898 -579 -252 859 -919 313 497 -937 437 152 -756 827 -343 -417 994 -708
1590g08P50O27j741J588p0j485J778n62q57J379j125J40J061j544Q67M15j432
$$ -708 42 669 -1072 516 446 -1039 739 177 -680 699 -426 -286 775 -769 98 513 -919
1607i19J561l41j368J943r03n32J394j368J80J131j489P55K86j100J556p66q42
$$ -919 642 301 -1067 876 -27 -559 835 -533 -353 778 -711 44 330 -770 786 20 -822
1624h22J679j056l63J451j531M54R95j527R76K42j184J425q61m82J475j230m4
$$ -822 857 -199 -562 889 -642 -188 807 -720 256 498 -686 739 -122 -604 871 -359 -403
1641d03J181j554Q16P49j582J184o8j021J343q89l33J529j529L79R32j543J223
$$ -403 778 -776 40 789 -793 391 323 -698 645 -244 -577 952 -577 -198 734 -809 414
1658D14K17j597J510l27r20J280p88k63J248j314M12O97j450J326n9j492J696
$$ 414 631 -966 544 217 -703 577 -211 -474 774 -540 -128 569 -881 445 386 -1106 590
1675E90m20r39J458r85l5J078j331O29M50j246J303m33r47J648q46o81J421j142
$$ 590 170 -769 689 -296 -331 747 -584 45 495 -751 552 119 -828 820 -26 -707 714 -428
1693d28J37J114j551N83P17j197J090l48p54J503j156k05J229j348M57J078j762
$$ -428 -291 823 -728 -145 572 -625 465 117 -637 866 -290 -495 734 -614 -157 921 -841
1710h41R43O23j392J154n13m72J296j164M0J154j385P14M90j551J164K85j461
$$ -841 102 725 -667 487 -26 -498 798 -366 -326 828 -557 157 647 -904 260 545 -916
1727i16J264m19m17J205j003k0R23j222Q85%j198J484k03j210J457o52m81J393
$$ -916 348 -71 -488 717 -286 -306 617 -605 280 280 -918 566 363 -847 610 -42 -523 870
1745H70j305J25R90j180Q05q4r93J416m49r23J467q81k34J235j374L37P66j165
$$ 870 -435 -310 680 -500 305 221 -772 644 195 -728 739 -142 -376 859 -515 -178 588 -577
1763e77Q32p2o88J100o18n18J257j023J16J051j680P55Q23j353P08J65p91J186
$$ -577 255 183 -505 595 -23 -541 716 -307 -191 860 -820 -65 758 -595 113 278 -513 673
1781F73r15l57J097r00L60N98j397R83M87j410J070j07p17J192r21k77J158r76
$$ 673 -242 -599 498 -402 -42 556 -841 142 629 -781 289 182 -535 657 -264 -541 617 -359
1799c59L29M17j172J226j3j262J458m46p08J181q98k26J238j067L02K85r19J200
$$ -359 -30 387 -785 441 428 -834 624 178 -530 651 -247 -473 765 -302 0 285 -634 566
1817E66l37r93J396m96n82J215j210P5J028j125M16L30q05J058n15p86J260o54
$$ 566 229 -764 632 136 -446 769 -441 -366 662 -463 -47 283 -522 536 21 -765 495 -159
1835a59j63J052j311M73R18j436N93L97r60J063m54p17J380r07K5R27j435P18
$$ -159 -322 730 -581 -108 810 -626 -33 364 -596 467 13 -704 676 -231 -206 721 -714 4
1853DO33j478J053J76q26Q26m66l89J159r75J37P88j369R31K90j374J152Jq61
$$ 4 637 -841 212 388 -438 388 -78 -467 692 -283 -146 642 -727 204 494 -880 272 273 -588
1872e88J171p76k57J129r41N1O17r08Q35l2j053J313m57o79J044q23n5J175j045
$$ -588 583 -193 -450 679 -262 -211 406 -502 333 301 -752 561 104 -575 469 -354 -409 766 -279
1891b79J14O17q97P65j31r51J284m30o10J171j010J18J141j401M13O36j034Q30
$$ -279 -165 452 -445 320 189 -762 522 92 -518 653 -357 -239 902 -499 -86 550 -484 346
1909C46l67o13J325o53l93Q55r14L36P80j364O73M80j055Q65l28m45J102o68m05
$$ 346 -21 -634 691 38 -355 500 -414 -78 702 -662 11 491 -564 301 -27 -472 630 -38 -443
1928d43R86j022N18O25j468R40L03r68Q50l82m36J105q51j23P92o59L53J92j010
$$ -443 543 -479 39 664 -804 136 439 -529 321 -61 -497 608 -243 -366 426 -233 120 312 -698
1947f98J026k4j039J271p19l30J192j073O8Q73r44M17L11j024J093k57o96R48
$$ -698 328 304 -735 536 -183 -513 679 -394 -326 547 -397 20 331 -693 400 143 -553 395
1965C95o25oR53j326L52R83r84M72M3p30R59k16o90Q54o81N7Q79j256N15O22j069
$$ 395 -230 -236 717 -609 -257 726 -258 214 257 -473 486 270 -420 434 -247 -190 689 -567 -52 570 -499
1986d99N99J56p24Q92l87n13R15p19J94N83j199Q06M02j222R05K1q16J026m69
$$ -499 100 256 -468 424 37 -476 439 -280 -86 497 -702 104 506 -716 189 210 -606 420 -49
2005d9n40J146q79L37M72j098Q32J99j026Q77j95n85J181q53l51J053p89K60K65
$$ -49 -589 557 -322 15 487 -611 221 420 -606 271 76 -509 672 -181 -532 521 -268 -8 257
2024B57q45R02L1r39J026m66l40R47q74q6J057j044L80K70r24J085j29r91J018
$$ 257 -588 314 345 -594 432 -34 -374 573 -301 -387 670 -374 6 276 -648 437 308 -683 335
2043C35m42k30R27j077L18R39j167L39M03r79Q95j53o50J088o88j00P30r53L79
$$ 335 -107 -337 590 -487 -169 770 -397 -58 345 -634 261 108 -542 546 -142 -242 488 -465 -86
2062h6P04j068N90J95q51R40l91m88R30o60N4N63r49O50L22j023P57J02p07Q91
$$ -86 618 -450 140 335 -516 424 33 -455 475 -185 -131 432 -517 133 455 -568 189 291 -416 475
2082D75o40m36J060o85N5O41p70L37M67j065Q83l19m03R91p52l66J234j004J31
$$ 475 -165 -601 459 -226 -171 470 -300 37 504 -561 322 3 -400 591 -161 -527 707 -297 -166
2101a66N10p70O90m4p01Q26k56m72Q92q16O4R31j054L00M84p73O10Pp25Q02k16
$$ -166 344 -426 264 220 -481 345 89 -383 509 -307 -243 688 -366 -66 418 -355 255 262 -463 339 123
2122A23m97Q77p66J97P42j229M88N51j072R09k78n38R72k65m32N73p23L83M01
$$ 123 -374 503 -263 -66 676 -553 -65 486 -586 323 45 -493 479 214 -218 355 -368 15 416
2141D16j005P13J75p51P25k01o72R49m18k72P19p75L82M86r84P06N9p23Q90m36
$$ 416 -589 124 299 -452 273 72 -600 349 -69 -341 378 -397 -15 471 -513 193 252 -471 419 -17
2161a7m13R75p31j47Q14p71L55J59o62N84J2n68Q20n56j42R77j088M8Q11q22M03
$$ -17 -430 545 -186 -333 481 -290 65 224 -438 146 158 -410 410 -146 -288 689 -399 -351 460 -362 41
2182D1J55p63Q54j53m27N77n10nP36q96K31P09r32M98J59p94Q76j38o99Q67o20
$$ 41 196 -567 287 134 -293 284 -226 -231 505 -391 -160 549 -383 115 274 -520 356 218 -481 386 -234
2203b34K5O72r18N05L24q20P70j56p75J096l95m70P29m64M2M35p55M74K33p50
$$ -234 -209 463 -455 50 374 -446 324 168 -607 489 94 -376 353 -111 -69 366 -389 85 318 -432
2223d32P12j94l96Q10o08l40R12o40J55M56q21N63R4p40P59k80k75Q03o88p4O84
$$ -432 280 86 -310 500 -108 -448 464 -176 -21 435 -386 177 271 -469 290 10 -265 538 -150 -224 460
2244D60o59M0N30p50N20P2o87Q14m16j79Q13q02M6O57q24L15M81q62O32o9n58
$$ 460 -199 -159 371 -379 141 213 -474 340 -76 -255 558 -244 -198 459 -365 -50 431 -431 201 132 -426
2265d26O87k82k35O21o90K46N14r33O11J81p74Q55k38n99R11n00k14P11q39L95
$$ -426 261 -21 -256 365 -325 -79 435 -498 113 294 -480 375 137 -462 449 -51 -265 446 -393 2
2285BL34q33O49N7p64R07l57m52Q41n18j42P53p57L36K92p98N97J1n64Q25n34
$$ 2 336 -497 152 209 -555 352 -5 -457 384 -134 -276 477 -280 56 348 -450 147 158 -406 419 -115
2306a15k39P74n88k6O42p51L68K03o18N90k15l46O26m49m7O72p93K40M75o09K96
$$ -115 -354 420 -168 -194 448 -303 65 268 -350 240 25 -321 305 -144 -191 481 -312 -72 403 -206 90
2327I0K03p25O62j19l81N29m93J27N54p88K98M13p68N82N6o64P12j89m81N74m11
$$ 90 293 -432 230 111 -270 259 -234 -107 447 -341 -43 370 -398 184 240 -424 288 99 -382 192 -219
2348b19M9N39o80L53R6m91O50k52m40O42j38n00O90m95J06N08p62L75K26n49N65
$$ -219 -170 369 -311 42 138 -353 297 45 -395 247 109 -391 299 -196 -90 418 -344 31 257 -292 273
2369B73k57l37P35m18k74P25p14J75M19o74L45K15n68M89j62k67O55n32k9O19
$$ 273 16 -321 414 -4 -278 447 -267 -92 327 -347 -2 213 -355 134 -28 -295 360 -172 -201 418
2389D18o53J25L96o36L10K23m54N32k90k17O16o29J84M62p52L42K47o15O02j4
$$ 418 -235 -110 286 -350 -40 183 -271 261 -29 -246 370 -259 -75 387 -365 -23 224 -391 211 197
2409A97n07O20l24j65M68n45K68K80o44M75J09o46O49j45n04O22l72L5M99o05
$$ 197 -310 310 -14 -179 289 -256 12 292 -352 123 232 -414 235 90 -414 208 -164 -129 370 -235
2429b35R8K88n87O17n9n44P20k88m08Q23n50n2M27m76K88R6m73M26O3n01N97k33
$$ -235 -137 151 -436 181 122 -422 298 10 -398 425 -125 -177 250 -226 62 158 -315 111 174 -327 270 37
2451C7j82M98o40K83K72n51L34K04n65N43k09k26M62l25l5N09o15J07M63p80M28
$$ 37 -145 353 -287 -4 268 -283 51 255 -310 233 24 -202 260 -65 -100 409 -206 -99 364 -416 12
2472A2J68o54P29k33l27O08l92j37M33n11L30J86n30M45K4m01M54k26k34O33n26
$$ 12 180 -474 255 22 -305 303 -89 -226 207 -304 26 212 -318 127 151 -250 204 -22 -256 377 -149
2493a49N9L27m41K49J85o42P03k55l82O92m39n0M35l73j23N28n83M17K3m68N71
$$ -149 -90 237 -204 45 230 -412 291 36 -346 346 -93 -143 292 -81 -204 324 -259 158 181 -287 284
2514B84l67j93O69n36j9N69n82J46K62o84N53N9l43L93j61k75N67m46K8M86o71
$$ 284 -83 -276 393 -143 -162 407 -175 -29 233 -451 102 161 -182 211 50 -225 342 -104 -76 410 -261
2535b61L01J93n15M72j65k35M70k66r4M23o00K58K91n57L62K19o06M38l7l16M29
$$ -261 40 233 -282 190 25 -210 260 -6 -100 323 -277 -19 272 -285 77 296 -310 128 91 -225 204
2556B04l03l3K61k89J51J88m14L09j9k72M29k48j69M29m49Q3L61m16J33K53l83
$$ 204 -99 -132 129 -160 -9 179 -235 74 55 -217 212 -36 -205 224 -225 -142 219 -197 -64 189 -194
2577a94M13j03l65M85l26j42M42l02j05M79n02K46J91n17M02L3l09M90m32m5L01
$$ -194 219 116 -249 236 -90 -232 210 -92 -197 282 -220 26 217 -300 102 135 -174 316 -116 -161 140
2598A40l54K17J96k92J31L05n69L48n1k96L14j82l8M72o57K44L15m35L48j6l22
$$ 140 -214 3 199 -93 38 343 -226 122 71 -225 89 -93 -131 341 -316 -72 243 -192 156 140 -182
2619a82M02j24k09L63m11K42J18l43J54J80m69M31m9k19L49l89r8N61m76J10L27
$$ -182 220 96 -113 250 -161 81 199 -144 10 190 -279 152 103 -116 233 -156 -254 307 -169 -59 268
2640B68m07J93P0m54N69k09k99M54l18l7L70m06R8K86l80K25J58m58N27k71j84
$$ 268 -139 54 124 -330 239 30 -269 185 -133 -170 200 -206 -108 178 -202 23 181 -277 250 -21 -205
2661b05L43k04j1K87l61K15J38m89N05j21k67L60k43L3K45l17N3L47m91J66J80
$$ -205 138 -66 -77 210 -151 64 202 -287 218 97 -170 190 -53 -20 225 -92 -39 308 -183 -17 163
2682A63m23M01Ml73M58k31j20L02l65J62L36n71K38J65l63L86j08k49L70l85J41
$$ 163 -260 141 145 -228 230 -1 -121 181 -184 -22 314 -257 -19 146 -217 169 61 -188 182 -203 -62
2703f2K22l90K13J50k95K62Q8l67L37j97p1L70k27j32L04k97J61J68m19K87o1
$$ -62 160 -230 -17 133 -162 100 188 -179 158 -39 -110 260 33 -99 205 -92 69 237 -182 105 44
2724D4j97M42l17k5K28l30J00K79l61MK91l21K64j03k21M08j59j52K61k18n6L70
$$ 44 -153 289 -28 -53 175 -155 -55 224 -137 -133 158 -163 101 -2 -223 185 26 -126 135 -83 -139 231
2746B31l72K59J9l18J98ok20N50l39q3L69m74J79R1l48L65J0l61M17j70j67M58
$$ 231 -141 118 137 -181 17 11 -209 341 2 -81 288 -186 -7 84 -264 101 111 -250 167 -3 -170 288
2768B88m53J76J72l05J78J12m42N24k15l41N15q3k78K86l26J12K58m63K52J66
$$ 288 -165 11 183 -122 56 168 -274 250 35 -306 209 126 -152 134 -192 -80 178 -285 -33 133
2788A33l54L13k6k80L64l02OL21k14NJ58k28K08qk91L61j85r4K96k72N7K28l25
$$ 133 -221 92 66 -214 150 -152 -146 175 -39 -34 124 -104 104 96 -195 166 -19 -113 183 -89 -32 196 -129
2811a29Q4K33l14K07n2j92K66j77N3K46l68J36J82l85L57l6k86K34L4k43K64r9
$$ -129 -45 188 -126 81 29 -163 103 -74 -21 225 -143 -7 175 -210 147 111 -175 59 93 -150 114 15
2833A5o2J54j80L3K40k93M5J46k64L22o5k61L35k65M2K40k55N2J58m00K73L0k30
$$ 15 -47 107 -73 -40 200 -93 -48 98 -166 156 91 -170 165 -100 -58 182 -73 -21 137 -263 10 40 -190
2856a90L53k66pK79k19p1L87m46J48J34l60L85r2j75K04j20r0L62l23K15J02m05
$$ -190 163 -103 -110 169 -50 -121 266 -180 -32 102 -258 127 35 -140 64 -56 -146 216 -107 108 210 -195
2878a95K24Q6l07K95rj91K25j97l2L58m23J36K73l72K67m0l34L32j10j25K24k22
$$ -195 29 115 -192 103 94 -97 128 -69 -101 257 -166 -30 243 -129 138 98 -236 96 -14 -139 85 -137
2900a37P1J32j95J92L8l47M18o9k96L62k09j66K64r8k8J79k38K24mk50L06n1l01
$$ -137 -66 66 -129 63 101 -246 172 103 -193 169 -40 -206 58 -40 -68 111 -127 97 93 -157 149 98 -203
2923b03L63k26kL00k75M8K53l24J47k1j98L50j58k32K92k66J33J30k15l6K41k22
$$ -203 160 -66 -68 232 -43 5 258 -66 81 60 -138 212 54 -178 114 -152 -19 111 -104 -140 101 -121
2945a21J39J19k83L91k57l4J88l21J10K46l97K47J40l16K45l4j83K90j29r4K79
$$ -121 18 137 -146 245 -12 -46 142 -179 -69 177 -220 27 167 -149 96 62 -121 169 40 -54 225
2966B25k57J2L8j70J52L1k2J12o1k09L61k25r2J35j07l0N0j01J83Mj34L10j73
$$ 225 -32 -20 18 -152 0 31 9 121 60 -149 212 -13 -105 30 -77 -107 -57 -158 25 29 -105 205 32
2989C2k27K92j08j68K34j60J16R9l47K45K5j11K32l36J09K23k30L9J76j48N9J64
$$ 32 -195 97 -11 -179 55 -105 11 110 -237 8 33 -78 154 -182 -73 150 -80 -41 135 -13 46 210
3011B10l59K10L0j94J99j86J02J68k54J33L5k58J79J63k18P1k6q0K53k60p1K60
$$ 210 -149 61 91 -103 96 -90 12 180 -74 59 94 -164 15 178 -40 31 5 -75 178 -82 -153 107
3033A07k75J38J21j57J23j0k01J88%j2R9k04K4J02l2P1L8k53K31l9j73K61j42
$$ 107 -168 -30 91 -66 57 47 -154 34 34 22 121 -83 -59 43 11 82 120 -133 98 59 -114 147 5
3056EL3J61k78J44M1j88K12m5k46K76r8j11K26r9j85K18j35N9J62k59J80ok21
$$ 5 38 199 -79 65 106 -82 130 85 -161 115 17 -94 132 33 -152 66 -69 -10 152 -107 73 67 -154
3079a54L09j04j79L79l36J9J84j45q7K11k56K26M9j77J94m6j83J60j17l9L06k74
$$ -154 155 51 -128 251 -85 -66 118 -27 -114 97 -159 67 116 -61 133 87 -96 64 -53 -92 214 -60
3101f0R3K0j03J46N4l20K35q1p7J76j28Q0j3j78J33J27l47K98O3l04K24m2q6J60
$$ -60 33 53 -50 96 150 -170 65 -16 -93 83 -45 35 22 -156 -23 104 -243 55 118 -186 38 -4 -90 70
3125G0r5j07K13j72K05j11p8J30m3k00K92q6p5K33k83R6R3j52M4pj52L03r1o2
$$ 70 -25 -132 81 -91 114 3 -75 55 12 -188 104 18 -57 176 -107 -11 82 -70 -26 -33 -185 118 27 -35
3149c5J25j33L4J01j73J21O4k41R3K9j50K28p6r7K32k00n1K38k25K28n2k49K43
$$ -35 90 -43 -9 92 -81 40 104 -137 -44 -15 -165 63 -13 -110 122 -78 -129 109 -116 112 60 -189 54
3172E4ok00J75Lj54K42j97L8J68k43K59n2j77J50j2j51J46n9m8J48k02K34p1k03
$$ 54 48 -152 23 26 -128 114 -83 -45 123 -120 139 87 -90 60 48 -103 43 -16 -64 84 -118 116 45 -158
3196a58K45q1j90K65q3l6J72j37j60K61k08K5J54k52J74R1j92K62k32J3J94l8
$$ -158 87 6 -184 81 -2 -38 134 -3 -163 98 -110 -85 69 -183 -9 82 -110 152 -80 -67 127 89
3218H9j29K95l44K5J27j56J27p0l2K12k28R5M3j71J24M1j88J25R5k31L25k10l1
$$ 89 -40 255 -89 -64 63 -93 34 -36 -68 144 -84 11 54 -117 7 48 -140 -15 80 -151 174 -36 -67
3241f7J80o6m9J43j67NJ63k45P6J62k29J29J4k36J96m9m9J21j73J8J42j68K84
$$ -67 113 47 -2 141 -26 -21 142 -103 -27 135 -94 35 49 -187 9 -40 -89 32 -141 -123 19 -149 135
3264A35j57j65L04j73q5K30j39K2J87l88L49r3j61J77m1j37K09j08j0Q4j19l0
$$ 135 -22 -187 117 -56 -141 89 -50 -28 159 -229 120 27 -134 43 2 -135 74 -34 -44 40 -79 -109
3286a09K31j59O5K0j78J92M1j14J35p9j22R8j05R4L0j56J56J12k56K61o9j44J12
$$ -109 122 -37 28 48 -130 62 103 -11 124 45 -77 21 -84 10 40 -116 40 152 -104 157 88 -56 56
3309E6j36N8J64j34M4p1j7J66q5k00J89pj86K67k02Q2M6j19J38m7q5J41q0j41
$$ 56 -80 -22 142 8 52 -19 -36 130 45 -155 34 27 -159 108 -94 -12 34 -85 53 6 -79 62 -18 -159
3333a59K19r6j40K98k54J6K23k54K11j3j06J27q7p9J53o4j9J49k48J10O6q9J20
$$ -159 60 -36 -176 122 -132 -116 107 -147 64 51 -55 72 -15 -94 59 -5 -24 125 -123 -13 53 -36 84
3356H4j42PP1j8j38J15K7p9J37p5J7J5QnQ0j93K89k59Q4L8j66R3J13j69j1O5p6
$$ 84 -58 -51 20 2 -136 -21 6 -73 64 -11 6 21 29 24 104 -89 200 -59 25 63 -103 -10 103 -66 -77 -12 -88
3383h8J23l8j62K59j67P0N5j42N5P9j29M0P3j47K83k19M1J42k17J04N3j99R7L7
$$ -88 35 -3 -165 94 -73 -3 52 -90 -35 44 -85 -45 28 -119 164 -55 -14 128 -89 15 68 -131 -34 3
3407Cr2J68k4j94L36j31q3J16q4l8O5k25J91K2k16K05m9j55K98k25M8J81k48M2
$$ 3 -89 79 55 -139 197 66 -17 99 15 -23 42 -183 8 30 -186 19 -30 -185 113 -112 -64 117 -131 -89
3431h9J25k62K97Rj98L07j69j21J96j14P4O4k01O6P0j16Q0J36k88K46j18m8K07
$$ -89 36 -226 71 80 -118 189 20 -101 95 -19 55 119 -82 -16 54 -62 18 154 -134 112 -6 -54 153
3454A53j65rJ18j39L2Q5j26P6n4OM4j6l9Q0j33O1K28k09N6J32l09K11q2m8Q8m
$$ 153 -12 -21 97 -42 -10 75 -51 25 -29 -23 21 5 -34 46 -87 -26 202 -7 49 181 -128 83 1 -47 41 37
3480C7m5J20k48J78M0k02P0O7q0K42r5j87K37j04r1J08j17N3K8l2O1K0q6J06j77
$$ 37 -8 112 -136 42 82 -120 -50 17 -63 179 84 -103 134 30 -61 47 -70 -17 11 -21 40 60 -26 80 -97
3505i7N0K31k76j23K62j56%K59k63J77nk2m5J6jK6n8O2J19k18M4J78k52J83j05
$$ -97 -47 184 -92 -215 47 -109 -109 150 -113 64 59 37 -8 8 7 33 -25 37 156 -62 -18 160 -92 91 -14
3530a4r2K27q1n9K7j74K10J97l84K36L9j28P8p3j01K03r2m8J17j36NN5q9J36p
$$ -14 -106 121 40 -19 8 -166 44 241 -143 93 132 4 82 9 -92 111 19 -29 88 -48 -43 12 -77 59 52
3555E2o4P8k4q4J41j66p4J26n3O4N3k81L29Kk02J32j90M7K37k00J02o5J0M1J02
$$ 52 -12 66 42 -42 99 -67 -141 -15 -68 -4 49 -232 97 99 -103 29 -161 -114 123 -77 25 -40 -30 11 113
3580A13j89J70n9k1J30j74j3J37j51K00j59r2O2J34o1j8n9p6K69j32r0K35o4k03
$$ 113 -76 94 35 14 144 -30 -43 94 -57 143 -16 -108 -46 88 27 9 -50 -126 143 11 -79 156 92 -111
3604a11J62j27J18l6j61J65j64J50L6k5j10K49k09Q6R2k31K42j35j21K89j43k9
$$ -111 51 -76 42 6 -155 10 -154 -4 32 7 -103 146 -63 23 115 -116 126 -9 -130 159 16 -13
3626a3j4PK5R3k01J24k5j74K55n2j40K38r4L8Qj64J08O7j31M5P3j81J58k2k20
$$ -13 -27 -20 5 98 -103 21 -4 -178 77 25 -115 123 29 67 75 -89 19 86 -45 0 73 -108 50 28 -192
3651a92K56q0k6P5p8L6P3j21M0M9o1K60k47J4M0J7o6J25j18Nq4K3J97j08j06J32
$$ -192 64 -16 -42 33 -45 -9 64 -57 -17 32 -29 231 -16 -2 38 55 -11 114 -4 1 -83 -60 137 29 -77 55
3677E5M4j46O2k3j18K36k8j38P0j17Q2N2k08J90j4K8M5j96J4K09j15M2N6j27J37
$$ 55 99 -47 15 -8 -126 110 82 -56 14 -103 -21 31 -177 13 -1 27 72 -124 -110 99 -16 26 82 -45 92
3702I2m8j51Q7Rj16K83k98J05L7k0J65o2j19O6o0q6J63j67K63q5j81J96k0jk5
$$ 92 44 -107 -20 -11 -127 156 -142 -37 0 -20 145 83 -36 30 -30 -116 47 -120 143 58 -123 73 53 52 27
3727B7q4nQ3o0l4K05k37l6K71j84O0J36j86J50l9q6J80k01j8J78j86M9N6j57J12
$$ 27 -57 -62 21 -39 -73 132 -105 -141 130 -54 6 142 -44 106 67 -19 161 -40 -58 120 -66 -17 39 -118 -6
3752fN8j06J58j25n7J31j55R1J31o0j04K29k61J07k6j19J92%j89J56r5j5K50j94
$$ -6 52 -54 104 -21 -78 53 -102 -11 120 60 -44 185 -76 31 5 -114 78 78 -111 45 -50 -65 185 -9
3776iL5j27p0J75k8O3O9k59L1K39o2J05n8j25J6J8n7N4q7O4K6j39J70r5k5J23
$$ -9 26 -101 -171 4 -24 39 108 -151 -120 119 57 162 104 -21 -5 13 -44 10 -77 -13 13 -126 44 -51 -76 47
3802D7P0k49J66L0j27J70k83J39J87k72J49J3j9L7K8k20J80Pm5K4p8LO3k8Q1K5
$$ 47 117 -132 34 64 -63 107 -176 -37 150 -122 27 40 21 58 86 -134 46 53 8 32 -46 -43 20 -8 73 98
3828I8j77K2J03o5K2J23j61M4n6O9Q9j65N8J74k83J21M5j95K05Nj44O2j20Q2K13
$$ 98 -79 -57 46 -19 3 126 -35 9 -47 22 111 -54 4 178 -105 16 61 -134 71 76 -68 -6 -126 -44 169
3853A69k42N1K6p4N1J60k03K24k18K6L2l1J5M7J4O3J6j40J17q8r7J56j06j6J07
$$ 169 -73 -22 4 -70 -19 141 -62 162 -56 -30 2 -29 -14 33 47 110 126 -14 103 15 -82 74 -32 -48 59
3878E9m5mJ67k34lR9j55Q9lj09K05n1j43J14r3J46K7k92L08m3j90K75j23j04R0
$$ 59 14 10 177 -57 -60 39 -116 -27 -30 -139 66 15 -128 -14 -107 39 66 -226 82 39 -151 124 1 -103 -13
3903a3l7j08K89j52J20j38j29J64l6j02J48o4K5K9l9L5J68k21O3N4o5L1Kj39K29
$$ -13 -50 -158 131 -21 99 -39 -168 -4 -40 -142 6 -58 -33 -4 -43 -8 160 -61 2 56 -9 22 24 -115 114
3928A14Pk31J83k16J06PJ3J8k4p6PJ14j96L08k15R4o6m4J25J1r9Q6l7nJ39j02
$$ 114 121 -110 73 -143 -37 -30 -17 1 -23 -99 -92 22 -174 134 -81 13 -53 -97 28 39 -60 26 -11 -16 123 21
3954B1r3J26o9J05J42k52J56o8j46J94p4q2J05j2k1O6j24J2oj04J43j0k59K43
$$ 21 -72 54 -15 90 232 -20 136 68 -78 116 42 -40 65 53 32 98 -26 -14 -20 -124 19 9 -250 -7
3978gR9j18N1o1m7J60p9R1Pk42P4J94k96K66j34J8O1L0r0J16j97O7J21n7O0q4
$$ -7 92 -26 25 -36 -83 77 -2 89 96 -146 -72 122 -174 92 -42 -24 37 67 -23 93 -104 -37 84 27 87 3
4004CP6k6m2j18K76k38P8P3k44J53Q7n2q1K8p8J87j12m8J17j06lJ92j26P5j03
$$ 3 79 53 11 -107 169 -69 9 82 -162 -9 78 26 -55 -27 -105 82 -30 -78 39 -67 -70 122 -4 71 -32
4029c2j50K51Oj84K19l9q5J70j85pJ71j40O1R2k89K72Mj12J25r8l8J70k05QJ61
$$ -32 -182 69 75 -109 110 71 -14 156 -29 -36 135 -5 56 148 -141 131 135 23 148 50 12 182 -23 -15 146
4054A46k27R7R3k40K17j21n2K96k62J27K3k44J06J21k33K79j42J0j1m2n4J13r8
$$ 146 -81 16 109 -131 86 -35 -87 209 -53 74 97 -147 -41 80 -153 126 -16 -6 -17 -59 -113 0 -98
4077i8R3K07k86N3M1q4J64j56j8J88l4p8K06j84mL3j11J29l4p5J67j31l0K07k30
$$ -98 -5 202 -84 -31 10 -74 90 -66 -84 104 70 -8 198 14 10 43 -68 61 27 -48 119 -12 -42 165 -65
4102f5J86q3j44M8J31j45Q5m8n4J74j70J16m2p8J06N5j64M3J37j83K23j42m9J86
$$ -65 121 38 -106 -58 73 -72 13 -35 -89 85 -85 31 -11 -89 17 72 -92 -49 88 -95 128 -14 -63 123
4126A23j57P2P5j40j5R5j59J25J9r3K2M9j14J91p7j3J68j46p0Q9p7M0k0rJ22k21
$$ 123 -34 38 113 -27 -42 53 -106 19 38 -55 -33 16 -98 93 16 3 171 25 -45 44 -33 7 -13 -22 100 -121
4152a21rJ39j27Q5J01k18J40J41k81K18j0r0p4O6k9J30j30J27O3j53J30m0j36
$$ -121 -130 9 -118 -33 68 -150 -10 131 -150 68 58 -32 -106 -40 -69 61 -69 58 121 -32 98 58 -78
4175g8K11p1k29J68n5L5J01q0j7O2j43J33l6k28K43J1j35J35j25K8J36r8j05R1
$$ -78 133 62 -167 1 -54 -19 82 2 -15 47 -96 37 1 -227 16 27 -108 27 -98 -70 66 -32 -137 -46
4199d6k0J62j27j3J87k35Q1M7J2m6O8k5N5j8j26J36j03k2J91k27Q1Q9k37K22M1
$$ -46 -66 96 -31 -44 143 -92 -11 36 48 2 70 45 100 82 -44 92 -11 -33 158 -69 12 101 -136 86 127
4224A27l05J41J12j28P8j06Q2J22j52r9J93j70M4J45j38O8n2o4P7j01mL01k62
$$ 127 -178 -37 75 -53 25 -81 1 123 -29 -128 65 -105 -61 84 -54 14 -38 -102 -25 -126 -130 171 -91
4247i1k1Q3l7J73j29KK6j2j01K45j07r3R6j52O3J36j32M5P8k29L20j22r0O7L2
$$ -91 -112 -29 -66 107 -22 -20 6 -6 -107 138 31 -62 34 -118 -55 81 -51 -6 72 -157 163 41 -49 18 50
4272E0jnj13P2P1j29N3M6j05O2%o1J62j87J47p3p7N6R6j43J91j55R2J7j03lR8
$$ 50 49 44 -69 3 74 -55 -2 44 -61 1 1 -60 102 -85 62 -11 -88 -32 64 -79 112 -43 49 66 -37 -40 58
4299E8K8j55J96k73J73M6j38Q8N0j28J05o8o9J20j00J40J3k6o1l4n2P8m1O4K1
$$ 58 86 -69 127 -146 27 73 -65 23 73 -55 50 -18 -87 33 -67 73 86 60 -1 -35 -87 -9 -50 14 35
4324C5L9j12O2j81J64N4k25J56Kj67J71K9o5K04k00J12rj73J79J0k48K23j30R0
$$ 35 74 -38 24 -157 7 61 -164 -8 -6 -173 -2 27 -38 166 -34 78 69 -104 75 85 -163 60 -70 20
4348B0R7j54o4J09p8M9K8r1L4N0m6J35j48j09J92j98K29N6r8q3J74j71J11j0o6
$$ 20 117 -37 -101 8 -70 -21 7 -84 -50 0 -46 89 -59 -168 24 -174 55 111 13 -70 104 -67 44 34 -32
4373c2J63k04N0K55k29m3J44j69J31m9p2R9m5o0J39q9q4J9j8J70j00j5J50j57
$$ -32 131 -73 -23 232 3 -40 104 -65 66 17 -55 44 -1 -61 78 -11 -95 -76 -94 76 -24 -39 111 -46
4397d6k6J71J9k65K65k7j19P9j38M0O4j27J59o3p9J94j69j7J69j45J6J27m9j43
$$ -46 -72 99 118 -147 118 91 -28 51 -87 -47 17 -110 49 -14 -93 101 -68 -85 84 -61 -45 82 33 -110
4421a10K49k79J70J01k48J79m0j21K00j21k2J51k31M7J18j61J63N0j18K7k1L8
$$ -110 139 -140 30 131 -117 62 22 -99 101 -20 -42 109 -122 -75 43 -118 45 95 -23 4 -17 21
4443B1M3k10N8J69k52K32n0k09L25j14j65J81k7n6J34k18J93O2k05J47Oj64J76
$$ 21 64 -146 -88 81 -171 61 11 -198 127 13 -152 29 2 -54 80 -138 55 117 -88 59 65 -99 77
4466G7l9k53L74j12m0J15q4R3K0k49J27O1k78L85j52j57J56rk5Q8k28J74j1j62
$$ 77 38 -215 159 47 7 122 38 131 151 -98 29 90 -188 197 45 -112 44 35 10 98 -130 44 33 -129
4490a29O5K2lJ35k02n5J99j9l7Q9j42J52L5j52O7Kq4J72j13q2J88j90J70k0j63
$$ -129 -64 -42 -45 90 -112 -167 32 13 -24 65 -77 75 110 -42 25 27 -57 115 2 -80 108 -82 88 68 -95
4515i5K3L7k4J50j65N7J74k44J23j1K1m5P5q5J3%m3J27j27k1N0j4L4n5k1P3J50
$$ -95 -72 -35 -59 91 -74 -17 157 -87 36 25 46 1 76 -9 4 4 -39 88 -39 -60 -10 -24 10 -45 -66 7 157
4542A57k23J48o3k0M1j90J46O5j97P4J11j26J36l3j76J79j02N3Q7q8L1Pk8QN9
$$ 157 -66 82 19 -1 40 -150 -4 61 -136 -62 49 -77 59 26 -150 29 -73 -20 67 -21 10 17 -11 -3 56
4567E6j02J31j01j39J80j04N7J9m3O1K9m9l3J07k41R8o3J04J15j70j0P9r5J10
$$ 56 -46 85 -16 -155 25 -79 -22 -3 -46 15 44 -5 -38 69 -172 -74 -137 -33 82 -88 -98 -19 -114 -4
4591d%q5J98l0k02J59o8K4J24q4l8m7O7o1J43j35Q8K6k17K27j42n6K29j96J31
$$ -4 -4 -89 109 79 -123 36 -32 -8 116 32 -6 -53 14 -47 96 -39 49 75 -142 85 -57 -113 116 -80 51
4616E1O7j42k2Pj13J71l4j17K58j78KJ49k62K30%j46J13N1r3J92p7p3m7O9l5K2
$$ 51 118 -24 -46 -39 -152 19 -15 -132 126 -52 -50 99 -163 67 67 -79 34 85 -8 184 107 34 -13 56 21 43
4642D3q6R4Q9j94L7Q0p0R2n0j03J37J0j06L9l1O5o0k42L76j83k1J66N7j21j09
$$ 43 -43 51 140 -54 -17 63 -7 85 35 -68 69 79 -27 12 -19 46 -14 -256 120 -63 -84 82 139 18 -91
4667i1R7k9O1q3J4R0j63R6R2j40K05j86m4J31j69K39m2m8J24j05j10J56M3r0J3
$$ -91 6 -23 38 -45 -31 59 -104 -8 84 -56 149 -37 -81 50 -119 120 78 30 154 49 -61 95 138 48 61
4692F1L1r0R3p8o0K9o7J03o2p2J07L7m2J94j84j17J01Omlp4J41j18K9J65J9k14
$$ 61 92 2 95 17 -43 -14 -81 22 -40 -112 -5 32 -10 184 0 -117 -16 -10 -14 -17 -91 50 -68 -39 126 145 -69
4719f9J76k68J73J07k03Q6k8J4J79k09l2J02j18K12j51j63K04J24k14K07n2r4
$$ -69 107 -161 12 119 -84 2 -26 -12 167 -42 -74 28 -90 122 -29 -192 12 136 -78 129 77 -17
4741a7L9N1j38J91j66M6K5j04J4K0j28O6J02l9j1J19j53J36j17L4O1j07J18K5
$$ -17 22 73 -65 126 -40 6 31 -73 -59 -39 -167 -101 1 -38 -49 70 -83 53 -64 -30 31 -76 42 67
4765F7k49K59L5k67K28n9l7Q9o9P6k3k2p6J13j91J68j9p2J04n0K1J04j98J54k4
$$ 67 -182 77 112 -155 73 14 -23 66 -3 73 50 28 -48 65 -126 42 23 -49 55 5 26 130 -68 86 62
4790F2j02J21j1j30P8k5j73K40j93J05L9q5J03M7k13J51L1j18J78j16l5L9j6K1
$$ 62 -40 81 70 -60 18 -7 -180 60 -133 -28 11 -74 29 76 -137 14 45 -73 105 -11 -46 -7 -23 -2
4814bJ7m6nP9oJ25j62m2K61k61N4Q0j70J20J8j61J61o2m1kj3J3j2N3L8O6p6jJ41
$$ -2 15 -31 -36 43 37 162 0 -42 219 -42 12 92 -78 42 60 -101 60 -2 -43 -45 -58 -45 -57 -4 34 100 24 23 164
4843A64k37J52p5m2J08j39%J39j28J8R2j80K05l5p2J09o7p2J38k17Q1K17j06j0
$$ 164 -73 79 4 -38 70 -69 -69 70 -58 -40 52 -128 77 42 -30 79 12 -60 78 -139 -58 159 53 43
4867D3l0JL5j34J32J6k7j63K10j71L2J20j92J90m2j07N5R3j09J68j21p5J33m8
$$ 43 13 14 49 -85 47 63 36 -127 83 -88 -56 64 -128 62 20 -87 -32 61 -48 120 -1 -76 57 9
4891IO4m5m1j5K2M1j5r4P2L5o9j9J99j41L0L4j52N9J68k16M5M1%J25j46L8O2j30
$$ 9 73 28 -13 -28 -6 35 20 -74 -2 33 -36 -55 144 3 33 67 -85 -26 142 -74 -29 12 12 137 -9 29 91 -39
4919c9j02J36j06m5J33o2Q3J0qQ0q5q8P7J06p2L9j07K6N7o8O6l4K4pp0j1J29j68
$$ -39 -141 -5 -111 -156 -23 -85 -2 8 0 80 -5 -93 -16 90 18 57 -50 -24 33 -35 31 -3 21 14 -56 -67 62 -106
4947a06J00Jo6N1J1n9J73j31R5Qj21J20p6q8P4Jo4J86j27j41Q5M7n8J71j34L4
$$ -106 -6 -5 -71 -20 -9 -68 105 -26 69 77 -44 76 0 -88 -14 -13 -77 109 -18 -159 -74 -27 -85 86 -48 -14
4973a4%q8R1o1l1J38p5R3R2k19P1L7j54J72oj41N9N0j1KO8k13J67j2m7R6j54O4
$$ -14 -14 -102 -11 -72 -103 35 -40 53 145 -74 -3 34 -120 52 46 -95 -36 14 3 5 73 -140 27 15 -32 64 -90 -26
5001b6Q4r9N6K6j66K29q3%rj8m1J1k2R6r5L4J39r0m1J3r2J11O3j75J60P1l10K41
$$ -26 58 -41 15 41 -125 104 21 21 12 -6 -47 -36 -58 38 -57 -23 116 26 -15 -2 -94 17 80 -95 65 136 -174 67
5029F7j01L3J26j87J3K7k8l5k0J45n6M7j15J81j48RJ79k24J95p0j17K8M1j36J55
$$ 67 -34 -1 125 -62 -49 -22 -50 -85 -105 40 -16 31 -84 97 -51 -42 137 -87 108 38 -79 -51 -10 -146 9
5054Ipl7l0P8j76K53j52J3R5r8O5O4j72kJ25m7J49k07J41j3n7J5J7j05J8J13q4
$$ 9 2 -35 -65 13 -163 90 -62 -49 46 -52 13 77 -95 -97 28 -19 130 -77 64 51 -6 9 26 -79 -61 52 -32
5081c2P0n9l0J22j31L3P8j04n4R1o6K09o9j72O7K2NJ28j66J3K2n3k4N1J3J08j49
$$ -32 38 -21 -51 71 -60 -27 51 -53 -107 -16 -82 127 58 -114 -47 -25 -20 108 -58 -45 -23 -76 -100 -49 -36 72 -77
5108g7j8J70J9j00j9nm8K39k04J03p4L9R0q2j85J50o8N3J32j39J8N0j10o5K15
$$ -77 -95 75 94 -6 -25 -30 -78 161 -43 60 -14 25 115 33 -152 -2 -70 -17 115 -24 -6 44 -66 -131 84
5133H4r0J36l9j25Q8n0J9R0j67J59j13q8N6Q5j63K35q7j2NJ7o2O2m1k1L9p4O4
$$ 84 -6 130 91 -34 54 4 23 113 -54 105 -8 -96 -40 45 -118 117 30 18 23 40 -22 40 -1 -22 17 -57 7
5160GQ5j75J73q8o6M7m5Q0lo4K5k0j25K10o7k8J57j31L6%l2K0J34j54N9l7N7j09
$$ 7 92 -83 90 2 -64 -17 -62 18 15 -49 -24 -44 -169 41 -26 -54 103 -28 8 8 -24 -4 130 -24 35 -2 55 -54
5188e4l1J5N2M5r3J37j12R2j7l4%L8j00O5p7R3q1N8N1p1J5J3j6l2lN8r4K5P7k8
$$ -54 -85 -70 -18 27 -66 71 -41 51 34 0 0 38 -62 3 -74 19 -62 -4 47 -24 -9 4 -12 -44 -47 11 -83 -58 19 -9
5218iQ9n1N7O6j99RN8Qmk8m9J14n3j1L0j61J04j50P8J72r8J2J18j35k9J62O1k51
$$ -9 80 29 86 152 -47 -38 20 28 24 -4 -53 61 8 -3 27 -134 -30 -180 -102 70 -28 -16 102 -33 -62 100 161 -90
5246i0J63p3O3pj53M2K00k10J00pn0k9k2J51L1q9Q0kj41L3n1R0J53k18L5R9j84
$$ -90 73 0 63 56 -97 -55 145 -65 35 28 -22 -51 -73 78 109 20 100 98 -43 -10 -61 29 182 -36 -1 98 -86
5273h6P8P3j48J40M8r9J3P2j00j5j05Q4L8j13J53r0p7J81rj11J23J9j19J6j5J8
$$ -86 -8 65 -83 57 105 6 19 91 -9 -24 -129 -45 -7 -120 33 -57 -134 47 38 -73 50 69 -50 -34 -49 -31
5299c1K7M0M4k2q4O6Mo4J14j94J01m4J5k3J05q1J19j00l0R3k9j18J21n2Q2P4j84
$$ -31 -4 36 80 58 -26 40 44 -20 94 -100 1 -43 -28 -51 54 -27 92 -8 -38 55 26 -92 29 -23 59 133 -51
5326e1R5m0o8R8n0k21L40j25JJ32j63J06j23J7J29r1p9J70o6n6J13j52N4K9o6
$$ -51 44 4 -64 34 -16 -237 103 -22 -21 111 -52 54 -69 -52 77 -14 -93 77 11 -45 68 -84 -30 -1 -67
5351f7kR7j05k0P9J01j40N4j67L79k46l3j8RN4J20j31Q6k4j48J57M6j99K39j49
$$ -67 -69 28 -77 -97 -18 83 -57 -3 -170 209 -37 -70 -88 -79 -25 95 -36 50 26 -122 35 81 -118 121 -28
5376b8K8P6j24J04l3j14P1J91k02Q4j14j2J42q4jR6j85P6P9r7k0R4j60J19R3j17
$$ -28 0 76 -48 56 23 -91 -20 171 -31 53 -61 -73 69 -15 -16 80 -105 -29 50 -47 -67 27 -133 -14 79 -38
5402c8K28k68J63L0k58J71k9l8K4J47k16J42p8J16q4P3M1p1p8J24l9j22Q1m1M2
$$ -38 190 -78 85 115 -143 28 -1 -39 -15 132 -84 58 -20 96 12 85 126 55 -23 101 62 -60 21 -20 22
5427B2q3p7J00R2j53J18l1o7R4j1r6O1J20k10J50j9n5Q6n4P6Qj35J63o7KK2n2
$$ 22 -61 -138 -38 54 -99 19 -12 -79 15 4 -92 -31 89 -121 29 10 -45 41 -13 63 71 -64 99 32 34 56 4
5454DJ2k3l9N0Op8M1Nr5J83r0m4R3r8J35n5L7j19J32j20J43l7o1J43p7p4J1p5
$$ 4 16 -7 -46 4 10 -68 -27 -22 -117 66 -24 -68 25 -73 62 7 44 -75 57 -63 80 43 -18 125 48 -26 -15 -90
5482i0P3R2j26J21j19K4M4Kj66K02o4o3J20j18M0P7l7J00q9k24K57l2L7%r5J7
$$ -90 -17 75 -51 70 -49 -25 19 21 -145 57 -7 -70 50 -68 -28 49 12 112 23 -201 56 24 61 61 -34 -17
5508a7P1j17J03n5Q5o5O6j96K02o7p4J62j11J2l5k6m0J01l7J7J04r4J65j85q1
$$ -17 54 -63 40 -15 70 5 71 -125 77 10 -64 98 -13 -1 -36 -62 -102 -1 -38 -21 83 -11 154 -31 -112
5533a12K32n3j21L1j12J86Mo4j1J00j30J17n2M9o2o8K7M9n2O7J05j77P9p5P4Q
$$ -112 120 67 -54 -23 -135 51 55 -9 -20 80 -50 67 15 64 2 -66 -39 10 -42 25 130 -47 32 -43 31 39
5559C9k2Nj5o3J48r6k2k6lO0k7J20j11K3l1mN3JO3pj31j9O6L7K8j62J48r7J4K
$$ 39 17 22 7 -56 92 -4 -26 -52 -55 5 -22 98 -13 10 -21 -25 28 29 92 85 -46 -65 1 38 66 -96 52 -45 -31 -29
5589b9J03j42P6p7M3J05k01K01J1j95J54J13k67N8J23op2N5j11P1l3m3P5qlm2
$$ -29 74 -68 8 -69 -26 79 -122 79 90 -105 49 162 -105 -47 76 70 -2 53 -58 13 -20 -63 12 4 1 -41
5615d1OQ6nj05P9Qo5L1n8Q3O9l0N6%j79P4j6M3j2o4j07L14k90N3L4K8Q2Kr7R8
$$ -41 -35 51 46 -59 20 28 -37 -6 -64 19 88 58 114 114 -65 9 -7 36 24 -40 -147 167 -123 -70 -36 -8 74 76 -21 77
5645G7r4q5J83j05l2N9L8p8K4j40J05N7k19K58o0o2J48l4q1M4k1P6L8j86L1J35
$$ 77 -17 -102 81 -24 -56 3 41 -37 -13 -153 -48 9 -210 48 -12 -74 74 40 -41 3 -18 58 96 -90 -59 76
5671G6o7k7j2L3M8j28P0J62j22o1L9m5r8J91k09J69m1j0J06p8j4J00o7N3o7o7
$$ 76 9 -18 -30 3 51 -77 -7 155 33 -28 11 -34 -132 59 -150 19 -22 -32 74 -4 -18 82 15 68 1 -66
5697f6k6Ql2J67j66L7J27k6lk1l6M9Q5k55L19n6r6Ok0L7j08J61o8Q0k16J60l5
$$ -66 -92 -84 -116 51 -115 -78 49 23 20 -1 -37 12 97 -158 161 105 9 15 -5 32 -76 85 17 97 -119 41 6
5724Fn5Q9l9O9m5l6k6P1n1l4N5m0J33r3j1MPQ8n5j07j3J50o6o4Qj17K50Nj26R4
$$ 6 -49 40 1 70 25 -11 -37 34 -17 -51 4 -36 97 4 -7 -3 4 92 37 -70 -83 67 1 -63 -55 -172 78 83 -43 51
5754E1L3j14q3J02n8K9K5k7K8j18K24j39N1N6Rm3m6k3o0J63m6Pj9loRj35J28r
$$ 51 84 -30 -113 -11 -69 -40 -15 -42 -14 -132 92 -47 4 60 69 26 -20 -43 -103 60 14 21 2 -1 -7 2 -133 -5 -14
5783a4j17K21q7qK6o9J31m4j26Q0k1O2Q1j65J43j02mJ61p4q9k8J42j69J75j73
$$ -14 -131 90 3 -5 21 -48 83 39 -87 -7 -28 34 115 -50 93 -9 -13 148 74 -15 -43 99 -70 105 -68
5808f8P5P7o5l5J4n1O0j4j12K17j26M0P7j67P3j4O2o8J13m2n0oKp1N7J4PjO3J
$$ -68 7 84 19 -16 -2 -53 7 -7 -119 98 -28 12 89 -78 -5 -19 43 -25 88 46 -4 -10 -8 -79 -22 -8 -1 -2 61 62
5838F2j10Q2l7q5K3J9k6P7q1O0J51j50m3J05L1j38J52j19J02n9p0J18P7j63r5
$$ 62 -48 34 -3 -88 -65 -46 -72 5 -76 -16 135 -15 -58 47 78 -60 92 -27 75 16 -54 64 141 -22 -117
5863a17J56j42J36r2N9R4j09P4p9R8j93O0Q6j00o6Q2L5j9J38j27n0J02q3J53n6
$$ -117 39 -103 33 -59 0 94 -15 59 -20 78 -115 -55 31 -69 -135 -53 -18 -37 101 -26 -76 26 -57 96 40
5888D0j08J24k4n8Q5L5k35K03j03N7M2m3K8p2n6Q6L0j77K49l1p6K7p5m0R3M7j43
$$ 40 -68 56 32 -26 59 94 -141 62 -41 16 58 15 43 -29 -85 1 31 -146 103 72 -4 23 -52 -92 1 48 -95
5915i5J68k06J62j6k4R6m0j47J68j75Q9ql4K06k27P1O6o5Q5j3j20LQ9Pj00J14
$$ -95 73 -133 29 13 -11 85 45 -102 66 -109 -20 -28 -62 144 -83 -12 54 -11 74 61 -59 -56 33 40 -60 54
5941E4K3q3J24j15j7pO8j26N8k6K2m5QK0l9J37j56J01M0j08jJ4N2j6Rk0N4M7J0
$$ 54 77 -6 118 3 -14 -21 47 -79 -21 -47 -25 -70 -62 -42 -81 56 -100 1 41 -67 -68 -54 -2 -18 -9 -29 25 72 82
5970H2Mn3j43j2K03j53L4P9O7p6m3R9J6j67kP9j38M2J86j56J05j41q1K01j14p9
$$ 82 86 33 -110 -122 81 -72 -38 41 108 32 -11 88 104 -63 -65 14 -124 -82 104 -52 53 -88 -169 32 -82 -161
5996a61J39rN8o4m6O1k3n3J97k02J64J8j46R8j19k9J02j3R6m0ro1Q5O4j95R0j
$$ -161 -22 -31 27 -37 -83 -22 -45 -98 99 -103 61 79 -67 31 -88 -117 -15 -28 68 28 19 -42 43 107 -88 2 1
$$ [...]
8191f
##END NTUPLES=NMR FID
##END=
